##TITLE=1H_CG-1204-xy
 DMSO
 8 sc, 
 7.6.2024
##JCAMPDX= 6.0         $$ Bruker NMR JCAMP-DX V2.0
##DATA TYPE= NMR SPECTRUM
##DATA CLASS= NTUPLES
##ORIGIN= UXNMR, Bruker Analytische Messtechnik GmbH
##OWNER= root
$$ XWIN-NMR		Version 3.5
$$ Fri Jun  7 15:43:22 2024 Russian Standard Time (UT+4h)  she@DPX200
##.OBSERVE FREQUENCY= 200.1309
##.OBSERVE NUCLEUS= ^1H
##.ACQUISITION MODE= SIMULTANEOUS
##.ACQUISITION SCHEME= undefined
##.AVERAGES= 8
##.DIGITISER RES= 18
##SPECTROMETER/DATA SYSTEM= spect
##.PULSE SEQUENCE= zg30
##.SOLVENT NAME= CDCl3
##.SHIFT REFERENCE= (INTERNAL, CDCl3, 0, 15.5894)
##AUDIT TRAIL= $$ (NUMBER, WHEN, WHO, WHERE, WHAT)
$$ ##TITLE= Audit trail, XWIN-NMR		Version 3.5
$$ ##JCAMPDX= 5.01
$$ ##ORIGIN= Bruker BioSpin GmbH
$$ ##OWNER= she
$$ F:/spectra/data/she/nmr/H-F/1/pdata/1/auditp.txt
$$ ##AUDIT TRAIL=  $$ (NUMBER, WHEN, WHO, WHERE, WHAT)
(   1,<2024-06-07 15:42:07.31 +0400>,<she>,<DPX200>,
      <created by zg, POWCHK disabled, PULCHK disabled
       configuration hash MD5:
       00 E9 B6 7A A2 85 ED C7 34 08 36 98 17 FE 4E 26
       data hash MD5: 16K
       E6 16 25 07 FF D5 9B 6F E9 72 79 66 7A 81 69 AF>)
(   2,<2024-06-07 15:42:10.39 +0400>,<she>,<DPX200>,
      <Start of raw data processing
       efp BC_mod = 2 LB = 0.24 FT_mod = 6 PKNL = 1 PHC0 = -25320.23 PHC1 = 12.78748 SI = 16K 
       data hash MD5: 16K
       5B A2 6D E2 A8 56 37 BD 0A E7 B8 9A 3D D1 BB 34>)
(   3,<2024-06-07 15:42:26.50 +0400>,<she>,<DPX200>,
      <pk PHC0 = 2.408358 PHC1 = -2.2 
       data hash MD5: 16K
       8C EE B4 0C 9E 6B E7 43 DD 4B 19 49 87 7C F1 8C>)
(   4,<2024-06-07 15:42:29.64 +0400>,<she>,<DPX200>,
      <abs ABSG = 5 
       data hash MD5: 16K
       EB 74 2F CE 93 0A 49 75 83 7E DF E7 7D 53 35 B5>)
$$ ##END=
$$ 
$$ hash MD5
$$ 47 37 E6 4A E2 E5 EF 9E B6 E1 91 5A 0C DC 5F 87
##$RELAX= 
##$RELAX= 
##$RELAX= 
##$RELAX= 
##$RELAX= 
##$RELAX= 
$$ Bruker specific parameters
$$ --------------------------
##$DU= <F:/spectra>
##$EXPNO= 1
##$NAME= <H-F>
##$PROCNO= 1
##$TYPE= <nmr>
##$USER= <she>
##$AMP= (0..31)
100 100 100 100 100 100 100 100 100 100 100 100 100 100 100 100 100 100 
100 100 100 100 100 100 100 100 100 100 100 100 100 100 
##$AQSEQ= 0
##$AQ_mod= 1
##$AUNM= <au_zg>
##$AUTOPOS= <>
##$BF1= 200.13
##$BF2= 200.13
##$BF3= 200.13
##$BF4= 200.13
##$BF5= 200.13
##$BF6= 200.13
##$BF7= 200.13
##$BF8= 200.13
##$BYTORDA= 1
##$CFDGTYP= 0
##$CFRGTYP= 5
##$CHEMSTR= <none>
##$CNST= (0..31)
1 1 145 1 1 1 1 1 1 1 1 1 1 1 1 1 1 1 1 1 1 1 1 1 1 1 1 1 1 1 1 1 
##$CPDPRG= <>
##$CPDPRG1= <>
##$CPDPRG2= <>
##$CPDPRG3= <>
##$CPDPRG4= <mlev>
##$CPDPRG5= <mlev>
##$CPDPRG6= <mlev>
##$CPDPRG7= <mlev>
##$CPDPRG8= <mlev>
##$CPDPRGB= <>
##$CPDPRGT= <>
##$D= (0..31)
0 1.2 0 0 0 0 0 0 0 0.06 0 0.03 0 0 0 0 0.0002 0 0 0 0 0 0 0 0 0 0 0 0 
0 0 0 
##$DATE= 1717760526
##$DBL= (0..7)
120 120 120 120 120 120 120 120 
##$DBP= (0..7)
150 150 150 150 150 150 150 150 
##$DBP07= 0
##$DBPNAM0= <>
##$DBPNAM1= <>
##$DBPNAM2= <>
##$DBPNAM3= <>
##$DBPNAM4= <>
$$ [...]
##$SUBNAM3= <"">
##$SUBNAM4= <"">
##$SUBNAM5= <"">
##$SUBNAM6= <"">
##$SUBNAM7= <"">
##$SUBNAM8= <"">
##$SUBNAM9= <"">
##$SW= 18.0517689322627
##$SWIBOX= (0..15)
0 0 2 0 0 0 0 0 0 0 0 0 0 0 0 0 
##$SW_h= 3612.71676300578
##$TD= 16384
##$TD0= 1
##$TE= 0
##$TE2= 300
##$TE3= 300
##$TEG= 300
##$TL= (0..7)
0 120 120 120 120 120 120 120 
##$TP= (0..7)
150 150 150 150 150 150 150 150 
##$TP07= 0
##$TPNAME0= <>
##$TPNAME1= <>
##$TPNAME2= <>
##$TPNAME3= <>
##$TPNAME4= <>
##$TPNAME5= <>
##$TPNAME6= <>
##$TPNAME7= <>
##$TPOAL= (0..7)
0.5 0.5 0.5 0.5 0.5 0.5 0.5 0.5 
##$TPOFFS= (0..7)
0 0 0 0 0 0 0 0 
##$TUNHIN= 0
##$TUNHOUT= 0
##$TUNXOUT= 0
##$USERA1= <user>
##$USERA2= <user>
##$USERA3= <user>
##$USERA4= <user>
##$USERA5= <user>
##$V9= 5
##$VALIST= <valist>
##$VCLIST= <CCCCCCCCCCCCCCC>
##$VD= 0
##$VDLIST= <DDDDDDDDDDDDDDD>
##$VPLIST= <PPPPPPPPPPPPPPP>
##$VTLIST= <TTTTTTTTTTTTTTT>
##$WBST= 1024
##$WBSW= 4
##$XGAIN= (0..3)
0 0 0 0 
##$XL= 0
##$YL= 0
##$YMAX_a= 102447
##$YMIN_a= -102317
##$ZGOPTNS= <>
##$ZL1= 120
##$ZL2= 120
##$ZL3= 120
##$ZL4= 120
##$ABSF1= 15.57614
##$ABSF2= -2.475747
##$ABSG= 5
##$ABSL= 3
##$ALPHA= 0
##$AQORDER= 0
##$ASSFAC= 0
##$ASSFACI= 0
##$ASSFACX= 0
##$ASSWID= 0
##$AUNMP= <proc_1d>
##$AZFE= 0.1
##$AZFW= 0.1
##$BCFW= 0
##$BC_mod= 2
##$BYTORDP= 0
##$COROFFS= 0
##$CY= -3
##$DATMOD= 1
##$DC= 0
##$DFILT= <>
##$DTYPP= 0
##$F1P= 0
##$F2P= 0
##$FCOR= 1
##$FTSIZE= 16384
##$FT_mod= 6
##$GAMMA= 0
##$GB= 0
##$INTBC= 1
##$INTSCL= 3.70164e-10
##$ISEN= 128
##$LB= 0.24
##$LEV0= 0
##$LPBIN= 0
##$MAXI= 10000
##$MC2= 0
##$MEAN= 0
##$ME_mod= 0
##$MI= 1.114404
##$NCOEF= 0
##$NC_proc= -9
##$NLEV= 6
##$NOISF1= 3.799351
##$NOISF2= 2.8
##$NSP= 0
##$NTH_PI= 0
##$NZP= 0
##$OFFSET= 15.58937
##$PC= 1
##$PHC0= -25317.82
##$PHC1= 10.58748
##$PH_mod= 1
##$PKNL= yes
##$PPARMOD= 0
##$PSCAL= 0
##$PSIGN= 0
##$REVERSE= no
##$SF= 200.129586465275
##$SI= 16384
##$SIGF1= 3
##$SIGF2= 2
##$SINO= 5.538805
##$SIOLD= 16384
##$SREGLST= <1H.CDCl3>
##$SSB= 0
##$STSI= 16384
##$STSR= 0
##$SW_p= 3612.71676300577
##$SYMM= 0
##$S_DEV= 0
##$TDeff= 16384
##$TDoff= 0
##$TI= <>
##$TILT= no
##$TM1= 0
##$TM2= 0
##$TOPLEV= 0
##$USERP1= <user>
##$USERP2= <user>
##$USERP3= <user>
##$USERP4= <user>
##$USERP5= <user>
##$WDW= 1
##$XDIM= 16384
##$YMAX_p= 501613454
##$YMIN_p= -5393644
$$ End of Bruker specific parameters
$$ ---------------------------------
##NTUPLES= NMR SPECTRUM
##VAR_NAME=  FREQUENCY,     SPECTRUM/REAL,   SPECTRUM/IMAG
##SYMBOL=    X,             R,               I
##VAR_TYPE=  INDEPENDENT,   DEPENDENT,       DEPENDENT
##VAR_FORM=  AFFN,          ASDF,            ASDF
##VAR_DIM=   16384,         16384,           16384
##UNITS=     HZ,            ARBITRARY UNITS, ARBITRARY UNITS
##FACTOR=    0.220516191357247, 1,           1
##FIRST=     3119.89412609781, 0,            0
##LAST=      -492.822636907961, 0,           0
##MIN=       -492.822636907961, -5393644,    0
##MAX=       3119.89412609781, 501613454,    0
$$ Real data points
##PAGE= N=1
##DATA TABLE= (X++(R..R)), XYDATA
$$ [...]
7296g41969m92806P18430J024812n43852l17168N59837n08479P78765l33171o40071
7286d95672o62567O49970N10819k84210k33084l27120J24311N71011O38013M29188
7276I20659m96670k22519M6941n50617j30323j033515O22511L21337L53902k38389
7266d06683M56035m0819m47094L84133l58880j26778J58515M81203j161599L16292
7256g45675Q71200m29427k57365O07628l65021j32529k71864j33987l46690j70520
7246a374250J281838j151811n88814M30918K13970K24994k739K66486m90875J02899
7236a087384L74879m48757l15207N71393J99988K56354j58691O64869j20888R19790
7226H56346j56944j260457k72473K91673R23924k46019l84138P24608r3248m53972
$$ plain form
7296 -741969 -1234775 -516345 508467 -35385 -352553 207284 -301195 477570 144399 -495672
7286 -495672 -1158239 -508269 2550 -281660 -514744 -841864 -717553 -146542 491471 920659
7276 920659 423989 201470 248411 -302206 -432529 -1466044 -843533 -522196 -168294 -406683
7266 -406683 49352 8533 -438561 -54428 -413308 -540086 -381571 99632 -1061967 -745675
7256 -745675 125525 -303902 -561267 46361 -318660 -451189 -723053 -857040 -1203730 -1374250
7246 -1374250 -92412 -1244223 -1833037 -1402119 -1188149 -963155 -965894 -699408 -1190283 -1087384
7236 -1087384 -712505 -1161262 -1476469 -905076 -705088 -448734 -607425 57444 -63444 856346
7226 856346 699402 -561055 -833528 -541855 382069 136050 -248088 476520 383272 -70700
7216g0700K99074J06381m37200o07534k82319N07370K72112J86246n61551k5481
7206f13602j43741m12985J243289l89192k10898K55914M45980q78090n56736q1303
7196a341364N77593R07474l15891m9940K68227k45528Q74315r62336N8856J62316
7186f6278k0836j23559L90565l64095n5476P32411m26054j15199N40213l67122
7176A24570M7072N22326k69354j18007M38822o11064O5678m66256p66266O7159
7166i65320j52631m1192L42824Q33634j6132K54978m75320n65825j81575Q36695
7156a29864j66381k52662j78878J94001M77885N95663j325220K40369K59613M51929
7146A66455O77196j710371J014583L18043p44558M47174o01996O82691R120l25654
$$ plain form
7216 -70700 228374 334755 -102445 -709979 -992298 -484928 -212816 -26570 -588121 -613602
7206 -613602 -757343 -1170328 72961 -316231 -527129 -271215 174765 -703325 -1260061 -1341364
7196 -1341364 -763771 143703 -172188 -222128 46099 -199429 674886 -287450 -228594 -66278
7186 -66278 -87114 -210673 179892 -184203 -239679 492732 66678 -48521 491692 124570
7176 124570 171642 693968 424614 306607 745429 134365 200043 -266213 -1032479 -965320
7166 -965320 -1117951 -1159143 -816319 17315 1183 256161 -219159 -784984 -966559 -129864
7156 -129864 -296245 -548907 -727785 -533784 -55899 539764 -785456 -545087 -285474 166455
7146 166455 843651 -866720 147863 465906 -278652 168522 -433474 249217 258337 -67317
7136f7317l596K96073j05398M16266j84212n05607M41027m81647L75860L57582
7126E39031l04846j436047n91734R53999P30398k3194l65211m71698K33966J32487
7116f02849R36645l05640l29255J40918k91130l8685M45043j87416l96026j004797
7106a633192O0252J468447M87452n12252L73560J31755P5151M13049L15995O41535
7096A821752j446000p5175k51449k40388p60510K27343J067109K51557L89649
7087I83888p82826n63981R66124q19291m81364P84620M17894o39895q6261J19822
7077a01270N9630k10787K85334k54598M88250p26266l96099N35119J70966J83737
7067C4016m48481K3699J62926q67l90269M15752M10426p27319J43826q72099L62725
$$ plain form
7136 -67317 -70913 225160 119762 536028 351816 -153791 287236 -194411 181449 539031
7126 539031 234185 -1201862 -1793596 -839597 -109199 -132393 -497604 -969302 -735336 -602849
7116 -602849 333796 28156 -301099 -160181 -451311 -489996 -44953 -232369 -628395 -1633192
7106 -1633192 -1572940 -104493 382959 -129293 244267 376022 451173 864222 1180217 1821752
7096 1821752 375752 300577 49128 -191260 -951770 -724427 342682 594239 983888
7087 983888 201062 -362919 603205 -216086 -697450 87170 505064 -134831 -221092 -101270
7077 -101270 -41640 -252427 32907 -221691 266559 -459707 -855806 -320687 -149721 34016
7067 34016 -414465 -390766 -227840 -228707 -618976 -203224 207202 -520117 -376291 -1248390 -885665
7056h85665M18487o63982k08051L59136O93514N58076K08794q63022O34454l95563
7046a43822k97498m65455J6973K79109P97115j30131r8471N06929k1277j69558
7036B73914p63754K22164O35647m59769n437n71739J50969L72544m59858j13450
7026g18769Q88840k71497k80943q7381L37178m14336n14975N53837O80106n00494
7016c28434r72094P55253O05892K82869M5095r16716k2406K33008L94801q22125
7006g44857N12888J68718j3398L65111o99035J29452L60092M30666J94400o36125
6996F7912m90063n10089L30016L70944L6447N5847N2790o12786k3640J58880N26584
6985c7158P42843j335870k6330j28027j52514M408N70295J28032j68019M74486
$$ plain form
7056 -885665 -467178 -1131160 -1339211 -980075 -286561 271515 480309 -382713 251741 -143822
7046 -143822 -441320 -906775 -889802 -610693 186422 56291 -42180 464749 443472 273914
7036 273914 -489840 -267676 367971 -91798 -97235 -668974 -518005 -145461 -605319 -718769
7026 -718769 170071 -101426 -382369 -469750 -132572 -546908 -1061883 -508046 172060 -328434
7016 -328434 -1300528 -545275 60617 343486 388581 -528135 -550541 -317533 77268 -744857
7006 -744857 -231969 -63251 -76649 288462 -410573 -281121 78971 509637 704037 67912
6996 67912 -422151 -932240 -602224 -231280 -194833 -138986 -86196 -698982 -722622 -563742 -37158
6985 -37158 705685 -630185 -656515 -784542 -937056 -932648 -362353 -234321 -402340 72146
6975G2146l57839k94830K86135k68453n6354M10321l02990J25799n94669N36871
6965d43863K86167o18139N90505L69152R4652K36852N31217L86609m57877p54670
6955B20605p36511k15293N48152J35838l77474J66904J035283J96638K23391r56219
6945B41314K552p39158j82606O55495k69134l85715l38907O16246J050274l23820
6935C26541j44048p9059L15088j135991p5053M60961n77045K43292l01749M27026
6925e40037P09337l51151M97566m36553r23007M24172L34671j85198k28754J16319
6915e82635p32980j13995J661189N31329j434498L2088M54724K03190P95327J06578
6905I20317k83484q20241O64852J25353j38685m13980M27178k44907M20926j26063
$$ plain form
6975 72146 -285693 -580523 -294388 -562841 -619195 -208874 -511864 -386065 -980734 -443863
6965 -443863 -157696 -775835 -185330 183822 278474 515326 1046543 1433152 975275 220605
6955 220605 -515906 -731199 -183047 -47209 -424683 -257779 777504 974142 1197533 241314
6945 241314 243866 -495292 -677898 -22403 -291537 -677252 -1016159 -399913 650361 326541
6935 326541 182493 103434 418522 -717469 -792522 -331561 -908606 -665314 -967063 -540037
6925 -540037 169300 -181851 315715 -120838 -1043845 -619673 -285002 -470200 -698954 -582635
6915 -582635 -1315615 -1429610 231579 762908 -671590 -639502 -184778 18412 813739 920317
6905 920317 636833 -183408 481444 606797 468112 54132 481310 236403 657329 531266
6895E31266m63844j60639M69119L84686k58536k34463r78460K76618M02141q387
6885d0499M46699m84792m75494L94977n02080L67763l36116J20461N5193O60887
6875B06999L20243J53315l71656j39672n85286K44868L45065k78886l46296k46100
6865f97406m52426M52047K49393q5853P20917J99686n72930J93795J97910k33841
6855b8708P52097q8237j066371M08447P20798m85022q35183l34633K803P07890
6845b46119L96433J35221m38936j357027P64349O41010p60492K94174K41653L06979
6835b2755j29366k79306M78848M78498O85838k97803j186734J61224m65672O30137
6825E2909j44968k1946L10131J31502k73897k71666M81336k41880K90352K26568
$$ plain form
6895 531266 67422 -93217 375902 760588 502052 267589 -710871 -434253 -32112 -40499
6885 -40499 406200 -78592 -554086 -159109 -661189 -293426 -629542 -509081 -453888 206999
6875 206999 527242 680557 308901 169229 -416057 -171189 173876 -105010 -451306 -697406
6865 -697406 -1149832 -697785 -448392 -534245 186672 386358 -186572 7223 205133 -28708
6855 -28708 723389 635152 -431219 -22772 698026 213004 -622179 -956812 -954009 -246119
6845 -246119 150314 285535 -153401 -1510428 -746079 -105069 -865561 -571387 -329734 -22755
6835 -22755 -152121 -431427 47421 525919 1211757 913954 -272780 -111556 -577228 52909
6825 52909 -92059 -114005 196126 327628 53731 -217935 263401 21521 311873 538441
6815E38441N97791m86419k79722J39851m2378l79523o81380j48551J218619M37528
6805I14257m25076n16455K12582r6616l625P08810L77715K13073q70078L94600
6795I09187l15468K80341L6764k21496k40830k67821J91658k80734l25928J113118
6785H78791O47705o00263o74598k34928N24740J18924K36730O65753n25496n45876
6775D91482l15656J69039K33540o34622J779787k23891o43549m62481J066994
6766A460643M59246k34187n16741o18233l6152M19811J99011M60530r17065l63202
6756C13661m33342o10508Q77701M49684k09371K15403P2569k69382Q20281k74842
6746I51854l21379J88481K69940l54200o082K27050m36559L04745o30252K32357
$$ plain form
6815 538441 1136232 649813 370091 509942 467564 88041 -593339 -741890 476729 914257
6805 914257 489181 -27274 185308 88692 85067 793877 1171592 1384665 514587 909187
6795 909187 593719 874060 910824 689328 448498 180677 372335 91601 -234327 878791
6785 878791 1526496 926233 251635 16707 541447 660371 897101 1562854 1037358 491482
6775 491482 175826 344865 578405 -56217 1723570 1499679 856130 393649 1460643
6766 1460643 1919889 1685702 1168961 550728 514576 934387 1133398 1593928 676863 313661
6756 313661 -119681 -730189 147512 597196 387825 603228 675797 406415 1226696 951854
6746 951854 630475 818956 1088896 734696 728614 955664 519105 823850 193598 425955
6736D25955n48908l24733J303530R06640r54204m11292O96812q34989m27856L42173
6726A73128l4936l17997J03340p57211M73217M91615L77645N631k99999k18375
6716c942O26960K38099l02538j66732J52829n47126L07924M55039J96889L83633
6706A341035j18935n34400k33949J37784p0977R70811k48247N92818o24011l17994
6696H93935j47188k62839P43222m51016j23614q0850J52317o33443L87336K47773
6686G25633J73505k51922P15872K58031o92194q9231M20102q33189J45155J184124
6676A755886n50624K73292l27832J15513p11223j2705Q9889j75217L70202L00175
6666A127356k08997p9316N25300N54845n09049j131793j07308K90827k5226n87279
$$ plain form
6736 425955 -122953 -447686 855844 1762484 808280 396988 1093800 258811 -169045 173128
6726 173128 138192 -179805 -76465 -833676 -360459 131156 508801 514432 214433 -3942
6716 -3942 623018 861117 558579 391847 544676 -2450 305474 760513 957402 1341035
6706 1341035 1222100 687700 453751 591535 520558 1491369 1243122 1835940 1211929 893935
6696 893935 746747 483908 1227130 776114 652500 571650 723967 90524 477860 725633
6686 725633 899138 647216 1363088 1621119 928925 839694 1259796 426607 571762 1755886
6676 1755886 1205262 1478554 1150722 1266235 555012 542307 632196 456979 827181 1127356
6666 1127356 918359 839043 1364343 1919188 1410139 278346 171038 461865 436639 -150640
6656a50640j08335K66834Q04616Q86752o64292k62820N32850K89886J24196l66259
6646A352788j95770K4061P62317k75560p85496L28087q7977l34205L27705P63292
6636A879242o68950N3110M77083K05638m498k32145j61848j20031J9753M1095
6626A488449Q26850m37296j312059l46393Q60493M35473l91890j87363M96732
6617A432996j85325J04485j452426k01182Q26558J72737K94777L99501k77618
6608A114503q17710J82767Q01976l80639j10200J94996K05103K14448N00515N02124
6598B407883k78830j2405n47946n01187L44602j62948k93299L87877l83802J09416
6588A069361M24927P41205K36052J42874k16732R3021n3233n56946J24068p3904
$$ plain form
6656 -150640 -258975 7859 812475 1699227 1034935 772115 1304965 1594851 1719047 1352788
6646 1352788 1157018 1181079 1943396 1667836 882340 1210427 1122450 788245 1115950 1879242
6636 1879242 1210292 1263402 1740485 1946123 1941625 1709480 1547632 1427601 1447354 1488449
6626 1488449 2315299 1878003 565944 219551 1080044 1515517 1123627 936264 1432996
6617 1432996 1247671 1352156 -100270 -301452 525106 697843 992620 1392121 1114503
6608 1114503 296793 479560 1281536 900897 790697 985693 1190796 1405244 1905759 2407883
6598 2407883 2129053 2116648 1568702 1067515 1412117 1249169 955870 1343747 959945 1069361
6588 1069361 1494288 2235493 2471545 2614419 2397687 2490708 2437475 1880529 2004597 1930693
6578A930693p03128j177996p2416J090866P46718J21816r6262K23345k56918l84664
6568A422054N00840l56620j96234J97360j19023k26656j74167P50061j07541l52844
6558A337230P36312J67730l00296k22608l76134O03166l13415M61002N94p24884
6548A368697O32514o14757J70551o88791J013485R48469o21478p31565J50122
6539A627247N54910m36657P71389N855P5663j431325j64407M13607N49590N68796
6529B534668k97555j44837M96814M03846p78921P3737N61405q44206L20481K52088
6519B577520L40924m12440l92900k00497M05259M68979R2923j31085O7029o68192
6509B147520M9160M95172p33745N69440J24558K30877M21869j07708o927J10055
$$ plain form
6578 1930693 1227565 49569 -22847 1068019 1814737 1936553 1840291 2063636 1806718 1422054
6568 1422054 1922894 1566274 1370040 1567400 1448377 1221721 1047554 1797615 1690074 1337230
6558 1337230 2073542 2241272 1940976 1718368 1342234 1945400 1631985 2092987 2093581 1368697
6548 1368697 2001211 1386454 1557005 868214 1881699 2830168 2208690 1477125 1627247
6539 1627247 2182157 1745500 2516889 2522744 2598407 1167082 1002675 1416282 1965872 2534668
6529 2534668 2237113 2092276 2589090 2992936 2214015 2287752 2849157 2004951 2325432 2577520
6519 2577520 2918444 2506004 2113104 1912607 2317866 2786845 2879768 2748683 2815712 2147520
6509 2147520 2196680 2691852 1958107 2527547 2652105 2882982 3304851 3197143 3190216 3300271
6499C300271n33941p23194O05776J29785M23925k22914m62639M48983Q59168k80965
6489C544255l1547P37293k41339O63022n22248R10982n88409l48099Q7085J98903
6479D409898l93811L11750N20933O14777M48938j7311m61127P7156j73492J093361
6469F431072O40449j101458M46666O6139M07606k6670N54870P18560r0923n96122
6459G450189o2204J381887O55261m5683M17975P10771J21148N21376l37815M62065
6449A1274970P68138Q94345J38940M556N02598r3781J008481j91013J74489M94784
6439A4976507N61788n121l79717M27874P40855K92395J39858l9647P43132O55663
6429A8113587L08423j7098P5096l65376k50439k88143p34544K73013J44124r93194
$$ plain form
6499 3300271 2766330 2043136 2648912 2778697 3202622 2979708 2517069 2966052 3825220 3544255
6489 3544255 3512708 4250001 4008662 4671684 4149436 5060418 4472009 4123910 4210995 4409898
6479 4409898 4016087 4327837 4848770 5463547 5912485 5895174 5434047 5511203 5337711 6431072
6469 6431072 7071521 5970063 6416729 6482868 6890474 6863804 7418674 8137234 8046311 7450189
6459 7450189 7387985 8769872 9425133 9379450 9797425 10508196 10629344 11150720 10812905 11274970
6449 11274970 12043108 12937453 13076393 13080949 13583547 13489766 14498247 14307234 14481723 14976507
6439 14976507 15538295 15533174 15153457 15581331 16322186 16614581 16754439 16714792 17457924 18113587
6429 18113587 18422010 18404912 18480008 18114632 17864193 17576050 16841506 17114519 17258643 16265449
6419A6265449r10388N77270m97994M63491P8061P58079k90072o59666L56376l36388
6409A5804218P87119n16842o02605q74971k12390N12405j74751j89100M58610
6400A4991693N2878L29500R005j089355L5789l28623n26099M85685J229662Q53634
6390A6043769r86096q1075J882364J97738J80251J062916n01692R29811Q85318
6381A9613304L74281l83441J490085O71032P50958K60432P0304O3395O94837N06780
6371B4111967N31341M07504j89904m13243J37163K61513n85672Q69087N8623j24888
6361B5063491n20716K16856q24084l44286j99395m34033o52281j094572l02383
6352B0908597Q6847n92246j156206q0213j041038q72602j391562p58390J44284
$$ plain form
6419 16265449 15355061 15932331 15434337 15897828 15975889 16733968 16443896 15784230 16140606 15804218
6409 15804218 16591337 16074495 15471890 14596919 14384529 14896934 14722183 14533083 14991693
6400 14991693 15044571 15374071 15383076 14293721 14329510 14000887 13474788 13960473 15190135 16043769
6390 16043769 15057673 14976598 16858962 17056700 17236951 18299867 17798175 18727986 19613304
6381 19613304 19987585 19604144 21094229 21765261 22516219 22776651 22846955 22910350 23605187 24111967
6371 24111967 24643308 25050812 24860908 24447665 24584828 24846341 24260669 25129756 25188379 25063491
6361 25063491 24542775 24759631 23935547 23591261 23391866 22957833 22305552 21210980 20908597
6352 20908597 20995444 20403198 19246992 19166779 18125741 17253139 15861577 15103187 15247471
6343A5247471l20692l54004m28622K28638p53403j139681l18183J10709n60876
6334A1711357K19969l36919m95093o02509m50735K15150M6993o31573j055726
6325H620914m82543J77491j70614j173703O03657M08158j54927l29998q73655
6316F624780L67013j94932Q7521r6237J36097o15200M49729R03499l06220n58853
6306F797197k15589m60591j43106M21591R8869q06221p7041N04029K20951o81727
6296E658362k73117k68417L31010Q44980p37553l24373M5354j88368L41735k0477
6286E409136J57310m34129J88238J41441N94405j04690J09392N48706N3282l61635
6276F301456m46377M89563J77206k83461r3858K65954J118699l95571j596848
$$ plain form
6343 15247471 14926779 14572775 14144153 14372791 13619388 12479707 12161524 12272233 11711357
6334 11711357 11931326 11594407 11099314 10496805 10046070 10261220 10308213 9676640 8620914
6325 8620914 8138371 8315862 8145248 6971545 7575202 7983360 7828433 7498435 6624780
6316 6624780 6991793 6796861 6884382 6788145 6924242 6309042 6758771 7662270 7356050 6797197
6306 6797197 6581608 6121017 5977911 6399502 6498371 5692150 5615109 6119138 6340089 5658362
6296 5658362 5385245 5116828 5447838 6292818 5555265 5230892 5276246 5087878 5429613 5409136
6286 5409136 5566446 5132317 5320555 5461996 6056401 5951711 6061103 6609809 6663091 6301456
6276 6301456 5855079 6344642 6521848 6238387 6144529 6410483 7529182 7133611 5536763
6267E536763K87720L13219L36569j40225k52863L94795n92859l93454R60359j5524
6257F434500r9520n6862j65267r35777Q43040M428L61422k15769k5526j42418
6247F002251k65872n91058J01280k93992N5203K70539J29086j44493N54157M64974
6237F282075j35704k68672j22655j42300K8759q1804m80947J11759K65308m3048
6227E412771R8284J36160r4944P86589L3973L59827K6270n47881M23743j03255
6217F531537m07613J09875P62331J350147K04490j200467p81334P46090l79713
6208F935343P02063J68600K81025k88030K4842m52286j59856O57576L82455P9582
6198H331314m88058P18842o19646j21565J800642K31699n16073K15964K83413
$$ plain form
6267 5536763 5824483 6137702 6474271 6334046 6081183 6475978 5883119 5489665 6450024 6434500
6257 6434500 6334980 6278118 6112851 5177074 6020114 6024542 6385964 6170195 6144669 6002251
6247 6002251 5736379 5145321 5246601 4952609 5007812 5278351 5407437 5262944 5817101 6282075
6237 6282075 6146371 5877699 5755044 5612744 5641503 5559699 5078752 5190511 5455819 5412771
6227 5412771 5511055 5647215 5552271 6338860 6372833 6732660 6758930 6211049 6634792 6531537
6217 6531537 6123924 6233799 6996130 8346277 8550767 7350300 6568966 7315056 6935343
6208 6935343 7637406 7806006 8087031 7799001 7823843 7371557 7211701 7869277 8251732 8331314
6198 8331314 7843256 8562098 7942452 7820887 9621529 9853228 9337155 9553119 9836532
6189I836532J06649q16214K61186J197493J04337P756n6830N44732J296127j242066
6179A1239702L30182R61445N95440K19899K21127N77708J65155L29265Q29044
6170A5468967J70266N51382J059470l61853O69926Q94061K76171P6836J96931
6161A9002157k74338N5394N32848Q7366q38845M14030O76918P15752J70117K30535
6151B0771934N64208K26633N68408Q60391J59178J099165Q36251o4924K006781
6142B7028025P85682j045443N11944J389753J182511K09310L87645R50042L70664
6133C1770133K75886Q37716J12805M98627J173260J607071M14826L02547P94909
6124C7787780n78791j15326j075837j95750M48914P05530J011005K82648l56422
$$ plain form
6189 9836532 9943181 9126967 9388153 10585646 10689983 10697739 10640909 11185641 12481768 11239702
6179 11239702 11569884 12531329 13126769 13346668 13567795 14145503 14310658 14639923 15468967
6170 15468967 15639233 16190615 17250085 16888232 17558158 18452219 18728390 18805226 19002157
6161 19002157 18727819 18783213 19316061 19403427 18564582 18978612 19655530 20371282 20541399 20771934
6151 20771934 21336142 21562775 22131183 22991574 23150752 24249917 25086168 25021244 27028025
6142 27028025 27813707 26768264 27280208 28669961 29852472 30061782 30449427 31399469 31770133
6133 31770133 32046019 32883735 32996540 33495167 34668427 36275498 36690324 36992871 37787780
6124 37787780 37208989 37093663 36017826 35822076 36270990 36976520 37987525 38270173 37913751
6115C7913751R20037J177997M40425Q50175J2827K64435Q22420R29795L55680
6106D3687542J543662Q63258R09040R30273Q57270P05185J003225K23939N14332
6097E1237726J830062K46046L27045N70820O24238K1102J066894J571094N95845
6088E8090872j71033P13544k24979n03521P59757R71907J190449R44759J551330
6079F3323085Q97502J82570J436662J022511J227875R61565n52299Q48156N29040
6070F9876667q8417p11121q78936j16800q60614l31882q41561r50526n53985j543698
6060F2999127q43593o53720j332207p07369j290050j176854o06472j140695k80420
6051E4967747q95158o12100k59368r75483k4502m50444k30080j205345j713985
$$ plain form
6115 37913751 38833788 40011785 40452210 41302385 41315212 41579647 42402067 43331862 43687542
6106 43687542 45231204 46094462 47003502 47933775 48791045 49496230 50499455 50723394 51237726
6097 51237726 53067788 53313834 53640879 54211699 54835937 54857039 55923933 57495027 58090872
6088 58090872 57919839 58633383 58408404 57904883 58664640 59636547 60826996 61771755 63323085
6079 63323085 64220587 64403157 65839819 66862330 68090205 69051770 68499471 69347627 69876667
6070 69876667 69788250 69077129 68198193 68081393 67220779 66888897 66047336 65096810 64542825 62999127
6060 62999127 62155534 61501814 60169607 59462238 58172188 56995334 56388862 55248167 54967747
6051 54967747 54072589 53460489 53201121 52225638 52201136 51750692 51520612 50315267 48601282
6042D8601282j053209j155979j366922j359030r44118p49402j607914j435305
6034C8929403o41648p82404j488529j222589j275133j809100l83122j658580j648052
6025B8020246j20607r24438r72875m68636p36235j827051N3774j77057J91742
6016B3038863p0964j053714j1656n56673O5842q18920j041031j05279k46458k57128
6006A8942882j590595q6212J6241j01069Q3428j02602l75681j018978j30500n97656
5996A5039258m55218l44897j18512j6028o02663j409228k21813P6279J30585P4086
5986A2151849n07468q49008j150521O96004P8438M01024J09572o70469j32624
5977A0126797k49425q48690r10847P65199L43883j67803k25439o12691M5024K83902
$$ plain form
6042 48601282 47548073 46392094 45025172 43666142 42722024 41972622 40364708 38929403
6034 38929403 38287755 37505351 36016822 34794233 33519100 31710000 31326878 29668298 28020246
6025 28020246 27899639 26975201 26002326 25533690 24797455 22970404 23024178 22847121 23038863
6016 23038863 22967899 21914185 21902529 21345856 21411698 20592778 19551747 19446468 19200010 18942882
6006 18942882 17352287 17266075 17282316 17181247 17264675 17162073 16786392 15767414 15636914 15039258
5996 15039258 14584040 14239143 14120631 14104603 13501940 12092712 11870899 11947178 12077763 12151849
5986 12151849 11644381 10795373 9644852 10340856 10419294 10820318 10929890 10259421 10126797
5977 10126797 9877372 9028682 8117835 8883034 9226917 9059114 8833675 8220984 8266008 8549910
5967H549910J46933l45878q44277j26866P91268j44278l82270N46253n2030k02734
5957G936031K00895j64089o62596o49862l89240N42081p45989n59676r0894J91265
5947E607926L91443L21012q2470k18501r76825j2800N32921L05482o02544n28087
5937D737557P04576l55368q17669j31377R56425o56n93693o06261N2974L87687
5927D334195L64474J53251L3694K22576n24134O24101k36541k63010N1679L5863
5917D796148L15923O51521k80811q70114J86333n48499L05815k87792N57213r63165
5907C862572m55272K62664J01790K85156j119361Q77638J117218q43941J25551
5898D214015M46695k6930o18763j059904L21943J041194J27837n07576m93678
$$ plain form
5967 8549910 8696843 8350965 7506688 7379822 8171090 8026812 7644542 8190795 8138765 7936031
5957 7936031 8136926 7972837 7310241 6660379 6271139 6813220 6067231 5507555 5416661 5607926
5947 5607926 5999369 6320381 6237911 6019410 5042585 5029785 5562706 5868188 5265644 4737557
5937 4737557 5442133 5086765 4269096 4137719 5094144 5093488 4499795 3893534 3946508 4334195
5927 4334195 4698669 4851920 4885614 5108190 4584056 5208157 4971616 4708606 4760285 4796148
5917 4796148 5112071 5763592 5482781 4612667 4799000 4250501 4556316 4268524 4825737 3862572
5907 3862572 3407300 3669964 3771754 4056910 2937549 3815187 4932405 4088464 4214015
5898 4214015 4660710 4633780 4015017 2955113 3277056 4318250 4446087 3938511 3444833
5889C444833O90507l37343o3026L31433j79899j83652k55111L62309P630j59784
5879C657897r17030N42352P48093k62257j99P41167p94830k8656p09122m69287
5869B508128K54267R37610l00064k16365l20190r7110R6507N57989Q15869q90659
5859C345982O3227l7107l0593K55194K70924k10474o37710k04322Q20064O60317
5849D295502j011761K64928J66296k56645O65627k67394l09998J66687p8323l88387
5839C246532l88395Q32796Q116J81419m7280N80456j82385q49845N8180k09909
5829C229685N77249o24202M20182P94927r82552l04348P47903r07812J34155k60856
5819B824331K94778j92088R45536o93482j77831J757147M73868m75805j04471
$$ plain form
5889 3444833 4135340 3797997 3734971 4066404 3886505 3702853 3447742 3810051 3817681 3657897
5879 3657897 2740867 3283219 4031312 3769055 3768856 4510023 3715193 3686537 2977415 2508128
5869 2508128 2762395 3700005 3399941 3183576 2863386 2766276 2862783 3420772 4236641 3345982
5859 3345982 3409209 3372102 3341509 3596703 3867627 3657153 3019443 2815121 3635185 4295502
5849 4295502 3283741 3548669 3714965 3458320 4123947 3856553 3546555 3713242 3634919 3246532
5839 3246532 2858137 3690933 3699049 3880468 3833188 4413644 4231259 3381414 3439594 3229685
5829 3229685 3806934 3182732 3602914 4397841 3415289 3110941 3858844 2951032 3085187 2824331
5819 2824331 3119109 2927021 3872557 3179075 3001244 4758391 5232259 4756454 4651983
5810D651983j308695o7629P05890L1577n8232j41809P56590M1487o29294o04732
5800C377136J82312P84910M48183M68726j245096r21527K09955N50177J30354
5791C985130k07845l00351P49193l08200l44760j89120o66475J7041o91338O00529
5781B643804J38374O67515P86014k26129k80920n02564N15818J079726j15201
5772D706437L15008l05326n67331n86918L94882j3951K65848k632j154254Q65181
5762C916944R55127p00920q5702m46814K75265r78168K59482O93149n3419J17341
5752C952285J71599J210611K48299q63184m79859N06896l28577M67931p07285
5743D178716j34916K53272o42473N43892J029464J38373O1288M52443j486642
$$ plain form
5810 4651983 3343288 3275659 3981549 4013126 3954894 3813085 4569675 4611162 3981868 3377136
5800 3377136 3559448 4344358 4792541 5261267 4016171 3094644 3304599 3854776 3985130
5791 3985130 3777285 3476934 4226127 3917927 3573167 3384047 2717572 2734613 2043275 2643804
5781 2643804 2782178 3449693 4235707 4009578 3728658 3226094 3741912 4821638 4706437
5772 4706437 5021445 4716119 4148788 3561870 3956752 3942801 4208649 4206017 3051763 3916944
5762 3916944 4872071 4171151 4085449 3638635 3913900 2935732 3195214 3888363 3834944 3952285
5752 3952285 4123884 5334495 5582794 4719610 4239751 4746647 4418070 4886001 4178716
5743 4178716 4043800 4297072 3654599 4198491 5227955 5366328 5427616 5880059 4393417
5734D393417k58374L38181J57374K011422l30144j407507R18484J16572P4711
5725F014136M3244N144l58394m70713J29627j29889M18597l0018k57351O81521
5715F045904Q56716k25163M14820K83910n8901p04319O32968J93014l28687n51931
5705F558331r5444R59644j99485l85146o11775K84295L80462J0619L76407P28201
5695H006109m40669j26825r4638J22293Q58432M23215l06170M30943l77071M84788
5685H980407N17135r3907l29605p29121J044217N53580K63946o9564m87943P73922
5675A0423067o39750J028131M98394L89144o50451m74588M81575J58522L01822
5666A1515866l23429P63236L05183j45693m08402o8137j76676K64928M05537k45743
$$ plain form
5734 4393417 4135043 4473224 4630598 6642020 6311876 4904369 5822853 5939425 6014136
5725 6014136 6057380 6062524 5704130 5233417 5363044 5233155 5651752 5621734 5364383 6045904
5715 6045904 6902620 6677457 7092277 7376187 7317286 6612967 7245935 7438949 7110262 6558331
5705 6558331 6462887 7422531 7223046 6837900 6226125 6510420 6890882 6901501 7277908 8006109
5695 8006109 7565440 7438615 7343977 7466270 8324702 8747917 8441747 8872690 8495619 8980407
5685 8980407 9497542 9403635 9074030 8344909 9389126 9942706 10206652 10137088 9649145 10423067
5675 10423067 9783317 10811448 11309842 11698986 11048535 10573947 11055522 11214044 11515866
5666 11515866 11192437 11955673 12260856 12115163 11706761 11638624 11461948 11726876 12132413 11886670
5656A1886670l24269O49046m92724L92218O97015q31746K92829K5543P51264N65834
5646A3611680k68819l29696J77572Q29908K60895j8164K98771q42961J158533
5637A4877719O16911r73986K12173M32332J50640R7290q13542O85348J137421
5628A6422306n13928M79796k85516O79789Q82292o65369m83098Q57393J09528
5619A7483193L19709L12122K84829M94601N5678m07599k22099O19121P30759k60417
5609A9409897N81099J73975J004533M31700J99400O70627P27701l1118M23714
5600B3591528J30455J155911m62525o31945O06457J32822Q33542Q41777k09322
5591B5988700N20356N14762R88964R95984n8499k44533J491619J476089J18460
$$ plain form
5656 11886670 11562401 12211447 11718723 12110941 12807956 11976210 12269039 12294582 13045846 13611680
5646 13611680 13342861 13013165 13190737 14020645 14281540 14263376 14562147 13719186 14877719
5637 14877719 15494630 14520644 14732817 15165149 15315789 15413079 14599537 15284885 16422306
5628 16422306 15908378 16388174 16102658 16782447 17664739 16999370 16516272 17373665 17483193
5619 17483193 17802902 18115024 18399853 18894454 18950132 18542533 18320434 18939555 19670314 19409897
5609 19409897 19990996 20164971 21169504 21601204 21800604 22471231 23198932 23167814 23591528
5600 23591528 23721983 24877894 24415369 23783424 24389881 24522703 25356245 26198022 25988700
5591 25988700 26509056 27023818 28012782 29008766 28950267 28705734 30197353 31673442 31791902
5582C1791902L66289m66772L0068K08661Q6270J771098Q21606J17945j74180L66660
5572C4919547J102498j57743m07117N79280J530797k67387N41642J228549Q19655
5563C9889721Q30049O17295k54884o5417k53772N68030K87161M97395M06784K110
5553D2524472n66973L3938K31317L50344O09275m32719L61340J577144L30203
5544D5018341m6416Q76393M16080M4128K37051M75248J116147J155189R16727
5535E0208888P44551J746640Q08917j95544J184124R86277J715519Q26876J121243
5526E9147491J716792P85649K22834n03741O66891J201509k21410O88712P29156
5517F4433883J14061K83M87441J26923k81323J97140N14795M43887O53218M78573
$$ plain form
5582 31791902 32158191 31691419 31721487 31930148 32016418 33787516 34609122 34727067 34552887 34919547
5572 34919547 36022045 35864302 35457185 36036465 37567262 37299875 37841517 39070066 39889721
5563 39889721 40719770 41337065 41082181 41016764 40762992 41331022 41618183 42115578 42522362 42524472
5553 42524472 41957499 41991437 42222754 42573098 43182373 42749654 43110994 44688138 45018341
5544 45018341 44971925 45848318 46264398 46308526 46545577 47020825 48136972 49292161 50208888
5535 50208888 50953439 52700079 53508996 53313452 54497576 55483853 57199372 58026248 59147491
5526 59147491 60864283 61649932 61872766 61369025 62035916 63237425 63016015 63704727 64433883
5517 64433883 64547944 64548227 65035668 65162591 64881268 65078408 65593203 66037090 66690308 67168881
5507F7168881P78588N53762M81586Q14553K51532M37330K7881L13151m81635n92458
5497F9753171j044121J7864j023138j588042j142336j265339j542996r78982j334708
5488E9851373j234419j513376j135695j323373j570196j683558p31364l63361
5480E0296031j82010k28791j730247j896073n27214j261955m87078p43356j098154
5471D2141153j165901j206980r47461m06512m31928o64285j142998r24560j116572
5462C4133956j055650j756484L38173K6317p81995m44031j532574n03053o43998
5453B7780661r29262j84973n01330M4772k34839r70471L42633n34096k72664k11652
5443B4328779r29648n64299k23996j256370M44678o30393K16019K3801m80693
$$ plain form
5507 67168881 67947469 68501231 68982817 69797370 70048902 70486232 70514113 70827264 70345629 69753171
5497 69753171 68709050 68726914 67703776 66115734 64973398 63708059 62165063 61186081 59851373
5488 59851373 58616954 57103578 55967883 54644510 53074314 51390756 50659392 50296031
5480 50296031 50114021 49885230 48154983 46258910 45731696 44469741 43982663 43239307 42141153
5471 42141153 40975252 39768272 38820811 38414299 37982371 37318086 36175088 35250528 34133956
5462 34133956 33078306 31321822 31659995 31686312 30904317 30460286 28927712 28424659 27780661
5453 27780661 26851399 26666426 26165096 26209868 25975029 25004558 25347191 24813095 24540431 24328779
5443 24328779 23399131 22834832 22610836 21354466 21799144 21168751 21384770 21408571 20927878
5434B0927878m70193n00391J79517J10975m29533l29656o54211j00944K0932M59972
5424A9214346J6764n08631l79652K26359j70935P51198N10468L84924j162956
5415A8881885J156789P17894M23995l93582K39715Q47609l91243k12708j232814
5406B0037540q30282m37001n29324m02125k13489K29565P72984m22082l52646
5397A7853140n87577k22785L27575J27027L97800J784697J62399J63164j52522
5388A9852918J538862J151215N56792J178561J400201J898390K069299K618989
5380C2265227J558890K324345P2494k240661k399148k746419j881480r98980j312201
5371B4642067m59217r52483l91838m58567R7508L38393p53641r88553Q44341J187261
$$ plain form
5434 20927878 20457685 19957294 20136811 20247786 19818253 19488597 18834386 18733442 18754374 19214346
5424 19214346 19231110 18722479 18342827 18569186 18398251 19149449 19659917 20044841 18881885
5415 18881885 20038674 20756568 21180563 20786981 21026696 21874305 21483062 21270354 20037540
5406 20037540 19207258 18770257 18240933 17838808 17625319 17854884 18627868 18205786 17853140
5397 17853140 17265563 17042778 17370353 17497380 17895180 19679877 19842276 20005440 19852918
5388 19852918 21391780 22542995 23099787 24278348 25678549 27576939 29646238 32265227
5380 32265227 33824117 36148462 36220956 33980295 31581147 28834728 26953248 25954268 24642067
5371 24642067 24182850 23230367 22838529 22379962 22477470 22815863 22062222 21073669 21918010 23105271
5361B3105271Q33878J273682P16284K69066Q34018L65595L47569J361898P11855
5352B9819116J497554J259047J418323K403555J869431R50187l62661j859586
5344C6994966k384946l313131j892131j007770j182487p50746n22564L33827J52836
5335B6427854K41405k64137r08106j68002l67611n1612o73468k98407n39741o39928
5325B2758247j1398J198865Q96356m06075r9068R21663R11425Q92771K82597J379160
5315B8724543J121295j531235j340454K46314n21797K37526p03886k40030o37751
5306B5354525J87238j92569l78908P17149j52369N49536k13953p4627j7616K31794
5296B6010200M03148r97206L39868N24295J84341J16232n4690q50491O62018n80991
$$ plain form
5361 23105271 23939149 25212831 25929115 26198181 27032199 27397794 27745363 29107261 29819116
5352 29819116 31316670 32575717 33994040 36397595 38267026 39217213 38854552 36994966
5344 36994966 34610020 31296889 29404758 28396988 27214501 26463755 25941191 26275018 26427854
5335 26427854 26669259 26405122 25497016 25329014 24961403 24909791 24236323 23937916 23398175 22758247
5325 22758247 22746849 23945714 24842070 24435995 24336927 25258590 26170015 27062786 27345383 28724543
5315 28724543 29845838 28314603 26974149 27220463 26698666 26936192 26232306 25992276 25354525
5306 25354525 25541763 25349194 24970286 25687435 25535066 26084602 25870649 25796022 25778406 26010200
5296 26010200 26413348 25416142 25756010 26280305 26464646 26580878 26526188 25675697 26337715 25756724
5286B5756724k02253L96386J27478k39497p39929M47448p24146N12799n90482
5277B4744528j66855J232739k96527r5725J48869j27280j85126k18572k00366
5268B4835685J237345R88604j427684p0730j028383L50231K84486j025128l15393
5259B3829033R30765j065416o80733O01271O07192n08611k36330j30293K10917
5250B3557795k62627Q55937l30449j107564P4626J080983N16382j352068M30806
5241B3463821j0923M10749O1706j189344k39434l41068j40812l0995K37800K31308
5231B2452808j85334q0070O9252J60842n93783R29246p45932l23370O05319N59984
5221B2848962k43013m15254m59549k34403m33726l2426L25780J77664R26753N4731
$$ plain form
5286 25756724 25554471 25950857 26078335 25838838 25098909 25546357 24822211 25335010 24744528
5277 24744528 24577673 25810412 25513885 25418160 25567029 25439749 25254623 25036051 24835685
5268 24835685 26073030 27061634 25633950 25563220 24534837 24885068 25169554 24144426 23829033
5259 23829033 24759798 23694382 23013649 23614920 24222112 23713501 23477171 23346878 23557795
5250 23557795 23295168 24151105 23820656 22713092 22787718 23868701 24385083 23033015 23463821
5241 23463821 23452898 23863647 23925353 22736009 22496575 22155507 22014695 21983700 22221500 22452808
5231 22452808 22267474 22187404 22256656 22417498 21823715 22752961 22007029 21683659 22288978 22848962
5221 22848962 22605949 22190695 21731146 21496743 21063017 21030591 21356371 21534035 22460788 22515519
5211B2515519q84074m22400L06299p47526J40979L27960o91221L76232O62239
5202B1584007n4926L79513J98713K93073m8616o4343r4726l45337J65299n37828
5192B1474829N50954P61293k92184n89033k55170J7375k64191N3859L62600n32926
5182B1287406k41221l33646j31091j70870o46450P67530k9276j13458k6293Q8762
5172B0451393K1117R9893j22890k22387L57037n02059n26878O38447P10709r21954
5162A9982428m28451k29633k21886Q13294l6315N36878J15617Q5252n53975M21345
5152B0484554Q23017n86703l452k60842K58116L34538L09445P03440j185805L44387
5142B1220695K51842k27816j58550k88575m22289N06884p8422r6182K88224N89699
$$ plain form
5211 22515519 21631445 21209045 21515344 20767818 20908797 21236757 20545536 20921768 21584007
5202 21584007 21529081 21908594 22107307 22400380 22351764 22287421 22192695 21847358 22012657 21474829
5192 21474829 22025783 22787076 22494892 21905859 21650689 21668064 21403873 21457732 21820332 21287406
5182 21287406 21046185 20712539 20581448 20410578 19764128 20531658 20502382 20388924 20362631 20451393
5172 20451393 20472510 20572403 20449513 20227126 20584163 20082104 19555226 20193673 20904382 19982428
5162 19982428 19553977 19324344 19102458 19915752 19879437 20416315 20531932 20617184 20063209 20484554
5152 20484554 21307571 20720868 20717416 20456574 20714690 21049228 21358673 22062113 20876308 21220695
5142 21220695 21472537 21244721 21086171 20797596 20375307 20882191 20803769 20707587 20995811 21585510
5132B1585510l96012r40589O34119K88349m29097k47743N12779j08929k94627
5123B0603760L83223k52802n62040J58071l29159m67716J94429m22643p15816
5114A8589307R65454j32078l8829J05322Q74560n64787K71715k94262l60568l86877
5104A9028957K25700M43503m58663j71958l04662O03501p50725k48686N9401r8240
5094A8328128o81796M33019K58890l13281l05966L69318j19809l00624O43051
5085A8310930J70537j72727m23873P49521K48901J73901r2063o05057J53837P29891
5075A9243798L85012J071979M30181l70754L22618L01722m92280M11446j37178
5066B1166544n16617j05963J026778K8709M26240J22298R9874J010656P02426
$$ plain form
5132 21585510 21189498 20248909 20883028 21171377 20742280 20494537 21007316 20898387 20603760
5123 20603760 20986983 20734181 20172141 20330212 20001053 19533337 19727766 19305123 18589307
5114 18589307 19554761 19422683 19383854 19489176 20363736 19798949 20070664 19776402 19415834 19028957
5104 19028957 19254657 19698160 19239497 19067539 18762877 19366378 18615653 18366967 18426368 18328128
5094 18328128 17646332 18079351 18338241 18024960 17718994 18088312 17968503 17667879 18310930
5085 18310930 18481467 18308740 17884867 18634388 18883289 19057190 18965127 18360070 18513907 19243798
5075 19243798 19628810 20700789 21130970 20760216 21082834 21384556 20892276 21303722 21166544
5066 21166544 20649927 20543964 21570742 21599451 22025691 22147989 22247863 23258519 23960945
5057B3960945L64569p21042L92144j52220l80741J90482J44239J007852l73052
5048B4433176o78992O3810Q54756R00812j76712l8367k35840K00922l03045l2427
5038B4988093O93807j15172n04418k49648R90120j88832n09581M79485J172441
5029B6756295N45701q14383j91392l02618L66310n46379O62481k05993P49417
5020B7019439J56086r31540Q45994O6236k22510n60570O33826o78436o9777k67968
5010B5990780P19923O72551J21474N37828j01282o45428m2116J16566k2059O66900
5000B8015137q206P66429N65599o5653r64599L05259L06486K27067P62117K00829
4990C0110465m18685l70265N43170Q68528N41747o57881m17505J727974Q36935
$$ plain form
5057 23960945 24325514 23604472 23996616 23844396 23463655 23654137 23798376 24806228 24433176
5048 24433176 23754184 23817994 24672750 25573562 25396850 25358483 25122643 25323565 25020520 24988093
5038 24988093 25681900 25566728 25062310 24812662 25802782 25613950 25104369 25583854 26756295
5029 26756295 27301996 26487613 26296221 25993603 26359913 25813534 26476015 26270022 27019439
5020 27019439 27175525 26243985 27089979 27156215 26933705 26373135 27006961 26328525 26258748 25990780
5010 25990780 26710703 27383254 27504728 28042556 27941274 27295846 27253730 27370296 27348237 28015137
5000 28015137 28006931 28773360 29338959 29273306 28308707 28613966 28920452 29147519 29909636 30110465
4990 30110465 29691780 29321515 29864685 30733213 31274960 30617079 30199574 31927548 32764483
4981C2764483l84068k03329N06116p4875j91922L85035l7204L10048L07374j48344
4971C3233314M69629J8424L40823L65753J10206N81976Q94293j67829N28659K30348
4961C6605596l80024R49459K105880N77532J086571R2241O44552R55222P57996
4952D3395025J937997J188722J298500J242160J186133J752264J155373j028965
4944E2127209J199470J205894M54849J473522Q07210M72588L78693N06976J316154
4935E9942565K135031J192653Q71534J998735K331734J727342K125094L051949
4927G5376637L200483J711667K410637K645084K675265L888897K412484K881715
4919I7202869K940626K595444K351505K524971K084390J141685J829179J102804
$$ plain form
4981 32764483 32380415 32177086 32683202 32608327 32416405 32801440 32764236 33074284 33381658 33233314
4971 33233314 33702943 33721367 34062190 34427943 34538149 35120125 36014418 35846589 36375248 36605596
4961 36605596 36225572 37175031 39280911 39858443 40945014 41037255 41681807 42637029 43395025
4952 43395025 45333022 46521744 47820244 49062404 50248537 52000801 53156174 52127209
4944 52127209 53326679 54532573 54987422 56460944 57268154 57740742 58119435 58626411 59942565
4935 59942565 62077596 63270249 64141783 66140518 68472252 70199594 72324688 75376637
4927 75376637 78577120 80288787 82699424 85344508 88019773 91908670 94321154 97202869
4919 97202869 100143495 102738939 105090444 107615415 109699805 110841490 112670669 113773473
4911A13773473R56329P07564K52397l37441o55607M108j273919q77677k24236
4902A12324991O4301p48232k28015l4152K09864k98467n66519K78185K70059j052784
4892A10219231j777340j552983k095259k291772l116599l646360l589543l469544
4884H8679831l814528l254737l538566m350169l445061l725439l114333k251264
4876F1185734k881462k134945k293165k650890j476341j911352q19555n31817
4868D6486207j832345j888725j461452n16095j059010j689031l29327j241333
4860C6468889j136904j056701j242221r15161K34702j052653j422812j50135j681700
4851B8045304m53868l013l55469r58139l44419j29214o72088K71015p75255j479891
$$ plain form
4911 113773473 114729802 115437366 115689763 115352322 114696715 114700823 113426904 112549227 112324991
4902 112324991 112389292 111641060 111413045 111378893 111588757 111290290 110723771 111001956 111272015 110219231
4892 110219231 108441891 106888908 104793649 102501877 99385278 95738918 92149375 88679831
4884 88679831 84865303 81610566 78072000 73721831 70276770 66551331 63436998 61185734
4876 61185734 58304272 56169327 53876162 51225272 49748931 47837579 47018024 46486207
4868 46486207 44653862 42765137 41303685 40787590 39728580 38039549 37710222 36468889
4860 36468889 35331985 34275284 33033063 32117902 32352604 31299951 29877139 29727004 28045304
4851 28045304 27591436 27588423 27232954 26274815 25930396 25801182 25129094 25400109 24624854 23144963
4841B3144963L53325j37751r63964r05901L30546K01315l95573k60888n98760
4832B0767312j47986n99103j81688j96028p07700o67752n79539m86217l62050
4823A6839249n69262N15551l46027n93848m64675m50526M30211N0075q06868o13067
4813A3990813p87969K25564p19090M12079J23499m93999p83020p12606j09571
4804A1145700R81522l08390j324225k8192O73070K8892l92119o04196j219110
4795H952952Q24299L42025P789n63437O2941n82834l85875O0512j85299P01395
4785I234468p5022o47085q3621n78666N09905M91095L07129q14995M72746J33279
4775H949233j2503K59370n19568J01781K88449p68707J27724J12575p28286L21180
$$ plain form
4841 23144963 23498288 23360537 22396573 21490672 21821218 22022533 21626960 21366072 20767312
4832 20767312 20619326 20020223 19838535 19642507 18934807 18267055 17687516 17201299 16839249
4823 16839249 16269987 16785538 16439511 15845663 15380988 14930462 15360673 15410748 14603880 13990813
4813 13990813 13202844 13428408 12709318 13121397 13244896 12750897 11967877 11255271 11145700
4804 11145700 12127222 11818832 10494607 10466415 11139485 11168377 10776258 10172062 8952952
4795 8952952 9777251 10119276 10127065 9563628 9626569 9043735 8657860 8718372 8533073 9234468
4785 9234468 9159446 8512361 8428740 7850074 8359979 8851074 9158203 8343208 8815954 8949233
4775 8949233 8936730 9196100 8676532 8778313 9066762 8298055 8425779 8538354 7810068 8131248
4765H131248n30245L19487p9337j45317L68948m76164j06948k41254M6410k01805
4755G085023M36776N49874J47815n67679M61571q12964Q12434J79513n68285l51678
4745G372400k03215j002410L61266J184405j70089l12206p20927O19855q17010
4736F312069l93109L76833O27402m43785j06594Q57815O27235k26025N80053l09609
4726G902285p02026N1592M08517J44001J44864L37655N85297J29171j54520R19850
4716I766686j8482n58483j150674l57544j1288l73678O16377l2815m62632j077016
4706F340451K21138K33074n24032J42880M29537P05993o94868L74356n21280p72623
4696E934626o0221J438248l15412o65055N1246j25605R8275K95299l52687L504
$$ plain form
4765 8131248 7601003 7920490 7841153 7695836 8064784 7588620 7481672 7240418 7286828 7085023
4755 7085023 7521799 8071673 8219488 7651809 8113380 7300416 8112850 8292363 7724078 7372400
4745 7372400 7169185 6166775 6528041 7712446 7542357 7230151 6509224 7129079 6312069
4736 6312069 5918960 6295793 6923195 6479410 6372816 7230631 7857866 7631841 8211894 7902285
4726 7902285 7200259 7251851 7660368 7804369 7949233 8286888 8872185 9001356 8846836 9766686
4716 9766686 9748204 9189721 8039047 7681503 7670215 7296537 7912914 7880099 7417467 6340451
4706 6340451 6561589 6794663 6270631 6413511 6843048 7549041 6854173 7228529 6707249 5934626
4696 5934626 5874405 7312653 6997241 6332186 6383432 6257827 6356102 6651401 6298714 6302218
4686F302218R43905p26845K94246K35018O4399k84220k34127l31535L00590m25045
4676F138604K86171J92381O42617M68945N28165J1473P496o18750n5851k65202
4666G336049k8408N85707j26801j33032J73901J04397m63630m95496P39957R18948
4656H611592O07469k73241l48687N31444j72069m75428J47836l63842l59766J049737
4646H955045J11076J7743P8796L29919L12509J75621k90163l7532R1746q5544
4636I659216q11361L13111Q62069K42194j31123j49134O93185K06843k72896M05151
4626A1017255M4097n15593k82533N09895Q59701k7258l65298J507094m27585r0298
4616A2229477j85925o5175N97627J97194J661193j291170Q24390P08853J60780
$$ plain form
4686 6302218 7246123 6519278 6813524 7048542 7112941 6828721 6594594 6263059 6563649 6138604
4676 6138604 6424775 6617156 7259773 7728718 8256883 8268356 8275852 7657102 7601251 7336049
4666 7336049 7307641 7893348 7766547 7633515 7807416 7911813 7448183 6952687 7692644 8611592
4656 8611592 9219061 8945820 8597133 9128577 8956508 8481080 8628916 8265074 7905308 8955045
4646 8955045 9066121 9083864 9162660 9492579 9805088 9980709 9690546 9653014 9744760 9659216
4636 9659216 8847855 9160966 10023035 10265229 10134106 9984972 10678157 10885000 10612104 11017255
4626 11017255 11061352 10545759 10263226 10773121 11632822 11605564 11240266 12747360 12319775 12229477
4616 12229477 12043552 11978377 12576004 12773198 14434391 13143221 13967611 14676464 14837244
4607A4837244Q6508L29993N05244n62510L7830J948439J094416n16334J56748
4598A7917578P09364L74996J17472P99647J673256O57023O14796j57408k6967
4589B2679757J572416L08137K79993Q64922k9916R17476J179684J487266J477219
4580C0736954P22359O55036J412175N70317m71219J118974J047214Q90286J017286
4571C7699382J891118K077599J550651J258163J181302R44096J051158K301063
4563D9954532J820878J447765J908486J517537L153066K658333K596677K475702
4555F7532976K442848K352508L266475L387136L746434M860048M517385M357302
4547I6463112N467606O906256P830477P147444Q627849J0207252J0650299J2657891
$$ plain form
4607 14837244 14923752 15253745 15758989 15196479 15234309 17182748 18277164 17760830 17917578
4598 17917578 18626942 19001938 19119410 19919057 21592313 22249336 22864132 22706724 22679757
4589 22679757 24252173 24560310 24840303 25705225 25675309 26592785 27772469 29259735 30736954
4580 30736954 31459313 32114349 33526524 34096841 33625622 34744596 35791810 36682096 37699382
4571 37699382 39590500 41668099 43218750 44476913 45658215 46602311 47653469 49954532
4563 49954532 51775410 53223175 55131661 56649198 59802264 62460597 65057274 67532976
4555 67532976 69975824 72328332 75594807 78981943 82728377 87588425 92105810 96463112
4547 96463112 101930718 108836974 116667451 123814895 132442744 142649996 153300295 165958186
4539A65958186J5044078J5682050J8128148J9551851J8653481J8422969J6366002
4532B87806765J3661886J5308428J7013880K0029238K3857444K4227809J9970889
4525D21876339J3710122O998434M194503N025215P756706J2853902J3981795J1532172
4517D97929188L684266p709692j5845626j8723631j6744074j1671557q580804
4510D22338070p336250q223417j6317252k3046286k4888980k4579988k1633175
4503B96312722j6659416j5013428j4403419j5402339j6347989j8475703j9836812
4496A80173616j7095488j4669078j3316398j1521967q025230p458720p124598
4489A00962137o484490n125067n721527n204125l596553m709900l168091l399720
$$ plain form
4539 165958186 181002264 196684314 214812462 234364313 253017794 271440763 287806765
4532 287806765 301468651 316777079 333790959 353820197 377677641 401905450 421876339
4525 421876339 435586461 442584895 446779398 451804613 459561319 472415221 486397016 497929188
4517 497929188 501613454 493903762 478058136 459334505 442590431 430918874 422338070
4510 422338070 415001820 406778403 390461151 367414865 342525885 317945897 296312722
4503 296312722 279653306 264639878 250236459 234834120 218486131 200010428 180173616
4496 180173616 163078128 148409050 135092652 123570685 115545455 108086735 100962137
4489 100962137 94477647 89352580 83631053 78426928 74830375 70120475 66952384 63552664
4481F3552664l789216k273490j910205j929210k315762k656500k066414j455032
4473D5156835k287878j492575j791443q02035j681763j905445L12830q59758j404803
4464C3243965p92989q05154j491574j109534p96168o98728l75993j326761o38846
4455B5208218m68911q70727n37044j64304l00059l29689j622463r68579r51776
4446A8994666o92516r4740O94217r15033n60213J06828n59748j13694k885m75405
4436A6381477o3140p0090r54283q47354K16320j39185p42678j77948L4889p03695
4426A2934313J20413j30322L10953p02859l52542J432443o5217k4566K57402J66275
4416A3946293j02295M4358q19001m76923r56007j376934L71424l11057o52762
$$ plain form
4481 63552664 59763448 57489958 55579753 53650543 51334781 48678281 46611867 45156835
4473 45156835 42868957 41376382 39584939 38782904 37101141 35195696 35508526 34648768 33243965
4464 33243965 32450976 31645822 30154248 29044714 28248546 27549818 27173825 25847064 25208218
4455 25208218 24739307 23868580 23331536 23167232 22867173 22537484 20915021 19946442 18994666
4446 18994666 18302150 18207410 18901627 17986594 17426381 17533209 16973461 16859767 16856882 16381477
4436 16381477 16318337 16248247 15293964 14446610 14662930 14523745 13781067 13603119 13638008 12934313
4426 12934313 13054726 12924404 13235357 12532498 12179956 13612399 13547182 13522616 13780018 13946293
4416 13946293 13843998 13888356 13069355 12592432 11636425 10259491 10630915 10319858 9667096
4407I667096j61851q61014q36813j28513M31285J114326j22616j180005M44542
4398H366437k18378j371108j30037l78535M30301P14559m58752l10659l40659
4389F303169r3108K1488o46650O61017J67636j409089q21503O79489M48606j08088
4379E202967N5972K29876l24410j166447O92758L89030j26248m9547m22144M87186
4369D968993P17583n67203l38934k1790K11949M9451j74910n54262p16095K0811
4359C595593M26649N88125m52024j011389l35631Q37389J047304j184165O9827
4350C581678m42669O28366K69663o73863L45802J07846l34680P83445p82860o61093
4340B821635P42269L7307L85936l88926k63151K72587l51840n69255p12524l5902
$$ plain form
4407 9667096 9505245 8644231 7807418 7678905 8110190 9224516 9101900 7921895 8366437
4398 8366437 8148059 6776951 6646914 6268379 6698680 7413239 6954487 6643828 6303169
4389 6303169 6210061 6231549 5584899 6245916 6413552 5004463 4182960 4862449 5311055 5202967
4379 5202967 5258939 5488815 5164405 3997958 4690716 5079746 4953498 4903951 4481807 4968993
4369 4968993 5686576 5119373 4780439 4758649 4970598 5020049 4845139 4290877 3574782 3595593
4359 3595593 4022242 4610367 4158343 3146954 2811323 3648712 4696016 3511851 3581678
4350 3581678 3139009 3767375 4037038 3363175 3708977 3816823 3482143 4265588 3482728 2821635
4340 2821635 3563904 3601211 3987147 3598221 3335070 3607657 3255817 2686562 1974038 1938136
4330A938136M48492L6770J64999M76358m83051R9265n78762j083897N20383Q91852
4320B430545L39562n66124r7123L40538p42038l82383J97435j70208j26263K29893
4310A453834N26598l75665J56640M73232m92964J167122j27692l63659O2682k86508
4300B193620l2623l98763J14262O58127l77476j080421O61278j082104k16951
4291D38949Q83876O43643K25920n48539l16880j027486J158011K98281m32675
4282A323100L71331L41070L90708n24365k64611J75474L19228m12137k38912m92557
4272I88329L84864j6281m60900m1669P99294n38586R1224J89885k10485N63776
4262A749451k09606j71972p26836P44981K35211N2985O48301p16944J18005J47760
$$ plain form
4330 1938136 2386628 2423398 2588397 3064755 2581704 2680969 2102207 1018310 1538693 2430545
4320 2430545 2770107 2203983 2106860 2447398 1705360 1322977 1520412 1350204 1223941 1453834
4310 1453834 1980432 1604767 1761407 2234639 1741675 2908797 2781105 2417446 2480128 2193620
4300 2193620 2160997 1762234 1876496 2534623 2157147 1076726 1738004 655900 438949
4291 438949 1322825 1966468 2192388 1643849 1326969 299483 1457494 1755775 1323100
4282 1323100 1694431 2035501 2426209 1901844 1637233 1812707 2131935 1719798 1480886 988329
4272 988329 1373193 1356912 896012 854343 1653637 1115051 1206275 1396160 1185675 1749451
4262 1749451 1539845 1367873 641037 1386018 1621229 1674214 2322515 1605571 1723576 1871336
4252A871336L06944M99456p08737K8883J19176j21908Q6669L9227n42985r67499
4242F10562R42457M56893l15123j19963o69262l38423L35063N34061j5704J42359
4232A562920J47327l8849K79586J49110K34822L892Q80397J6277J69891j046667
4222B358706L8088M15514Q64156P07593p01637j455630o72642M83710P09170N64649
4212C311677M37122R4307K23584J78159O51400n31966m65296N12811o12066j06046
4202C693686K3449K05528o21599j31599K78116K69870l40769k06736J59697n17187
4192B812456L5674K35923p03196l92506M01438R12402L1245n90526m42295l24478
4182A976137o25991k8982P607Q88291M45791L92186l58586k24908j33912l44845
$$ plain form
4252 1871336 2178280 2677736 1968999 1997882 2117058 1995150 2081819 2121046 1578061 610562
4242 610562 1553019 2009912 1694789 1574826 905564 567141 902204 1436265 1420561 1562920
4232 1562920 1710247 1671398 1950984 2100094 2334916 2338808 3219205 3235482 3405373 2358706
4222 2358706 2396794 2812308 3676464 4384057 3682420 2226790 1554148 2037858 2747028 3311677
4212 3311677 3748799 3843106 4066690 4244849 4896249 4364283 3898987 4411798 3799732 3693686
4202 3693686 3717135 3922663 3301064 3169465 3447581 3717451 3376682 3169946 3329643 2812456
4192 2812456 2848130 3084053 2380857 1988351 2389789 3302191 3333436 2742910 2300615 1976137
4182 1976137 1350146 1321164 1328771 2217062 2662853 3055039 2696453 2471545 2337633 1992788
4172A992788J96205j54873o44941n91712N01993R96762J65684k25975N0095r08618
4162A377408k56116K63215K04456j0219P04983l163N44172j242735p35552J005696
4152A852145j49924k45480l73406M59580M5476M33217M23631O75503K62446m07558
4142B975630J55876k51443K63561K008203Q15094K27119O9294O2330J350407R17184
4132H593255P15669P4648j020790j139473j574486q47131j191469p84232N67259
4123C393250N28435p24767l51915j262489R0577O22210l46356j23805J62827O76685
4113B664652q89999k65274k33568n24657M47133j26794L33473Q27532m85942K8823
4103A775379K77887m17705m38978K49122J60712j89903k31495m95142M61187L07456
$$ plain form
4172 1992788 2188993 2034120 1389179 797467 1299460 2296222 2461906 2235931 2286026 1377408
4162 1377408 1121292 1384507 1588963 1578744 2283727 2280564 2824736 1582001 846449 1852145
4152 1852145 1702221 1456741 1083335 1542915 1588391 2021608 2445239 3120742 3383188 2975630
4142 2975630 3131506 2880063 3143624 5151827 5966921 6194040 6263334 6325664 7676071 8593255
4132 8593255 9308924 9383572 8362782 7223309 5648823 4801692 3610223 2825991 3393250
4123 3393250 3921685 3196918 2845003 1582514 1673091 2295301 1948945 1825140 1987967 2664652
4113 2664652 1774653 1509379 1275811 751154 1198287 1071493 1404966 2232498 1746556 1775379
4103 1775379 2053266 1635561 1196583 1445705 1606417 1416514 1185019 689877 1151064 1458520
4093A458520K3620q9119j60298j077749l82477J10901N65929j46140k73157L76716
4083D06746J15174k0067j58508q54298O57687l7395j51475P42972J307420J73534
4073B181790j97844k92992m21640J15558N60309p76407J67116n83726j100884
4064c48720L16880P5812L31733r7222P9795M91943N53135p10321L9689j77841
4054E54883K18368O1763Q7470l0075K75171n31391k18024L1563L31901R9070o1320
4043H19379j71249R51974m15679K11145l41919J33934m98835k44485k06831K78225
4033E15659O71378J04249q47941o15637N8069O98525j02432O24836N15986l25360
4023A297332j558995k29023Q00696p5576O69794l01090K2942M82936M7379r20958
$$ plain form
4093 1458520 1482140 1393021 1232723 154974 -227503 -116602 449327 303187 30030 406746
4083 406746 521920 501853 343345 -510953 146734 109339 -42136 700836 2008256 2181790
4073 2181790 1983946 1690954 1269314 1384872 1945181 1168774 1335890 752164 -348720
4064 -348720 -31840 43972 375705 278483 358278 850221 1403356 693035 732724 554883
4054 554883 773251 835014 922484 892409 1167580 636189 418165 449728 781629 880699 819379
4043 819379 648130 1600104 1184425 1395570 1053651 1187585 688750 444265 237434 515659
4033 515659 1187037 1291286 443345 -172292 -114223 584302 481870 1106706 1622692 1297332
4023 1297332 -261663 -490686 310010 234434 904228 603138 626080 1109016 1156395 235437
4013B35437k26207L42191J65718k96862l48061k43537k11620Q30849j32362o28564
4003e13018L04652L04146R9852O79514k7623j027152j32401l57734O20896l81210
3993d30078o88167J32733M40066N67608J67892J66832L51839j35273j13683j86584
3983B73185J77320n91280j39348o8485L71750N2731L57811p9385L07500L57732
3973A019531k94991L59973J39237j402260m4380P10847m4031k35266M95165j18482
3963E85343l06825Q52273L56045k98110r11809l29089N63416J68848K16987l63846
3953E33233J10043J77211j79451K1383J17268K15870j27979p69008M9628Q3815
3943B32013N27726l61358n00519n7479k02393M04824P35171q81692J45459J12945
$$ plain form
4013 235437 9230 351421 517139 220277 -127784 -371321 -582941 247908 115546 -513018
4003 -513018 -208366 95780 195632 875146 847523 -179629 -312030 -669764 -48868 -430078
3993 -430078 -1118245 -985512 -545446 22162 190054 356886 708725 573452 459769 273185
3983 273185 450505 -140775 -280123 -348608 23142 75873 433684 354299 661799 1019531
3973 1019531 724540 1084513 1223750 -178510 -222890 487957 443926 208660 703825 585343
3963 585343 278518 1130791 1486836 1188726 276917 -52172 511244 680092 897079 533233
3953 533233 643276 820487 641036 662419 779687 995557 867578 98570 148198 232013
3943 232013 759739 398381 -102138 -159617 -362010 42814 777985 -103707 41752 154697
3933A54697Q7253L8779o30601l14550K54881Q18818m24231j18092L08183N35472
3923G10609o21519L69771n02699J49528k30634M29882J88794k68730Q20950j046900
3913i48J70802K32619o55130L95506m24532l9553k15509L96469n83184Q45560
3903A22100j95721N68147K5108K48770j64368j214322l93987N68685J409517o56816
3893C17113r68465M75286J03960L37061Q97604K127N2598n28982p18801q4575
3883a15074j69603L34408R74674j68139L04069n15948Q93090O18986r91988o17988
3873E46487j000453O88981j41561j11850m63319m40885M58944P12039N64299n26431
3863B86251O64758k51353L06957n25599l28831P8794J01579K13561q66505k32012
$$ plain form
3933 154697 241950 280729 -349872 -664422 -409541 409277 -14954 -133046 175137 710609
3923 710609 89090 458861 -43838 105690 -124944 304938 493732 225002 1045952 -948
3913 -948 169854 402473 -252657 142849 -281683 -321236 -536745 -140276 -723460 122100
3903 122100 -73621 494526 519634 768404 604036 -610286 -1004273 -435588 973929 317113
3893 317113 -651352 -176066 -72106 264955 1162559 1164686 1217284 688302 -30499 -115074
3883 -115074 -284677 49731 1024405 856266 1160335 644387 1537477 2156463 1164475 546487
3873 546487 -453966 235015 93454 -18396 -481715 -922600 -463656 248383 812682 286251
3863 286251 951009 699656 1006613 481014 152183 230977 332556 546117 -320388 -552400
3853e52400k06078K28629N82712m01989K58943L18035N90967m46779K70060l8692
3843F03408K58176o83n09883k93605l15803O10291N93054k29557k95105L19515
3833G39808r3135K94374p56279j38622J29220j75321J18853l63269l03376K36235
3823c11512M58011L68168m52866l29026M03501K04560L53240q57750k56763M65809
3813D5372j00906M17552L8738l29093N52276k94471q0762m08605M15551k49709
3803E943r6712j86944O47589J266895k46210j72957k77568K45257o56338J75111
3793G04066J27990j03365j52750K46711N1671M8505N4361M20920j78447o86991
3783E32671p83079n84501p7275J05777N35985J261538n45032p47511Q39055M82777
$$ plain form
3853 -552400 -758478 -529849 52863 -349126 -90183 227852 818819 372040 642100 603408
3843 603408 861584 860901 351018 57413 -258390 351901 944955 715398 420293 739808
3833 739808 646673 941047 184768 46146 175366 45 118898 -244371 -547747 -311512
3823 -311512 146499 514667 61801 -267225 136276 340836 694076 -163674 -420437 45372
3813 45372 -55534 362018 400756 71663 623939 329468 248706 -159899 255652 5943
3803 5943 -90769 -277713 369876 1636771 1390561 1217604 940036 1185293 528955 704066
3793 704066 832056 728691 575941 822652 874323 922828 977189 1398109 1219662 532671
3783 532671 -250408 -834909 -912184 -806407 -270422 991116 446084 -301427 537628 1020405
3773A020405q1151r93870j34209P7296N93237n44107K96911j26190K63968m59931
3763h7641l09833L73326L79696K03296k48899M62106O26460l59537n77014L22024
3753G83984L85140K39295j168466J076082J422418o79178j426092M4251K09374
3744H86808q87601l70560J117702N09061L33525p79824q13932K52694L99090l25754
3734C21209J97644o10408l6497N50306j29522M15115M92737l24894P36004m10802
3724A200892P25431l34820p95791l9516k61629N098P90481p01900k85003M42073
3714G45316l61720N24104L2519N21037J63654q03758l53611j031792P1018N08690
3704A5457P303N26025K75064K58349l6839r27772J02751J166070M36148k73896
$$ plain form
3773 1020405 939254 -54616 -188825 -111529 481708 -62399 234512 108322 372290 -87641
3763 -87641 -397474 -24148 355548 558844 309945 772051 1398511 1038974 461960 783984
3753 783984 1169124 1408419 239953 1316035 2738453 2059275 633183 677434 886808
3744 886808 -793 -371353 746349 1255410 1588935 809111 -4821 247873 646963 321209
3734 321209 518853 -91555 -128052 422254 292732 707847 1200584 875690 1611694 1200892
3724 1200892 1926323 1591503 795712 756196 494567 499665 1290146 588246 303243 745316
3714 745316 383596 907700 940219 1461256 1624910 821152 467541 -564251 -493233 15457
3704 15457 22760 548785 823849 1082198 1045359 117587 220338 1386408 1822556 1548660
3694A548660q17837j12728O67645K39355k23461q0613n88721k26365m40959J328403
3684A293379j90196r23062j70510N5430P48154L24321m02982j11611Q0291P02922
3674A406136n45823j133740l42272M34978M50585r4753j46798J70370P54380j49629
3664H03434J65052J066586J87129l0980l57654J99988j113427J71068j181742
3655i0546L83681N60929k12110r7573J02236J33705J12707j79527q61851K91983
3645A43634P24586m74442j22192j94091J005739L57124o91658j43642L13234K83035
3635A201327m58942J53673J60625Q6665l32504l37k62943n85107Q45387J39666
3625I47510k96925k31455J76264N28294O91377r68831m79286J080245L32414L38676
$$ plain form
3694 1548660 730823 618095 1285740 1525095 1301634 1221021 632300 405935 -35024 1293379
3684 1293379 1103183 180121 9611 65041 813195 1137516 734534 622923 703214 1406136
3674 1406136 860313 -273427 -615699 -180721 269864 175111 28313 198683 953063 803434
3664 803434 968486 2035072 2222201 2191221 1833567 2033555 920128 1091196 -90546
3655 -90546 293135 854064 641954 544381 646617 780322 893029 713502 -148349 143634
3645 143634 868220 393778 271586 77495 1083234 1440358 748700 605058 918292 1201327
3635 1201327 742385 896058 1056683 1143348 810844 810507 547564 -37543 807844 947510
3625 947510 650585 419130 595394 1123688 1815065 846234 366948 1447193 1779607 2118283
3615B118283k14330K49568r14518P6512o27337k1756M35600L27278j2074q95391
3605E21835n06747p2848L3377J065109L8031j67128M03711R3512p19463L5881
3595G25270N71064m75995M90562N82155L98079m07517k18641j037773l54173M72203
3585G45234o17532J437790m74884l32542R08483N91065m75294k11557q9675j30183
3575A350905P11450K70933o34088O87831J58533J07894K15686j011622R4122J22413
3565B074057k69028J3640m08733l93298N19212l61234p7028O1144R12623j51611
3555A919744J21851l36315k94722r7396K60337K08485L8959k1589j40646o4739
3545A593969r32145l62094l12292J78422J178946Q94570q39724M77511m83651
$$ plain form
3615 2118283 1903953 2153521 1239003 1315515 688178 666422 1102022 1429300 1417226 521835
3605 521835 15088 -57760 -24383 1040726 1078757 911629 1315340 1408852 689389 725270
3595 725270 1296334 820339 1310901 1893056 2291135 1883618 1664977 627204 273031 745234
3585 745234 127702 1565492 1090608 758066 1666549 2257614 1782320 1570763 1481088 1350905
3575 1350905 2062355 2333288 1699200 2387031 2545564 2653458 2869144 1857522 1951644 2074057
3565 2074057 1805029 1818669 1409936 1016638 1535850 1174616 1097588 1158732 2071355 1919744
3555 1919744 2041595 1705280 1410558 1313162 1573499 1781984 1820943 1799354 1658708 1593969
3545 1593969 661824 299730 -12562 165860 1344806 2239376 1399652 1877163 1393512
3536A393512O02495M33847p12928r86884O21763J46656j87170m01278J35570k23853
3526H21730J020139j80116K98746J61841p14164J92813N73106o60116m0792n64137
3516I09050K19129P20376m2329L96522q02704j92319L82244n14086O3494N27501
3506A666878N48203J36124q99830r629J17006K88175J77475P97736k34464p91629
3496A796045q15466R85662M31611q54460n21446N49037j76626k54419q36338L33227
3486F36827P12067k41806l82840J109783P53072j78726K99991l17570q58552O53498
3476B185744N36227P1684l29527n9921o71781M39519K118l51101o5417j42752
3466A614793K14649M44988J35466K77215K19195n01625k22387K30568k25643M70058
$$ plain form
3536 1393512 1996007 2429854 1716926 730042 1351805 1498461 1311291 910013 1045583 821730
3526 821730 1841869 1661753 1960499 2122340 1408176 1600989 2174095 1513979 1473187 909050
3516 909050 1128179 1848555 1806226 2202748 1400044 1207725 1589969 1075883 1139377 1666878
3506 1666878 2215081 2351205 1451375 1441746 1558752 1846927 2024402 2822138 2587674 1796045
3496 1796045 980579 1966241 2397852 1543392 1021946 1570983 1394357 1139938 303600 636827
3486 636827 1348894 1107088 724248 1834031 2587103 2408377 2708368 2390798 1532246 2185744
3476 2185744 2721971 2793655 2464128 2404207 1732426 2171945 2174063 1822962 1757545 1614793
3466 1614793 1829442 2274430 2409896 2687111 2906306 2404681 2182294 2412862 2187219 2657277
3456B657277k64022Q19393M67245p0657j173955J71369J19418K83707k45237K62642
3446C027180O34207k16407N62989j066480L94675n67309l6368O34286k91998M04069
3436C478844j19933k24445l80684M53288K8023K55277Q90665K65195k94846l16836
3426D034548J8761k54489j23021l9460m38635O08144M30397K57258L6738K97624
3416D827865m02352o38044J143430J34779Q11361l72763n84434k23769j76358
3407D519715n51451O06310m8793Q70052P0613m53928m88556N09318O56479L93223
3397F082982Q18088l78936P12928l14335k60820m01508O04069P72291P7316k68184
3387G443891L61845O42727l012K30085o33649n1544l6427R11650Q94170J205607
$$ plain form
3456 2657277 2393255 3212648 3679893 3609236 2435281 2606650 2726068 3009775 2764538 3027180
3446 3027180 3661387 3444980 4007969 2941489 3336164 2768855 2732487 3366773 3074775 3478844
3436 3478844 3358911 3134466 2753782 3207070 3235093 3490370 4381035 4646230 4351384 4034548
3426 4034548 4053309 3798820 3675799 3636339 3197704 3805848 4236245 4493503 4530241 4827865
3416 4827865 4425513 3787469 4930899 5065678 5877039 5504276 4919842 4696073 4519715
3407 4519715 3968264 4574574 4525781 5395833 5466446 5012518 4523962 5033280 5689759 6082982
3397 6082982 6901070 6522134 7235062 6920727 6659907 6258399 6862468 7634759 7712075 7443891
3387 7443891 7805736 8448463 8445451 8675536 8041887 7990343 7953916 8865566 9759736 10965343
3377A0965343m20256K83506j07560L44823O48157j82405P18328J60385J008748
3368A3419069J27265P40308R32881N75545J326344N80643J23075P83080J282643
3359A9890853Q6006Q3299n65787l44201q1438n217q68516m74538n92809j062927
3349A6064725p55804K15694K25322j012150k8754M09487L27126j5539j416889
3340A4013218R8738j08503j35390m36295l24863o97724K47357O90843M09251k84503
3330A3472129k41724Q33658K51369j039826j812O36780O65051k12003K39211j32632
3320A4470201o07548J091645o12492k30167j46055n5440K70388J581462M23798
3311A6185792j841061j25337J01582m08754O71160K42554k72382k28653N07980
$$ plain form
3377 10965343 10545087 10828593 10721033 11065856 11714013 11531608 12249936 12410321 13419069
3368 13419069 13546334 14286642 15219523 15795068 17121412 17702055 17825130 18608210 19890853
3359 19890853 19976859 20060158 19494371 19150170 19068732 19063515 18194999 17720461 17127652 16064725
3349 16064725 15308921 15524615 15749937 14737787 14709033 15118520 15445646 15430107 14013218
3340 14013218 14111956 14003453 13868063 13431768 13106905 12409181 12656538 13347381 13756632 13472129
3330 13472129 13230405 14064063 14315432 13275606 13273794 13910574 14575625 14363622 14602833 14470201
3320 14470201 13862653 14954298 14341806 14111639 13965584 13910144 14180532 15761994 16185792
3311 16185792 14344731 14219394 14320976 13912222 14583382 14825936 14553554 14324901 14832881
3302A4832881q42830o917K83681k03018K41875j44216j18965n14896k66717j06234
3292A3154644l73835L4809l96862Q88453l07303J59667k49442n37472q80272k03352
3282A1289035k68130J81152P40179L37127l40137k51345K34812r2205o76961k70753
3272A0882774l33074k07630O6370m94133L58852m43422k2674K81187j000843n45378
3262H542029Q43789J190086o32193j145900k67438P03201P71632o82295N39367
3253I862278N8525r24590K71498L84377L12286n95472m67428K92649M41543o4385
3243I571281J39378J581934O06068O6473L61804k8954J003863J218682J534225
3234A6054754N81427J955779K172025K048333K807844K155979J525893p28278
$$ plain form
3302 14832881 13990051 13983134 14266815 14063797 14305672 14161456 14042491 13527595 13260878 13154644
3292 13154644 12780809 12815618 12418756 13307209 12999906 13159573 12910131 12372659 11492387 11289035
3282 11289035 11020905 11202057 11942236 12279363 11939226 11687881 11922693 11830488 11153527 10882774
3272 10882774 10549700 10342070 10408440 9914307 10273159 9829737 9807063 10088250 9087407 8542029
3262 8542029 9385818 10575904 9943711 8797811 8530373 9233574 10005206 9322911 9862278
3253 9862278 9920803 8996213 9267711 9652088 9964374 9368902 8901474 9194123 9635666 9571281
3243 9571281 9710659 11292593 11898661 11965134 12326938 12297984 13301847 14520529 16054754
3234 16054754 16636181 18591960 20763985 22812318 25620162 27776141 29302034 28573756
3226B8573756l453441l412619k391728j301348j272924j299848q06478k81340
3218A4354030l29007m11821Q06045l07426j93388J74786M25277Q78213P72435
3209A6169144L79626O48364J586228P63397K428948K764047Q07037J846086K548279
3200B9941156L757514L204018M255057N129093L09351m009604p107052n364997
3192C0114536l707800l351154j503814j401440r61924l52729j838461j940605
3184A5056609P78087j047893j732436l22150j1506j299123J97899J072012O48546
3175A3340045K36721K88026Q05230P33080P87912R30143K71111J591262K484008
3166B1467538J568956J318984k69024k126019k506927k890667k064821j568952
$$ plain form
3226 28573756 25120315 21707696 19315968 18014620 16741696 15441848 14635370 14354030
3218 14354030 14025023 13613202 14419247 14111821 13918433 14093219 14518496 15396709 16169144
3209 16169144 16548770 17197134 18783362 19546759 21975707 24739754 25546791 27392877 29941156
3200 29941156 33698670 36902688 41157745 46286838 46596189 42586585 35479533 30114536
3192 30114536 26406736 23055582 21551768 20150328 19188404 18835675 16997214 15056609
3184 15056609 15834696 14786803 13054367 12732217 12720711 11421588 11619487 12691499 13340045
3175 13340045 13576766 13864792 14670022 15403102 16191014 17121157 17392268 18983530 21467538
3166 21467538 23036494 24355478 24086454 21960435 19453508 16562841 14498020 12929068
3158A2929068j135311j168676m74798l81096o14818p51577o15492n18240N09337
3149G778397l40346k19677j846652m07865J051525q56497m28824n99664j53884
3140C976513Q87256J017876M9860j091831p0690j84169j02021P9674o50655O42092
3130D553905N353K56128R0948p28850n84765K82830Q54952l86322o87900M33271
3120D089550j30197p84478L99691m14512k97505K46037j59336k63951J62498M51019
3110C298816K01144l4532l41791j47088P1446n87553m8138M32768J12579j87531
3100B770120n83688M4444j29471k5303l04613j45626O21063L43378k64331K30845
3090B556818n91401R57483P81434q51134o27650N79373j70214L37683k26788o59346
$$ plain form
3158 12929068 11793757 10625081 10150283 9769187 9154369 8402792 7787300 7269060 7778397
3149 7778397 7438051 7218374 5371722 4963857 6015382 5158885 4730061 4130397 3976513
3140 3976513 4863769 5881645 5931505 4839674 4768984 4584815 4482794 4562468 3911813 4553905
3130 4553905 4559258 4815386 4906334 4177484 3592719 3875549 4730501 4344179 3656279 4089550
3120 4089550 3959353 3174875 3574566 3160054 2862549 3108586 2949250 2685299 2847797 3298816
3110 3298816 3499960 3465428 3123637 2976549 3047995 2460442 2412304 2845072 2957651 2770120
3100 2770120 2186432 2230876 2101405 2076102 1771489 1625863 2246926 2590304 2325973 2556818
3090 2556818 1965417 2922900 3704334 2853200 2225550 2804923 2634709 2972392 2745604 2086258
3080B086258l07022j48836K59439L14703r1187k80551N05988O7760m35062l05435
3070A666055K94987K2773L47303L84628m57828J53606m76021O46179L49775M5200
3060B976657l25764m74683k65447K0603m10921J21497P84302M07960K20519K87802
3050C342525o6183K68425j10241k61798M42925K0014j10010J029992L33691j691299
3040C198041Q27936J009716j304945K61668L47221n95934n66240K41017N54219
3031C972699M33681q1304L80132m32288M21333k58163K46717L04206k44042J101994
3021E844965p04121k36904N86744P12177J64754m20360J14862R17369j395576
3012E583910o72222K50405J090363J21053n50771l02590j14876l45020P94886
$$ plain form
3080 2086258 1779236 1630400 1889839 2204542 2113355 1832804 2338792 2406552 1971490 1666055
3070 1666055 1961042 1983815 2331118 2715746 2257918 2411524 1935503 2581682 2931457 2976657
3060 2976657 2650893 2176210 1910763 1931366 1520445 1641942 2426244 2834204 3054723 3342525
3050 3342525 3276342 3544767 3434526 3172728 3615653 3635667 3525657 4555649 4889340 3198041
3040 3198041 4025977 5035693 3730748 3992416 4339637 3743703 3177463 3418480 3972699
3031 3972699 4406380 4325076 4705208 4272920 4694253 4436090 4682807 4987013 4742971 5844965
3021 5844965 5140844 4903940 5490684 6202861 6367615 5947255 6062117 6979486 5583910
3012 5583910 4911688 5162093 6252456 6373509 5822738 5520148 5405272 5060252 5855138
3003E855138O82639J26710j18912K96547r07441l704P31528N27344J09174K20139
2993G519162q6787j249389P89429m91773k73637J11710Q36167j74755l14461L66634
2983G032300n07087K27597l93873J50904M52170r90050M08409J97210m08792m68612
2973E700176k19902O36159k85698K10037M51939k83191K68606J16720q1917n08458
2963F004471J10243O1935l50674O81323J61541N31530K104q47346K7673n50382
2953E832418M63073k82384k90781k79482j63287Q95617K72347N77284r51102j34446
2943E939257l88444K04300k59522J366339m47299j86276m24320m61965m69320
2934D872750J1506O80700N79010J18163J61979q55397p54379J158014R2875m56115
$$ plain form
3003 5855138 6537777 6664487 6545575 6842122 5934681 5930977 6662505 7189849 7299023 7519162
2993 7519162 7432375 6182986 6972415 6480642 6207005 6318715 7154882 6980127 6665666 7032300
2983 7032300 6525213 6752810 6358937 6509841 6962011 5971961 6380370 6577580 6168788 5700176
2973 5700176 5480274 6116433 5830735 6040772 6492711 6209520 6478126 6594846 6512929 6004471
2963 6004471 6114714 6176649 5825975 6507298 6668839 7200369 7202473 6355127 6382800 5832418
2953 5832418 6295491 6013107 5722326 5442844 5279557 6175174 6447521 7024805 6073703 5939257
2943 5939257 5550813 5755113 5495591 6861930 6414631 6228355 5804035 5342070 4872750
2934 4872750 4884256 5564956 6143966 6262129 6424108 5568711 4814332 5972346 6065221 5609106
2924E609106m17919o48270m03064L30562K33444M24645L64208j583324j39716
2915C769672M74107l47613J50720L19532R80141p27030m83318M4170K31057o43118
2905C768320q01967K15978k46889K83366m8313j69503K44069J02770M85882q43289
2895B990424n54662o33401O55080n4935o3753n03772N33393l7974Q0332J07106
2885B517838j25939l02088k96644p34304m01500J27611J55534O947L85282L07492
2875A640229O32909p94632l9945K13428P84709O23270j190394k33912k92072j062771
2865B80819L72476P31403Q12973q30024l65959r9566l10635K08425K8834J06246
2855I34992m6546K22828j12955M45711K46904N33295p00712j084008q0948l36156
$$ plain form
2924 5609106 5191187 4542917 4139853 4470415 4703859 5128504 5492712 3909388 3769672
2915 3769672 4243779 3896166 4046886 4366418 5346559 4619529 4136211 4180381 4411438 3768320
2905 3768320 2966353 3182331 2935442 3218808 3170495 3000992 3245061 3347831 3833713 2990424
2895 2990424 2435762 1802361 2457441 2402506 2338753 1834981 2368374 2330400 2410732 2517838
2885 2517838 2391899 2089811 1793167 1058863 657363 784974 940508 947455 1332737 1640229
2875 1640229 2273138 1478506 1438561 1651989 2436698 3059968 1869574 1635662 1343590 280819
2865 280819 653295 1384698 2197671 1367647 1001688 902122 591487 799912 828746 934992
2855 934992 888446 1111274 998319 1444030 1690934 2224229 1523517 439509 358561 22405
2845B2405L16464O25123l65601n73388p00078N32655r0429N96472j53231m87310
2835b76918m29034J61077J015646k8716j42617L15429q72324J85791l85517N44525
2825H7342J82817O7938R57829l2968j091656q83977N1686m75153l7983J10121
2815a064004j71693O13414M7835m19740l2478J245629n02861n91060J12527l06171
2805a068602P50017L71488J20533K62933K17588m90826j192563l6243N34922P01014
2795A70261N49733k37578K6401j05515Q15583n39169O73129m03194m50851k2084
2785D76716N2556n60527k08329K23872p24958M29754m4363P2261o383J67427J20042
2774a932M04113l12380q05164O23633L15564k53810j12265l42372l01922J50614
$$ plain form
2845 22405 338869 963992 598391 25003 -675075 -142420 -232849 363623 210392 -276918
2835 -276918 -705952 -544875 470771 442055 299438 614867 -257457 -71666 -457183 87342
2825 87342 270159 338097 1295926 1262958 171302 -712675 -660989 -1136142 -1174125 -1064004
2815 -1064004 -1235697 -622283 -574448 -994188 -1026666 218963 -283898 -874958 -762431 -1068602
2805 -1068602 -318585 52903 173436 436369 653957 163131 -1029432 -1065675 -530753 170261
2795 170261 719994 482416 508817 403302 1218885 679716 1352845 949651 498800 476716
2785 476716 529272 -31255 -239584 -15712 -740670 -310916 -355279 -283018 -289401 -121974 -1932
2774 -1932 402181 89801 -715363 -91730 223834 -29976 -142241 -484613 -786535 -635921
2764f35921Q89663m63778K98613n57873M106L74755j32797L23429j0089L0720
2754A20828j151702Q00698J03217k93879O23773j79033k38724j81588q7027N14946
2744C1509J9439k65053K07447Q76089n21604o36976l30136k36988P08354K48195
2734A00276l71298j39823l85418j45696M79378J18787m714L72444K65759q00219
2724e10524m72825O53847Q34750r92678l93092L19085K39267L27216m57346j26220
2714e78520M47104K07816l53126q4592J238270m81637l36988J83645j46727k73899
2704a78654J14575N71565l49028r93376L76466p4108P64K40955P46263L1681m48177
2693C8926m45175M46422j13087j180806L11452M30652N60260Q9646J48841m78834
$$ plain form
2764 -635921 253742 -210036 88577 -469296 -465190 -90435 -223232 100197 90108 120828
2754 120828 -1030874 -230176 -126959 -420838 202935 23902 -214822 -396410 -483437 31509
2744 31509 50948 -214105 -6658 869431 347827 -289149 -619285 -856273 -147919 100276
2734 100276 -271022 -410845 -796263 -941959 -462581 -343794 -348508 23936 289695 -510524
2724 -510524 -983349 -329502 505248 -487430 -880522 -561437 -322170 5046 -452300 -578520
2714 -578520 -131416 76400 -276726 -361318 876952 395315 58327 241972 95245 -178654
2704 -178654 -64079 507486 158458 -834918 -458452 -532560 -531796 -290841 455422 487103 38926
2693 38926 -406249 40173 -72914 -1253720 -942268 -511616 48644 138290 287131 -191703
2683a91703L19037J80949L85695m57226n12935R52640n79453n47800L12194j4235
2673a52837q18812j15384J296189o80866n80402J49862J49671M1061M87841m17238
2663f40915J01563J17528M08929J073347k57340O6113r52357j02230R06506r18199
2653a97055l49372O45296n18401L62116o35579J69953K15205j122839J027942
2644d02734K88142J53830q74065k72419O64954J194010l53189n501j410283o51279
2634a668534R95760M39771O4837n13560J61026K21500l31613J97367j83996L57861
2624b59581K25411o99659N59407m66201L84272m57440j00020J49449k5437o91331
2614a381130J2860L60213J83425J28248l09933K22680q4150R0037M83987L8337
$$ plain form
2683 -191703 127334 308283 693978 236752 -276183 676457 97004 -450796 -138602 -152837
2673 -152837 -971649 -1087033 209156 -471710 -1052112 -902250 -752579 -711518 -223677 -640915
2663 -640915 -539352 -421824 -12895 1060452 803112 869225 -83132 -185362 721144 -197055
2653 -197055 -546427 98869 -419532 -57416 -692995 -523042 -307837 -1430676 -402734
2644 -402734 -114592 39238 -834827 -1107246 -442292 751718 398529 393028 -1017255 -1668534
2634 -1668534 -672774 -233003 -168166 -681726 -520700 -299200 -630813 -433446 -617442 -259581
2624 -259581 -34170 -733829 -174422 -640623 -256351 -713791 -813811 -664362 -689799 -1381130
2614 -1381130 -1368270 -1008057 -824632 -696384 -1006317 -783637 -867787 -777750 -293763 -255426
2604b55426k34615N05441o43134N0106M97971m36088N8711j38272M67612o05347
2594g33041N03100L22080q64391L76446j57279R8781J68465K57973m02312Q0932
2584c49246j007859j67096J91762P17936J038416r91054j34432O51750Q276J55741
2574A14194n12241o12579J204213p21709n07039r2959N2894j09171J026285l19602
2564d77714P64259J74712j034495M00610m16061q4632K68491j018789O62486j38465
2554h99598M09610J242546p76257k11861o93076k494N921K02976K37040R1069
2544c94124J74041N48017K01988m11285j15032J09097J74258M88430l55782l50128
2534F9480j52768N20226K9148m661m90575k83320L0823M4301n89362K11402N34685
$$ plain form
2604 -255426 -490041 15400 -627734 -577628 -79657 -515745 -457034 -595306 -127694 -733041
2594 -733041 -229941 92139 -772252 -395806 -553085 -454304 -285839 -27866 -430178 -349246
2584 -349246 -1357105 -1524201 -1332439 -614503 423913 -567141 -701573 -49823 -41547 114194
2574 114194 -398047 -1010626 193587 -528122 -1035161 -1128120 -1075226 -1184397 -158112 -477714
2564 -477714 286545 461257 -573238 -172628 -588689 -673321 -404830 -1423619 -761133 -899598
2554 -899598 -489988 752558 -23699 -235560 -928636 -931130 -925209 -722233 -485193 -394124
2544 -394124 -220083 327934 529922 118637 3605 112702 286960 775390 419608 69480
2534 69480 -83288 436938 466086 461425 -29150 -312470 -281647 -237346 -826708 -615306 -80621
2523h0621J95028L03383j70670O7930m90695j60901L60656m70303p49549R44710
2513b51032Q96647l63158n04430O92510o29894n92650O763K87665n3278r5707
2503f06564O25270j16482K2534n6049l99842L44476q2967j58674L72695k01391
2493b56994m0635J71718k60738l04494L6768K40364J52338J80765J39052n36029
2483d77885r38984M64669M73263k4777p67897O98027n83163q0188P72595k0189
2473d84529J45834R1383O02177L37485j009972n25705N44477j00895j18610j88440
2463g06795N35532m0113l02358m64056L27930j08022R08064o93637O55835o89236
2453e76856m29622r54557L7503J295305J11914R16059L68620o8248M00583o86881
$$ plain form
2523 -80621 114407 417790 247120 315050 -175645 -336546 24110 -446193 -1195742 -251032
2513 -251032 645615 282457 -221973 470537 -159357 -752007 -745244 -457579 -510857 -606564
2503 -606564 18706 -97776 -75242 -131291 -531133 -186657 -269624 -428298 -55603 -256994
2493 -256994 -297629 -125911 -386649 -691143 -654375 -414011 -261673 -80908 58144 -477885
2483 -477885 -1416869 -952200 -478937 -503714 -1271611 -573584 -1156747 -1236935 -464340 -484529
2473 -484529 -338695 -247312 354865 692350 -317622 -843327 -298850 -399745 -518355 -706795
2463 -706795 -171263 -211376 -513734 -977790 -649860 -757882 150182 -543455 112380 -576856
2453 -576856 -1006478 -1961035 -1923532 -628227 -516313 399746 768366 700118 1100701 413820
2443D13820m35933m31176N14316M60662j183149k19611M79233L94293J89261R6386
2433B78102n53693l67377O29806k14803r3771p24849r3075J21055J88007J98112
2423f32486K57747P16417k09643j49003j45334M26841J44333J64652k37203k59508
2413G6813o80957k26116p46605J157213L30667L40292p95503o54050p77788J027043
2403i48991L43309o24226j02749N23641O00623K89946q84068M72643L57744J12335
2393A40207q34837Q78686O61563p01920L35241o0015m35988n84041m77263O92350
2383c86017P75392l43897j06326o2901k64689P88635J56158q98269l0502p95478
2373a167894k70613n0335J065210J19399k48322Q9490Q86808n82092J27185J48580
$$ plain form
2443 413820 -22113 -453289 61027 521689 -661460 -881071 -401838 -7545 181716 278102
2433 278102 -275591 -642968 -13162 -227965 -321736 -1046585 -1139660 -1018605 -830598 -632486
2423 -632486 -374739 341678 132035 -16968 -162302 264539 408872 573524 336321 76813
2413 76813 -604144 -830260 -1576865 -419652 -88985 251307 -544196 -1198246 -1976034 -948991
2403 -948991 -605682 -1229908 -1332657 -809016 -208393 81553 -802515 -329872 27872 140207
2393 140207 -694630 184056 845619 143699 478940 418925 -17063 -601104 -1078367 -386017
2383 -386017 389375 45478 -60848 -123749 -388438 400197 556355 -341914 -372416 -1167894
2373 -1167894 -1438507 -1488842 -423632 -304233 -552555 -463065 423743 -158349 -31164 117416
2363A17416K29799N06834q50244m0099M55616K05154l79931l27423o9029M19384
2353B67477J063372o01701l63515n21581n2276p07673L19199M45587M19072M15064
2343F83025l95065m64783L69791J67817j01375j119719Q37040k14622K43061O66710
2333F71880l88634n68792j92982M79751l51620P85069L794j158215J205610p2971
2323D12890j126416j48816J233976M69937j26877R72304M7421n21010j486980
2314b73571O54746R05443n69265p64862R79291K84828j101987n2765k11676L53713
2304B03895M58426p70391K76462K65863J72942M89311K50721q47515m45948M46335
2294E00101M87637P53648J31311j002036O04916j66098k56704O36336O26589J0596
$$ plain form
2363 117416 347215 854049 3805 -36294 419322 624476 244545 -82878 -151907 267477
2353 267477 1330849 729148 365633 -155948 -208224 -915897 -596698 -151111 267961 683025
2343 683025 287960 -176823 192968 360785 259410 -860309 -23269 -237891 5170 671880
2333 671880 283246 -285546 -478528 1223 -350397 434672 438466 -719749 485861 412890
2323 412890 -713526 -862342 371634 841571 714694 1686998 1734419 1213409 -273571
2314 -273571 381175 1286618 717353 -47509 931782 1216610 114623 61858 -149818 203895
2304 203895 662321 -108070 168392 434255 607197 1096508 1347229 499714 53766 500101
2294 500101 987738 1741386 1872697 870661 1475577 1309479 1052775 1689111 2315700 2326296
2284B326296j99369l09575O45006j34618n20832J96575Q19143j27926J39987L59296
2274C193983O72991J72651R7722l56538k0374l61213J99992M08665K80008L24041
2264D611928J460636m53470J0832O75444r7225R79070P04781L33736Q89776l68882
2254H746626J37365J027906M45566J474962J532594R88814M87154J708915J157725
2245A7707627K715332J547284K967079L069137L378340M303492M953275N544253
2237D6185819Q019030Q350729O608709J817446o332098j3073203j0103258n862900
2229C5610274n104077m909755l389511j385699j604757j347100j051039j585976
2221A5232360j683711k88828j231144j009600j062048p71013j536499N13096L36824
$$ plain form
2284 2326296 2126927 1817352 2462358 2327740 1806908 2003483 2822626 2694700 2834687 3193983
2274 3193983 3866974 4039625 4137347 3780809 3760435 3399222 3599214 4007879 4287887 4611928
2264 4611928 6072564 5619094 5629926 6305370 6208145 7187215 7891996 8225732 9115508 8746626
2254 8746626 8883991 9911897 10357463 11832425 13365019 14353833 14840987 16549902 17707627
2245 17707627 20422959 21970243 24937322 28006459 31384799 35688291 40641566 46185819
2237 46185819 54204849 62555578 69164287 70981733 64649635 51576432 41473174 35610274
2229 35610274 30506197 25596442 22206931 20821232 19216475 17869375 16818336 15232360
2221 15232360 13548649 13259821 12028677 11019077 9957029 9186016 7649517 8162613 8499437
2212H499437j032819k6180n86213o43772r32732n58465r11130j00975n9838l28739
2202C318574O5558N91259o40383m06888K00966o28318j7311l32659j34743n44515
2192A471540n35371J159284Q27807Q0247j80088l02106m28501R6911q91582j98010
2182A100131J030945j27172j78480j21149n32637K9927K53174K26781J01872q76828
2172I06564N6231m81359N4269J39429J42504L95199p92502K86825p42079K22702
2162A87783K01156k81444J36633m15415J73762Q81963N42387j263042l72028M76959
2152B68714j43914N1848l95898k0640N12420M35517r64305n36685R86407N51564
2142G45028k820r45786P69026n17424q7512m81233J014375Q92081j334269n23640
$$ plain form
2212 8499437 7466618 7440438 6854225 6210453 5277721 4719256 3808126 3707151 3647313 3318574
2202 3318574 3384132 3975391 3335008 2928120 3129086 2500768 2483457 2150798 2016055 1471540
2192 1471540 936169 2095453 2923260 3003507 2823419 2521313 2092812 2189723 1298141 1100131
2182 1100131 2131076 2003904 1825424 1704275 1171638 1201565 1454739 1681520 1783392 906564
2172 906564 962795 481436 535705 675134 817638 1212837 420335 707160 -34919 187783
2162 187783 388939 107495 244128 -171287 2475 884438 1426825 163783 -208245 268714
2152 268714 124800 176648 -219250 -239890 272530 708047 -256258 -792943 193464 745028
2142 745028 742208 -203578 565448 48024 -39488 -520721 493654 1385735 51466 -472174
2132d72174O48812J67716N01478L65385k66299n05790p74451M70291l20898m6524
2122b32454m02299N04102k58021O0013j31016J61063P30166M10069p32182r85241
2112h75800l05992J04988P21973N7033J071859N58735K12298q01441p3154N28253
2102A198752J37631j085649Q701m9009m68225M93273J85220L35682n39232j90398
2092B6746k70830m23157R49133M04798l39408N59637r75522j97868Q3550j89779
2082c72700N84291P69987r20733p20362N60840l40440M98156L52231j202193o96168
2072a487091N75231m46568M86721j15814j7921M95436k9452l7425P34206M0317
2062A97640j96295J01461n6451m99919L29159J70068j61185J84523k94688O83653
$$ plain form
2132 -472174 176638 344354 845832 1211217 944918 439128 -335323 134968 -185930 -232454
2122 -232454 -634753 -130651 -388672 -328659 -459675 -298612 431554 841623 109441 -875800
2112 -875800 -1181792 -1076804 -354831 -297798 774061 1332796 1545094 743653 670499 1198752
2102 1198752 1336383 250734 259435 210426 -257799 235474 420694 756376 217144 26746
2092 26746 -244084 -667241 281892 686690 347282 906919 -68603 -266471 -182921 -372700
2082 -372700 211591 981578 60845 -659517 -98677 -439117 59039 411270 -790923 -1487091
2072 -1487091 -911860 -1358428 -871707 -987521 -1005442 -510006 -539458 -576883 157323 197640
2062 197640 1345 102806 46355 -453564 -124405 45663 -115522 69001 -225687 457966
2052D57966K08300l59879l22905j44793L07849j381295l74013J44893P65447O33173
2042f5257K92119l76165j704111J066442N75078N75188j65087j106510R1706L57247
2032d59350j55224o4454l97750r21955N00538J001758l64103O24047k59249K00318
2022b95424m12641L20640M03736m01110l45047L39350k97838K0932J29826J68678
2012c68898N19636R1027n37105l40469K88180m17619r31218K89703N82208J38999
2002f85556n0912L32962k1087P03576r43580L64031O98975n42750j75185n91563
1992i11089n42113J7359J018622k5999M13451J25173j02276q46123j57844k44079
1982a254918o71726J527907P21553L28899p2139j203537O83972J29183j42239
$$ plain form
2052 457966 666266 306387 -16518 -161311 146538 -1234757 -1608770 -1463877 -698430 -65257
2042 -65257 226862 -149303 -1853414 -786972 -211894 363294 198207 -908303 -816597 -459350
2032 -459350 -614574 -679028 -1076778 -1998733 -1498195 -496437 -860540 -236493 -495742 -295424
2022 -295424 -708065 -387425 16311 -384799 -729846 -390496 -688334 -667402 -537576 -368898
2012 -368898 150738 241765 -295340 -635809 -347629 -765248 -1696466 -1406763 -824555 -685556
2002 -685556 -736468 -403506 -424593 278983 -664597 -300566 398409 -144341 -319526 -911089
1992 -911089 -1453202 -1435843 -417221 -443220 -29769 95404 -6872 -852995 -1010839 -1254918
1982 -1254918 -1926644 -398737 322816 651715 579576 -623961 60011 189194 46955
1973D6955j28774K29354j67799Q20741j89997m21480r4532P50699n3237M3163
1963H35093j136043j36378L27916m96477O22376l19491J99844q9600j41796O87494
1953C52938k79229J69782k01985j61045p9886o81465J22782J013992l58171l32120
1943d34407n10032L59439Q1272q8202p895O34630K68303n74572k64253l7149N39863
1932c3003l83632j89418P6845Q0348M34117k73905k81389j10717K69724L73588
1922c7442M11007K82843m36051m73635o95473N91563M17132L87366n95185N19933
1912C72058j279171m53247K32332R87228L06765n48294m09342J54130M26247J27973
1902h3321n5974m94555m6371J13004n527K83603N02823j23703J47764m96623n63202
$$ plain form
1973 46955 -81819 147535 -20264 800477 610480 189000 94468 845167 791930 835093
1963 835093 -300950 -437328 -109412 -605889 16487 -303004 -103160 -192760 -334556 352938
1953 352938 73709 243491 41506 -119539 -199425 -880890 -758108 255884 -102287 -434407
1943 -434407 -944439 -585000 -503728 -591930 -599825 34805 303108 -271464 -535717 -572866 -33003
1932 -33003 -416635 -606053 -529208 -448860 -14743 -288648 -570037 -680754 -411030 -37442
1922 -37442 373565 656408 220357 -253278 -948751 -357188 59944 447310 -147875 372058
1912 372058 -907113 -1360360 -1128028 -140800 165965 -382329 -791671 -637541 -211294 -83321
1902 -83321 -139295 -633850 -680221 -567217 -572744 -289141 213682 89979 237743 -258880 -822082
1891h22082K14345R06451o31269j13200L66837o97642o80847K87505Q97237q8061
1881c60726K17421K76219j04881q74614m32794N99375J158200p96276l55877J58380
1871e15573j9710Q3613m0009N08572Q4748M7458j44027m51598P9952K04225l6741
1860a99090O16637j053942l75902K88033P4071n18921O40125N52209p09003l79953
1850a065736J83738k2891p31920K41527R62278R5215n72711N29152L97781Q2542
1840I8975q41402q61239P18071M26641m81365Q30568J1670k48032o29182o43083
1830a618378J153006K59759K80618l12302J64590n0873k84714L17777n2299l80472
1820e23288K91445m28013Q36593Q24844n86342o98187m98604N42157l27857k84564
$$ plain form
1891 -822082 -607737 298714 -332555 -445755 -78918 -776560 -1457407 -1169902 -272665 -360726
1881 -360726 -143305 132914 28033 -846581 -1279375 -680000 478200 -318076 -673953 -515573
1871 -515573 -535283 -451670 -491679 16893 101641 149099 5072 -446526 -366574 -162349 -199090
1860 -199090 417547 -636395 -1012297 -724264 -650193 -1169114 -528989 23220 -685783 -1065736
1850 -1065736 -881998 -904889 -1636809 -1395282 -433004 -337789 -910500 -381348 16433 98975
1840 98975 -742427 -1603666 -885595 -458954 -940319 -109751 -98081 -346113 -975295 -1618378
1830 -1618378 -465372 -205613 75005 -237297 -72707 -123580 -408294 -90517 -142816 -523288
1820 -523288 -231843 -659856 176737 1001581 415239 -282948 -781552 -239395 -567252 -851816
1810h51816n1066M92852L13983K16516l04674N7298r8633K95712K06698j492745
1800a215875J047553J028227j013454m4727n06228l91617j39489K04410P27015
1791c04185k74163M9593K78303M08961j027025n76014J300709J11708j63059m73133
1781f68305O76610r7851m50202J84720O71879n5901k3575k46587j235904R0828
1771a154288J115033K10595l7494p2761L01378O9960p18468k39510n8997N54750
1761b9802q58457p97871P91074M60691J68556n3879O3835J20949r38706J34199
1751i39411Q66780K21739n03140l66547j83442M53047k22057J40096l23524j3266
1741h69725O16161l42112m6205M30569j25761j56702j318954L90988J060246K15540
$$ plain form
1810 -851816 -902882 -410030 -96047 120469 -184205 -126907 -225540 70172 276870 -1215875
1800 -1215875 -168322 859905 -153549 -198276 -704504 -1096121 -1235610 -1031200 -304185
1791 -304185 -578348 -528755 -250452 158509 -868516 -1444530 -143821 -32113 -195172 -668305
1781 -668305 8305 -89546 -539748 -355028 316851 260950 237375 -9212 -1245116 -1154288
1771 -1154288 -39255 171340 133846 61085 362463 432423 -286045 -525555 -584552 -29802
1761 -29802 -888259 -1686130 -895056 -434365 -265809 -319688 -255853 -134904 -1073610 -939411
1751 -939411 -72631 149108 -354032 -720579 -904021 -450974 -673031 -532935 -856459 -869725
1741 -869725 -253564 -595676 -641881 -211312 -337073 -493775 -1812729 -1421741 -361495 -145955
1731a45955R6543o3273n13015L2522L61894L22523j97023L26386R31872l55397
1721G97077r52587m15493N32794Q75717j307920n99904J213080q33762K01839
1712d89159M07313m39021n32847K82461M43955J2152N82225P0923n95064n84469
1702h41531j65959p02609P02367J080021m1557J63354m87617l7468M9043k03907
1692d85863J56241l46048m7937R47948n75287l31137j7028j09198L55540P18997
1682B66228j321411m79992O12411N44865K61148O4150K89183j25811o30591o0064
1672e79884M1905K74130L82558j25229l66811m08032P07173J075044J04140M54180
$$ plain form
1731 -145955 -49412 -112685 -625700 -593178 -231284 91239 -105784 220602 1152474 797077
1721 797077 -155510 -571003 -38209 837508 -470412 -1070316 142764 -690998 -489159
1712 -489159 -81846 -520867 -1053714 -771253 -327298 -315146 267079 338002 -257062 -841531
1702 -841531 -1007490 -1710099 -1007732 72289 30732 194086 -293531 -330999 -281956 -485863
1692 -485863 -329622 -675670 -723607 224341 -350946 -682083 -699111 -808309 -452769 266228
1682 266228 -1055183 -1535175 -922764 -377899 -116751 -52601 236582 110771 -519820 -579884
1672 -579884 -537979 -263849 118709 -6520 -373331 -781363 -74190 1000854 1104994 1559174
$$ [...]
##END NTUPLES=NMR SPECTRUM
##END=
