##TITLE=1H_CG-1204-x
 DMSO
 8 sc, 
 7.6.2024
##JCAMPDX= 6.0         $$ Bruker NMR JCAMP-DX V2.0
##DATA TYPE= NMR SPECTRUM
##DATA CLASS= NTUPLES
##ORIGIN= UXNMR, Bruker Analytische Messtechnik GmbH
##OWNER= root
$$ XWIN-NMR		Version 3.5
$$ Fri Jun  7 13:42:07 2024 Russian Standard Time (UT+4h)  she@DPX200
##.OBSERVE FREQUENCY= 200.1309
##.OBSERVE NUCLEUS= ^1H
##.ACQUISITION MODE= SIMULTANEOUS
##.ACQUISITION SCHEME= undefined
##.AVERAGES= 8
##.DIGITISER RES= 18
##SPECTROMETER/DATA SYSTEM= spect
##.PULSE SEQUENCE= zg30
##.SOLVENT NAME= CDCl3
##.SHIFT REFERENCE= (INTERNAL, CDCl3, 0, 15.5761)
##AUDIT TRAIL= $$ (NUMBER, WHEN, WHO, WHERE, WHAT)
$$ ##TITLE= Audit trail, XWIN-NMR		Version 3.5
$$ ##JCAMPDX= 5.01
$$ ##ORIGIN= Bruker BioSpin GmbH
$$ ##OWNER= she
$$ F:/spectra/data/she/nmr/H-F/1/pdata/1/auditp.txt
$$ ##AUDIT TRAIL=  $$ (NUMBER, WHEN, WHO, WHERE, WHAT)
(   1,<2024-06-07 13:40:48.92 +0400>,<she>,<DPX200>,
      <created by zg, POWCHK disabled, PULCHK disabled
       configuration hash MD5:
       00 E9 B6 7A A2 85 ED C7 34 08 36 98 17 FE 4E 26
       data hash MD5: 16K
       D6 33 94 C8 17 80 AA C9 37 94 3E E2 45 77 20 FB>)
(   2,<2024-06-07 13:40:52.12 +0400>,<she>,<DPX200>,
      <Start of raw data processing
       efp BC_mod = 2 LB = 0.24 FT_mod = 6 PKNL = 1 PHC0 = -25316.14 PHC1 = 11.58748 SI = 16K 
       data hash MD5: 16K
       6A F1 C3 62 32 5F C2 B4 BF C7 78 D9 BB C4 A1 C8>)
(   3,<2024-06-07 13:41:10.04 +0400>,<she>,<DPX200>,
      <pk PHC0 = -4.088161 PHC1 = 1.2 
       data hash MD5: 16K
       01 49 6B A0 59 B0 9E F6 3E 5C BB B0 E4 DD 9C 66>)
(   4,<2024-06-07 13:41:13.26 +0400>,<she>,<DPX200>,
      <abs ABSG = 5 
       data hash MD5: 16K
       28 C4 E9 6F 2D 7D 90 30 CE 1C B8 C8 BC 9E 26 22>)
$$ ##END=
$$ 
$$ hash MD5
$$ 84 FA 7E 0C 48 0B D1 0D 83 C0 A3 83 0D C7 04 0E
##$RELAX= 
##$RELAX= 
##$RELAX= 
##$RELAX= 
##$RELAX= 
##$RELAX= 
$$ Bruker specific parameters
$$ --------------------------
##$DU= <F:/spectra>
##$EXPNO= 1
##$NAME= <H-F>
##$PROCNO= 1
##$TYPE= <nmr>
##$USER= <she>
##$AMP= (0..31)
100 100 100 100 100 100 100 100 100 100 100 100 100 100 100 100 100 100 
100 100 100 100 100 100 100 100 100 100 100 100 100 100 
##$AQSEQ= 0
##$AQ_mod= 1
##$AUNM= <au_zg>
##$AUTOPOS= <>
##$BF1= 200.13
##$BF2= 200.13
##$BF3= 200.13
##$BF4= 200.13
##$BF5= 200.13
##$BF6= 200.13
##$BF7= 200.13
##$BF8= 200.13
##$BYTORDA= 1
##$CFDGTYP= 0
##$CFRGTYP= 5
##$CHEMSTR= <none>
##$CNST= (0..31)
1 1 145 1 1 1 1 1 1 1 1 1 1 1 1 1 1 1 1 1 1 1 1 1 1 1 1 1 1 1 1 1 
##$CPDPRG= <>
##$CPDPRG1= <>
##$CPDPRG2= <>
##$CPDPRG3= <>
##$CPDPRG4= <mlev>
##$CPDPRG5= <mlev>
##$CPDPRG6= <mlev>
##$CPDPRG7= <mlev>
##$CPDPRG8= <mlev>
##$CPDPRGB= <>
##$CPDPRGT= <>
##$D= (0..31)
0 1.2 0 0 0 0 0 0 0 0.06 0 0.03 0 0 0 0 0.0002 0 0 0 0 0 0 0 0 0 0 0 0 
0 0 0 
##$DATE= 1717753248
##$DBL= (0..7)
120 120 120 120 120 120 120 120 
##$DBP= (0..7)
150 150 150 150 150 150 150 150 
##$DBP07= 0
##$DBPNAM0= <>
##$DBPNAM1= <>
##$DBPNAM2= <>
##$DBPNAM3= <>
##$DBPNAM4= <>
##$DBPNAM5= <>
$$ [...]
##$SUBNAM3= <"">
##$SUBNAM4= <"">
##$SUBNAM5= <"">
##$SUBNAM6= <"">
##$SUBNAM7= <"">
##$SUBNAM8= <"">
##$SUBNAM9= <"">
##$SW= 18.0517689322627
##$SWIBOX= (0..15)
0 0 2 0 0 0 0 0 0 0 0 0 0 0 0 0 
##$SW_h= 3612.71676300578
##$TD= 16384
##$TD0= 1
##$TE= 0
##$TE2= 300
##$TE3= 300
##$TEG= 300
##$TL= (0..7)
0 120 120 120 120 120 120 120 
##$TP= (0..7)
150 150 150 150 150 150 150 150 
##$TP07= 0
##$TPNAME0= <>
##$TPNAME1= <>
##$TPNAME2= <>
##$TPNAME3= <>
##$TPNAME4= <>
##$TPNAME5= <>
##$TPNAME6= <>
##$TPNAME7= <>
##$TPOAL= (0..7)
0.5 0.5 0.5 0.5 0.5 0.5 0.5 0.5 
##$TPOFFS= (0..7)
0 0 0 0 0 0 0 0 
##$TUNHIN= 0
##$TUNHOUT= 0
##$TUNXOUT= 0
##$USERA1= <user>
##$USERA2= <user>
##$USERA3= <user>
##$USERA4= <user>
##$USERA5= <user>
##$V9= 5
##$VALIST= <valist>
##$VCLIST= <CCCCCCCCCCCCCCC>
##$VD= 0
##$VDLIST= <DDDDDDDDDDDDDDD>
##$VPLIST= <PPPPPPPPPPPPPPP>
##$VTLIST= <TTTTTTTTTTTTTTT>
##$WBST= 1024
##$WBSW= 4
##$XGAIN= (0..3)
0 0 0 0 
##$XL= 0
##$YL= 0
##$YMAX_a= 86234
##$YMIN_a= -113933
##$ZGOPTNS= <>
##$ZL1= 120
##$ZL2= 120
##$ZL3= 120
##$ZL4= 120
##$ABSF1= 16.12155
##$ABSF2= -1.930347
##$ABSG= 5
##$ABSL= 3
##$ALPHA= 0
##$AQORDER= 0
##$ASSFAC= 0
##$ASSFACI= 0
##$ASSFACX= 0
##$ASSWID= 0
##$AUNMP= <proc_1d>
##$AZFE= 0.1
##$AZFW= 0.1
##$BCFW= 0
##$BC_mod= 2
##$BYTORDP= 0
##$COROFFS= 0
##$CY= -3
##$DATMOD= 1
##$DC= 0
##$DFILT= <>
##$DTYPP= 0
##$F1P= 0
##$F2P= 0
##$FCOR= 1
##$FTSIZE= 16384
##$FT_mod= 6
##$GAMMA= 0
##$GB= 0
##$INTBC= 1
##$INTSCL= 3.70164e-10
##$ISEN= 128
##$LB= 0.24
##$LEV0= 0
##$LPBIN= 0
##$MAXI= 10000
##$MC2= 0
##$MEAN= 0
##$ME_mod= 0
##$MI= 1.114404
##$NCOEF= 0
##$NC_proc= -8
##$NLEV= 6
##$NOISF1= 3.799351
##$NOISF2= 2.8
##$NSP= 0
##$NTH_PI= 0
##$NZP= 0
##$OFFSET= 15.57614
##$PC= 1
##$PHC0= -25320.23
##$PHC1= 12.78748
##$PH_mod= 1
##$PKNL= yes
##$PPARMOD= 0
##$PSCAL= 0
##$PSIGN= 0
##$REVERSE= no
##$SF= 200.129589111853
##$SI= 16384
##$SIGF1= 3
##$SIGF2= 2
##$SINO= 5.538805
##$SIOLD= 16384
##$SREGLST= <1H.CDCl3>
##$SSB= 0
##$STSI= 16384
##$STSR= 0
##$SW_p= 3612.71676300577
##$SYMM= 0
##$S_DEV= 0
##$TDeff= 16384
##$TDoff= 0
##$TI= <>
##$TILT= no
##$TM1= 0
##$TM2= 0
##$TOPLEV= 0
##$USERP1= <user>
##$USERP2= <user>
##$USERP3= <user>
##$USERP4= <user>
##$USERP5= <user>
##$WDW= 1
##$XDIM= 16384
##$YMAX_p= 348638715
##$YMIN_p= -1212833
$$ End of Bruker specific parameters
$$ ---------------------------------
##NTUPLES= NMR SPECTRUM
##VAR_NAME=  FREQUENCY,     SPECTRUM/REAL,   SPECTRUM/IMAG
##SYMBOL=    X,             R,               I
##VAR_TYPE=  INDEPENDENT,   DEPENDENT,       DEPENDENT
##VAR_FORM=  AFFN,          ASDF,            ASDF
##VAR_DIM=   16384,         16384,           16384
##UNITS=     HZ,            ARBITRARY UNITS, ARBITRARY UNITS
##FACTOR=    0.220516191357247, 1,           1
##FIRST=     3117.24657895053, 0,            0
##LAST=      -495.470184055239, 0,           0
##MIN=       -495.470184055239, -1212833,    0
##MAX=       3117.24657895053, 348638715,    0
$$ Real data points
##PAGE= N=1
##DATA TABLE= (X++(R..R)), XYDATA
$$ [...]
10710 -119618 6280 30858 -298323 49517 -272867 -488402 -372249 -387952 -454728 -567310
10700 -567310 -499791 -169673 -192830 -6964 234595 -404915 -308978 -680948 -366874 -270601
10690 -270601 -421594 -214381 -170039 112531 102112 -447694 -203757 -105425 34081 56366
10680 56366 -152891 -185468 -74860 113032 -385819 -139493 119852 -275139 141736 308684
10670 308684 164926 136334 185515 126818 132187 72491 63102 78461 -273164 -392441 38677
10659 38677 367668 60309 21719 142546 507025 749189 538502 266001 327422 -241163
10649 -241163 -522021 -496303 -564755 -379062 -357903 -514526 -16862 -194222 -5125 -53402
10639 -53402 -127635 -14861 -153478 361098 169565 -438671 12707 377960 -334497 -495029
10629 -495029 1832 -76099 -374393 -483942 146125 21085 4817 61792 -94123 232797
10619 232797 -263601 -311939 -468826 -203760 -347535 -313919 225450 440890 -66754 181383
10609 181383 31682 -326258 -91074 127647 25760 -199520 -90619 -79076 -49643 244975
10599 244975 138141 107140 448594 807938 503844 -261632 -561012 -622575 -61104 -237553
10589 -237553 80682 265402 144706 -172490 407 68495 349488 426294 445401 453446
10579 453446 264859 296274 492504 -37592 198138 351185 157760 3566 -69748 279435
10569 279435 111107 -14384 -413553 -83609 56872 -38049 -125518 -113614 -76985 -337045
10559 -337045 -589868 -136132 -173039 -210364 -275301 -568682 -436826 -251809 -145467 -421037
10549 -421037 -88465 86550 -394681 -431927 -244043 305677 224273 52644 -207459 -460929
10539 -460929 -244512 139511 -133214 248814 455013 157819 330769 111439 -205538 -270307
10529 -270307 -508774 -182121 67945 219422 388645 -201617 -31972 127495 -266447 36648
10519 36648 231371 131176 113997 -526553 -127942 197479 -35794 -290997 -376755 102727
10509 102727 61435 -103045 -299102 -221490 -146706 -420343 -622667 -604379 182806 260034
10499 260034 -137573 -363500 -344448 101502 -183009 -130309 -157904 -385132 -136318 -432201
10489 -432201 -329947 216950 -139090 -243790 -260482 -515376 -75156 -347947 -601740 -452234
10479 -452234 -456633 -422528 -4998 421067 506524 134985 -271237 -366220 -196491 -124748 -204312
10468 -204312 -147826 -559178 -44637 99561 34363 240448 32579 -192213 -270627 -373921
10458 -373921 -66004 -362210 -668875 -454383 -318774 -94752 273171 -46840 102181 224533
10448 224533 109734 422063 470856 632927 561309 290959 -68120 -129611 -197938 -189287 -483328
10437 -483328 -76837 34269 -292213 146018 -206846 -320243 -276621 -153012 -54912 173193
10427 173193 407840 -11268 178033 363403 -133933 -158449 54148 -21660 44077 -167518
10417 -167518 -511641 -525146 -238306 21790 25641 -230691 -16559 -391159 193684 -23968
10407 -23968 -113334 -664153 -114919 170467 -204318 -167909 -670366 -127660 -140937 -528229
10397 -528229 -802582 -458713 -311732 -452061 -250508 -197585 -193561 -624019 -432089 8599
10387 8599 -90822 182824 10810 -96507 36063 -264861 -468955 -335169 -243672 -358187
10377 -358187 -114473 -118368 -401566 -561173 -735180 -294424 -15337 -316050 -179943 -59383
10367 -59383 -149269 -157951 -25631 -124769 -132024 -14662 217442 162174 274119 345683 142869
10356 142869 181521 -9744 -135360 -117268 161745 -89528 111616 603635 431211 286558
10346 286558 12539 -234008 -19426 180047 457746 89775 25468 -454595 -290087 -475671
10336 -475671 -687563 -937901 -524253 -262423 -707316 -476492 -84569 30483 -134087 -1455
10326 -1455 -226531 -782031 -636878 20791 64116 123656 37225 -122664 -423203 -380524 -362987
10315 -362987 -229363 -71543 -418851 -325592 -562370 -314287 135194 186762 -185847 -130217
10305 -130217 -215192 -227365 -222511 -295186 -280653 -195728 -251337 -8666 9478 -238873 -200055
10294 -200055 -389565 -360678 -249909 -85677 132679 354492 108077 81586 43436 237710
10284 237710 228108 -121601 -92482 333838 200090 508840 92971 63486 82778 -112744
10274 -112744 -82713 -44700 196839 170068 379857 -376795 -420910 -336727 -296149 -350782 -289595
10263 -289595 -22649 -251926 -158441 -314325 73676 109237 -324353 -712447 -608784 -423477
10253 -423477 -45810 120406 -145132 -506301 -444294 -310090 -84201 -175995 -607774 -216261
10243 -216261 180334 -34485 -234494 50164 -222786 -174526 -264052 -672995 -384264 -424283
10233 -424283 -341010 196340 280799 363195 -139169 -250753 -314722 -597386 -194385 -281601
10223 -281601 -98767 -209766 -436922 -80374 -181806 71984 97962 233263 248450 159684
10213 159684 298058 28980 -231676 41427 -44202 -269643 -134100 26076 296105 6260
10203 6260 -370508 -591998 -322965 -15392 289837 346809 438840 143193 -293210 -285217 -491229
10192 -491229 -612187 -486077 -488218 -149839 200728 156642 325353 327751 -597163 -762704
10182 -762704 -123654 -362397 -331204 -193106 -237883 -244624 -22374 251870 468565 167116
10172 167116 -86454 -27192 -17264 206646 298852 -187565 -288297 179123 -3319 -3311 -421803
10161 -421803 -372163 -377507 -487011 82029 472930 495911 61782 -85319 -390727 -633542
10151 -633542 -336405 -249243 -348570 -228381 -224710 -151805 -229339 -307314 -108178 -396573 -868101
10140 -868101 -496940 -567230 -228676 -233846 -359027 -191209 -615935 -312857 -432031 -107810
10130 -107810 -164714 402408 602154 311088 34453 -231955 -176224 -98540 353559 359146
10120 359146 278422 -42863 -24942 -58782 -833465 -694243 -271235 -256124 -337325 -207640
10110 -207640 -464353 -814614 -877992 -539042 -167213 -467218 -342764 -340765 -331074 -308389 -121090
10099 -121090 65518 -79339 -321470 -152397 -214628 -462153 -446672 -723500 -220583 94372
10089 94372 -226357 -126824 -251540 -516388 -349288 -336994 -480362 -128868 -402428 -170951
10079 -170951 -406340 -245757 -379254 -284048 84219 -69405 -253023 -457585 66213 588422
10069 588422 168560 -2993 -178976 -303249 22906 -121985 -456953 -264047 87031 211334
10059 211334 384537 107373 -58181 -182387 -3400 117124 -256801 100165 -52566 -347592
10049 -347592 -292324 -68023 -36918 467829 109227 -196524 -346609 45128 171202 -153345
10039 -153345 180638 79742 229838 217472 -53844 -197168 -262933 -27156 98486 -207231
10029 -207231 174284 132155 97135 415612 465265 124944 150151 -62648 248876 87650
10019 87650 72555 10056 -273732 -34535 -58658 -129481 68849 11779 -63471 -631693 -527930
10008 -527930 111696 358424 166989 -136593 -53353 182310 551297 50279 -144861 448621
9998 448621 527145 202551 -25562 -16313 259343 253799 -271036 -47687 366529 660490 209517
9987 209517 -188938 -120931 -26542 -116045 -290884 -129642 -216350 198609 414079 -170620
9977 -170620 -86934 -27115 671858 340008 359555 139887 20608 752520 569234 34730
9967 34730 -119577 -99093 182173 193018 177912 214773 260543 29590 -183932 82504 -22500
9956 -22500 131338 100285 122531 -69198 -298859 -760479 -395919 -265421 -80591 102514
9946 102514 -4207 165243 -98516 -465532 -541081 -170091 65226 66551 32593 -371342
9936 -371342 -326599 -192811 -91109 -394069 208859 409362 647538 347432 77984 -13914
9926 -13914 -34737 -82957 -241740 77253 -606029 -356069 -45985 -33569 217457 -199199
9916 -199199 -358598 -33228 -658993 -803045 -245465 -167207 36223 -30401 -289133 -357256
9906 -357256 -254934 -522728 -221051 -146826 -478222 -313433 -423332 -663080 -443806 -342011
9896 -342011 -214725 -145483 -184354 299721 211568 110872 73718 -333278 144382 121360 36663
9885 36663 76455 2026 -70040 -318033 -580065 -249966 35339 -34200 -567476 -331962 -167017
9874 -167017 -475671 -560708 -306063 -106969 -313577 -434340 -129442 -283223 -387543 2520
9864 2520 198141 63879 106699 93623 -386329 35514 21965 82488 184657 83227 83832
9853 83832 -52839 -541596 -251196 -325266 -462916 -282030 -407792 -244630 295368 203799
9843 203799 283403 186272 -38717 -68957 109504 309612 408457 -158898 23622 537099
9833 537099 289403 178590 -97059 -243768 200099 125741 167745 137751 600222 650928
9823 650928 345194 253703 79290 606067 364005 -261405 -300072 -301261 -271451 -570124 -238152
9812 -238152 177163 264345 233759 204789 -217506 230855 136181 -120816 424462 314666
9802 314666 118263 199188 474375 -507010 -508621 -457075 -289053 -247274 -395894 -591131 -976463
9791 -976463 -635028 -498802 -529815 -345360 -515504 -531528 -360483 -23795 -103330 -349800
9781 -349800 -21186 134973 74666 -69557 -469479 20300 172615 -403188 -232588 -225934
9771 -225934 -285383 184051 -79451 -100399 -23171 281551 518745 350824 118952 185728
9761 185728 52826 161759 -176715 -117859 -64771 -220535 -292241 17886 339405 840698
9751 840698 177789 -548353 -163301 -326139 -470321 -607053 -575402 -28129 44599 11106
9741 11106 -243431 -325692 -97925 -1466 94497 6726 -28032 -291087 -54890 -193489 -16247
9730 -16247 387873 297697 211423 220744 -138921 213768 -128312 52146 -33786 -279055 118559
9719 118559 454780 207646 -79888 -242537 -384005 -456552 -262736 -208615 -200088 -336787
9709 -336787 67312 -102774 -1488 45758 186266 -24128 123214 172452 -39016 78890
9699 78890 -288641 -331604 150290 372307 -200717 -486792 -96533 114703 187246 183137 -15953
9688 -15953 527215 390857 265878 159985 -260593 -240182 -360503 -210274 -320091 -208386
9678 -208386 -182601 -160984 -63910 404790 538932 -12097 81059 -21963 327964 47339
9668 47339 -114791 -154428 -188309 -175152 150660 -60471 -11386 -184762 -135222 -77402 332149
9657 332149 263502 -50276 166082 387574 180507 181230 304077 530117 -45110 -27728 -44794
9646 -44794 -185032 276361 149793 264042 178221 460916 479715 257202 474237 -140061
9636 -140061 -622377 -221792 -109429 8542 62371 -61868 111965 395981 455272 10462
9626 10462 -87869 -126114 54186 -31610 -425814 -79496 -328315 -200649 68942 355969
9616 355969 87647 118185 458740 357968 -195330 -145916 179417 337769 396544 266614
9606 266614 489045 589119 290472 -138160 190070 337209 5487 332691 743444 545278
9596 545278 556125 -246 256998 544423 167566 294581 -56830 -42116 193033 -80464
9586 -80464 -79796 335351 274572 45374 -359816 295270 316228 -47515 49051 322003 656830
9575 656830 573265 287516 308120 130077 214509 -119049 -281486 73917 -470 110376
9565 110376 -42172 212265 60484 311372 254554 214626 42575 -261301 -36599 -11784
9555 -11784 73293 -42833 242920 364335 54268 74255 -21280 -61280 284938 182131 206941
9544 206941 -16485 227077 246387 282424 133404 -113202 109504 738124 378524 526919
9534 526919 -95657 -438356 -254392 -439814 410701 726811 615261 416880 458076 -55317
9524 -55317 -368516 -64824 266500 143858 380747 411805 299271 199248 -6605 395109
9514 395109 843787 376623 -62128 -48287 390833 546844 501926 307544 350877 512206
9504 512206 545788 680841 509890 733949 749155 187684 64850 76464 270428 -77196
9494 -77196 -142486 -204040 109850 158198 325496 661577 201115 48523 237039 422681
9484 422681 451514 47939 85682 76097 -279870 -346423 238575 490837 783874 769746 161428
9473 161428 81958 298521 837242 1171210 487304 -187812 -95997 315512 538510 126768
9463 126768 422060 856926 979938 586076 434083 685333 663848 692504 652532 322383
9453 322383 210905 580729 682170 512539 394958 251055 202553 465831 706524 387521
9443 387521 855214 844638 412488 -135182 47730 544564 240854 456233 138682 187269
9433 187269 688467 580396 440477 583896 517954 510183 899169 708457 218084 431075
9423 431075 332544 302209 630541 654494 505286 478883 848246 833825 509264 480377 529993
9412 529993 526304 242789 491861 830768 948636 877738 766023 543580 111541 295136
9402 295136 459408 33111 258418 387231 557298 634922 907520 986936 522923 808988
9392 808988 580793 324233 414615 394798 80768 161044 440755 717852 179902 20429
9382 20429 -80431 373900 819453 501058 945726 1242860 780746 923654 1008669 1175980
9372 1175980 1114745 755060 434666 314540 282154 6626 -127480 80361 434800 525311
9362 525311 1127753 849961 793828 946951 932649 863714 592686 1045606 925949 833281
9352 833281 866035 867817 716492 628643 590499 719712 1160798 1280455 1115473 1167823 1282387
9341 1282387 1043899 952947 891729 1101916 949593 756911 1010862 1223944 1159848 1156298
9331 1156298 1140052 1121629 1081178 973700 1011243 882662 1124408 1209273 1168223 1212724 1253811
9320 1253811 1283804 1425146 1338269 1391601 1076092 1052174 832982 405349 836338 1039736
9310 1039736 1040640 1189091 1359420 1069879 1462336 1605056 1278264 1171605 866894 1088332
9300 1088332 1396375 1290794 824502 886582 1288240 1133175 1074487 1115627 739567 304481
9290 304481 700240 507388 507891 698782 647180 314564 246401 865502 725023 340953 1177422
9279 1177422 1232064 1082789 821364 1094658 641828 405981 800039 662327 601063 656891
9269 656891 884840 1219118 1090054 687780 432957 278713 627363 1128435 963422 942442
9259 942442 620017 499790 735128 753999 607898 950551 1240520 723001 565697 568590
9249 568590 498109 480269 723195 691980 792214 909212 1168898 1000167 1118031 1301763
9239 1301763 1089755 713459 617447 616337 538252 432077 697944 739627 1242701 1146570 1144852
9228 1144852 715626 506003 710954 751923 1202126 1337536 1052692 1080961 1154450 1170278
9218 1170278 1152313 947399 997805 834820 913042 664527 340093 310325 757861 960116
9208 960116 828713 964921 762101 387826 531384 424167 533518 620636 851120 615031
9198 615031 703816 770208 799161 1065802 866830 899887 713746 642371 961747 1146277 1007889
9187 1007889 973027 790371 990809 594686 577001 1088741 1139672 791841 1209386 1311787
9177 1311787 1330389 1253724 1666576 1633308 1106796 1086691 960851 731107 939427 1457262
9167 1457262 1371266 1331047 1664901 1290172 1092117 1306863 1172247 978597 1060839 819752
9157 819752 846289 1765740 1843696 1351660 1236928 1407200 1289971 1229228 1611331 1704377
9147 1704377 1545607 1459990 1585766 1682246 1891991 1870805 1397452 1551605 1346061 1465271
9137 1465271 1516036 1906592 1680266 1766787 2130345 2051518 1753477 1386373 1208748 1609614
9127 1609614 1671103 1715855 1806658 1529607 1860415 1722131 1818424 1785659 1823041 1960421 2041661
9116 2041661 2391010 2282890 2215409 2502863 2304910 2282314 2559450 2606314 2580560 2476559
9106 2476559 2276135 2712952 2970576 2968611 3237073 3319490 3235587 2879753 3003409 3235822
9096 3235822 3081405 3080855 3648813 3354396 3216934 3342084 3396289 4080569 4111209 3583031
9086 3583031 3705815 3896666 3935045 3436990 3654666 3933991 3971062 3990801 4097221 4480223
9076 4480223 4469362 4851924 5078110 5500496 5550859 5551711 5911942 5251648 5100176 5408873
9066 5408873 5744360 6037791 5582515 5693329 5988150 5982356 6053824 5722415 6039745 6393119
9056 6393119 6781543 6864617 6866274 6865916 7064047 7369376 7579370 7681572 7910921 8353381 8650217
9045 8650217 8588042 8462474 9148438 9839171 10293647 10193936 10282154 10940572 11317589 11696601
9035 11696601 12208371 12577799 13014955 13106530 13579825 13956275 14386470 15459329 16647395
9026 16647395 17209445 18194531 19769844 21163302 22136999 23523478 24978631 26357791 27229470
9017 27229470 28317981 29111000 29623820 29938687 30046739 30111727 30022691 29413603 28382528
9008 28382528 27440517 26590755 25759042 24704904 24054994 23253361 22120211 21620428 21364839
8999 21364839 21107240 20780103 20723674 20863917 21037923 21397956 21833942 22053689 22822118 23835335
8989 23835335 25094169 26405206 27502530 28898296 30011447 30844401 31290920 31491816 31886735
8980 31886735 32279796 32436772 32606005 32479209 31539411 30691093 29771089 28028916 26634853
8971 26634853 25420410 24070927 22985072 21397805 20173884 18781712 17567035 16673092
8963 16673092 15396718 14444955 13745300 13492839 12925708 11811256 10955457 10553106 10410446
8954 10410446 10179213 9971434 9671033 9140692 8904988 8714231 8283296 7979381 7680115
8945 7680115 7108508 7146691 6932135 6502279 6264378 6925689 7147995 6924432 6587813 6176547
8935 6176547 6255373 5810367 5132468 5435112 5490473 5284771 5348405 5211342 4952987 5201644
8925 5201644 5006135 4844346 4433142 4625187 4965055 4542729 4320678 4594319 4595560 4670484
8915 4670484 4602543 4499951 4351412 3858325 3804696 3993898 4083719 3706259 4012257 4514630
8905 4514630 4159518 4209064 3880165 3047850 3665032 3480174 3338357 3488718 3137963 3006623
8895 3006623 3127734 3848020 3862285 3086222 2735467 2748939 2650549 2922094 2890214 3432489
8885 3432489 3687738 3488071 3039102 2387937 2220042 2865600 3207227 2423538 2486767 2870014
8875 2870014 2791381 2665313 2717267 2213921 2489311 2762418 2323785 2413745 2816794 2319349
8865 2319349 2790718 2725344 2496705 2072909 2382083 2912858 2664650 2356877 2029273 2125968
8855 2125968 2299412 2026153 1641408 1679696 1366314 1643911 2127435 2088052 2354833 2082426
8845 2082426 1738210 1925458 2285721 2177799 2130376 1882142 2142161 2460007 2121588 2390771
8835 2390771 2362380 2309311 2569964 2210143 2102554 2127739 2251243 2450829 2538847 2875035
8825 2875035 2650136 2633389 2678636 2744718 2325075 2308061 2162839 2183654 2292894 2475084
8815 2475084 2395505 2488529 2574919 2976627 2795398 2483319 2712112 2721983 2661958 2998310 3276188
8804 3276188 3485953 3347034 3114568 3422064 3565527 3535231 3412512 3416571 3388793 3545917
8794 3545917 3347635 3247599 3798739 3712444 4056865 4220732 4236923 4394816 4703173 5137607
8784 5137607 5213083 5409290 5535363 5923407 6103826 6233293 7077617 7404645 7130380 7300973
8774 7300973 7871318 8496457 9006854 9725121 10420919 10273524 10033086 10144624 10393615 10255466
8764 10255466 10278519 10762512 10630683 10429555 10300928 9703887 9597097 9490602 9799268 10073002
8754 10073002 9970740 10443736 10810733 11224977 11250238 11411463 11636334 12341305 13179271 13801095
8744 13801095 14410103 14774992 15443249 16218798 16930205 17766223 18291370 18296909 18330608 18271660
8734 18271660 17710803 17698837 17224582 16875011 16296198 15845008 15401361 14843563 14419760 14450542
8724 14450542 13934767 13768878 13354609 12825693 12668149 12667233 12423418 13247462 13555112 13388413
8714 13388413 13541991 13796808 14360851 14619318 15171946 15265152 15551745 16276388 16910767 17707843
8704 17707843 18207458 18656629 18788553 19364148 20033191 19960207 20179966 20065308 20297040 20932606
8694 20932606 21053857 21915336 22234700 21861433 21550894 21414032 21366851 20906447 20902319 20477192
8684 20477192 19952977 19492804 18474599 17351157 16247786 15315129 14489058 14161250 14746741
8675 14746741 14057823 13413577 13385244 13259880 12760288 12852859 12849622 13150948 12979911 13809489
8665 13809489 14098766 14722211 15202639 15210479 16041079 16567474 17128713 17828023 18212652 18912219
8655 18912219 19347343 19304053 19106739 18728753 18265217 17341676 16442361 15524165 14579308 13449137
8645 13449137 12033782 11213984 11162393 10551518 10039054 9682696 9402404 9084436 8748499
8636 8748499 8533414 8665442 8324346 8155719 8326305 8206473 8072452 8424146 8551108 8539991
8626 8539991 8682253 8819522 8990249 8875737 8850168 8749826 8674004 7970620 7720758 7589687
8616 7589687 7302182 6844974 6734958 5926483 5156983 5057984 4982654 4689678 4487741 4170508
8606 4170508 4171401 4151125 3970894 3849193 3776102 3313421 3258689 3502914 3154166 2982601 2834037
8595 2834037 2728555 2946841 3241877 2681097 2742143 2745297 2730693 2545006 2098464 1998111
8585 1998111 2130531 2404588 1812554 1549921 1903796 1945473 1651886 1688680 2286559 2012382
8575 2012382 2239634 2055248 1986299 1666082 1279718 1065978 1230241 1438437 1414494 1158981
8565 1158981 1012682 1197920 901702 731010 972232 973280 1023325 1259359 1523247 1414470
8555 1414470 1374450 956773 561837 408386 675215 1127522 1368508 1003873 1346209 948417
8545 948417 1171146 1041224 518836 427047 611712 450175 353073 523204 348549 529188
8535 529188 343315 504612 141824 90180 259627 186185 170114 416298 832819 722969
8525 722969 655163 483027 105682 775322 689271 611010 698085 547983 587918 437660 339768
8514 339768 724293 677495 516410 132583 319680 543944 662761 502761 417346 435166
8504 435166 466298 387395 517224 358105 325706 281997 37490 145985 109207 476378 362506
8493 362506 365217 735756 790121 643938 565321 674481 361719 293107 626090 105286 -235283
8482 -235283 -172560 -142466 -54288 248267 387972 656241 571843 -123514 34833 -33667 191955
8471 191955 35198 115245 -30449 41190 -12270 90175 147378 -212782 211337 562827
8461 562827 535953 271315 116211 82393 119669 -99962 -37590 248518 37854 -180812
8451 -180812 72633 101267 -34353 -184407 338947 212137 111766 270903 -73238 -94315
8441 -94315 404602 321708 53768 489319 482834 95595 -554729 -135524 389352 234485
8431 234485 76344 153098 518839 404042 -67693 80827 411677 323425 175229 -122569
8421 -122569 98955 -25228 -128694 -88082 -48908 257356 211822 53835 236284 140934
8411 140934 237355 -58868 -265445 143043 212556 139765 439358 386095 177759 227959 453061
8400 453061 250665 67559 -770 464898 183701 -292572 -134491 -857178 -603970 -303133
8390 -303133 -65697 -72075 -331941 -8182 -432811 204545 305253 128232 256731 -93510
8380 -93510 408484 276303 323268 438179 458185 106082 77016 -22417 -8610 -135268 -201541
8369 -201541 -149024 439286 447120 22988 401490 428705 -64793 -143982 -83435 -9547 333208
8358 333208 394929 33971 302740 167231 -91331 143306 481004 360561 213240 558856
8348 558856 535320 370070 -9024 -91467 -50159 507056 323291 -50132 -169171 280084
8338 280084 317133 258750 121369 218076 275474 -372870 -301711 -201828 -350189 -330854 -118582
8327 -118582 188980 -1361 233947 193701 -139326 -264095 84474 -97310 -441856 -177151
8317 -177151 410281 463963 123505 -153521 -372978 -279769 47974 343125 374854 -58131
8307 -58131 -584536 -596063 -276456 245265 190662 -406367 -135689 91818 -274505 -65565
8297 -65565 -70872 -107748 109565 347923 -8708 435875 127913 -144050 41937 -60269
8287 -60269 -86382 -253295 -70333 -108689 314366 278221 74228 186247 -72983 -120391 293457
8276 293457 -42432 -44684 577089 100033 122345 154395 -21472 26187 -133227 -113963 399229
8265 399229 -26503 -131365 -654283 -401852 -510532 -488970 -176797 -312061 -674789 -645681
8255 -645681 42661 -358334 -223145 -90999 50255 -335013 -81377 -39411 -98476 -698880
8245 -698880 -408715 -493443 -538535 -364422 59472 75894 -96228 -144503 -115815 414619 29889
8234 29889 -76835 -202055 -175372 -402675 -221919 -199683 -225822 -205450 -331928 -25119 198353
8223 198353 -24003 -13748 145120 219896 -39985 -580213 -480008 -227518 -123628 -136861
8213 -136861 -208552 -287669 -499345 -620639 -257960 -133223 -103025 -425970 -134927 204427
8203 204427 213406 294916 -178151 -420137 -252334 -82459 -358618 -378633 -602231 -293331
8193 -293331 -910869 507042 1779513 413181 320610 544306 449088 399828 116679 14082
8183 14082 -71551 -315788 -307851 -46021 -387729 -421256 -135263 149230 204679 249437 -165264
8172 -165264 -340163 103661 -86021 -499309 -297826 -144968 -419762 -165004 -266293 -4012
8162 -4012 -378961 -259734 468707 790335 391092 61997 -594786 -825928 -278353 -93938
8152 -93938 61494 -31730 -48572 82834 218597 169735 135215 226268 -262290 -109154 342385
8141 342385 -20640 -184306 -359988 -226096 -242134 -174164 -250052 -61363 13513 -556807
8131 -556807 -604530 -175490 -364676 -366669 -42917 -185597 -81804 -2042 -128343 -49286 -375940
8120 -375940 -197411 192361 115359 184434 32395 -468511 -438028 -387279 -447425 -207682 -151512
8109 -151512 83254 -91939 -114986 -49878 -353673 -59723 -11202 -453318 -203705 6756
8099 6756 -382780 -451687 -206064 -317617 -247868 -156896 -336126 -56510 -16248 18882 115567
8088 115567 430685 593030 229423 47713 -37806 -509995 -1017375 -471865 -276922 -524259
8078 -524259 -391364 -289402 -527587 -339639 -137700 -228498 -390303 -477334 -319043 432154
8068 432154 451443 239258 -39651 -165118 -226132 273290 354996 246121 -298832 -333600
8058 -333600 -122868 -361460 103329 65422 200619 -360162 -98839 147422 -120891 -466230
8048 -466230 -384758 -355359 -422594 -293117 -226137 -175289 53246 36651 133827 242701 66015
8037 66015 34875 -208992 -543359 -310354 31240 -74663 313911 516507 270270 11360
8027 11360 306175 -640 -283875 -49670 100729 -238205 178403 103814 -380864 -382755
8017 -382755 -144229 -412381 -844495 -367429 -339997 -203506 108539 -216869 -291820 282729
8007 282729 371066 -358583 -475306 -457000 -138386 -569226 -1009333 -298740 -429124 -351581
7997 -351581 -380356 -324263 -250705 147848 446868 255910 157501 168068 -62479 -3277 169864
7986 169864 160506 265341 264456 257028 233480 -86604 -176499 -109331 -452083 -392137 -259349 -450639
7974 -450639 -268510 37773 78377 -381476 -496359 -343761 -139030 -140488 -175397 -134241 -50450
7963 -50450 37917 182816 699 -425253 -730936 -546823 -247896 -353098 -93566 82236
7953 82236 32361 2160 -92930 -204859 -218519 -1768 -95105 13023 -3222 -129689 -438624
7942 -438624 -152225 -246958 -178804 -212416 -515201 -246507 378977 484452 -7348 -215156
7932 -215156 -862327 -695410 16852 187336 326351 532977 494799 65217 -173639 91637
7922 91637 -75354 -422183 -108349 247395 421649 443505 25346 -386170 -560219 -310599
7912 -310599 -113682 -245162 50879 128336 -408607 -314721 -361136 -530485 -410251 -16391
7902 -16391 67145 59495 -133349 -241970 -162945 -188497 3343 -10275 -253275 -678926 -525358
7891 -525358 -462470 -350149 -366529 -62432 68336 -71492 -327136 -63509 -206012 -462085
7881 -462085 -164700 -120279 -7998 -324261 -260920 -187477 -81149 3650 166379 -51960
7871 -51960 -139864 210412 577799 -136930 -165684 -322008 -117347 -159952 -192881 81744 -67990
7860 -67990 -502336 -267327 -607253 -475591 44309 -175495 -145482 -198260 -388088 -119586
7850 -119586 -331729 -303093 -6456 72525 -143354 78475 45285 -351937 -297386 -239301 -298946
7839 -298946 -124001 326080 228465 146273 243333 536008 185185 870 -98470 -305447
7829 -305447 -67888 102777 -209722 -319904 -246720 166328 186932 574398 80637 -143189
7819 -143189 -213318 -223148 -133165 -106491 308559 815937 911078 632216 260984 91001 210981
7808 210981 458835 -524739 -1212833 -434380 -237682 -261156 -302787 -175270 -176991 47979
7798 47979 93710 -630380 -288251 -200879 -332788 -731050 -434155 205830 -302943 -501683
7788 -501683 -563392 -255819 -366973 -217928 -171376 -473902 -199397 -125627 -266371 -164211
7778 -164211 -229989 -600942 -963610 -1020456 -862168 -684779 -305730 -206903 -24364 -42329
7768 -42329 -160900 -106189 -219640 -318217 -822496 -558513 -246891 -420146 -303067 70869
7758 70869 497386 158605 94533 -115023 -407848 -660593 -639517 -154209 -278477 -409122
7748 -409122 -307278 -77908 -49214 -237696 -392833 -165283 -28561 -324834 -266001 -381186
7738 -381186 -61975 438284 -186099 -166417 35113 -373882 -304275 -120981 -91768 -337190
7728 -337190 -129330 -611557 -509371 -275461 -334703 -254031 -251131 -229042 -165529 -142859 -519049
7717 -519049 -266035 39205 -325995 -702990 -741202 -423336 -628348 -547569 -237885 -569152
7707 -569152 -389645 -99570 86607 -231963 -28541 -105738 -28814 83505 -75484 -90508
7697 -90508 -431390 -122298 90766 -95492 -182096 -479181 -391567 -110957 148959 265475
7687 265475 -7003 -98225 -227126 -84743 -190705 -634794 -181160 -184788 -365976 -367896 -295630
7676 -295630 -520217 -390435 -232303 -191358 -106425 151287 478237 303415 22738 -355378
7666 -355378 -281089 -133986 -191603 -43501 126252 -372526 -836323 -295178 -377457 90021
7656 90021 522616 -37791 24890 103902 273694 202051 255428 -246443 42582 561012 414183
7645 414183 284435 -208654 -275430 -130884 -295140 -175992 -168383 143239 3342 -138940
7635 -138940 78077 27425 23454 92653 298086 102462 61534 -137454 298577 275024 -105161
7624 -105161 -437272 342614 455754 572339 370909 -172755 166692 422941 391498 190445
7614 190445 117789 153075 158224 79736 243778 347801 113102 499799 303353 239413 174855
7603 174855 -437928 107720 234083 292821 -175925 -227360 859 -181186 -239995 -18159
7593 -18159 91340 -93216 66897 470341 422086 74219 -624284 -702651 -147549 -125260
7583 -125260 -71789 -123608 -12787 -7839 -224607 238412 -207817 -346031 -214462 -361823
7573 -361823 -290322 -26261 -204218 -509873 -385139 -362877 -367506 -418348 -187373 -361115 -795129
7562 -795129 -561795 -308048 -402244 -464367 -10041 175426 727844 807447 538060 197401
7552 197401 282614 373265 -7259 -477623 -116042 313372 212685 173743 -378185 -205275
7542 -205275 -328733 67417 83258 -332601 -1820 142691 -317229 -429273 -195960 -43199
7532 -43199 -126494 -219309 183656 -15050 -318220 -8247 -273978 -281098 -406783 -233449 -21340
7521 -21340 290575 124354 -226604 65835 115422 526137 149317 -137232 179248 248494
7511 248494 -142347 -155137 -284097 -387387 -414143 104168 250478 -43058 -58294 -117655
7501 -117655 25904 375321 68887 -99693 21895 -26890 -154229 -422461 -222144 170063
7491 170063 -337776 -130430 387005 112995 -2819 316750 -48733 -348718 186 -131578
7481 -131578 -182026 -184970 -88443 -354002 -660378 -237147 -310027 -374330 -460301 -323565 -164732
7470 -164732 -269078 504749 626228 655119 -95958 -113589 -136315 -165507 138277 -203897
7460 -203897 -199528 -74928 -3533 20165 -127808 -124140 -144806 296689 -114621 -197797 230102
7449 230102 -35184 -77592 -110715 -263539 -283496 -209726 -55962 5457 -377714 -225206 1152
7438 1152 160586 493926 176821 359717 484437 329053 33837 585 -281779 69075
7428 69075 43694 -137222 209539 239140 69325 66431 345265 185553 83733 -158724 -124541
7417 -124541 84258 163974 103663 -192793 -134550 -113978 -282530 -155615 -6067 -48444 365687
7406 365687 -148350 14879 123517 -91438 170408 -168097 -107851 67700 128268 -463599
7396 -463599 -339792 -381647 -12194 -10239 -393179 -86935 17461 172140 152323 -4862
7386 -4862 206763 309257 297746 125322 -109024 -99050 163544 399578 385367 -209089 -163966
7375 -163966 199142 266019 20123 370170 222293 -28772 -303322 -148901 -37807 -133284
7365 -133284 -63227 -14739 82300 318225 191416 211842 -93531 -205502 -268977 -89123 37433
7354 37433 -437263 -182459 105063 -15 44050 386170 582696 585728 -23920 -235598
7344 -235598 -96845 27460 107320 203325 -123824 -391383 6023 230908 180057 356384
7334 356384 153514 -140447 -181517 -173848 -277596 -187060 -299656 -193920 -451870 -224435
7324 -224435 -145687 144316 -121899 -102581 -11355 -35212 -23594 320970 188915 -130971 -98680
7313 -98680 -333177 -412498 -471282 19688 137330 431910 -48641 166494 35787 65610
7303 65610 309461 58045 201173 -213758 -490941 -201623 -233128 -48454 -91964 -320597
7293 -320597 -75405 111920 -327989 -755091 -786437 -747800 -422379 -368975 -193468 -130420
7283 -130420 -114781 -90566 -209311 -27138 39131 79369 -42270 -566479 -396349 79559
7273 79559 -83303 -19417 239428 -86204 -35588 98398 101048 325546 106801 -77247 -524578
7262 -524578 -467162 -291347 -255293 -417495 -129825 323750 119832 -315036 -517959 -88288
7252 -88288 61174 -1660 -10698 175305 -174027 -146978 -277622 21439 339409 81283 162898
7241 162898 -167133 -155836 -5942 -52210 -71518 -95266 239283 47101 -180129 38715
7231 38715 -211813 -893206 -529563 -518200 -348201 249668 -15303 -34010 -112954 -91126 -122687
7220 -122687 -349271 -525057 -453982 -539295 -179902 -141323 -186925 -26064 -482472 -389636 -143036
7209 -143036 -77543 -263081 -88105 279614 315554 193426 222705 -62826 -336815 -344646 19190
7198 19190 177790 -467 195904 -92962 186293 402028 -90632 -590105 13014 229484
7188 229484 107482 28719 75023 515177 430665 -160603 -191753 -265567 -424092 -296231 -183905
7177 -183905 84039 89841 148986 -299380 -422026 -70903 65170 -328706 75451 -5439
7167 -5439 -160554 -439269 -493820 -576229 -155875 -452814 -597530 -371441 -203794 -225739 -431814
7156 -431814 -298848 -462512 -410483 -424052 -569736 -667119 -376243 -26931 -202947 -308332
7146 -308332 225218 67914 -102014 -293968 -111013 -114136 -61595 114764 1791 -325400
7136 -325400 -674335 -602892 43774 7290 114366 -166975 40661 -255316 199041 671023
7126 671023 332442 -153520 14079 393893 69278 -134504 -57416 -76294 -351378 6509
7116 6509 -154132 -35723 72642 179510 292192 -202262 -307949 162946 731535 220714
7106 220714 -16767 -126567 -19564 301265 234904 346545 205314 361834 810096 269330
7096 269330 152709 105717 -223430 -149178 158108 361836 341444 204897 103969 -22828
7086 -22828 130096 400614 216377 587050 788849 148273 389361 160396 -190646 271667
7076 271667 362284 540422 443262 178743 120888 269345 336980 52148 -499836 -4573
7066 -4573 -94538 264896 297550 206552 -60403 -125628 -132236 -193772 -56760 -54244 -236551 -45439
7054 -45439 194006 -184693 -340642 -30866 -475070 -669594 -204903 207956 -289921 -348773
7044 -348773 -571909 -201816 112963 32346 315387 271575 -300988 -232548 -34830 26477
7034 26477 -245928 -252111 509206 550841 45089 -30923 47968 -127127 -360615 -232883 185730
7023 185730 142434 249726 475603 202645 -144956 -72148 -203268 -43172 -402931 73408
7013 73408 100254 279678 192378 -77653 -326235 -439768 -16815 359758 498343 858348
7003 858348 687574 631185 809285 821476 323951 123269 322392 218524 141640 369347
6993 369347 344869 -244085 186205 345109 -25933 258119 500384 331745 675632 414183
6983 414183 300690 12965 -231953 -176627 200409 177910 -149376 -289725 -134829 232588
6973 232588 73823 -241759 -241118 66600 -215472 -180827 380084 273232 -97911 358418
6963 358418 395579 349032 160588 -124372 -607854 -230869 329566 803220 108517 114985
6953 114985 132185 275531 221229 -36139 184639 134559 58476 -125333 244142 391799
6943 391799 36249 -97552 -386300 132927 302733 -174682 -110036 12828 -19825 -188828
6933 -188828 215961 247160 338949 390308 561571 291879 88295 66335 -395685 -65883
6923 -65883 267501 220731 224396 -108295 -33962 -175907 -8784 -48443 -51930 427133 184298
6912 184298 -104259 630020 509466 116966 523457 334204 381304 353927 200614 202579
6902 202579 -6149 337446 408779 130504 96096 31476 -435395 56878 -29328 -141671
6892 -141671 103871 404039 519245 617486 191483 114700 93282 533890 343200 -202073
6882 -202073 148906 60819 -158912 -31024 281643 411549 309948 215269 109828 144920
6872 144920 235645 242426 429828 278593 335616 569930 988303 336339 155798 158650 -26728
6861 -26728 300436 331481 202950 415282 -88374 -212682 85117 108149 -125983 -15501
6851 -15501 288979 317893 5223 -187427 -77567 54973 334669 683116 516212 213500
6841 213500 571136 732504 533532 276698 218054 321965 133478 670566 538842 713651
6831 713651 896078 195369 -57679 281744 635267 -325694 -256780 117115 334119 423800
6821 423800 429195 89100 156138 234369 235313 164012 115996 90748 98916 -112491 420321 268238
6809 268238 64517 295752 454545 167098 87230 178687 454334 647349 339683 236445
6799 236445 321900 292161 226307 283822 319655 779061 235774 148209 -26903 343358 472893
6788 472893 265435 242869 345447 788503 386080 263619 755522 960841 613767 390302
6778 390302 394739 377049 857745 838731 1039854 695617 420106 220285 202921 473797 584688
6767 584688 106775 412332 673028 537127 828449 778350 482503 554259 919090 881281
6757 881281 751506 865862 304552 586332 971196 591413 601342 445900 302065 435884
6747 435884 546144 460149 431930 620458 601808 583954 793579 708593 976766 883319 691208
6736 691208 626775 662769 809725 592870 578345 704055 597828 1110283 819835 525957
6726 525957 600928 482417 800626 674046 682459 837648 919668 950097 866289 694359 564659
6715 564659 1011062 947997 1021480 958467 836518 1218693 1153618 953836 743187 496737
6705 496737 571914 874037 850898 916412 837402 1253587 1420821 891839 942119 947659 1090439
6694 1090439 965168 479837 571776 502260 901867 732149 980341 1028482 1470037 1562517
6684 1562517 1061337 747210 755333 724727 973771 1219030 893544 965023 751234 830896
6674 830896 1139721 620647 836557 1209990 1107309 950670 452722 718647 609264 391057
6664 391057 701323 806394 715195 1085650 1097805 1428906 1317214 1066369 838623 832265
6654 832265 1117569 1445471 1578010 1223612 450289 795267 619066 687215 679783 696871
6644 696871 699642 942199 657973 1092866 1146277 608149 848924 1190823 902191 826282
6634 826282 868755 855898 801775 870302 820482 1056321 1037927 1039434 1225187 1225620 1002518 910988
6622 910988 1022297 310351 568800 1031232 1015910 863774 433245 393886 398524 489508 833919
6611 833919 1062892 613390 564089 988786 1069261 1242531 812121 762649 1091477 1303407
6601 1303407 1634555 1005644 868851 810406 842560 1327532 577574 540434 632772 426414
6591 426414 555602 1061677 1033396 969477 681394 808132 1264498 1532797 1349858 1233068
6581 1233068 1165300 1411698 1578371 1211276 1136142 1301538 886178 1061995 805882 1232430
6571 1232430 1282000 1431353 1472307 998140 859800 1190005 967866 934315 1099255 946725
6561 946725 630259 782349 1008094 924365 846228 880886 1539430 1701719 1357955 1651596
6551 1651596 1377127 1194510 1207088 886206 908741 920068 730285 858246 1124977 1317461
6541 1317461 994354 810762 888227 1436914 1265880 1325320 985360 1010300 1212211 880975
6531 880975 1189086 1322460 1037956 1149704 1467561 1326566 912094 839288 867446 1068761
6521 1068761 1218545 758195 1062693 1094915 1208005 752192 955132 666057 998199 1074863
6511 1074863 954075 1544309 1880016 1751408 1628206 1542004 1329698 1423576 1649404 1820406
6501 1820406 1708159 1618222 1526104 1678759 2211429 1594174 1549061 1758394 2085207 1952843
6491 1952843 1916764 2156535 1671041 1296972 1393152 1576807 1780076 1934413 2368519 2384871
6481 2384871 2371726 2377833 2261870 2271096 2220530 1999474 2138289 2601576 2683857 2370620 2339816
6470 2339816 2259491 2545364 2422226 2061516 2598052 2905213 2868707 2800494 3014376 3213196
6460 3213196 2702888 2863814 3215170 3544535 3898502 3687409 3964885 4060357 4102534 4114056
6450 4114056 4524985 4711178 4437661 4433849 4902755 5381588 5636352 5576234 5728987 5609104
6440 5609104 5464041 6285478 5883703 6099391 6538709 6173962 6451277 6835973 7127415 7614556
6430 7614556 7585489 7850149 8236380 8589491 8287642 8205710 8670548 8626437 8634301 8593832 8529841
6419 8529841 8570090 9193580 9136056 9173317 9179784 9165775 9177915 9561560 9419212 9010767 9058622
6408 9058622 8569932 8743638 8948979 8795162 8617403 8321003 8726226 8261420 7821893 8118290
6398 8118290 8337322 7933912 7504123 7893586 7841022 7988075 7534428 7206894 7607499 7781833
6388 7781833 7578029 8005447 8154295 8265820 8594685 8351050 8462645 7813706 8407146 8770670
6378 8770670 8991887 8750402 8763477 9255368 9135886 9648620 10322024 10585406 10621406 10385500
6368 10385500 10274528 10104261 10314557 10949146 11091226 11512603 11682803 11666549 11632393 11450703
6358 11450703 11830131 12139160 12097049 12195515 12269707 12138103 12182543 12193945 12221612 12163464 11853897
6347 11853897 11434794 11377187 11291585 10511832 10112142 10680485 10886466 10695121 10092239 10057475
6337 10057475 10002125 9461160 9289153 8798394 8161601 8166322 8490850 8076704 7859649 7341248
6327 7341248 6998912 6468082 6415763 6589838 6656029 6455759 5986024 6124886 5818079 5839958
6317 5839958 5569852 5697084 5643158 5844459 5495168 5149286 4929871 5346987 4962647 4528526
6307 4528526 4347109 4074544 4209130 4068293 4105222 4189917 3926943 3615327 3932098 3857211
6297 3857211 4196132 3971588 4090009 4091635 3992057 4056150 4297510 4059726 4173780 4202254
6287 4202254 3878655 3935491 3926412 3603022 3619863 3925645 3734224 3698338 3461145 3678402
6277 3678402 3629791 3385130 3071930 3469474 3778502 3439751 3385331 3479303 3273602 3164808
6267 3164808 3264755 3419092 3291658 3205128 3303717 3198947 3525285 3433514 3310652 3206917
6257 3206917 3443154 3834959 3781892 3523011 3355110 3141404 3106217 2901094 3076842 3421462
6247 3421462 3250296 2534796 2645074 2665048 3347694 3281805 3407934 3848918 3755863 3844941
6237 3844941 3843055 3549646 3616718 3634799 3674037 3624969 3699561 3916462 3760854 3235114 3492159
6226 3492159 3387653 3455945 3626026 3768684 3962038 3983334 4109219 3921351 3916676 3914462 3838998
6215 3838998 4097572 4116610 4087369 3855022 3662364 4173231 4170624 4127830 4410415 4132012
6205 4132012 4358986 4098001 4363610 4690479 4415683 4443656 4475952 5207496 5447014 5505247
6195 5505247 5372418 5029308 4858360 5283045 5428315 5398146 5264805 5595536 5789996 6115553
6185 6115553 6250904 6576723 6544996 6866273 7106069 6969083 6775886 7103487 7315880 7418236
6175 7418236 7543050 7664121 8055645 8611896 8725429 8763078 8835458 8936210 9033611 9046121
6165 9046121 9389405 9910531 10048875 10045138 10071786 10217491 10211187 10327133 10238463 10650186 10846512
6154 10846512 10903231 11319590 11702752 12146847 12469266 12927210 13461717 13996348 14572251 14661617
6144 14661617 14797896 15182393 15703162 16705946 17568913 17630795 17595016 17298625 17167932 16928753
6134 16928753 16683142 16270655 16158294 16269425 16661103 16663637 16761727 17079815 17110979 17159495
6124 17159495 16983866 16906629 17878648 18410149 18192573 18568302 18810148 19209667 19692602 20270916
6114 20270916 20678799 21124024 22065090 22222682 22374133 23006053 23530602 24112538 24931088
6105 24931088 25610497 25388521 25778758 26215559 26853670 27398308 27978017 28286532 28330767 27889111
6095 27889111 28007721 27946690 28475789 28638313 28968927 29217162 29044556 29227783 29682401 30148858
6085 30148858 30311573 31234493 31610737 31998441 32599710 32974301 33291489 33502530 33731730
6076 33731730 33909566 33889960 34100369 33699895 33195434 32977238 32655413 32163013 31788299 31567033
6066 31567033 31018085 30398625 29481532 28914979 28473925 28579059 28109780 28035503 27333101 26883285
6056 26883285 26511347 25808603 25933033 25479330 24949632 24724380 23979675 23320163 22867323
6047 22867323 22343425 22320264 21936374 21399885 20898500 20313537 19892054 19293693 18654718 18158784
6037 18158784 17563339 17272404 16714847 16333052 16018070 15264154 14359801 14220734 13666034
6028 13666034 13002932 12786943 12162857 12593944 11962972 11779375 11580937 11460276 11000135
6019 11000135 10812716 10516540 10745517 10638939 9693136 9967592 9869912 9961175 9614976 9607183
6009 9607183 9643072 9243532 8873789 8763181 8558774 8451028 8240047 8169486 8323777 8377988
5999 8377988 7999664 7823938 7408820 6950520 6999646 6846244 6656755 6612895 6367430 6205216
5989 6205216 6136468 5963175 5674303 5634184 5684928 5570909 5901180 5683148 5292208 5239809
5979 5239809 5411213 5458531 5360187 5164728 5066826 4860405 4511363 4237815 4401225 4547006
5969 4547006 4458069 4333368 4377312 4419131 4124354 4146790 3983414 3933809 3692571 3945297
5959 3945297 3880353 3438281 3584989 3869191 3671634 3825542 3990237 4403361 4463125 4420188
5949 4420188 4121361 3978085 3810263 4196405 4168171 3798631 3662306 3773852 3642367 3386788
5939 3386788 3456474 3561911 3305885 3045706 2879250 3147590 3562083 3372663 3050920 3260664
5929 3260664 3273686 3389451 3258919 3403113 3392463 3439169 3456294 3207868 2969439 2628540
5919 2628540 2897181 3092954 3542426 3281139 2980520 2933745 3020979 2982055 2744235 2727386
5909 2727386 2599810 2587795 2429687 2773850 2883720 2590052 2703687 2685234 3088948 2924919
5899 2924919 2929518 2897668 2611227 2623920 2721421 2675064 2659048 2606009 2705665 2994858 3084377
5888 3084377 3131964 3135655 2648597 2732619 2497458 2645278 2665739 2812022 2685815 2686441 2744713
5877 2744713 3191857 2720414 2095383 2137978 2082778 2416782 2740227 2840368 2244625 2228548
5867 2228548 2303287 2725999 2489054 2258355 2451156 2702357 2870442 2906327 2820671 2465305
5857 2465305 2817828 2772087 2523002 3001282 3147263 3051391 2875959 2534873 2869339 3075761
5847 3075761 2933734 2706326 2984530 3069509 3182572 3190358 2926205 2570930 2827041 2955034
5837 2955034 2849484 2936228 2744736 2872478 3367400 3156089 3082324 2856220 2777918 2465519
5827 2465519 2287351 2707554 2672288 2935168 3134059 2981790 3301986 3228074 3166189 3303238
5817 3303238 3110680 3170411 3248528 2967745 2837201 3022088 2975054 3150649 3046729 3118005
5807 3118005 3147767 3355972 3053502 2934332 2996498 3163366 3138161 2502325 3026887 3642983
5797 3642983 3411189 3223450 2994584 3275006 3244744 3074334 3387119 3888041 3927131 3372134
5787 3372134 2916498 2993141 3100883 3162378 3136239 2914134 3157932 3339353 3373843 3393573
5777 3393573 3299588 3596061 3997048 3718033 3624486 3810221 3580261 3725505 3662499 3698899
5767 3698899 3594136 4081965 4219096 4169376 4157419 4003319 4153871 4299003 4257434 4084168
5757 4084168 3834778 3501828 3305601 3523548 3570848 4292477 4165413 4317152 4261595 3803912
5747 3803912 4262197 4373811 4227693 4398989 4448373 4430019 4457931 4092436 4259374 4335265
5737 4335265 4308514 4686424 4700965 4538699 4452153 4476170 4639377 4801948 5092235 5437868
5727 5437868 4725882 5075494 5500629 5306982 5369670 5260909 4600974 4754013 5348571 5304486
5717 5304486 5622059 5427531 5497399 5772083 5551638 5173291 5258878 5364058 5671288 5786951
5707 5786951 5555523 5514215 6079247 6071758 5418891 5561857 6323327 5941753 6466629 6676751
5697 6676751 6663085 6678312 7129726 7069863 7132266 7002558 6930358 7200738 7556435 7472537 7712546
5686 7712546 7828724 7982248 7898633 7877846 8166953 8143981 8041670 7940942 7869263 7925126
5676 7925126 7866386 8254388 8736780 8693238 8669057 8422727 8750510 8677185 8315346 8465626
5666 8465626 8336292 8501008 8616881 9015025 9327045 9532529 9286867 9479497 9752503 9455733
5656 9455733 9896061 10238163 10447677 10158833 10270638 10094757 10055853 10292713 10495547 10778527
5646 10778527 10968367 11198896 11374680 11217742 11742675 11395449 11352808 11289570 11572390 12034821
5636 12034821 11647362 11833677 12026636 12129797 12365131 12246736 12306701 12760645 12947718 13238951
5626 13238951 13589011 13696175 14044338 14012507 13405091 13589857 13729413 13824277 14608693 14343939
5616 14343939 13973513 14123994 14669174 15239639 14989320 15197462 15475413 15338079 15746417
5607 15746417 15997077 16175378 16212464 16169506 16834617 17025621 16687051 16917760 17283783 17724535
5597 17724535 17879574 18474338 18458508 18722087 18868720 19258540 19885179 20359540 20436858 20591744
5587 20591744 20900790 21192561 21434122 21646314 21735404 21847544 22263590 22179489 22752832 22971648
5577 22971648 23135115 23323298 23994178 24634431 24679671 25194577 25531861 26288823 26747737 27182263
5567 27182263 27657831 27889000 28042276 28205045 28737390 29044728 29447051 30031439 30205943
5558 30205943 30664440 31222889 31427810 31385098 32082593 32934793 32779493 33007544 33700383 34030523
5548 34030523 33735647 34163721 34957035 35454440 35872309 36118810 36743024 37511845 38115357
5539 38115357 38717058 39366461 40169980 40109171 40730808 41601032 42445127 42760674 43494841 44193928
5529 44193928 45152969 46136884 47204905 48384778 48877127 49967476 50730172 51671417 52613613
5520 52613613 53134045 54018266 55243146 56046203 56911639 57553102 58094865 59316798 59886113
5511 59886113 60864409 61958058 62957283 64926365 65848289 66865812 67900232 69210179 70794486
5502 70794486 71656754 73397519 74705160 76188110 77663964 79037536 80003874 80813982 81791234
5493 81791234 83041528 83995327 84649454 85295866 86096182 87110618 88345634 89397083 91187806
5484 91187806 92630156 93233877 94733264 97001425 99029175 101578256 104190488 106483913
5476 106483913 108745480 111529245 114608906 117175360 120225485 123461310 127077035 131036102
5468 131036102 134982571 138953804 143372193 147515018 151746737 156592573 161566747 166277043
5460 166277043 171401995 176986191 182650744 188331975 194454070 200703078 206398620 213091211
5452 213091211 220045318 226554491 233691918 240683483 247721715 255200416 262624929 269889852
5444 269889852 277291819 284052535 291328492 298755432 305552345 312410505 319045172 324595467
5436 324595467 330145967 335326005 339829799 343411583 345954778 347852660 348638715 348258033
5428 348258033 346149062 342341992 337040860 330386563 322797034 314018216 304523944 293652340
5420 293652340 282695963 271521598 259978991 248381212 237042302 226060991 214465156
5413 214465156 203693831 193111994 183183559 174142633 165604200 157859193 150548328 143747552
5405 143747552 137045295 130706822 124935722 119848053 114454887 109479376 105542904 101709042
5397 101709042 98160365 95038021 91632416 88727809 85991142 83738770 81782345 79429443
5389 79429443 77827433 76398153 75118498 74385080 73137132 71770468 70340220 67719115
5381 67719115 64384004 61496687 58835468 56394642 55056241 53227618 51556119 50481311
5373 50481311 48947823 47849954 46520440 45567307 44508802 43539815 43046285 42774603 42141814
5364 42141814 41686818 41348916 40804396 40201710 39731610 39570686 39686488 39903453 39977856 40523231
5354 40523231 40505719 40824149 40910604 40187259 37868185 35684984 33948093 32581097 31903283
5345 31903283 31044304 30467240 29176544 28945630 28819642 28167963 28003014 27550653 27189946
5336 27189946 27214974 26938974 26018509 25701304 25453001 24812021 24420821 23973136 24192995 24160457
5326 24160457 24330399 24299039 24176975 24750642 25054089 25445279 24981490 24632838 23645196 23444939
5316 23444939 22937418 22148496 22000488 21695908 21455431 21157771 21280709 21320171 21345425 21010858
5306 21010858 20463007 20197939 20012121 20116383 19582850 19650037 19459080 19132316 18584523 18676770
5296 18676770 19057853 19137996 18946186 18457972 18660356 19083710 19052969 18972976 18623797 18401835
5286 18401835 17876305 17860705 17854249 17674731 17427067 17102308 17343497 16952384 17268239 17200399
5276 17200399 17126919 17208955 17151812 17151518 17032696 17046828 17382851 17364983 16957136 16508525 15987444
5265 15987444 16051829 16321233 15893714 15612581 15514707 15314785 15225357 15164490 15333542 15116380
5255 15116380 14813109 14879711 14628540 14675436 15369774 15301578 14855265 15070062 14840195 14900292
5245 14900292 14740646 14413100 14770750 14404487 14325559 14981864 14822172 14466862 14443166 14456853
5235 14456853 14018016 14151174 14530945 14368144 14431100 14789903 14334067 13999888 13699991 13588946
5225 13588946 13678115 13483276 13463687 13166660 12772989 12832894 12963310 13062806 13086628 13179154
5215 13179154 13007005 12876495 13274241 13053738 12894308 12626306 12881097 12921152 12756448 12477914
5205 12477914 12685969 12929337 12779609 12723165 12702414 13217623 12851951 12565116 12811046 12967961
5195 12967961 12632486 12837581 12932063 12616353 12884850 13055474 12600036 12776357 12818342 12983410
5185 12983410 12455419 12217404 12216322 12308829 12586961 12378855 12123349 11731596 11675253 11372874
5175 11372874 11355047 11861412 12199839 11833549 12129175 12766442 12840482 12590069 12534483 12592356
5165 12592356 12374571 12198034 12269069 11977900 12027953 12145420 11970266 12493114 12434787 12506632
5155 12506632 12715026 12874513 12490162 12682510 12747359 12337340 12583906 12726216 12602508 12832997
5145 12832997 13010730 12362067 12063256 12074804 12285215 12414036 12274681 12231427 12326443 12187656
5135 12187656 12492535 12135134 11858897 11714749 11769415 11907422 11755725 11946277 11432583 11309081
5125 11309081 11077017 11288378 11091415 10946498 10839806 10449591 10393630 10277896 10617846 10737506
5115 10737506 10487422 10653167 11021449 10292644 10049164 10244482 9986988 9952597 9845862 9538415
5105 9538415 9730345 9728303 10005397 10078272 10001662 10019182 10156819 10368912 10219745 9494325
5095 9494325 9601532 9595931 9772709 10028045 9882763 9787145 9940773 9575050 9886566 10141104
5085 10141104 10268601 10750791 10973828 10685112 10664999 11011857 11141992 11311487 11431801 11464414
5075 11464414 11554251 12060118 11991922 11985330 11845356 11935995 11935931 11961030 12160735 11915492 11763095
5064 11763095 11792410 11481096 11489047 11597032 11492452 11452457 11643030 11514451 11654770 11649225
5054 11649225 11595082 11637041 11306151 11603494 11528602 11409579 11474013 11946128 11917288 12113560
5044 12113560 11872993 11738463 11790091 11505307 11900673 12106552 11900665 11647043 11515522 11467880
5034 11467880 11977345 11653064 11239029 10951580 10803764 11419107 11412386 11237553 11233774 10778865
5024 10778865 10638761 10546976 10822103 11060778 10871135 11169087 11026774 10663529 10592376 10398859
5014 10398859 10080425 9851053 10295593 10414468 10567968 11031032 10940495 10754666 10528501 10516167
5004 10516167 10390348 10542710 10814532 11046209 11099652 11043838 11073774 10893741 10646781 10580834
4994 10580834 11101758 11219429 11220552 11186682 11138119 11614731 11820578 11674013 11771695 11572470
4984 11572470 11610540 11527995 11624451 12139352 12942886 12562869 12454381 13009807 13050211 13087318
4974 13087318 13434605 13227710 13294339 13357941 13200899 13605396 14077291 13927785 13778588 14246606
4964 14246606 14483609 14428196 14126230 14388884 15061583 15169229 15278659 15546498 16018853 15955209
4954 15955209 16346081 16663733 17273847 17225183 17221808 17653294 18253236 18969424 19292138 19376607
4944 19376607 20102080 20657663 21069323 22080881 22911865 23633570 24022815 24902039 24527033
4935 24527033 24753092 25760118 26137735 26234590 26553016 27037152 27470012 28157261 29102643
4926 29102643 29931333 30248621 30457199 31303762 31768949 32520960 33736129 34520646 35867617
4917 35867617 37194343 38773818 40028650 41351807 43354795 44533844 45546004 46795163
4909 46795163 47861011 49160741 50682995 51958842 52964147 54047272 55177154 55529767
4901 55529767 55623326 55633583 55882952 55948373 55794389 55326373 54409642 53731872 53378188 53146099
4891 53146099 52933074 52384161 52061998 51950565 52105577 52147740 52115568 51981673 51907356 51477697
4881 51477697 51147862 50345924 49175851 47691656 46220801 44648695 43033646 41165081
4873 41165081 39225507 37979188 36381185 34222122 32779193 31446583 30061259 28483307
4865 28483307 27251369 26038152 25039479 23939449 22911627 22423531 21428002 20483674 20146451
4856 20146451 19317510 18629171 18024977 17680061 17582409 17212320 16576684 16313633 15468436 15339767
4846 15339767 15045319 14904926 14828752 14308333 14221353 13878091 13475779 13320442 13213996 12422992
4836 12422992 12129394 12090757 11895058 11122443 11284457 11019715 11108203 11221325 10766295 10383931
4826 10383931 10171153 10066991 10117511 9653759 9688188 9374752 9220970 9135255 8647757 8298310
4816 8298310 8017375 7529961 7466551 7502325 7593022 7771244 7142130 6790717 6343890 6334360
4806 6334360 6381119 5986345 6202085 6398881 6514432 6444534 6024586 5751107 5440375 5669017
4796 5669017 5485343 5326713 5076203 5211013 5213110 5140413 5102022 4626953 5039497 4849937
4786 4849937 4796690 4225967 4314181 4371671 4826466 4682166 4185898 4068414 4127307 3951863
4776 3951863 4084353 4896149 4528643 3950608 3637707 3698061 3716440 3766196 3752044 3535036
4766 3535036 3917919 4236768 3844057 3927457 4248245 4487991 4611037 4475292 4422043 4073024
4756 4073024 4268877 4667019 4608869 4399549 3975499 3952795 3611585 3261681 3336601 3410508
4746 3410508 3591257 3350408 3698335 3608943 3315002 3618216 3696608 3399412 2961522 3500774
4736 3500774 3206915 3226718 3813378 3757301 3899800 4246578 3774496 3901523 4312850 4634010
4726 4634010 4752208 4638322 4961135 4250514 4239559 4139836 3762763 3704438 3716433 3576300
4716 3576300 3803697 3563756 3301569 3570195 3741249 3462922 3729363 3894127 3398652 3643692
4706 3643692 3496097 3296268 3045987 3027376 3743550 3796773 3259095 3208192 3335629 3731217
4696 3731217 3551438 3442550 3464802 3146350 2964542 3289538 3328283 3631403 3702306 3696455
4686 3696455 3733113 3252826 3139195 3254980 3385922 3594780 3437551 3591564 3768979 3616073
4676 3616073 3997146 3981846 3736274 3934769 3289700 3528641 3983632 4155674 4066808 4039413
4666 4039413 3923795 3894482 3765368 3918948 4523912 4694806 4368488 4230714 3807028 3840595
4656 3840595 4203508 4717927 4591166 4393224 4623520 4877714 4925130 4816700 4570194 4484625
4646 4484625 4783171 4915807 4714956 4395833 4558457 4466263 4419155 4949409 5024489 5034505
4636 5034505 5103645 5349011 5401204 5359468 5620887 5327711 5550476 5795446 6005344 6000236
4626 6000236 6258532 5870401 6006481 6154452 6049897 6137730 6359846 6274769 6208416 6619493
4616 6619493 6857738 7008747 7187093 7567338 7822950 8055562 8081761 7727156 7714592 8111975
4606 8111975 8777256 8840224 8875215 9299782 9579398 9925595 10158825 10362682 10229505 10507008
4596 10507008 11227839 11617133 12104741 12341000 13067665 13312000 13603624 14214154 14609243
4587 14609243 14639997 15321675 16343190 16501800 16690532 17553334 18113110 18275820 18583960
4578 18583960 19338409 19952591 21093370 21516790 21941661 22881826 23495810 23793263 25021011
4569 25021011 25792577 26276174 27443933 28338386 29378379 30562414 31650729 32758024 34322764
4560 34322764 35396652 36675979 38167737 40042280 41793136 43525897 44856638 47080046
4552 47080046 49911907 52592244 55495404 59089239 62853109 66921473 71986308 77162766
4544 77162766 83210377 90029818 98008110 106902600 115823979 126267632 136293286 145053799
4536 145053799 152670715 159929932 167544085 176245573 187484041 200050155 212189418 221428307
4528 221428307 227110874 229398685 230977307 233400615 237642412 244345372 252017320 257495840
4520 257495840 257066356 250405154 239919189 229218664 221020134 215568431 212342958 208792927
4512 208792927 202957299 193248601 180249630 166804017 154201156 143905761 135482369
4505 135482369 128893706 121915031 113413854 103865944 94180712 84654411 76933563 69676073
4497 69676073 63614265 58188080 53578806 49902909 46704420 43947794 41314085 38572141
4489 38572141 36522097 34777334 32974860 31319154 29419651 28149890 27128243 25717544
4481 25717544 24427038 23558286 22699656 22067160 21033327 19758054 19083082 18386715 17626829
4472 17626829 16961762 16166256 15854966 15424296 15119439 14244889 14022608 13498581 12996799
4463 12996799 12721707 12187635 12024095 11377994 10917912 10576764 10480105 10678302 10126779 10060863
4453 10060863 9687714 9205245 8815960 8663589 8734632 8096320 8110796 8117632 7977268 7569410
4443 7569410 7418794 7354250 7134864 6803624 6774805 6668587 5911672 6104929 5689524 5768908
4433 5768908 5778437 5413299 5249956 5044371 4704778 4965408 5066154 5161523 4724842 4577686
4423 4577686 4605532 4552328 4200596 4348208 4434683 4415617 4571290 4173878 4170866 3971976 3843070
4412 3843070 3492184 3514712 3489370 3755233 3249977 2951401 3084753 2819771 2522730 2850166
4402 2850166 2942359 3169014 3234417 3138212 2767315 2527014 2896437 2726157 2716550 2420120
4392 2420120 2300326 2402028 2423979 2392509 2390090 2420467 2149779 2071554 1877626 2194301 2108377
4381 2108377 1523366 1522132 1498433 1960840 2110859 2233746 2103165 2166809 2238876 2014765
4371 2014765 1747729 1347761 1594090 1729606 1502542 1827635 2197699 1945830 1986096 1720596
4361 1720596 1539114 1745548 1823536 1561504 1947046 2380955 2514640 2025876 2034667 1832398
4351 1832398 2185527 2316824 2526921 2514759 2529638 2716874 2638171 2654824 2374315 1743307
4341 1743307 1536824 1776167 1832323 2300671 2061066 2050419 1387931 1426545 1644547 1222958
4331 1222958 912206 1297194 1191923 1081794 1303804 1279634 765596 771152 912940 679162
4321 679162 714581 723702 926302 1222995 1328934 1143520 1034145 941708 1255880 944977
4311 944977 1049040 831847 1052917 1043746 922138 628526 222209 470407 538515 793305
4301 793305 501521 470053 435750 545541 715047 1103988 1069970 810681 398632 502088
4291 502088 625767 648477 492042 359376 250144 653401 634583 121802 577714 931847
4281 931847 893182 796895 451263 564650 602455 620331 740441 623985 943871 962228 861535
4270 861535 826131 995016 593126 336693 732712 795763 795623 903894 599541 512293 476173
4259 476173 279433 369988 419141 589834 337955 287854 434072 130223 557627 833960
4249 833960 912821 618518 621081 966689 801906 615645 527957 704060 900112 334237
4239 334237 158055 355515 800817 524142 308256 361069 -94076 478917 821117 646032
4229 646032 497108 690944 833786 1197916 1117623 941128 650223 611273 952609 927756
4219 927756 1242321 1309857 1431202 1521003 2075548 2384659 1780554 1640590 1161945 1275268
4209 1275268 1644896 1609932 1785168 1553251 1179303 1517981 1136962 1212607 1431418 1299842
4199 1299842 1539420 1406493 1360269 1596870 1415664 1261047 1193218 918029 696469 575330
4189 575330 475966 674533 908622 597339 457035 713539 872261 803527 864301 772013
4179 772013 588481 420609 600023 856581 748988 174849 267648 623708 533802 751724
4169 751724 814887 595694 798917 845906 366158 334303 387104 427289 408186 629837 936033
4158 936033 795391 607991 525804 842663 1069598 1180770 914615 652767 963936 1280138
4148 1280138 1509261 1738857 1783452 1735733 1958014 2660386 2973703 2552947 2105641 2262292
4138 2262292 2033058 1406684 1209620 1263036 1281187 1026890 603449 914449 1076214 1078266
4128 1078266 809205 725361 1050933 922649 56669 99000 300649 159863 -210747 -322653
4118 -322653 -299351 -171236 -359811 5025 457627 331317 249822 305924 177654 415585
4108 415585 335708 159799 422540 435012 401188 648682 507784 495370 174985 58203
4098 58203 489033 323458 -31360 -284527 -144134 -100725 737332 339718 222911 352283
4088 352283 40195 151509 184499 308624 336489 -58083 222448 388184 89297 34959
4078 34959 19732 -385149 -489487 -271858 -65410 -279884 -401655 -326896 -142666 172787
4068 172787 82075 -268804 -442250 -559948 -188423 299863 385754 412308 120349 -40422
4058 -40422 121305 515451 499825 303387 -2924 -50055 -11372 -382609 -125768 -99433 -147600
4047 -147600 -208369 -204818 -135764 89575 -329779 -184645 120649 92865 -19181 128308 -190091
4036 -190091 -373655 -331321 -72301 -7255 152423 207669 -179220 -169395 -110661 -67890 -159436
4025 -159436 -386276 443606 1026981 949660 472490 102416 112931 231981 213636 -194496
4015 -194496 -138516 -144709 -207013 -251695 -2395 118756 492416 464417 281050 541360 266535
4004 266535 175999 -30550 40638 267547 -198385 195025 610153 392086 -327871 -350081
3994 -350081 -411639 -558102 -123797 266783 266067 371141 -93406 -194234 203986 212110 -81280
3983 -81280 385542 446197 -6701 183756 353238 191082 140098 520749 572733 162957
3973 162957 -94007 271916 581754 624127 507283 434300 216258 -185245 -76970 -236158
3963 -236158 -390151 -393624 -74931 -423480 -425149 16017 -246244 -171992 -97250 -60845 169175
3952 169175 37739 263481 146702 -270845 -424566 -380079 79750 263028 -195813 199881
3942 199881 337265 190797 339557 465115 598954 398860 446653 570077 -17340 467132
3932 467132 427799 -117019 32874 -212625 -257719 -236234 73294 -515338 -341346 163414
3922 163414 401132 188014 36199 289383 61491 -231077 -403885 -396776 -11071 46419
3912 46419 -175503 -196023 55870 269000 33570 -243830 -495469 -257382 -38006 97193
3902 97193 352223 315762 395376 317089 -54155 389900 275397 218581 -54718 -11028 275488
3891 275488 68492 -21048 144323 17953 -111001 226445 265220 -3018 -322614 -184188
3881 -184188 -122539 113780 376095 522608 37744 37662 263368 364977 74241 -127354 -6223
3870 -6223 76291 176528 332437 257889 406484 239234 17386 538172 125852 97721 106863
3859 106863 -289956 -103993 -79871 -251712 -191730 296179 83056 57532 398432 118901
3849 118901 -230230 -218679 -221624 -105574 2733 58458 209450 94559 149578 167066 -31600
3838 -31600 -204039 96521 383881 206504 172452 26543 175021 74715 -72214 62844
3828 62844 304617 478656 558937 399843 -181977 -176911 -24460 -203296 209597 -185942
3818 -185942 62682 103181 465024 87121 -167614 -12575 -14742 -156691 -268318 133638
3808 133638 423723 398653 260831 217243 41466 -296269 -348043 82130 358201 218278
3798 218278 -82227 100552 128690 630159 831764 529238 390982 591845 374273 472480
3788 472480 242079 387234 330964 443308 515805 -141921 -147632 -229827 -568068 -313669 -115568
3777 -115568 -58935 -9112 -44733 -375593 15936 182044 140034 117074 124310 85125 -218233
3766 -218233 151446 -92745 -367633 -318634 35932 455534 267006 -39010 30452 52700
3756 52700 336714 294279 235705 151396 -92584 296410 248980 5385 58100 311022 35778
3745 35778 42346 -107837 207433 207032 246607 183069 96254 304865 -20883 340853 347084 -77427
3733 -77427 -185930 263448 528848 -176623 -50060 204576 150481 158539 51493 369201
3723 369201 297575 128837 350663 335041 -128801 -283296 718044 589063 701604 480453
3713 480453 479675 697366 662762 76239 523078 611018 95457 250405 308880 314805 282203
3702 282203 181964 71461 222632 198449 184643 59037 267113 733194 758915 370426
3692 370426 629954 284696 1005069 868910 899044 769156 311518 81227 258438 163443
3682 163443 163999 289312 564923 428218 350090 641934 581247 206183 513313 761456 792635
3671 792635 1071579 467069 268120 50508 -56473 89863 306997 353393 379565 385598
3661 385598 192336 337023 405347 473497 723117 634495 626575 454416 319347 340623 409119
3650 409119 403875 495056 464980 900093 651914 646560 411319 83220 97702 213353 370516
3639 370516 432000 659082 440325 448769 499108 678496 478498 351317 235602 640276
3629 640276 687887 652226 734158 949999 565263 592004 846978 642838 668115 738889 758563
3618 758563 705164 804896 660304 554753 773563 909776 1027360 800771 712692 330741
3608 330741 484639 701598 647931 966378 596976 451534 762490 715385 529035 273071
3598 273071 258602 479523 543839 199843 585998 530180 477502 223319 233685 438216 428118
3587 428118 770194 881447 1205946 1189966 1092469 429328 195249 287138 345799 374098 464301
3576 464301 497885 630198 821580 1103215 995406 974558 422130 640932 1105192 748126
3566 748126 721848 310236 199916 369621 428971 499951 378185 537618 492576 505561 690509
3555 690509 826049 772380 128735 224903 550548 475285 183944 58531 287618 516860
3545 516860 746301 672702 1369369 998484 707093 720144 522261 367226 501832 466681
3535 466681 735495 600670 690027 510525 673934 1091919 1139120 1102995 747642 493288
3525 493288 412826 670550 565456 365704 457693 689516 842602 660625 554353 787156
3515 787156 497273 617297 438476 695057 959338 1094708 1175492 896429 830531 896417
3505 896417 942628 1333209 1069885 818492 817390 814838 1123870 854130 1126187 1121556 719746
3494 719746 442872 659278 1204308 988063 764843 810912 1216810 1036378 897481 1116767
3484 1116767 1664150 1621009 1153123 866152 1280905 975982 809430 725002 590972 1070359
3474 1070359 739025 463498 524142 666673 380627 739212 1082149 1551282 1673971 1308116
3464 1308116 1539007 1584722 1496290 1646625 1540372 1315764 1460731 1847189 1726515 1627693
3454 1627693 1883341 1496095 1309619 1977917 2152175 2191695 1883902 1418119 1593657 1664637
3444 1664637 1653280 1757727 1938982 1709031 1704186 2165282 2388652 2241274 2345726 2061812
3434 2061812 1797474 1900378 1923563 2023163 2443661 1979177 1870033 1925398 1901935 2013335
3424 2013335 1938311 2130367 2624758 2622440 2206350 2165344 2243303 2420450 2887136 3317675
3414 3317675 3064864 3062238 3272205 3486818 3221990 3201781 3755160 3507724 3201961 3447747
3404 3447747 3662742 3493580 3310148 3897715 3791709 3465473 4048524 3943668 4196935 4345191
3394 4345191 3921895 4403906 4046818 4224161 4698189 4941251 5031729 5534414 5782240 5669372
3384 5669372 6021566 5930330 6250749 6550418 6736830 7031185 7104216 7344840 7767574 8184987
3374 8184987 9063431 9033950 9091936 9520466 9942962 10335620 10209826 10232649 9675379 9311664
3364 9311664 9144129 9277579 9243542 9366700 8751148 8510653 8236196 8168591 8137313 8162552
3354 8162552 8217677 7604730 6854081 6872012 6917765 7335016 7677142 6797645 7000224 6927201
3344 6927201 7299420 7252272 7297602 7326865 7340046 7169583 7452398 7517151 7179152 7003770
3334 7003770 7075407 7139483 6987732 7234147 6904092 7196488 7517771 7481815 7707898 7626041
3324 7626041 7324654 7189244 7892121 7934219 7950150 8346437 8747115 8280026 8241770 8317949
3314 8317949 8150108 8230089 7966147 7868467 8073908 7919700 8249221 8572751 8326357 8289901
3304 8289901 8277035 8107724 7711243 7938940 7736905 7359696 7092051 7346204 7944431 8029649
3294 8029649 8041124 7748105 7718637 7525582 7455858 7394145 7214309 7195035 7375377 7474459 7312124
3283 7312124 7190054 6976267 7249110 6569239 6607833 6991090 6972274 6801993 6851914 6402043
3273 6402043 6287305 6407939 6354687 6014161 5737518 6261670 6022604 5390500 5807786 5979453
3263 5979453 5870857 5971594 6086496 6220708 6267464 5923257 5891737 5849162 5723023 5511637
3253 5511637 5956107 6309717 6167058 6556908 6897432 7022247 7298111 7329063 7632705 8295128
3243 8295128 8844553 9464994 9849237 10431198 11113287 11915089 13772121 14965134 15671318
3234 15671318 14832959 13012739 11027858 9506795 8852873 8425405 8283622 7935877 8191864
3225 8191864 7713606 7813569 7704618 7619747 7390471 7883994 7673511 7712290 7994780 8690981
3215 8690981 9234283 9872188 10547128 10665081 11386598 12549017 14106454 15222940 16925657
3206 16925657 19113237 21958900 24047744 23809362 21003955 18030648 15164202 13072862
3198 13072862 11385845 10615923 9739786 8933508 8493909 7900944 7992907 7430449 6894896
3189 6894896 6614110 6536767 6613606 6722843 6418939 6563223 6621900 6764052 6898110 7328807
3179 7328807 7881053 8259552 8433974 9230944 9963826 11318056 12139259 12274816 11919031
3170 11919031 10615337 9102697 7560390 6715404 5922315 5482243 5496259 5172453 4468220
3161 4468220 4158016 3915241 3715699 3884655 3249393 3171012 3200697 3331838 3075138 2831895
3151 2831895 2919359 2665567 2629546 2839237 3121676 2488015 2332728 2869674 2676926 2492184
3141 2492184 2415833 2063298 2023770 1967441 2112595 2031927 1900979 2144987 2566581 2080465
3131 2080465 1829643 1895353 2006347 2023343 1974043 2188554 2872467 2528565 2530539 2051856
3121 2051856 1689906 1674984 1085958 1135382 1147687 1346853 1206747 1418479 1268871 1123521
3111 1123521 1700937 1736108 1732593 1456793 1470122 1569257 1508062 1566275 1611431 1195142 1456720
3100 1456720 1285589 1575961 1738501 1658036 1829860 1750492 1675128 1561705 1463822 1263438
3090 1263438 1273121 955704 1011135 839721 1337900 1474682 1507657 1610905 1837135 1630774
3080 1630774 1023277 1111352 1368532 1541791 1832950 1796309 1789511 1754422 1569326 1797577
3070 1797577 1836241 1378166 1183987 1751085 1528637 1475275 1688220 1184136 1319493 1386323
3060 1386323 1578038 1463515 1409935 1591574 1541601 1398453 1514406 1317163 1518812 1736751
3050 1736751 1686225 1523926 1954918 2096996 1473439 1453651 1992713 2081907 1924429 1752102
3040 1752102 1928518 1885253 1850299 2206240 2313814 2338159 2585427 2654935 2612096 3041234
3030 3041234 2985496 2854754 3007095 3069903 3095430 3449229 3432694 3312280 3290225 3200471 3073539
3019 3073539 3099005 3236334 3438344 3338936 3573410 3269315 3678651 3537144 3597620 3307471
3009 3307471 3312418 3505970 3455347 3412562 3181624 3175804 3632393 3588360 3856700 4034856 3813944
2998 3813944 3973925 3593317 3496694 3144700 2466304 2747593 3297297 3177753 3179533 3123880
2988 3123880 3196777 3244120 3146839 2910745 3084162 3386803 3409992 3243522 3173522 3192941 3504243
2977 3504243 3370372 3501002 3618478 3468129 3173160 3421733 3617305 3609741 3617593 3699801
2967 3699801 3837489 3783793 3491292 3740377 3538206 3251727 3120958 2915531 3101924 3103792
2957 3103792 2757552 2781358 3306415 3457894 3605257 3411381 3485249 3372495 3266491 3220124
2947 3220124 3173606 3406382 3194753 3460657 3912945 3808086 3653231 3158623 2868926 3132119
2937 3132119 3258831 3306505 3058683 3048131 2995875 3025816 3230243 3197043 3044614 2950636 2676000
2926 2676000 2808566 2774242 2761537 3079498 3109793 3097489 3225088 2813663 2723686 2622760
2916 2622760 2602042 2747533 2819461 2582133 2190804 2643127 2706959 2700550 2384656 2283907
2906 2283907 2070091 2459769 2482876 1952058 1938454 2033739 2102905 2185150 2015273 1993556 1787708
2895 1787708 1891460 1942496 1674990 1843320 1354842 1231787 1659741 1422034 1743464 1774562
2885 1774562 1781082 1949609 1622953 1590323 1634584 1787817 1944873 1519420 1111330 1085735
2875 1085735 794087 1148185 1351235 1186091 911348 962096 1076454 1022615 1362574 1448751
2865 1448751 1047781 1259690 1328487 1095572 808954 673953 284389 282888 572861 629925
2855 629925 654414 943485 754775 725061 390751 200252 239412 129106 256010 -224322
2845 -224322 396026 722573 541981 80749 520978 816840 799432 989601 880710 656323
2835 656323 993456 966430 557252 155971 260320 541027 643006 619840 339135 43494
2825 43494 -296723 -41137 345968 176313 -218920 -230214 -570351 -751581 -388770 94175
2815 94175 355591 877395 456685 746892 427063 -87325 159970 281129 216995 -256995
2805 -256995 153192 400128 324782 368711 -132272 -154547 32355 -62619 -194057 78165
2795 78165 381988 536197 553638 388862 251122 197440 387892 178684 259168 -58182
2785 -58182 -102994 -309024 -8338 -236898 -44611 126967 -154959 -590718 -333931 299330
2775 299330 346219 359059 374251 281100 -90239 80713 -43815 15090 -48317 -483856 -484827
2764 -484827 -782621 -226014 75665 -39735 -353251 -223130 -313363 -164539 286468 63165
2754 63165 187782 -279058 -344786 -177105 -63745 580756 336931 -518852 -482959 -459591
2744 -459591 245108 431214 202540 -285387 -142511 -147076 -65451 -205883 46183 -282803
2734 -282803 -644406 -239002 -172390 142928 -80556 133175 115517 72908 174898 307556
2724 307556 -128485 -61647 148622 -447630 -263829 -249859 -397122 -39541 -75769 -68780 25440
2713 25440 -390791 -12771 304232 534750 217271 -320774 -176358 -48395 -295029 -416602
2703 -416602 -302590 -330109 -434982 -513943 -314345 -120773 -605203 -510816 83066 75629 166948
2692 166948 108529 -280752 -262635 -192729 -388700 -37562 -90282 -167460 -141855 -161531 -325239
2681 -325239 -398413 -505709 -315966 -340080 -421969 -527708 -252904 -272979 -77257 -8747 39157
2670 39157 156013 -53543 197098 -190482 -222255 -338068 -71504 -184430 -281264 -151448
2660 -151448 114955 57542 -16516 -137075 163161 -223009 -594390 -485216 -177110 262381
2650 262381 16918 -138270 104469 187454 203556 40081 -336749 -336848 -358727 -364981 -207642
2639 -207642 18765 -29205 -207 -285441 -468298 -699165 -546558 -404077 -310745 -71480
2629 -71480 38183 27105 -242286 345831 94191 -190659 -51355 -310637 -407093 -549186
2619 -549186 -341826 -357610 -219061 -249004 -57255 -27253 -40701 -169790 -280842 -202556 -209715
2608 -209715 -205594 -209559 -376374 9253 12075 -255753 -125602 -178002 -227229 -196304 -503567
2597 -503567 -367309 -256402 3476 -12382 -292047 -329742 -283200 -537288 -854585 -709039
2587 -709039 -418787 -220652 -257118 -519087 -359449 -203078 -346706 -79366 -567158 -833122
2577 -833122 -327200 -646942 -681124 -208505 -97429 146073 154365 -52112 -49515 -84733 -350662
2566 -350662 -392067 -144466 -264114 -189794 -183715 -237909 -295397 -256677 -182674 -23046 93174
2555 93174 -344231 -351821 -398097 -468839 -367062 -401633 -295260 -228150 -28680 -537224 -658260
2544 -658260 -522910 -174764 -471183 -544768 33547 -458582 -380647 -469309 -151227 -147944 -227202
2533 -227202 -433761 -494375 -364817 -313358 -143019 29825 -240555 -134944 -175765 425532
2523 425532 174173 -29797 96244 243180 101392 11934 -32523 -134343 -334276 -376568
2513 -376568 182796 51601 61793 -193522 192830 49156 166756 92146 -23350 -99450
2503 -99450 -437330 -610012 -345681 58059 -186174 -563324 -423638 -72580 6822 -138323
2493 -138323 -351551 -334050 -54188 -433494 -867295 -900524 -238278 -266439 -535607 -88047
2483 -88047 -610903 -565251 254925 -107490 -367675 337819 119338 -156234 72860 22383
2473 22383 -262678 -269479 -442904 -153209 -50282 352715 -95843 -259588 -224582 -32957
2463 -32957 -139350 -339053 -561563 -429690 -119989 -229006 -59601 -152205 -285733 -287778
2453 -287778 -119854 -243512 -61935 217187 309957 49905 195177 580936 470192 -379954
2443 -379954 -378143 -205595 -127732 -428070 -351117 -154967 72806 136593 178434 136317 74665
2432 74665 -110464 -45364 -225303 -125613 275450 249690 185140 183227 579706 -62962 -375036
2421 -375036 -11500 57784 -69605 291532 675402 479909 370236 99489 -7809 -279606
2411 -279606 -280221 25884 -43980 10722 231073 -67977 363332 73047 -355166 -355683 -597438
2400 -597438 -835734 -485347 246768 392732 530776 408784 443057 -83727 5632 336329
2390 336329 95113 -191099 -229429 -44406 -13095 -148642 -186657 29106 306872 -153057
2380 -153057 -536274 -195410 441410 356772 -166657 -27656 78313 2667 -66412 -61077 164619
2369 164619 424393 270971 197450 -55624 -10664 236360 223691 192569 -44337 -53423 -241852
2358 -241852 -267475 -405713 -610659 -574574 -116271 -336023 -269496 32088 98450 467729
2348 467729 462942 372299 442663 335660 -12511 434930 397493 748820 538644 399695 539698
2337 539698 386479 376762 282336 260683 134069 -57639 -212371 -195987 -182935 251527 644672
2326 644672 505371 662347 838870 680181 825647 802786 629852 562536 604425 836116
2316 836116 780763 1144698 745215 328784 439955 819962 1086942 499677 903942 907351
2306 907351 923906 768034 1344256 1558466 1651572 1514879 1768480 1959415 1289374 1281391
2296 1281391 1453973 1567264 1442879 1685509 1485429 1814854 1797812 1633147 1972905 2034802
2286 2034802 2649912 2595989 2635160 2697474 2614876 2605640 2280742 2313219 2326088 2074526 2759320
2275 2759320 3476080 3231888 3222139 3680222 3871823 3794270 3879252 4341416 4751141 5133693
2265 5133693 5793691 6496398 7221908 8080457 8098574 8832023 9293955 10236910 11599846 12979150
2255 12979150 14327405 16214096 18342471 20612632 23529636 27069185 31344931 37409058
2247 37409058 40254431 37379698 31964508 25076149 20443525 16919910 14627219 12657228
2239 12657228 11593359 9994417 8922992 8314152 7643553 7078178 6623478 5871572 5717376
2230 5717376 5650445 5189849 4540461 3936900 3542394 3148506 3170716 3125882 2983602 2802832
2220 2802832 2563950 2567150 2246842 2604955 2573273 2391253 2155339 2009714 1861767 1777517
2210 1777517 1457415 1587042 1927954 2019510 1503006 1058349 876294 614953 1007329 999012
2200 999012 904267 835850 752921 642191 1028728 959966 799703 343916 362000 54388 364749
2189 364749 743929 782970 1129349 939767 876230 832346 498155 508453 304345 211125 26166
2178 26166 -91660 331627 233485 270640 248144 260654 286328 319832 578870 262159 -37355
2167 -37355 327924 614453 313601 327411 -41625 565825 495384 -102606 -14540 564937
2157 564937 733221 561543 501681 211791 530154 519428 -9399 -85860 82540 267340
2147 267340 18730 143189 -89878 -561149 -351977 129710 -124633 -211039 78481 51329
2137 51329 53027 -19357 360602 162268 195845 641010 210392 -226668 -233037 -326489 -158938
2126 -158938 177552 359141 298194 34561 -93502 -97744 -147885 268958 109986 384462
2116 384462 339271 -69015 136774 569059 675496 509380 66723 -409724 -390025 11995
2106 11995 226319 275240 91533 -104573 106845 69197 200650 -198723 -58642 511957
2096 511957 381788 -74328 -78396 181884 96754 -89596 -175129 92550 -243298 -403993
2086 -403993 -395264 -758785 -504436 -208201 107639 -278748 -338787 110347 -170723 -244372
2076 -244372 9573 -98604 39881 68618 321135 202663 -65537 264296 357741 192642
2066 192642 171821 351762 -18188 59643 -216430 -260924 -209995 341330 271998 -254087 148862
2055 148862 20739 -151974 65453 268337 284782 303859 171093 -91017 243978 37350
2045 37350 -47651 7607 -118254 -136142 -278901 -299168 -198619 -265981 149677 -63025 -182530
2034 -182530 -237851 -348424 323570 327778 343999 181265 -47439 -196805 -552694 -289627
2024 -289627 -471452 -821695 -618331 -575944 -314473 -19849 -195336 88233 29816 -313666
2014 -313666 -40083 149223 -224947 -554416 -20924 -383102 -208238 -120757 -261571 24884
2004 24884 31902 -203440 -501449 6236 153598 -139785 -16992 -132049 -413355 -747490
1994 -747490 -702789 -339194 3523 91092 49723 -19274 -117691 -3572 181503 -250359 -434304
1983 -434304 -67797 487247 124480 -100482 -287222 -349959 20709 143068 228932 35641
1973 35641 136809 -307522 -67563 448736 239401 329972 189709 126762 421971 -25708
1963 -25708 1978 -19866 -57334 -111344 -353062 -79818 -266414 -65464 1306 -127632 15900
1952 15900 -280500 36807 -46712 -473601 -120917 19325 135853 -49760 -330211 6988
1942 6988 -236643 -718178 -174278 -496182 -486606 -133727 -134809 3603 -242433 -556070 -525654
1931 -525654 -306735 -258728 -348890 -610930 -793762 -584782 91712 -323197 -261472 -185475
1921 -185475 -162844 -489857 -165858 77897 121424 200448 81169 -158160 -132358 182145
1911 182145 -324233 -306046 -360730 -371261 -564817 -408345 -416242 -194463 -342632 -146535 27182
1900 27182 -85193 -221967 55816 13949 154571 281666 -49229 -745000 -517407 161951
1890 161951 -164015 -106804 -29314 100104 -388967 -27536 443142 305376 111733 -182646
1880 -182646 -9061 -228424 -290642 -208879 -551196 -663706 -484289 -36683 -8911 -163056
1870 -163056 256233 81697 48749 -291163 -355715 -173051 -242163 -258514 -968573 -514706
1860 -514706 -10144 -226911 -454028 -498089 -341931 -115465 -284420 22811 -67270 -602124
1850 -602124 -582242 -496848 -519476 -490170 -407935 -134223 -23599 181604 -310504 -979833 -463158
1839 -463158 -387454 -208365 208482 262090 295259 366879 354643 389445 -315984 -685794 -240373
1828 -240373 -85964 -49184 -196931 -49855 140405 85761 76797 -23792 42172 -29258 159420
1817 159420 -106481 -372601 -566858 -318795 225641 -69670 -298580 -132869 451602 638742
1807 638742 243756 -55391 82255 87835 142446 380371 183469 -5736 723135 81289
1797 81289 486 -271299 -165777 73717 121571 334856 496908 -77701 -554569 -583321
1787 -583321 -466911 -35049 -16301 -163398 -242756 -260951 -276440 -13099 -182174 17348
1777 17348 123361 180997 106845 -281410 -121358 -204630 -290815 -588312 -235616 -116848 -493603
1766 -493603 -625167 -551301 -4897 -403498 -195073 81187 -21777 214097 308409 356010
1756 356010 -113173 -476603 -280915 -404691 -8016 -37384 -227072 -69720 173433 104146
1746 104146 200202 -167392 -372912 -318738 -270252 -162700 58076 43278 -153336 -261401
1736 -261401 -355128 -457506 -199216 -402533 -469203 -88145 -320739 -488262 -614081 -752812
1726 -752812 -133129 61763 159948 -80363 -104235 -529952 -374012 -138016 186388 333457
1716 333457 367280 517951 147470 -17240 86510 254924 -144507 -754942 -505181 -20164
1706 -20164 -335073 -692417 -6749 -51639 -626730 -343611 -391956 -202913 -696472 -497463
1696 -497463 -136397 218893 404333 -7949 -348826 -200946 -366639 -410092 -455333 -106141
1686 -106141 172290 -63322 48466 -228847 -45511 -303946 -323229 -418164 -417033 -61183
1676 -61183 -301871 -147098 -88377 -61451 55579 70699 -230186 -77409 -55246 -574684 -452760
1665 -452760 -21451 -209330 -165343 -60498 34881 279681 -288896 -172011 -325646 -579310
1655 -579310 -571224 -537530 -191977 -91136 -315360 -9571 -12769 -365276 -225262 -192735 -490482
1644 -490482 -525069 -602704 -498188 -386484 -336838 -58148 -227027 -18335 -5843 -4833 -20522
1633 -20522 475555 149496 208409 86076 -155398 -1086552 -660976 198636 361477 -46475
1623 -46475 4356 -164788 -158577 -69673 196412 60579 21860 -1847 -146707 -260036 -156319
1612 -156319 -612804 -699093 3403 22278 200606 468193 578482 173527 -104534 -186192
1602 -186192 127471 181913 67444 -186843 74783 236123 339506 530361 472008 -99922
1592 -99922 -290936 11338 258591 483216 304429 -23687 58263 -198602 14606 -48215
1582 -48215 716249 319006 -282703 -407552 -620614 -408369 -207812 65 8735 -261727
1572 -261727 153397 118685 44004 381397 433172 -52882 -24925 85646 143509 195184 53919
1561 53919 6357 -124490 -145988 181269 79096 337835 241474 297966 243201 104396 221539
1550 221539 -292794 -411137 -296585 -153299 -413330 -221675 -684 -110533 -382860 -323905
1540 -323905 -150847 -266946 -631313 -587321 -590084 -506312 -99188 371933 352402 -119878 42299
1529 42299 164587 -108338 -275281 -282449 -157333 558611 -5715 -356665 27765 -527485
1519 -527485 -347604 -276762 -32660 -199080 -120507 195384 -55090 -373658 -496527 20042
1509 20042 -225231 -538618 -331398 -51650 -71789 -209936 -281760 -229973 -302211 -549474 -270195
1498 -270195 -290312 175037 317533 347186 -211289 -256935 287433 262190 189280 -341039 -274804
1487 -274804 -311182 -95734 44224 -243851 -65769 169629 442507 362346 174332 130481
1477 130481 -72464 -234789 -72106 -41307 -148236 4149 -32510 -39537 353500 208592
1467 208592 -28722 141189 75664 93129 600 208894 188409 -130005 27171 -102855
1457 -102855 -286619 169351 277162 75554 105554 -83004 -125103 10192 -100423 -357754
1447 -357754 -432407 -506689 -379976 -291110 -150280 -81045 -238558 17113 -67663 -157043 98494
1436 98494 -23497 -281956 -181545 233311 -89557 -443217 -512556 -368910 -343439 -252859
1426 -252859 -440356 -333173 -136182 -92438 36833 85703 -275714 -259754 -134415 -27175
1416 -27175 130856 313791 9678 -52770 290957 42847 -16847 184742 586084 555156
1406 555156 230832 -16660 -201022 -275632 -136007 77911 65019 -552952 -623510 -485012
1396 -485012 -328229 161344 -135791 -202886 -46768 -245977 86069 -312615 -338900 -391959
1386 -391959 -351484 -49812 8491 149455 193803 290603 292118 -55706 -400133 -424758 300670
1375 300670 183258 88725 181719 273013 445159 679000 422313 -2711 -49861 -18565 203351
1364 203351 51379 -14002 106637 100236 43540 -14769 -211440 -49279 146806 73 -384343
1353 -384343 -372142 -259157 -502203 -253138 -301159 -446186 -126956 73978 -23311 -200308
1343 -200308 -77443 -404955 79557 -138417 -208369 -121629 -57169 102565 -91685 -413420
1333 -413420 -292637 64614 -362346 -253835 -520394 -126377 173400 25746 101234 169647
1323 169647 81150 381448 410617 -250266 -601678 -543447 -157244 -95438 375762 11135
1313 11135 -411537 -149964 125167 -183897 -332453 -751267 -407072 135129 316882 56505
1303 56505 -236628 -256730 -123030 -30509 146603 115656 186022 -83678 -416601 50385 -350160
1292 -350160 -282997 -15025 117070 237500 547133 207098 -223327 -187444 38515 -65541
1282 -65541 -229853 -527537 -510747 -294037 4261 538370 434688 553132 155028 126665
1272 126665 330566 87596 -129912 -352785 -289696 -536682 -483429 -352037 157428 33381
1262 33381 -244979 -249934 -587150 -264460 100385 212952 324953 240598 498065 -284
1252 -284 -224897 -139114 -501137 -441886 -23044 -55177 -28662 -278594 -60533 52804 69893
1241 69893 -79943 137432 -193649 -617101 -547026 -588774 -243864 -196533 -105122 104889 231572
1230 231572 389287 508274 145230 96822 -99380 -424402 -177567 207253 -197464 -507650
1220 -507650 -486658 39794 -89345 -277900 -126312 -414386 -379765 -282612 258485 163317
1210 163317 -383805 -228259 -92818 -91253 -388740 -521565 -625927 -446313 161219 -5682
1200 -5682 -17194 154093 86008 708604 128158 62951 -11934 -137531 -86069 89924 198539
1189 198539 -315608 -425356 45916 -62885 -208318 -196229 193177 201532 -112275 324334
1179 324334 379454 194694 34853 -115705 13527 -103747 186569 427554 90557 142648
1169 142648 -185682 -197689 73616 -154554 -462954 -224381 41835 199648 -133574 4050
1159 4050 195831 -60321 -123740 -76167 127275 -65175 -305993 -262177 -311014 25929 -37084
1148 -37084 -79806 -124257 -248212 163862 280913 11821 -455199 212326 271865 -268786
1138 -268786 -163582 197049 53780 152792 125694 -267907 -337121 -295383 -336625 -777659 -219223
1127 -219223 -58833 131152 -33881 -333096 327890 23110 128567 -111946 -48795 194741
1117 194741 404900 285488 -6172 426644 106137 -15258 190400 -255230 -532319 -353666
1107 -353666 -245032 -153395 -576411 -299580 10877 -378069 -341909 -29593 -456516 39251
1097 39251 289754 248060 231834 35903 -213368 87240 36379 1386 297859 279829 329452
1086 329452 12526 -468734 -178402 -109260 134098 -18270 -110300 -212752 30481 393008
1076 393008 342922 259658 -8178 35246 8119 162276 167400 60035 116345 286929 -37803
1065 -37803 -277766 -259448 -169033 -303533 -352075 -638124 -286334 -180515 -390088 -141566
1055 -141566 -112085 -89592 -35347 -205952 -472917 -134774 -62419 -58997 150715 455117 103754
1044 103754 -168818 94332 113886 92424 -279172 -389947 -176056 -185335 90038 375903
1034 375903 265709 152996 -430726 -513892 -432857 2936 -198616 -137097 -497404 -571227
1024 -571227 -468126 -523575 -243140 10682 -261198 68182 41844 -140475 -456554 -18192
1014 -18192 306903 -62190 -175519 -207081 -4902 22881 -241980 163968 294061 37904
1004 37904 -169484 -805 285669 370847 630354 524878 702922 467927 479091 220409
994 220409 -69745 134492 267701 -247635 -79187 -122511 131998 177980 222462 145922 81364
983 81364 -135468 171897 240803 512803 95851 -339907 -262277 94881 -185666 -31542
973 -31542 219145 90070 314173 143134 -257898 -33397 590335 296491 130665 -85778
963 -85778 -393884 396366 66283 -81629 -229362 -399721 200918 141785 268728 -4296
953 -4296 -451750 -314612 230215 200813 -271200 -475279 -262939 229635 -202819 -654337
943 -654337 -143182 -314814 86819 -158853 -63284 -23762 -140803 48409 -78778 -301335
933 -301335 -527065 -324417 387411 121396 5541 34367 166648 -45659 -227914 -34942
923 -34942 392758 360472 397707 490306 597889 373779 -95228 -319411 -203111 136011 -15340
912 -15340 -262438 -243028 150624 -5517 69961 84378 424656 504056 -92575 146282 301515
901 301515 300044 563344 758537 83969 -341270 -261706 -448439 -75439 -169126 97123 33924
890 33924 -220442 -488448 -22047 112620 -106083 -58026 306498 443046 338229 421679
880 421679 267582 242534 5864 255588 290910 94225 12414 -257973 -294992 -344527 -212350
869 -212350 -208393 -382249 -456713 40784 121875 -198070 8167 -250989 -194410 -175616 106895
858 106895 -73440 186431 -252783 32166 112415 -172842 11055 203030 82464 -47315
848 -47315 91588 240851 256646 244259 394659 390314 362616 -73039 114640 197622 78660
837 78660 -9201 95766 -449390 71311 399494 131997 210882 -263489 30680 -90501
827 -90501 -160743 249097 123462 293448 299276 150394 -204058 -147584 -119301 50337 -255000
816 -255000 -588618 -218374 191897 5907 273661 293407 270925 183168 -227832 107468
806 107468 528183 422029 215928 -134890 137711 188624 350314 642309 562222 342299
796 342299 335398 398896 20539 327693 465645 693981 652803 278464 30073 -178179 -262107
785 -262107 -195917 -292253 -121582 327272 230237 545028 676605 -44224 -115822 18100 19555
774 19555 41243 67334 95072 72397 267695 33615 125575 76401 -143420 -93275 32348
763 32348 39751 436733 314354 382980 462263 27445 53414 179960 58859 -77291 -202271
752 -202271 110746 147660 74002 186154 191300 156036 -425154 -247522 -195088 64106 232684
741 232684 264830 336966 501475 493225 271359 259531 102083 199481 -201722 118135 554261
730 554261 86840 277393 194652 500995 405978 414057 67105 67658 302197 483188 681396
719 681396 680625 575872 478559 514054 320230 210388 224626 -74294 -207087 -339825 118660
708 118660 628696 482387 539234 530795 533604 479229 504412 326770 151228 133232 225503
697 225503 89742 61130 -17904 -120452 -194483 -145897 -398824 -467930 -186561 -120639 135062
686 135062 199479 132395 -6483 399253 108754 416061 60891 156009 272192 65027
676 65027 121734 -190128 63329 159670 288233 458622 208115 -59906 -257716 28257
666 28257 -156330 -153251 256766 -100216 120371 81581 278585 119973 193437 -57286 70396
655 70396 195821 224113 -147996 -349367 221714 -125221 -381862 -202219 229903 -168043
645 -168043 -120853 417359 222421 388895 -34362 -294401 -397182 150914 129472 -16362
635 -16362 115216 128601 -33646 -253038 -117880 -248564 -370256 -58428 85610 -209993
625 -209993 -131486 -500943 147337 -40205 178384 739271 -43140 -309332 -32272 117347
615 117347 -261702 -144686 -57362 -308974 -191660 -22705 -370056 -573100 -501809 56689
605 56689 278441 342417 233290 94664 -7940 39929 223158 662884 359904 567550
595 567550 839179 234622 -114128 -104983 41298 -34339 97173 316572 212784 247594 73794
584 73794 -92335 118656 106937 -10735 -171132 127016 103446 367934 200128 -220730
574 -220730 110855 -52161 -314476 -165204 -17033 -216385 -448850 -310183 74385 143176
564 143176 -327435 -239448 685347 597597 437143 -22396 36341 77529 255915 583588 534366
553 534366 318014 178557 402736 259768 174178 139794 206118 404888 75804 123224 466996
542 466996 388558 149814 -256664 338891 823901 340181 61606 141809 258739 602507
532 602507 196006 166537 338194 471144 678982 514910 276708 396591 524864 108147
522 108147 -83222 209712 93432 304717 4844 145832 76845 -10752 -206337 172385
512 172385 127710 145155 -60834 -106204 -249077 -583042 -140839 -94378 -234403 56019 -37301
501 -37301 -76644 123394 -88319 245435 575481 127890 -213871 80872 -104458 53287
491 53287 352214 2856 -349676 -110071 185377 440017 366761 688517 395076 23105
481 23105 175270 164633 454534 751372 444925 717396 483764 142763 -135889 -28590
471 -28590 268675 -236655 -147781 16459 251912 285876 -65442 -127135 -167563 -28005 100769
460 100769 -181806 -117515 -225033 41553 51499 234671 -117746 -110509 213498 29777 329398
449 329398 78514 143835 416954 438177 282734 511482 298449 65152 16895 -964 393639
438 393639 53760 154586 -77442 -156186 38150 -109502 172201 1051269 529019 -61958
428 -61958 -168274 -313136 12499 -75342 -246736 -249896 367730 208895 226921 249430 99657
417 99657 223388 -137833 -320398 -44648 -136092 -242153 -168968 100865 158781 157343 -451550
406 -451550 -111447 -161544 90860 -124364 -136689 -20089 -511411 -270456 96718 75398
396 75398 546049 656092 515542 681817 499700 -64260 -63146 -116591 -67817 112562 353319
385 353319 707191 398426 265990 173766 58722 181060 178788 -124261 -289396 -227260 -254526
374 -254526 144505 464699 -97111 -231980 -394277 -45 257038 344167 242597 199789
364 199789 -89468 31560 121483 241528 495982 369660 350583 -59473 -173474 -51178
354 -51178 121713 439749 140698 443120 415655 -50368 -579608 -621007 -291460 -356944 -378520
343 -378520 -14490 232658 -28035 -139038 96097 114007 20142 -63117 -152032 -309837 -351888
332 -351888 -9442 225916 262775 160747 79553 46349 -489328 -390054 -450015 -574386 -465890
321 -465890 -196113 647966 502359 138028 296717 208233 113012 347727 231847 498620
311 498620 484200 390111 357118 378010 169434 110256 32920 -10385 1509 -184490 -379875
300 -379875 -278032 358963 335434 219047 154504 596085 399769 422185 508642 177167 -88244
289 -88244 275162 58824 -321389 -138508 -155490 -476075 -82086 181361 -58916 -237527
279 -237527 -422744 -291021 -58172 19902 275995 431881 161196 203731 252354 557859
269 557859 478811 162597 -28790 450398 242075 58597 -138875 -291307 -337320 -414374
259 -414374 -290318 -134520 -276478 -321157 -501781 -287568 442561 361512 102648 321161
249 321161 177938 620970 665073 -106312 -106451 20825 59913 -153848 -302636 -67314 -182177
238 -182177 31430 316565 150487 -88440 -102134 197783 204171 -193841 -223472 -259098 220834
227 220834 76114 -30833 22591 -65430 57939 260544 417731 -44317 -232802 -150363
217 -150363 -317068 -368313 411735 685947 322270 209873 148757 31777 95263 -68326
207 -68326 -153367 -128921 181817 61377 -42699 11341 565648 619837 414679 291012 318022
196 318022 -100992 -157377 51959 -236943 -541231 -256909 -17000 352314 109203 -126443
186 -126443 35850 -296139 -363284 -49150 -95573 48668 -187406 -229909 -276808 57337 158332
175 158332 -355556 68667 -71311 -23090 -171816 -96258 -40600 -192709 -91198 -38552 50438
164 50438 -134321 -159003 167761 92332 277521 472968 726552 114358 49224 -109364 56947
153 56947 1850 18370 259199 -77928 375820 570727 341562 22226 187103 321546
143 321546 264929 95760 81021 162571 55476 -356605 121962 300763 -22247 234959
$$ [...]
##END NTUPLES=NMR SPECTRUM
##END=
