##TITLE=1H_CG-1204-2
 CDCl3
 8 sc, 
 5.6.2024
##JCAMPDX= 6.0         $$ Bruker NMR JCAMP-DX V2.0
##DATA TYPE= NMR SPECTRUM
##DATA CLASS= NTUPLES
##ORIGIN= UXNMR, Bruker Analytische Messtechnik GmbH
##OWNER= root
$$ XWIN-NMR		Version 3.5
$$ Wed Jun  5 14:02:56 2024 Russian Standard Time (UT+4h)  she@DPX200
##.OBSERVE FREQUENCY= 200.1309
##.OBSERVE NUCLEUS= ^1H
##.ACQUISITION MODE= SIMULTANEOUS
##.ACQUISITION SCHEME= undefined
##.AVERAGES= 8
##.DIGITISER RES= 18
##SPECTROMETER/DATA SYSTEM= spect
##.PULSE SEQUENCE= zg30
##.SOLVENT NAME= CDCl3
##.SHIFT REFERENCE= (INTERNAL, CDCl3, 0, 16.0224)
##AUDIT TRAIL= $$ (NUMBER, WHEN, WHO, WHERE, WHAT)
$$ ##TITLE= Audit trail, XWIN-NMR		Version 3.5
$$ ##JCAMPDX= 5.01
$$ ##ORIGIN= Bruker BioSpin GmbH
$$ ##OWNER= she
$$ F:/spectra/data/she/nmr/H-F/1/pdata/1/auditp.txt
$$ ##AUDIT TRAIL=  $$ (NUMBER, WHEN, WHO, WHERE, WHAT)
(   1,<2024-06-05 14:01:47.17 +0400>,<she>,<DPX200>,
      <created by zg, POWCHK disabled, PULCHK disabled
       configuration hash MD5:
       00 E9 B6 7A A2 85 ED C7 34 08 36 98 17 FE 4E 26
       data hash MD5: 16K
       8B CB 59 49 D1 B1 87 07 97 9A 73 95 42 81 66 5E>)
(   2,<2024-06-05 14:01:51.51 +0400>,<she>,<DPX200>,
      <Start of raw data processing
       efp BC_mod = 2 LB = 0.24 FT_mod = 6 PKNL = 1 PHC0 = -25309.77 PHC1 = 5.58748 SI = 16K 
       data hash MD5: 16K
       CE CB 44 1F 89 F5 C4 F8 6A 35 EA 20 D4 62 E1 BB>)
(   3,<2024-06-05 14:02:09.93 +0400>,<she>,<DPX200>,
      <pk PHC0 = 0.3711584 PHC1 = -0.6000002 
       data hash MD5: 16K
       44 E9 0F 22 40 AF 3A 06 86 E6 DA 8B 46 A4 FA B6>)
(   4,<2024-06-05 14:02:13.39 +0400>,<she>,<DPX200>,
      <abs ABSG = 5 
       data hash MD5: 16K
       79 4A 73 D4 DB CB E1 24 1A E5 D6 77 DD 87 A8 55>)
$$ ##END=
$$ 
$$ hash MD5
$$ 07 4B 51 5A F4 D0 5B D9 23 70 66 AA 5D CE 3A F0
##$RELAX= 
##$RELAX= 
##$RELAX= 
##$RELAX= 
##$RELAX= 
##$RELAX= 
$$ Bruker specific parameters
$$ --------------------------
##$DU= <F:/spectra>
##$EXPNO= 1
##$NAME= <H-F>
##$PROCNO= 1
##$TYPE= <nmr>
##$USER= <she>
##$AMP= (0..31)
100 100 100 100 100 100 100 100 100 100 100 100 100 100 100 100 100 100 
100 100 100 100 100 100 100 100 100 100 100 100 100 100 
##$AQSEQ= 0
##$AQ_mod= 1
##$AUNM= <au_zg>
##$AUTOPOS= <>
##$BF1= 200.13
##$BF2= 200.13
##$BF3= 200.13
##$BF4= 200.13
##$BF5= 200.13
##$BF6= 200.13
##$BF7= 200.13
##$BF8= 200.13
##$BYTORDA= 1
##$CFDGTYP= 0
##$CFRGTYP= 5
##$CHEMSTR= <none>
##$CNST= (0..31)
1 1 145 1 1 1 1 1 1 1 1 1 1 1 1 1 1 1 1 1 1 1 1 1 1 1 1 1 1 1 1 1 
##$CPDPRG= <>
##$CPDPRG1= <>
##$CPDPRG2= <>
##$CPDPRG3= <>
##$CPDPRG4= <mlev>
##$CPDPRG5= <mlev>
##$CPDPRG6= <mlev>
##$CPDPRG7= <mlev>
##$CPDPRG8= <mlev>
##$CPDPRGB= <>
##$CPDPRGT= <>
##$D= (0..31)
0 1.2 0 0 0 0 0 0 0 0.06 0 0.03 0 0 0 0 0.0002 0 0 0 0 0 0 0 0 0 0 0 0 
0 0 0 
##$DATE= 1717581706
##$DBL= (0..7)
120 120 120 120 120 120 120 120 
##$DBP= (0..7)
150 150 150 150 150 150 150 150 
##$DBP07= 0
##$DBPNAM0= <>
##$DBPNAM1= <>
##$DBPNAM2= <>
##$DBPNAM3= <>
##$DBPNAM4= <>
$$ [...]
##$SUBNAM3= <"">
##$SUBNAM4= <"">
##$SUBNAM5= <"">
##$SUBNAM6= <"">
##$SUBNAM7= <"">
##$SUBNAM8= <"">
##$SUBNAM9= <"">
##$SW= 18.0517689322627
##$SWIBOX= (0..15)
0 0 2 0 0 0 0 0 0 0 0 0 0 0 0 0 
##$SW_h= 3612.71676300578
##$TD= 16384
##$TD0= 1
##$TE= 0
##$TE2= 300
##$TE3= 300
##$TEG= 300
##$TL= (0..7)
0 120 120 120 120 120 120 120 
##$TP= (0..7)
150 150 150 150 150 150 150 150 
##$TP07= 0
##$TPNAME0= <>
##$TPNAME1= <>
##$TPNAME2= <>
##$TPNAME3= <>
##$TPNAME4= <>
##$TPNAME5= <>
##$TPNAME6= <>
##$TPNAME7= <>
##$TPOAL= (0..7)
0.5 0.5 0.5 0.5 0.5 0.5 0.5 0.5 
##$TPOFFS= (0..7)
0 0 0 0 0 0 0 0 
##$TUNHIN= 0
##$TUNHOUT= 0
##$TUNXOUT= 0
##$USERA1= <user>
##$USERA2= <user>
##$USERA3= <user>
##$USERA4= <user>
##$USERA5= <user>
##$V9= 5
##$VALIST= <valist>
##$VCLIST= <CCCCCCCCCCCCCCC>
##$VD= 0
##$VDLIST= <DDDDDDDDDDDDDDD>
##$VPLIST= <PPPPPPPPPPPPPPP>
##$VTLIST= <TTTTTTTTTTTTTTT>
##$WBST= 1024
##$WBSW= 4
##$XGAIN= (0..3)
0 0 0 0 
##$XL= 0
##$YL= 0
##$YMAX_a= 257288
##$YMIN_a= -430353
##$ZGOPTNS= <>
##$ZL1= 120
##$ZL2= 120
##$ZL3= 120
##$ZL4= 120
##$ABSF1= 15.96729
##$ABSF2= -2.084605
##$ABSG= 5
##$ABSL= 3
##$ALPHA= 0
##$AQORDER= 0
##$ASSFAC= 0
##$ASSFACI= 0
##$ASSFACX= 0
##$ASSWID= 0
##$AUNMP= <proc_1d>
##$AZFE= 0.1
##$AZFW= 0.1
##$BCFW= 0
##$BC_mod= 2
##$BYTORDP= 0
##$COROFFS= 0
##$CY= -3
##$DATMOD= 1
##$DC= 0
##$DFILT= <>
##$DTYPP= 0
##$F1P= 0
##$F2P= 0
##$FCOR= 1
##$FTSIZE= 16384
##$FT_mod= 6
##$GAMMA= 0
##$GB= 0
##$INTBC= 1
##$INTSCL= 3.70164e-10
##$ISEN= 128
##$LB= 0.24
##$LEV0= 0
##$LPBIN= 0
##$MAXI= 10000
##$MC2= 0
##$MEAN= 0
##$ME_mod= 0
##$MI= 1.114404
##$NCOEF= 0
##$NC_proc= -6
##$NLEV= 6
##$NOISF1= 3.799351
##$NOISF2= 2.8
##$NSP= 0
##$NTH_PI= 0
##$NZP= 0
##$OFFSET= 16.02238
##$PC= 1
##$PHC0= -25309.4
##$PHC1= 4.98748
##$PH_mod= 1
##$PKNL= yes
##$PPARMOD= 0
##$PSCAL= 0
##$PSIGN= 0
##$REVERSE= no
##$SF= 200.129499807479
##$SI= 16384
##$SIGF1= 3
##$SIGF2= 2
##$SINO= 5.538805
##$SIOLD= 16384
##$SREGLST= <1H.CDCl3>
##$SSB= 0
##$STSI= 16384
##$STSR= 0
##$SW_p= 3612.71676300577
##$SYMM= 0
##$S_DEV= 0
##$TDeff= 16384
##$TDoff= 0
##$TI= <>
##$TILT= no
##$TM1= 0
##$TM2= 0
##$TOPLEV= 0
##$USERP1= <user>
##$USERP2= <user>
##$USERP3= <user>
##$USERP4= <user>
##$USERP5= <user>
##$WDW= 1
##$XDIM= 16384
##$YMAX_p= 315312011
##$YMIN_p= -439762
$$ End of Bruker specific parameters
$$ ---------------------------------
##NTUPLES= NMR SPECTRUM
##VAR_NAME=  FREQUENCY,     SPECTRUM/REAL,   SPECTRUM/IMAG
##SYMBOL=    X,             R,               I
##VAR_TYPE=  INDEPENDENT,   DEPENDENT,       DEPENDENT
##VAR_FORM=  AFFN,          ASDF,            ASDF
##VAR_DIM=   16384,         16384,           16384
##UNITS=     HZ,            ARBITRARY UNITS, ARBITRARY UNITS
##FACTOR=    0.220516191357247, 1,           1
##FIRST=     3206.55106100418, 0,            0
##LAST=      -406.165702001594, 0,           0
##MIN=       -406.165702001594, -439762,     0
##MAX=       3206.55106100418, 315312011,    0
$$ Real data points
##PAGE= N=1
##DATA TABLE= (X++(R..R)), XYDATA
$$ [...]
$$ plain form
7347 -172166 -206892 -210399 -137451 -162920 -200456 -83270 -58869 -38054 -102938 98299 45446
7336 45446 -182538 -172511 -110916 -72838 586 178542 142174 158277 79254 144487 116996
7325 116996 104295 63542 -48459 60570 -211249 -182984 -76071 -140895 -123465 -171029 -128958
7314 -128958 -57507 -63347 -15934 -128639 -116413 -93581 -29340 -137258 -90896 -31304 -65650
7303 -65650 96272 -99276 -42086 -1627 -105181 -85465 143487 149023 93085 -103342 -79133
7292 -79133 -2210 -96721 -11866 70497 -105405 -132663 -37705 -33258 -121630 -89784 173079 191016
7280 191016 111338 170150 339761 240554 17844 -63215 45884 2318 95727 185596 134276
7269 134276 67296 -72430 89055 -76808 -89473 30460 29903 67410 -40558 904 97422
$$ packed form
7347a72166l4726l507P2948k5469l7536J17186K4401K0815o4884K01237n2853
7336D5446k27984J0027O1595L8078P3424J77956l6368J6103p9023O5233k7491
7325A16996j2701m0753j12001J09029k71819K8265J06913o4824J7430m7564M2071
7314a28958P1451n840M7413j12705J2226K2832O4241j07918M6362N9592l4346
7303f5650J61922j95548N7190M0459j03554J9716K28952N536n5938j96427K4209
7292g9133P6923r4511Q4855Q2363j75902k7258R4958M447q8372L1846K62863J7937
7280A91016p9678N8812J69611r9207k22710q1059J09099m3566R3409Q9869n1320
7269A34276o6980j39726J61485j65863j2665J19933n57L7507j07968M1462R6518
$$ plain form
7258 97422 325543 247848 66126 -91936 -184485 11635 175404 279813 286983 73149 105707
7247 105707 48188 137225 229368 182253 172741 136606 46944 113108 25772 82857 153656 165248
7235 165248 73013 139226 120614 182438 256828 279518 393695 342460 336783 300530 400796
7224 400796 539169 399846 368677 352745 178199 238325 233869 199925 186235 322136 285337
7213 285337 221516 353220 303454 72402 82226 26574 66340 186153 250551 261464 323445
7202 323445 179853 207596 221446 67140 128465 145903 111209 155860 54556 150819 5248
7191 5248 29709 154158 267540 328930 292060 121898 -25669 -63716 74518 357890 194440
7180 194440 54954 14259 9837 90637 159969 191720 231106 58276 84950 159018 161644 92570
$$ packed form
7258I7422K28121p7695j81722j58062r2549J96120J63769J04409P170k13834L2558
7247A05707n7519Q9037R2143m7115r512l6135q9662O6164q7336N7085P0799J1592
7235A65248r2235O6213j8612O1824P4390K2690J14177n1235n677l6253J00266
7224D00796J38373j39323l1169j5932j74546O0126m456l3944j3690J35901l6799
7213B85337o3821J31704m9766k31052R824n5652L9766J19813O4398J0913O1981
7202C23445j43592K7743J3850j54306O1325J7438l4694M4651j01304R6263j45571
7191E248K4461J24449J13382O1390l6870j70162j47567l8047J38234K83372j63450
7180A94440j39486m0695m422Q0800O9332L1751L9386j72830K6674P4068K626o9074
$$ plain form
7168 92570 145476 56567 28165 184079 116133 100881 119779 128934 71535 132861 195873 184973
7156 184973 268213 323385 427616 251174 129222 188622 78332 185675 261888 302934 235137
7145 235137 199983 251023 302517 425306 134641 -22315 82230 181321 182957 162396 398185
7134 398185 344307 255121 195352 254916 308907 257343 138668 21918 120948 166658 62267
7123 62267 -124609 67807 71507 -39317 -21089 -42934 -25793 120898 101561 34105 -59059
7112 -59059 -193420 -172207 19172 -86189 48940 69149 14460 61515 108282 130657 158491
7101 158491 102586 49851 133392 -129996 8208 -142454 -210210 -179223 76220 217580 14628
7090 14628 208976 160896 38485 52267 14804 51099 37595 149759 69463 12491 22834
$$ packed form
7168I2570N2906q8909k8402J55914o7946j5252J8898R155n7399O1326O3012j0900
7156A84973Q3240N5172J04231j76442j21952N9400j10290J07343P6213M1046o7797
7145B35137l5154N1040N1494J22789k90665j56956J04545R9091J636k0561K35789
7134C98185n3878q9186n9769N9564N3991n1564j18675j16750R9030M5710j04391
7123F2267j86876J92416L700j10824J8228k1845J7141J46691j9337o7456r3164
7112e9059j34361K1213J91379j05361J35129K0209n4689M7055M6767K2375K7834
7101A58491n5905n2735Q3541k63388J38204j50662o7756L0987K55443J41360k02952
7090A4628J94348m8080j22411J3782l7463L6295j3504J12164q0296n6972J0343
$$ plain form
7079 22834 42342 21560 49752 -29095 -192478 -114680 -222030 -278757 -98127 8219 -24794
7068 -24794 -32295 -53918 -172317 -53863 94424 61000 -6998 113604 5297 -152456 -32061
7057 -32061 52711 69001 115012 105149 24122 260563 214007 7409 106374 139097 -97594
7046 -97594 -129441 -34106 49157 7809 -79407 -45121 91737 1964 63732 -47675 -264886
7035 -264886 -118061 -103467 -139350 -207578 -211285 -237196 -166092 -11314 24948 -125057 -185745
7024 -185745 -70019 44133 67124 -58291 -41915 91781 90642 98156 -52375 -160499 -256945
7013 -256945 -154475 -77716 -173712 -159473 39839 45352 -159171 -129195 -233462 -215578 -134256
7002 -134256 -199125 -358007 -197977 103729 118499 101083 120825 78408 16221 -41558 33516
$$ packed form
7079B2834J9508k0782K8192p8847j63383P7798j07350n6727J80630J06346l3013
7068b4794p501k1623j18399J18454J48287l3424o7998J20602j08307j57753J20395
7057c2061Q4772J6290M6011r863q1027K36441m6556k06598R8965L2723k36691
7046i7594l1847R5335Q3263m1348q7216L4286J36858q9773O1768j11407k17211
7035b64886J46825J4594l5883o8228l707k5911P1104J54778L6262j50005o0688
7024a85745J15726J14152K2991j25415J6376J33696j139P514j50531j08124r6446
7013b56945J02470P6759r5996J4239J99312N513k04523K9976j04267J7884Q1322
7002a34256o4869j58882J60030L01706J4770j7416J9742m2417o2187n7779P5074
$$ plain form
6991 33516 -10123 -110601 23079 187149 -25909 -104805 -199306 -40004 -44756 21364 -20349
6980 -20349 -103682 -28504 -72178 -554 43273 24091 -171603 54646 -39644 -50173 15300
6969 15300 5145 84030 -15621 -70125 -49313 -60232 -88508 34190 70172 133787 129079 58744
6957 58744 2244 -63133 -49327 -4380 186445 58299 176675 115383 65060 118930 68260
6946 68260 86085 29991 42775 100455 74476 157649 195486 -78977 -201952 51634 109352
6935 109352 128577 74757 -142058 -182357 146961 281436 3046 -54170 -42426 78591 46030
6924 46030 22184 37349 106263 8301 -36063 -40802 47394 10029 -174147 -126896 49016 9184
6912 9184 -95822 -166763 -135859 -102905 -129587 -60303 72891 -21652 4150 14312 3000 43909
$$ packed form
6991C3516m3639j00478J33680J64070k13058p8896r4501J59302m752O6120m1713
6980b0349q3333P5178m3674P1624M3827j9182j95694K26249r4290j0529O5473
6969A5300j0155P8885r9651n4504K0812j0919k8276J22698L5982O3615m708p0335
6957E8744n6500o5377J3806M4947J90825j28146J18376o1292n0323N3870n0670
6946F8260J7825n6094J2784N7680k5979Q3173L7837k74463j22975K53586N7718
6935A09352J9225n3820k16815m0299L29318J34475k78390n7216J1744J21017l2561
6924D6030k3846J5165O8914r7962m4364m739Q8196l7365j84176M7251J75912l9832
6912I184j05006p0941L0904L2954k6682O9284J33194r4543K5802J0162j1312M0909
$$ plain form
6900 43909 169279 275421 183731 131847 290357 340220 394417 371224 300048 201633 112773
6889 112773 128017 191717 387033 189015 258294 112221 70697 95680 138465 193913 144981
6878 144981 60155 117193 267547 201115 152234 130660 340081 310394 249044 240981 167019
6867 167019 306166 261237 163876 144985 363548 408749 447351 583448 637537 533354 282320
6856 282320 289731 366614 368980 344468 340567 365684 319528 291096 328619 283309 82112 140178
6844 140178 88045 103560 221326 235881 308583 382059 443405 348235 289126 248315 243159 76171
6832 76171 30830 70340 143779 192037 165942 245535 138415 45533 162662 240431 323239
6821 323239 434714 358336 453120 294342 340103 296440 244189 293252 200936 180608 279066
$$ packed form
6900D3909J25370J06142r1690n1884J58510M9863N4197k3193p1176r8415q8860
6889A12773J5244O3700J95316j98018O9279j46073m1524K4983M2785N5448m8932
6878A44981q4826N7038J50354o6432m8881k1574K09421k9687o1350q063p3962
6867A67019J39147m4929r7361j8891K18563M5201L8602J36097N4089j04183k51034
6856B82320P411P6883K366k4512l901K5117m6156k8432L7523m5310k01197N8066
6844A40178n2133J5515J17766J4555P2702P3476O1346r5170n9109m0811n156j66988
6832G6171m5341L9510P3439M8258k6095P9593j07120r2882J17129P7769Q2808
6821C23239J11475p6378R4784j58778M5761m3663n2251M9063r2316k0328R8458
$$ plain form
6810 279066 363557 419926 533425 578546 391258 355484 611068 446329 480053 425842 342008
6799 342008 310492 297425 371990 301287 275839 310091 382247 385381 93952 144191 216705 241209
6787 241209 284684 335236 240953 58158 70456 133027 228293 279844 245453 185926 268508
6776 268508 455723 381280 219171 275264 384170 359707 252043 231850 192670 212193 366732
6765 366732 440066 421941 309336 386947 347917 291183 204227 264268 401938 531735 372140
6754 372140 509980 500902 460168 387576 238898 204939 306185 314700 243803 316541 315033 283162
6742 283162 215973 291718 221328 210380 264233 347835 235498 237433 270331 332265 286211 106295
6730 106295 54334 266112 300370 384068 208362 193503 323736 264791 89994 -22065 95827
$$ packed form
6810B79066Q4491N6369J13499M5121j87288l5774K55584j64739L3724n4211q3834
6799C42008l1516j3067P4565p0703k5448L4252P2156L134k91429N0239P2514K4504
6787B41209M3475N0552r4283j82795J2298O2571R5266N1551l4391n9527Q2582
6776B68508J87215p4443j62109N6093J08906k4463j07664k0193l9180J9523J54539
6765C66732P3334j8125j12605P7611l9030n6734q6956O0041J37670J29797j59595
6754C72140J37840r078m0734p2592j48678l3959J01246Q515p0897P2738j508l1871
6742B83162o7189P5745p0390j0948N3853Q3602j12337J935L2898O1934m6054j79916
6730A06295n1961K11778L4258Q3698j75706j4859J30233n8945j74797j12059J17892
$$ plain form
6719 95827 139492 192261 207427 317586 274519 361255 363217 307140 475768 581287 458213
6708 458213 443731 516519 438261 538868 475830 497688 506108 475845 480558 492206 482768 428156
6696 428156 354155 295158 248579 124686 187048 332634 257176 245150 315468 255915 407858
6685 407858 373044 392212 352362 295169 324103 205238 215055 312600 291512 345740 485453
6674 485453 384156 518932 493574 494483 395212 440471 539379 690000 620953 288369 323387
6663 323387 373481 442156 313079 503029 514757 385520 381522 386537 481284 380586 341286
6652 341286 415165 445033 350042 448468 466988 376032 215588 186219 178286 325442 442008
6641 442008 464273 275417 150088 210717 371391 453342 350307 411003 250993 92552
$$ packed form
6719I5827M3665N2769J5166J10159m3067Q6736J962n6077J68628J05519j23074
6708D58213j4482P2788p8258J00607o3038K1858Q420l0263M713J1648r438n4612
6696D28156p4001n8997m6579j23893O2362J45586p5458j2026P0318n9553J51943
6685D07858l4814J9168l9850n7193K8934j18865R817R7545k1088N4228J39713
6674D85453j01297J34776k5358R09r9271M5259R8908J50621o9047l32584L5018
6663C23387N0094O8675j29077J89950J1728j29237l998N015R4747j00698l9300
6652C41286P3879K9868r4991R8426J8520r0956j60444k9369p933J47156J16566
6641D42008K2265j88856j25329O0629J60674Q1951j03035O0696j60010j58441
$$ plain form
6631 92552 270112 299388 391851 179127 45337 -60648 79379 374793 328546 243272 310212
6620 310212 290356 207499 252559 226495 77056 138783 146516 146047 242001 181366 213326 238690
6608 238690 77166 107392 75103 -7989 113503 17862 188555 54471 92041 185577 316484
6597 316484 428417 597413 550677 387657 233918 287710 282043 366734 102040 161022 231234
6586 231234 278127 227188 121674 256695 126977 158319 254738 312561 211357 33738 60832
6575 60832 360598 243594 297268 192289 38359 138823 28948 -48580 90127 245989
6565 245989 424940 356792 311278 436101 206675 75775 134528 351876 268021 118729
6555 118729 92677 182888 182085 223070 245215 83445 162676 408948 395645 394770 353205 222577
$$ packed form
6631I2552J77560K9276R2463k12724j33790j05985J40027K95414m6247q5274O6940
6620C10212j9856q2857M5060k6064j49439O1727P733m69R5954o0635L1960K5364
6608B38690j61524L0226l2289q3092J21492r5641J70693j34084L7570R3536J30907
6597C16484J11933J68996m6736j63020j53739N3792n667Q4691k64694N8982P0212
6586B31234M6893n0939j05514J35021j29718L1342R6419N7823j01204j77619K7094
6575F0832K99766j17004N3674j04979j53930J00464j09875p7528J38707J55862
6565B45989J78951o8148m5514J24823k29426j30900N8753K17348q3855j49292
6555A18729k6052R0211q03M0985K2145j61770P9231K46272j3303q75m1565j30628
$$ plain form
6543 222577 291277 255879 72346 135201 178208 211477 196087 158990 333171 239530 320077
6532 320077 406738 285909 304001 294756 227344 343325 361301 347648 333534 137517 62463
6521 62463 196405 455334 427149 336678 245507 300435 237787 265058 391265 501386 655401
6510 655401 682361 609056 571921 678322 473807 395776 288503 251133 259852 202564 323003
6499 323003 312863 265399 397690 407522 429867 308921 257262 328285 306377 173176 185235
6488 185235 114512 252337 392713 283382 143684 259563 306132 349893 308661 397774 440665
6477 440665 396227 241928 241730 452171 207108 301713 455837 459199 485361 485580 520150 513507
6465 513507 469458 586449 807460 734411 725028 883929 1022371 958485 850150 957258 951056
$$ packed form
6543B22577O8700l5398j83533O2855M3007L3269j5390l7097J74181r3641Q0547
6532C20077Q6661j20829J8092r245o7412J15981J7976j3653j4114j96017p5054
6521F2463J33942K58929k8185r0471r1171N4928o2648K7271J26207J10121J54015
6510F55401K6960p3305l7135J06401k04515p8031j07273l7370Q719n7288J20439
6499C23003j0140m7464J32291R832K2345j20946n1659P1023k1908j33201J2059
6488A85235p0723J37825J40376j09331j39698J15879M6569M3761m1232Q9113M2891
6477D40665m4438j54299j98K10441k45063R4605J54124L362K6162K19L4570o643
6465E13507m4049J16991K21011p3049r383J58901J38442o3886j08335J07108o202
$$ plain form
6454 951056 889723 719057 687780 794905 650176 747668 830586 805332 689827 658909 657158
6443 657158 588076 592211 587576 595079 651975 740046 823708 744960 752180 817431 871370 986802
6431 986802 1013188 972848 1114992 1016018 885151 905453 881220 925903 894709 872067 905985
6420 905985 782190 521012 626079 709911 734498 677932 673717 688062 663972 630918 569868
6409 569868 618141 653553 525698 612048 667859 629741 635423 708148 652969 717561 731075 723090
6397 723090 703137 739162 874371 886241 854515 739456 932864 1030659 1078671 1102931 1142984
6386 1142984 1344452 1358018 1198091 1240386 1286167 1340830 1421848 1570442 1506796 1592502 1682112
6375 1682112 1666528 1752405 1635764 1561926 1533659 1499493 1343070 1358648 1460548 1430400 1351764
$$ packed form
6454I51056o1333j70666l1277J07125j44729R7492Q2918k5254j15505l0918j751
6443F57158o9082M135m635P503N6896Q8071Q3662p8748P220O5251N3939J15432
6431I86802K6386m0340J42144r8974j30867K0302k4233M4683l1194k2642L3918
6420I05985j23795k61178J05067Q3832K4587n6566m215J4345k4090l3054o1050
6409E69868M8273L5412j27855Q6350N5811l8118N682P2725n5179O4592J3514p985
6397G23090j9953L6025J35209J1870l1726j15059J93408R7795M8012K4260M0053
6386A142984K01468J3566j59927M2295M5781N4663Q1018J48594o3646Q5706Q9610
6375A682112j5584Q5877j16641p3838k8267l4166j56423J5578J01900l0148p8636
$$ plain form
6364 1351764 1409399 1423787 1255757 984944 1093718 1124969 1140402 1006521 935076 1075862
6354 1075862 1065686 927182 859910 861923 783714 528547 660864 747119 723599 739919 600361
6343 600361 636031 664849 417555 165521 150321 443844 453873 413073 468796 589187 509938
6332 509938 379248 322764 199129 199658 171497 301188 264456 274440 292994 277026 230786 250525
6320 250525 392183 429253 365262 302679 422836 302629 411604 442823 428957 407769 357168
6309 357168 337342 529169 349056 122124 189418 120933 239240 172294 129579 212959 189710
6298 189710 162810 83956 161045 360868 273444 195303 200534 313080 267721 376212 98825
6287 98825 19440 80478 227536 201449 338928 243208 121917 363920 450813 499487 367707
$$ packed form
6364A351764N7635J4388j68030k70813J08774L1251J5433j33881p1445J40786
6354A075862j0176j38504o7272K013p8209k55167J32317Q6255k3520J6320j39558
6343F00361L5670K8818k47294k52034j5200K93523J0029m0800N5723J20391p9249
6332E09938j30690n6484j23635N29k8161J29691l6732R984J8554j5968m6240J9739
6320B50525J41658L7070o3991o2583J20157j20207J08975L1219j3866k1188n0601
6309C57168j9826J91827j80113k26932O7294o8485J18307o6946m2715Q3380k3249
6298A89710k6900p8854P7089J99823q7424p8141N231J12546m5359J08491k77387
6287I8825p9385O1038J47058k6087J37479r5720j21291K42003Q6893M8674j31780
$$ plain form
6276 367707 331286 301519 267139 287824 203431 101294 -50785 145204 275214 297037 166262
6265 166262 152646 167431 40093 -19637 13499 -653 120581 68195 111143 331191 257173
6254 257173 276645 312985 263542 328580 226084 309180 191215 251187 153566 133641 362822
6243 362822 419289 330677 331433 337888 370355 276358 126620 143211 130985 157123 47989 142117
6231 142117 318982 414659 443899 345903 362993 538397 597440 534762 472908 343786 56591
6220 56591 224873 281951 371916 269089 129789 367638 389054 362835 458373 375304 262310
6209 262310 122153 302469 255206 368554 302920 349285 325489 273782 235477 245677 332125
6198 332125 336908 144503 254589 348820 450584 548049 402868 292783 219961 184192 247021
$$ packed form
6276C67707l6421k9767l4380K0685q4393j02137j52079J95989J30010K1823j30775
6265A66262j3616J4785j27338n9730L3136j4152J21234n2386M2948K20048p4018
6254B57173J9472L6340m9443O5038j02496Q3096j17965N9972r7621j9925K29181
6243C62822N6467q8612P56O455L2467r3997j49738J6591j2226K6138j09134R4128
6231A42117J76865R5677K9240r7996J7090J75404N9043o2678o1854j29122k87195
6220E6591J68282N7078Q9965j02827j39300K37849K1416k6219R5538q3069j12994
6209B62310j40157J80316m7263J13348o5634M6365k3796n1707l8305J0200Q6448
6198C32125M783j92405J10086R4231J01764R7465j45181j10085p2822l5769O2829
$$ plain form
6187 247021 341267 390473 418996 466276 578713 638622 621853 433563 509741 506304 538069
6176 538069 647084 488399 495484 600356 520321 396978 512011 669667 623041 528875 483687
6165 483687 507049 547247 575216 721468 713781 681974 875353 852126 793656 754726 629226
6154 629226 614211 896429 1085127 1098923 1177076 1202886 1315439 1383104 1512645 1325977 1400781
6143 1400781 1564201 1403436 1351750 1217621 1068849 1209475 1010136 982179 1134365 1126538
6133 1126538 1067605 997288 929894 768189 799661 753850 914134 935044 794187 732523 845665
6122 845665 794766 876377 657934 483214 457229 755584 797227 912260 650923 590845 792222
6111 792222 819102 713437 725354 805588 799625 933326 1034931 951887 938604 1131380 884240
$$ packed form
6187B47021R4246M9206K8523M7280J12437N9909j6769j88290P6178l437L1765
6176E38069J09015j58685P085J04872q0035j23343J15033J57656m6626r4166m5188
6165D83687K3362M0198K7969J46252p687l1807J93379k3227n8470l8930j25500
6154F29226j5015K82218J88698J3796P8153K5810J12553O7665J29541j86668P4804
6143A400781J63420j60765n1686j34129j48772J40626j99339k7957J52186p827
6133A126538n8933p0317o7394j61705L1472m5811J60284K0910j40857o1664J13142
6122H45665n0899Q1611k18443j74720k5985K98355M1643J15033k61337o0078K01377
6111G92222K6880j05665J1917Q0234n963J33701J01605q3044j3283J92776k47140
$$ plain form
6100 884240 835588 724071 792398 941433 1014014 1142996 1458507 1463735 1297590 1280799 1307630
6089 1307630 1585040 1674662 1707731 1665101 1662650 1744248 1838849 1787029 1868492 1912017 1813918
6078 1813918 1672907 1791734 1884161 1872759 1845436 1760782 1620831 1636951 1890201 1910205 1689506
6067 1689506 1506840 1461125 1408240 1447258 1372023 1438600 1499590 1397224 1295044 1308682 1224321
6056 1224321 1203706 1039764 925704 1072620 1198767 1251446 1094491 991501 946265 899251
6046 899251 888820 830454 1092796 1074290 840470 714773 923794 886657 859013 1018410 1041977
6035 1041977 1040890 1115704 1035772 977649 996682 1185441 1279350 1262352 1139779 1081678 1133083
6024 1133083 1082768 1184009 1122302 1345248 1325868 1448831 1417567 1340494 1323652 1345735 1406201
$$ packed form
6100H84240m8652j11517O8327J49035P2581J28982L15511N228j66145j6791K6831
6089A307630K77410Q9622L3069m2630k451Q1598R4601n1820Q1463M3525r8099
6078A813918j41011J18827R2427j1402k7323q4654j39951J6120K53250K0004k20699
6067A689506j82666m5715n2885L9018p5235O6577O0990j02366j02180J3638q4361
6056A224321k0615j63942j14060J46916J26147N2679j56955j02990m5236m7014
6046H99251j0431n8366K62342j8506k33820j25697K09021l7137k7644J59397K3567
6035A041977j087P4814p9932n8123J9033J88759R3909j6998j22573n8101N1405
6024A133083n0315J01241o1707K22946j9380J22963l1264p7073j6842K2083O0466
$$ plain form
6013 1406201 1149339 1175079 1302535 1248318 1071634 1005086 985212 1072166 1010097 1044462 906843
6002 906843 929753 970000 844394 888677 949220 989752 825639 751727 812309 704585 835281
5991 835281 854481 626831 584441 638802 665165 739762 676025 729380 917631 795365 765605
5980 765605 901537 925078 815289 736651 735229 928455 1013543 913669 711763 868652 711459
5969 711459 566146 679481 734190 796810 851229 897544 822891 658138 738365 861428 931712
5958 931712 810265 813584 1008330 974403 763037 687155 858557 736209 825147 861408 895517
5947 895517 801114 872065 936475 810811 844460 996555 912807 917231 928243 1052995 974919
5936 974919 786512 916072 899293 992941 933965 899738 675672 704044 681414 786482 667934
$$ packed form
6013A406201k56862K5740J27456n4217j76684o6548j9874Q6954o2069L4365j37619
6002I06843K2910M0247j25606M4283O0543M0532j64113p3912O0582j07724J30696
5991H35281J9200k27650m2390N4361K6363P4597o3737N3355J88251j22266k9760
5980G65605J35932K3541j09789p8638j422J93226Q5088r9874k01906J56889j57193
5969G11459j45313J13335N4709O2620N4419M6315p4653j64753Q0227J23063P0284
5958I31712j21447L319J94746l3927k11366p5882J71402j22348Q8938L6261L4109
5947H95517r4403P0951O4410j25664L3649J52095q3748M424J1012J24752p8076
5936I74919j88407J29560j6779R3648n8976l4227k24066K8372k2630J05068j18548
$$ plain form
5925 667934 751901 837442 838652 816862 879311 794641 715327 836623 904321 878137 759762
5914 759762 793842 827055 885120 779418 766651 717296 669419 695567 655572 709840 777562
5903 777562 810041 686383 708697 913485 901202 809113 795183 655353 539672 774028 708591
5892 708591 727105 913689 924148 848815 831491 1002505 1038496 1035670 947678 939356 901930 803731
5880 803731 1014020 1016469 1000528 931203 899258 902958 1148975 1183753 1086238 1053821 979383 907701
5868 907701 1010481 1089125 1051733 1019613 1021344 1072123 1001439 998878 1031472 1276420 1471871
5857 1471871 1440288 1383797 1276254 1348307 1286405 1195828 1403419 1465341 1346695 1372735 1431289
5846 1431289 1395055 1386967 1396936 1463311 1427964 1459124 1482303 1309563 1328360 1296128 1313329 1398650
$$ packed form
5925F67934Q3967Q5541J210k1790O2449q4670p9314J21296O7698k6184j18375
5914G59762L4080L3213N8065j05702j2767m9355m7877K6148l9995N4268O7722
5903G77562L2479j23658K2314K04788j2283r2089j3930j39830j15681K34356o5437
5892G08591J8514J86584J0459p5333j7324J71014L5991k826q7992q322l7426r8199
5880H03731K10289K449j5941o9325l1945L700K46017L4778r7515l2417p4438p1682
5868I07701J02780P8644l7392l2120J731N0779p0684k561L2594K44948J95451
5857A471871l1583n6491j07543P2053o1902r0577K07591O1922j18646K6040N8554
5846A431289l6234q088R969O6375l5347L1160K3179j72740J8797l2232J7201Q5321
$$ plain form
5834 1398650 1449443 1425209 1323096 1275541 1087680 957908 950571 1031212 1212576 1131640 1152339
5823 1152339 1250372 1188873 1203442 1332321 1333738 1374331 1186247 1243735 1223881 1088666 1192449
5812 1192449 1295294 1206705 1239792 1302338 1287782 1315816 1394967 1519086 1545390 1573437 1417452
5801 1417452 1436421 1362279 1424666 1359641 1231816 1220481 1234705 1491225 1528599 1454975 1392183
5790 1392183 1534380 1489214 1461093 1581817 1447955 1485884 1458621 1480493 1421763 1567556 1611438
5779 1611438 1613487 1666643 1774320 1751271 1701577 1759921 1689112 1509132 1583961 1619595 1709812
5768 1709812 1805327 1693338 1781110 1785731 1721598 1635681 1782374 1928558 1939478 1948095 2009955
5757 2009955 2071922 2057194 2005357 1901489 2021130 1951308 1992648 1985480 2008682 2039765 2072783
$$ packed form
5834A398650N0793k4234j02113m7555j87861j29772p337Q0641J81364q0936K0699
5823A152339R8033o1499J4569J28879J417M0593j88084N7488j9854j35215J03783
5812A192449J02845q8589L3087O2546j4556K8034P9151J24119K6304K8047j55985
5801A417452J8969p4142O2387o5025j27825j1335J4224K56520L7374p3624o2792
5790A392183J42197m5166k8121J20724j33862L7929k7263K1872n8730J45793M3882
5779A611438K049N3156J07677k3049m9694N8344p0809j79980P4829L5634R0217
5768A709812R5515j11989Q7772M621o4133q5917J46693J46184J0920Q617O1860
5757B009955O1967j4728n1837j03868J19641o9822M1340p168K3202L1083L3018
$$ plain form
5746 2072783 2094312 2218033 2288455 2212823 2341826 2421019 2306180 2297842 2566371 2633486 2494996
5735 2494996 2466295 2449097 2379079 2329887 2398346 2272674 2291933 2491856 2705675 2674983 2705857
5724 2705857 2816810 2786055 2907350 2841597 2834220 2826577 2866364 2955419 3131543 3081303 3094607
5713 3094607 3242246 3240033 3493042 3395085 3410737 3469815 3391296 3481849 3558678 3840187 3981628
5702 3981628 3994627 4068581 4192015 4270517 4451773 4443559 4511127 4592076 4788010 4943849 5312839
5691 5312839 5506832 5648570 5718923 5804889 6070940 6166016 6271261 6552608 6838987 7005788
5681 7005788 7272787 7556328 7787140 7963086 8265498 8567017 8913402 9114291 9359375 9495900
5671 9495900 9590518 9800433 9766719 9817554 9970099 9994058 10160432 10457552 10711032 10901204
$$ packed form
5746B072783K1529J23721P0422p5632J29003P9193j14839q338K68529O7115j38490
5735B494996k8701j7198p0018m9192O8459j25672J9259J99923K13819l0692L0874
5724B705857J10953l0755J21295o5753p377p643L9787Q9055J76124n0240J3304
5713C094607J47639k213K53009r7957J5652N9078p8519R0553P6829K81509J41441
5702C981628J2999P3954J23434P8502J81256q214O7568Q0949J95934J55839L68990
5691E312839J93993J41738P0353Q5966K66051R5076J05245K81347K86379J66801
5681G005788K66999K83541K30812J75946L02412L01519L46385K00889K45084J36525
5671I495900R4618K09915l3714N0835J52545K3959J66374K97120K53480J90172
$$ plain form
5661 10901204 11199906 11336789 11343407 11320866 11218838 11490468 11688297 11957719 12338764 12716455
5651 12716455 13158499 13587970 14097648 14313443 14282100 14294684 14148550 13807395 13443870 13062821
5641 13062821 12678135 12456175 12345260 12272182 12258686 12220549 12483598 12678777 12751711 12747326
5631 12747326 12743519 12735217 12387822 12418898 12435441 12535281 12767678 12977112 13060796 13016668 13052433
5620 13052433 13017270 12889151 12817660 12706922 12446183 12363142 12353828 12290222 12393547 12392202 12407070
5609 12407070 12564182 12756643 12875976 12902992 12983359 13056812 13173887 13267954 13238302 13290144
5599 13290144 13345346 13815025 14077081 14258882 14324401 14459893 15052453 15210823 15561862 16235496
5589 16235496 16791975 17143547 17733212 18374021 18963253 19668645 20507528 21438526 22522691
$$ packed form
5661A0901204K98702J36883O618k2541j02028K71630J97829K69422L81045L77691
5651A2716455M42044M29471N09678K15795l1343J2584j46134l41155l63525l81049
5641A3062821l84686k21960j10915p3078j3496l8137K63049J95179P2934m385
5631A2747326l807q302l47395L1076J6543R9840K32397K09434Q3684m4128L5765
5620A3052433l5163j28119p1491j10738k60739q3041r314o3606J03325j345J4868
5609A2407070J57112J92461J19333K7016Q0367P3453J17075R4067k9652N1842
5599A3290144N5202M69679K62056J81801O5519J35492N92560J58370L51039O73634
5589A6235496N56479L51572N89665O40809N89232P05392Q38883R30998J084165
$$ plain form
5580 22522691 23510144 24420745 25548071 26891969 28570474 30495046 32407868 34537950
5572 34537950 37111625 39903619 42661583 45738815 48695010 51065804 52402970 52576602
5564 52576602 51554298 49730235 47528100 45587531 44066985 42767565 41878703 41694495
5556 41694495 41742378 42089229 42976627 44022163 45513712 47350106 49663604 52592089 55800172
5547 55800172 59620105 63948165 68564696 73819309 79808817 85867147 91560979 96224326
5539 96224326 98714622 97938851 93561551 86816537 78907562 71715454 65359237 60106779
5531 60106779 56113413 53110262 50801540 48870032 47466713 46572293 46053337 45928522 46264621
5522 46264621 46830351 47706116 48776550 50261100 52028501 54000193 56254240 58421406
$$ packed form
5580B2522691R87453R10601J127326J343898J678505J924572J912822K130082
5572C4537950K573675K791994K757964L077232K956195K370794J337166J73632
5564E2576602j022304j824063k202135j940569j520546j299420q88862j84208
5556D1694495M7883L46851Q87398J045536J491549J836394K313498K928485L208083
5547E5800172L819933M328060M616531N254613N989508O058330N693832M663347
5539I6224326K490296p75771m377300o745014p908975p192108o356217n252458
5531F0106779l993366l003151k308722j931508j403319q94420n18956j24815L36099
5522D6264621N65730Q75765J070434J484550J767401J971692K254047K167166
$$ plain form
5514 58421406 60076052 61143965 60771811 58641121 54993979 50895893 46466530 42141767
5506 42141767 38382068 35485627 32962798 30612346 28558646 26699036 25218940 23766121
5498 23766121 22530795 21494853 20204016 19099339 18260512 17479660 16700606 16065531 15418987
5489 15418987 14897842 14431626 13719965 13228492 12767094 12205910 11999049 11721036 11386509
5480 11386509 11174323 10799943 10406784 10034676 9873130 9564644 9358464 8994316 8845670
5471 8845670 8525817 8360396 8136073 8143193 8187674 8045834 7803132 7603374 7538920 7555719
5461 7555719 7348098 7120932 6992800 6806004 6701596 6727365 6590667 6391447 6275814 5989790
5451 5989790 5923546 5982135 5813565 5716630 5614857 5539947 5272711 5021228 5199989 5042847
$$ packed form
5514E8421406J654646J067913l72154k130690l647142m098086m429363m324763
5506D2141767l759699k896441k522829k350452k053700j859610j480096j452819
5498B3766121j235326j035942j290837j104677q38827p80852p79054o35075o46544
5489A5418987n21145m66216p11661m91473m61398n61184k06861k78013l34527
5480A1386509k12186l74380l93159l72108j61546l08486k06180l64148j48646
5471H845670l19853j65421k24323P120M4481j41840k42702j99758o4454J6799
5461G555719k07621k27166j28132j86796j04408K5769j36698j99220j15633k86024
5451E989790o6244N8589j68570r6935j01773p4910k67236k51483J78761j57142
$$ plain form
5441 5042847 4939739 4923743 4896672 4859117 4715138 4599405 4481876 4612259 4436316 4292731
5431 4292731 4287985 4370217 4410477 4368883 4219224 4175001 4192112 4273759 4220206 4091368 4007446
5420 4007446 3869058 3944740 3923603 3978403 3971395 4050721 4020162 4086299 3885662 3893909 3701966
5409 3701966 3742533 3889493 3931693 3875167 3931645 3904563 3708301 3763146 3814216 3874826 4006457
5398 4006457 4024508 3952975 3910051 3745992 3729570 3975452 3842283 3593356 3567936 3674075
5388 3674075 3638836 3569081 3585072 3611355 3649746 3687370 3658581 3572686 3659562 3782686 3891918
5377 3891918 3953046 4018924 3962655 3866864 3973691 4011479 3992582 4067978 3998232 3975360 3742910
5366 3742910 3731649 3899420 3713735 3601913 3738863 3638841 3949438 3906291 3825114 3854405
$$ packed form
5441E042847j03108j5996k7071l7555j43979j15733j17529J30383j75943j43585
5431D292731m746Q2232M0260m1594j49659m4223J7111Q1647n3553j28838q3922
5420D007446j38388P5682k1137N4800p008P9326l0559O6137k00637Q247j91943
5409C701966M0567J46960M2200n6526N6478k7082j96262N4845N1070O0610J31631
5398D006457J8051p1533m2924j64059j6422K45882j33169k48927k5420J06139
5388C674075l5239o9755J5991K6283L8391L7624k8789q5895Q6876J23124J09232
5377C891918O1128O5878n6269r5791J06827L7788j8897P5396o9746k2872k32450
5366C742910j1261J67771j85685j11822J36950j00022L10597m3147q1177K9291
$$ plain form
5356 3854405 3666560 3663219 3587114 3677207 3794486 3784036 3858574 3802337 3808926 3845485 3772828
5345 3772828 3805040 3926095 3807744 3761282 3733534 3735599 3665385 3681154 3711180 3569569 3619981
5334 3619981 3851750 3791492 3756379 3796803 3958461 4006508 4019436 4104176 4048037 4041596 4034124
5323 4034124 4041658 4038469 4090981 3948942 3861790 3900633 4109025 3956400 3986863 4083492 4080505
5312 4080505 3998748 3928846 4019198 4128379 4205737 4502732 4449609 4416196 4532529 4912248 4885580
5301 4885580 4796797 4918777 4976497 4900661 4895390 5019114 5194627 5458922 5659867 5742896 5985992
5290 5985992 6294083 6503577 6846275 7012768 7173350 7316620 7148047 7052182 7039335 7219311
5280 7219311 7393027 7319203 7477024 7406808 7380836 7537692 7687566 7673901 7903055 8146770
$$ packed form
5356C854405j87845l341p6105R0093J17279j0450P4538n6237O589L6559p2657
5345C772828L2212J21055j18351m6462k7748K065p0214J5769L0026j41611N0412
5334C619981K31769o0258l5113M0424J61658M8047J2928Q4740n6139o441p472
5323D034124P534l189N2512j42039q7152L8843K08392j52625L0463R6629k987
5312D080505q1757o9902R0352J09181P7358K96995n3123l3413J16333L79719k6668
5301D885580q8783J21980N7720p5836n271J23724J75513K64295K00945Q3029K43096
5290E985992L08091K09494L42698J66493J60582J43270j68573r5865j2847J79976
5280G219311J73716p3824J57821p0216k5972J56856J49874j3665K29154K43715
$$ plain form
5270 8146770 8366525 8359250 8615980 8844686 9058477 9239185 9582270 10138383 10575091 10889527
5260 10889527 11150998 11341603 11321168 11564602 11975226 12268359 12580180 12992410 13317741 13813878
5250 13813878 14440474 15091959 15843940 16673693 17514697 18044093 18159993 17553788 16992704
5241 16992704 16364781 15623732 15294850 15121715 14905790 14708267 14800906 14775136 14455185 14211632
5231 14211632 14168035 14289319 14473566 14442736 14589556 14657438 14947028 14997444 15006959 15421547
5221 15421547 15828639 15969570 16304918 16780310 17225114 17694825 18258472 18903721 19354281
5212 19354281 19887933 20644742 21311010 22072128 22590341 23149897 23767667 24038942 24559388
5203 24559388 24910391 25228606 25612809 26039389 26623229 27134603 27644036 28276551 29090111
$$ packed form
5270H146770K19755p275K56730K28706K13791J80708L43085N56113M36708L14436
5260A0889527K61471J90605k0435K43434M10624K93133L11821M12230L25331M96137
5250A3813878O26596O51485P51981Q29753Q41004N29396J15900o06205n61084
5241A6992704o27923p41049l28882j73135k15925j97523R2639k5770l19951k43553
5231A4211632m3597J21284J84247l0830J46820O7882K89590N0416R515M14588
5221A5421547M07092J40931L35348M75392M44804M69711N63647O45249M50560
5212A9354281N33652P56809O66268P61118N18213N59556O17770K71275N20446
5203B4559388L51003L18215L84203M26580N83840N11374N09433O32515Q13560
$$ plain form
5194 29090111 29984595 30812475 31529465 32385152 33281597 34188196 35206670 36596219 38142071
5185 38142071 39780009 41570023 43405564 45486525 47488377 49693329 51818212 54293499
5177 54293499 56921580 59776624 63025493 66726473 71181076 76265912 81861620 88012093
5169 88012093 94834543 102305506 110308575 118288853 126284096 133770267 140929219 148009984
5161 148009984 154814851 161012322 166005085 169274098 169453561 166231145 159902261 151660015
5153 151660015 142713715 133952270 125302536 116788505 108911191 101558065 94702106 88591193
5145 88591193 83160335 78329982 74207992 70509530 67126003 64243050 61730546 59509036
5137 59509036 57280395 55324249 53226029 51395495 49644273 47952634 46594644 45101769
$$ packed form
5194B9090111Q94484Q27880P16990Q55687Q96445R06599J018474J389549J545852
5185C8142071J637938J790014J835541K080961K001852K204952K124883K475287
5177E4293499K628081K855044L248869L700980M454603N084836N595708O150473
5169H8012093O822450P470963Q003069P980278P995243P486171P158952P080765
5161A48009984O804867O197471M992763L269013J79463l222416o328884q242246
5153A51660015q946300q761445q649734q514031p877314p353126o855959o110913
5145H8591193n430858m830353m121990l698462l383527k882953k512504k221510
5137E9509036k228641j956146k098220j830534j751222j691639j357990j492875
$$ plain form
5129 45101769 43535597 42132680 40709939 39568856 38512125 37293599 36242457 35455010
5121 35455010 34611209 33866381 33347733 32971613 32830308 32386012 32034227 31760440 31496357
5112 31496357 31476439 31332158 31070591 30975648 30798012 30683716 30525224 30434426 30286855 29890419
5102 29890419 29811207 30005854 30255694 30533059 30807785 31352242 31757304 32568646 33343070 34419671
5092 34419671 35675980 37036554 38501241 40422631 42567610 45038287 47732624 50673280
5084 50673280 53960691 57426537 61014992 64617452 67673521 69655520 69841380 68186739
5076 68186739 65308482 61888441 58574315 55702863 53553641 51775575 50687427 49821112
5068 49821112 49579669 50013390 50728059 51920034 53743438 56038477 58826754 62060516 65670224
$$ packed form
5129D5101769j566172j402917j422741j141083j056731j218526j051142p87447
5121C5455010q43801p44828n18648l76120j41305m44296l51785k73787k64083
5112C1496357j9918j44281k61567r4943j77636j14296j58492r0798j47571l96436
5102B9890419p9212J94647K49840K77365K74726N44457M05062Q11342P74424J076601
5092C4419671J256309J360574J464687J921390K144979K470677K694337K940656
5084E0673280L287411L465846L588455L602460L056069J981999J85860j654641
5076F8186739k878257l420041l314126k871452k149222j778066j088148q66315
5068D9821112k41443M33721P14669J191975J823404K295039K788277L233762L609708
$$ plain form
5059 65670224 69927553 75075484 80900638 87307193 94611735 101842999 107412329 109615607
5051 109615607 107211973 100949395 92743755 84199995 76503922 70030440 64554173 60071676
5043 60071676 56675714 54097561 52121269 50584890 49453491 48736194 48389795 48459984 48913003
5034 48913003 49788146 50710360 52188972 53806901 55259374 56962821 58451633 60050929
5026 60050929 60674595 60382922 58675592 55849917 52053271 48025574 44292826 40848935
5018 40848935 38186119 35913184 34109295 32720811 31418880 30110464 29334574 28380995
5010 28380995 27440147 26646036 25924712 24883120 23735429 22455376 21578529 20481096 19566068
5001 19566068 18958020 18405395 17982068 17455233 17057397 16617466 16303116 16020253 15589550
$$ packed form
5059F5670224M257329N147931N825154O406555P304542P231264N569330K203278
5051A09615607k403634o262578q205640q543760p696073o473482n476267m482497
5043F0071676l395962k578153j976292j536379j131399p17297l46399P0189M53019
5034D8913003Q75143R22214J478612J617929J452473J703447J488812J599296
5026F0050929O23666k91673j707330k825675l796646m027697l732748l443891
5018D0848935k662816k272935j803889j388484j301931j308416p75890r53579
5010B8380995r40848p94111p21324j041592j147691j280053q76847j097433r15028
5001A9566068o08048n52625m23327n26835l97836m39931l14350k82863m30703
$$ plain form
4992 15589550 15318620 15165039 14999909 14920555 14741623 14545619 14380399 14056462 13811143 13765527
4982 13765527 13815372 13721730 13465586 13490666 13443417 13501932 13661718 13568664 13678595 14082341
4972 14082341 14366797 14396686 14191933 13928687 14024747 14343071 14685603 14978874 15237475 15718478
4962 15718478 16040745 16456787 16822329 17294263 17290081 16737815 16173924 15546738 15031627 14360060
4952 14360060 13904001 13645015 13489737 13229666 13042580 13010314 13244435 13026503 12965226 12995740
4942 12995740 13072117 13236193 13584926 13806147 14028185 14285706 14655060 14741871 14754031 14656702
4932 14656702 14421715 14420999 14147615 13865049 13633955 13475111 13295803 13112596 12993846 13073958
4922 13073958 13094582 13067745 13157531 13545499 13751385 14332548 14999369 16068619 17176061 18568518
$$ packed form
4992A5589550k70930j53581j65130p9354j78932j96004j65220l23937k45319m5616
4982A3765527M9845r3642k56144K5080m7249N8515J59786r3054J09931M03746
4972A4082341K84456K9889k04753k63246R6060L18324L42532K93271K58601M81003
4962A5718478L22267M16042L65542M71934m182n52266n63891o27186n15111o71567
4952A4360060m56059k58986j55278k60071j87086l2266K34121k17932o1277L0514
4942A2995740P6377J64076L48733K21221K22038K57521L69354Q6811J2160r7329
4932A4656702k34987p16k73384k82566k31094j58844j79308j83207j18750Q0112
4922A3073958K0624k6837Q9786L87968K05886N81163O66821J069250J107442J392457
$$ plain form
4912 18568518 20408210 22403139 24579482 26019837 26529392 26714450 26609827 26338384 26294908
4903 26294908 26723298 27579766 27908675 26808697 25867632 25784122 26060651 25929599 24441252
4894 24441252 22031132 19830142 18129024 16714315 15561316 14699458 14007528 13343853 12821432
4885 12821432 12384046 12252248 11926445 11819754 11667623 11665313 11695757 11931549 11893472 11847477
4875 11847477 11783041 11759627 11627331 11173825 10737316 10469711 9969210 9700693 9514672 9161545
4865 9161545 8846069 8677399 8610069 8451205 8537395 8385364 8533710 8620171 8786615 8706274
4855 8706274 8556549 8306793 8226617 8081088 7766243 7316118 7039449 6825513 6482407 6116471
4845 6116471 5951229 5759749 5628249 5424654 5119032 4888963 4973799 4877109 4852347 4817779
$$ packed form
4912A8568518J839692J994929K176343J440355N09555J85058j04623k71443m3476
4903B6294908M28390Q56468L28909j099978r41065q3510K76529j31052j488347
4894B4441252k410120k200990j701118j414709j152999q61858o91930o63675n22421
4885A2821432m37386j31798l25803j06691j52131k310L0444K35792l8077m5995
4875A1847477o4436k3414j32296m53506m36509k67605n00501k68517j86021l53127
4865I161545l15476j68670o7330j58864Q6190j52031J48346Q6461J66444q0341
4855H706274j49725k49756q0176j45529l14845m50125k76669k13936l43106l65936
4845F116471j65242j91480j31500k03595l05622k30069Q4836r6690k4762l4568
$$ plain form
4835 4817779 4496348 4285955 4373294 4380989 4390584 4269223 4228508 4118793 4050749 3882962 3957305
4824 3957305 3956571 3701790 3729616 3753388 3835975 3775291 3803366 3779298 3902689 3890052 3766608
4813 3766608 3774318 3853810 3816407 3689130 3740727 3803917 3651345 3511954 3438316 3595560 3482934
4802 3482934 3392161 3438539 3487366 3475993 3495417 3630431 3313998 3256078 3287737 3258428 3229944
4791 3229944 3283565 3086174 3051145 3107235 3088970 3255455 3139049 2976097 3005219 3088605 3100725
4780 3100725 3084677 3091284 3093551 2990425 2975923 2790873 2894865 2927417 2959670 2862758 2810833
4769 2810833 2864882 2890645 2899887 2938153 2909399 3021228 2837992 2858486 2893823 2837406 2703573
4758 2703573 2690393 2729000 2929076 2773494 2647513 2744054 2915580 2779107 2686131 2877553
$$ packed form
4835D817779l21431k10393Q7339P695R595j21361m0715j09715o8044j67787P4343
4824C957305p34k54781K7826K3772Q2587o0684K8075k4068J23391j2637j23444
4813C766608P710P9492l7403j27277N1597O3190j52572j39391p3638J57244j12626
4802C482934r0773M6378M8827j1373J9424J35014l16433n7920L1659k9309k8484
4791C229944N3621j97391l5029N6090j8265J66485j16406j62952K9122Q3386J2120
4780C100725j6048O607K267j03126j4502j85050J03992L2552L2253r6912n1925
4769B810833N4049K5763R242L8266k8754J11829j83236K0494L5337n6417j33833
4758B703573j3180L8607K00076j55582j25981R6541J71526j36473r2976J91422
$$ plain form
4748 2877553 2750701 2639656 2825628 2774900 2800694 2815228 2784564 2949194 2885100 2768024
4738 2768024 2865831 2811939 2895201 2917286 2912243 2962052 3133389 3103707 2931567 3029577 3126254
4727 3126254 3209470 3180791 3265181 3033639 2992442 3019502 2960492 3051117 2940955 2804309 2873310
4716 2873310 2866490 2956514 2762802 2626879 2713489 2845180 2814130 2695548 2815050 2745436 2687902
4705 2687902 2783135 2780208 2877826 2787573 3009024 3112494 3222100 3044966 2854812 2738864
4695 2738864 2752261 2825446 2818085 2850187 3076073 2984398 2861518 2963895 3003317 3069459 3092975
4684 3092975 3115854 3277535 3175241 3022788 3094509 3090380 3029033 3142107 3139437 3190739 3227686
4673 3227686 3218873 3137912 3119603 3103537 3173513 3172988 3136421 3261039 3121332 3289453 3199162
$$ packed form
4748B877553j26852j11045J85972n0728K5794J4534l0664J64630o4094j17076
4738B768024R7807n3892Q3262K2085n043M9809J71337k9682j72140R8010R6677
4727C126254Q3216k8679Q4390k31542m1197K7060n9010R0625j10162j36646O9001
4716B873310o820R0024j93712j35923Q6610J31691l1050j18582J19502o9614n7534
4705B687902R5233k927R7618r0253K21451J03470J09606j77134j90154j15948
4695B738864J3397P3185p361L2102K25886r1675j22880J02377L9422O6142K3516
4684C092975K2879J61681j02294j52453P1721m129o1347J13074k670N1302L6947
4673C227686q813q0961j8309j6066O9976n25l6567J24618j39707J68121r0291
$$ plain form
4662 3199162 3088217 3066539 3215936 3255633 3244432 3357025 3472668 3379825 3233172 3459452
4652 3459452 3536273 3619787 3596553 3567088 3601537 3590913 3764467 3725029 3791856 3928259 3917101
4641 3917101 3560725 3552609 3566299 3460685 3477566 3518803 3574297 3595378 3677619 3599169 3819737
4630 3819737 3808983 3810355 3926746 3977736 3951033 3767690 3683904 3569943 3521840 3500639 3557427
4619 3557427 3602486 3543469 3562484 3483598 3431804 3387762 3507091 3556671 3617874 3539544 3514871
4608 3514871 3488491 3575278 3630649 3547157 3613597 3708809 3841406 3782484 3867377 3802415 3852546
4597 3852546 3970411 3993253 4066234 4085879 4168127 4367361 4393436 4571293 4628057 4620958 4576175
4586 4576175 4377668 4411424 4522882 4649164 4582356 4585359 4487946 4560453 4573599 4610449 4502601
$$ packed form
4662C199162j10945k1678J49397L9697j1201J12593J15643r2843j46653K26280
4652C459452P6821Q3514k3234k9465L4449j0624J73554l9438O6827J36403j1158
4641C917101l56376q116J3690j05614J6881M1237N5494K1081Q2241p8450K20568
4630C819737j0754J372J16391N0990k6703j83343q3786j13961m8103k1201N6788
4619C557427M5059n9017J9015p8886n1794m4042J19329M9580O1203p8330k4673
4608C514871k6380Q6787N5371q3492O6440R5212J32597n8922Q4893o4962N0131
4597C852546J17865K2842P2981J9645Q2248J99234K6075J77857N6764p099m4783
4586D576175j98507L3756J11458J26282o6808L003r7413P2507J3146L6850j07848
$$ plain form
4575 4502601 4435981 4455753 4548273 4553895 4520169 4565967 4655949 4727813 4819555 4834494 4820027 4872705
4563 4872705 4862162 4881021 5070256 5095972 5033084 5348448 5398483 5387130 5448107 5426864 5638067
4552 5638067 5663461 5584014 5865361 5883443 5731586 5642547 5641202 5643300 5634781 5570487 5937002
4541 5937002 5890261 5903292 5860278 5899252 6042426 6298936 6316282 6377232 6523312 6564178 6666628
4530 6666628 6708966 6911845 7083971 7038661 7211542 7494959 7562198 7591730 7734127 8092254
4520 8092254 8374166 8756488 9249209 9591283 9957773 10323474 11036742 11705798 12639197 13669176
4510 13669176 14685536 15642918 16438057 16829994 16730744 16344520 15398796 14537969 13503310
4501 13503310 12799005 12318365 12139063 12137745 11985146 11988019 12186964 12252564 12383224 12641060
$$ packed form
4575D502601o6620J9772R2520N622l3726M5798Q9982P1864R1742J4939j4467N2678
4563D872705j0543J8859J89235K5716o2888L15364N0035j1353O0977k1243K11203
4552E638067K5394p9447K81347J8082j51857q9039j345K098q519o4294L66515
4541E937002m6741J3031m3014L8974J43174K56510J7346O0950J46080M0866J02450
4530F666628M2338K02879J72126m5310J72881K83417O7239K9532J42397L58127
4520H092254K81912L82322M92721L42074L66490L65701P13268O69056R33399J029979
4510A3669176J016360R57382P95139L91937r9250l86224r45724q60827j034659
4501A3503310p04305m80640j79302j318j52599K873J98945O5600J30660K57836
$$ plain form
4491 12641060 12838071 13093152 13197131 13403316 13548400 13856780 14148616 14353289 14548958
4482 14548958 14588596 14700503 15085261 15270652 15278545 15564506 15707813 16040725 16322286 16391633
4472 16391633 16575616 16771356 17172830 17650340 17953594 18381884 18766958 19174089 19685595
4463 19685595 20275527 20747145 21056322 21569862 21948865 22383427 23241204 23770594 24418347
4454 24418347 25106837 26032694 27054005 28211025 29220906 29847207 29920312 29245922 28265048
4445 28265048 27377686 26400051 25890319 25595055 25594030 25793238 26103076 26380143 26872107 27480525
4435 27480525 28103179 28622797 29110765 29573505 29876468 30224901 30511691 30659728 30695862 30775353
4425 30775353 30896297 31116065 31410522 31821054 32321735 32964567 33538390 34193593 35043794
$$ packed form
4491A2641060J97011K55081J03979K06185J45084L08380K91836K04673J95669
4482A4548958L9638J11907L84758J85391P893K85961J43307L32912K81561O9347
4472A6391633J83983J95740M01474M77510L03254M28290L85074M07131N11506
4463A9685595N89932M71618L09177N13540L79003M34562Q57777N29390O47753
4454B4418347O88490R25857J021311J157020J009881O26301P3105o74390r80874
4445B8265048q87362r77635n09732k95264j025J99208L09838K77067M91964O08418
4435B7480525O22654N19618M87968M62740L02963L48433K86790J48037L6134P9491
4425C0775353J20944K19768K94457M10532N00681O42832N73823O55203Q50201
$$ plain form
4416 35043794 35982335 36637856 37369816 38487630 39234195 39723257 40162812 40549855 40891628
4407 40891628 40987958 41441202 41981489 42570568 43378629 44188683 45066369 46281343 47296291
4398 47296291 48445840 49649801 50825149 51853589 52890906 54194856 55468986 56508407
4390 56508407 58004812 59394757 61036564 62932121 64933359 67281313 70067572 72957002
4382 72957002 76420049 80501214 85081498 90606489 96696684 103878839 111762251 120744675
4374 120744675 131129469 142787559 155830563 170735839 187399240 205686934 225197009
4367 225197009 245068449 263929337 279748735 290717221 296117930 295346956 288311755 275633952
4359 275633952 259128639 240334500 220689481 201376283 183229022 166860205 152411797
$$ packed form
4416C5043794R38541O55521P31960J117814P46565M89062M39555L87043L41773
4407D0891628R6330M53244N40287N89079Q08061Q10054Q77686J214974J014948
4398D7296291J149549J203961J175348J028440J037317J303950J274130J039421
4390E6508407J496405J389945J641807J895557K001238K347954K786259K889430
4382G2957002L463047M081165M580284N524991O090195P182155P883412Q982424
4374A20744675J0384794J1658090J3043004J4905276J6663401J8287694J9510075
4367B25197009J9871440J8860888J5819398J0968486N400709p70974p035201j2677803
4359B75633952j6505313j8794139j9645019j9313198j8147261j6368817j4448408
$$ plain form
4352 152411797 139808506 128583694 118660873 109943304 102118474 95000125 88745780 83376484
4344 83376484 78514624 74218746 70356993 67059062 63963969 61125757 58561685 56230290
4336 56230290 54248362 52288385 50326452 48714066 47114149 45558262 44262943 42936135
4328 42936135 41646424 40556680 39660230 38605923 37711563 36961263 36064978 35188131 34703017
4319 34703017 34078652 33334363 32732167 32350454 31736959 31234383 30763661 30300739 29679016
4310 29679016 29099099 28712033 28464927 28195167 27798700 27472768 27219811 26951815 26924437 26631566
4300 26631566 26543077 26304060 25986931 25793695 25439604 25142536 24907308 24549584 24080621 23641810
4290 23641810 23189519 22906745 22711431 22508833 22214897 21957670 21501241 21225075 20904850
$$ packed form
4352A52411797j2603291j1224812r922821q717569p824830p118349o254345n369296
4344H3376484m861860m295878l861753l297931l095093k838212k564072k331395
4336E6230290j981928j959977j961933j612386j599917j555887j295319j326808
4328D2936135j289711j089744q96450j054307q94360p50300q96285q76847m85114
4319C4703017o24365p44289o02196l81713o13495n02576m70722m62922o21723
4310B9679016n79917l87066k47106k69760l96467l25932k52957k67996k7378k92871
4300B6631566q8489k39017l17129j93236l54091k97068k35228l57724m68963m38811
4290B3641810m52291k82774j95314k02598k93936k57227m56429k76166l20225
$$ plain form
4281 20904850 20492850 20342000 20071419 19933757 19783898 19505362 19300809 18974317 18758559
4272 18758559 18728562 18544078 18216097 17930446 17785309 17627669 17473473 17123132 16909427 16833347
4262 16833347 16531496 16412172 16420712 16288654 16121511 16043054 15789880 15687012 15508085 15324439
4252 15324439 15111178 15096583 15014895 14883320 14762867 14692443 14725597 14765861 14554329 14660553
4242 14660553 14606670 14458060 14644448 14593050 14642115 14656524 14746422 14648020 14812823 14771552 14587287
4231 14587287 14710302 14869554 15091848 15101362 15170415 15348041 15524334 15673480 15688730 15887077
4221 15887077 16131752 16448384 16747933 16837573 17235914 17585364 17862211 18013039 18474405 18869009
4211 18869009 19320809 19703571 20094906 20478888 20730342 20902725 21516866 21941872 22299296
$$ packed form
4281B0904850m12000j50850k70581j37662j49859k78536k04553l26492k15758
4272A8758559k9997j84484l27981k85651j45137j57640j54196l50341k13705p6080
4262A6833347l01851j19324Q540j32058j67143p8457k53174j02868j78927j83646
4252A5324439k13261j4595q1688j31575j20453p0424L3154M0264k11532J06224
4242A4660553n3883j48610J86388n1398M9065J4409Q9898r8402J64803m1271j84265
4231A4587287J23015J59252K22294R514O9053J77626J76293J49146J5250J98347
4221A5887077K44675L16632K99549Q9640L98341L49450K76847J50828M61366L94604
4211A8869009M51800L82762L91335L83982K51454J72383O14141M25006L57424
$$ plain form
4202 22299296 22660577 23083305 23691197 24298764 24902114 25266739 25911518 26619509 27348206
4193 27348206 28068032 28723073 29435232 30211739 31088593 31933593 32755585 33497295 34277040
4184 34277040 35159326 35868172 36957537 38111042 39074208 40165611 41319535 42558157 44167892
4175 44167892 46042198 47981797 50038615 52443922 55102009 58317252 61852115 65723773
4167 65723773 70169536 75591298 81699617 88700831 96828606 105879108 116536210 128213098
4159 128213098 140944092 155248243 171209087 189245452 209309482 231730146 255345714
4152 255345714 279167062 301609162 315312011 311133658 288732275 257063364 224587185
4145 224587185 195738436 172192311 153534954 138603712 126804371 117607164 109730353
$$ packed form
4202B2299296L61281M22728O07892O07567O03350L64625O44779P07991P28697
4193B7348206P19826O55041P12159P76507Q76854Q45000Q21992P41710P79745
4184C4277040Q82286P08846J089365J153505R63166J091403J153924J238622J609735
4175D4167892J874306J939599K056818K405307K658087L215243L534863L871658
4167F5723773M445763N421762O108319P001214Q127775R050502J0657102J1676888
4159A28213098J2730994J4304151J5960844J8036365K0064030K2420664K3615568
4152B55345714K3821348K2442100J3702849m178353k2401383l1668911l2476179
4145B24587185k8848749k3546125j8657357j4931242j1799341r197207p876811
$$ plain form
4138 109730353 102986284 96622976 90433726 84673983 79199796 74078276 69345763 65149649
4130 65149649 61455422 58296758 55224718 52503068 49739697 47384256 45096825 42872629
4122 42872629 41028461 39322728 37679426 36138752 34709287 33236025 32011458 31050757
4114 31050757 30101232 28919684 27942070 26926551 26154456 25388538 24571259 23678563 22854058
4105 22854058 22182420 21279029 20713929 20353945 19848591 19407580 18946465 18410322 17866192
4096 17866192 17568144 17069728 16663716 16358708 16053046 15774658 15692321 15402162 15101089 14922204
4086 14922204 14735916 14390613 14095553 13839180 13517800 13214172 12904354 12773789 12321387
4077 12321387 12055780 11814554 11414108 11254459 11158127 10924586 10654477 10597549 10309905 10185323
$$ packed form
4138A09730353o744069o363308o189250n759743n474187n121520m732513m196114
4130F5149649l694227l158664l072040k721650k763371k355441k287431k224196
4122D2872629j844168j705733j643302j540674j429465j473262j224567r60701
4114C1050757r49525j181548r77614j015519p72095p65918q17279q92696q24505
4105B2854058o71638r03391n65100l59984n05354m41011m61115n36143n44130
4096A7866192k98048m98416m06012l05008l05662k78388q2337k90159l01073j78885
4086A4922204j86288l45303k95060k56373l21380l03628l09818j30565m52402
4077A2321387k65607k41226m00446j59649r6332k33541k70109n6928k87644j24582
$$ plain form
4067 10185323 10188954 9978040 9793206 9679361 9617967 9506729 9546522 9362165 9250272 9342205
4057 9342205 9267367 9065191 8642246 8545651 8399655 8088418 8064086 7830332 7770768 7612011
4047 7612011 7495903 7433492 7283673 7272165 7123936 7001667 6933587 6982803 6883164 6800332 6739387
4036 6739387 6607100 6729334 6674551 6299297 6242097 6290882 6130754 6173175 6028971 6120747
4026 6120747 5929271 5607589 5297461 5089243 5244927 5341264 5106996 5065323 4964397 5014331
4016 5014331 4941637 5040788 5042119 4791610 4747304 4493129 4389306 4432345 4376200 4455472 4323663
4005 4323663 4322298 4310445 4264618 4204960 4282538 4171290 3847797 3825379 3832906 3857489 3781177
3994 3781177 3763570 3876811 3797898 3574004 3476200 3348977 3447270 3513884 3539706 3533229 3386555
$$ packed form
4067A0185323L631k10914j84834j13845o1394j11238L9793j84357j11893R1933
4057I342205p4838k02176m22945r6595j45996l11237k4332k33754n9564j58757
4047G612011j16108o2411j49819j1508j48229j22269o8080M9216r9639q2832o0945
4036F739387j32287J22234n4783l75254n7200M8785j60128M2421j44204R1776
4026F120747j91476l21682l10128k08218J55684R6337k34268m1673j00926M9934
4016E014331p2694R9151J331k50509m4306k54175j03823M3039n6145P9272j31809
4005D323663j365j1853m5827n9658P7578j11248l23493k2418P527K4583p6312
3994C781177j7607J13241p8913k23894r7804j27223R8293O6614K5822o477j46674
$$ plain form
3983 3386555 3459797 3517583 3550394 3510274 3554960 3626285 3383893 3400133 3259202 3386619 3187093
3972 3187093 3085057 2970144 3018042 3106539 3049841 2913318 2884708 2884429 2852095 2887380 2961001
3961 2961001 3057911 2973594 2866077 2870246 2973331 3152886 3235029 3337035 3228866 3347476
3951 3347476 3522547 3517987 3443334 3431442 3310275 3231876 3197141 3148670 2927687 2907506 2944558
3940 2944558 2774117 2902561 2953261 3064970 2897714 2986777 2978473 3087462 3171590 3130131 3152805
3929 3152805 3334895 3572412 3536354 3362817 3146877 2959884 2909117 2794023 2788755 2784475 2599786
3918 2599786 2671909 2819174 2798600 2831504 2705668 2601696 2664842 2799013 2938346 2928485 2920378
3907 2920378 3012198 2851405 2841771 2821472 2771636 2797959 2784225 2684917 2766610 2695952 2781285
$$ packed form
3983C386555P3242N7786L2811m0120M4686P1325k42392J6240j40931J27417j99526
3972C187093j02036j14913M7898Q8497n6698j36523k8610k79l2334L5285P3621
3961B961001R6910q4317j07517M169J03085J79555Q2143J02006j08169J18610
3951C347476J75071m560p4653j1892j21167p8399l4735m8471k20983k0181L7052
3940B944558j70441J28444N0700J11709j67256Q9063q304J08989Q4128m1459K2674
3929C152805J82090K37517l6058j73537k15940j86993n0767j15094n268m280j84689
3918B599786P2123J47265k0574L2904j25836j03972O3146J34171J39333r861q107
3907B920378R1820j60793r634k0299m9836K6323j3734r9308Q1693p0658Q5333
$$ plain form
3896 2781285 2856173 2952793 3101963 3070192 2943220 2997150 3016693 3094117 2951461 3007286 2971500
3885 2971500 2868733 3070998 2928979 2966616 2855247 2840953 2788417 2768024 2748146 2885247
3875 2885247 2898038 2885201 2901391 2873247 2911546 3080213 3123403 3232041 3231301 3290803 3376132
3864 3376132 3560938 3884587 4123221 4215673 4311802 4486623 4864427 5160603 5472032 5777991
3854 5777991 6172669 6686087 7268760 7846886 8155731 7808473 7233019 6801314 6158305 5874880
3844 5874880 5548301 5194920 4957920 4644033 4296483 4229941 4129393 3913791 3901853 3957226
3834 3957226 3851936 3631532 3615144 3643293 3729809 3816501 3827617 3719832 3784768 4001153 4022998
3823 4022998 3906411 3889901 4057365 4262647 4273319 4224696 4285414 4207031 4302192 4131287 4046974
$$ packed form
3896B781285P4888R6620J49170l1771j26972N3930J9543P7424j42656N5825l5786
3885B971500j02767K02265j42019L7637j11369j4294n2536k0393j9878J37101
3875B885247J2791j2837J6190k8144L8299J68667M3190J08638p40N9502Q5329
3864C376132J84806L23649K38634R2452R6129J74821L77804K96176L11429L05959
3854E777991L94678N13418N82673N78126L08845l47258n75454m31705o43009k83425
3844E874880l26579l53381k37000l13887l47550o6542j00548k15602j1938N5373
3834C957226j05290k20404j6388K8149Q6516Q6692J1116j07785O4936K16385K1845
3823D022998j16587j6510J67464K05282J0672m8623O0718p8383R5161j70905q4313
$$ plain form
3812 4046974 3899141 3623146 3255612 3018447 3066567 2988324 2910888 2747363 2536845 2496556
3802 2496556 2565220 2526563 2427604 2304442 2428444 2383108 2236239 2044039 2026543 1963873 1991495
3791 1991495 2019409 1927958 1760436 1688539 1783424 1679962 1685045 1677522 1645372 1550333 1556663 1631753
3779 1631753 1626104 1655946 1731867 1696969 1483165 1410489 1463588 1445834 1404280 1405499 1274489
3768 1274489 1134560 1208917 1342494 1249679 1270026 1260072 1233361 1267370 1284723 1223816 1361531
3757 1361531 1408374 1140443 1220154 1225678 1173807 1148178 1240382 1059550 1096392 1222826 1136550
3746 1136550 1103309 1266514 1247684 1207091 1077306 1254401 1232890 1144345 1202642 998398 1100220
3735 1100220 1037796 1099388 1172476 1081799 975111 1038926 902246 1104392 1119424 1107270 1201483
$$ packed form
3812D046974j47833k75995l67534k37165M8120p8243p7436j63525k10518m0289
3802B496556O8664l8657r8959j23162J24002m5336j46869j92200j7496o2670K7622
3791A991495K7914r1451j67522p1897R4885j03462N083p523l2150r5039O330P5090
3779A631753n649K9842P5921l4898k13804p2676N3099j7754m1554J219j31010
3768A274489j39929P4357J33577r2815K0347r954k6711L4009J7353o0907J37715
3757A361531M6843k67931P9711N524n1871k5629R2204j80832L6842J26434q6276
3746A136550l3241J63205j8830m0593j29785J77095k1511q8545N8297k04244J01822
3735A100220o2424O1592P3088r0677j06688O3815j36680K02146J5032j2154R4213
$$ plain form
3724 1201483 1240639 1119944 902951 1102805 1152603 937210 853053 1042276 966751 1087884
3714 1087884 1121417 1155408 1274509 1286879 1082255 1064505 1125306 1174858 1276015 1322681 1185713
3703 1185713 1062991 1067059 1202857 1225645 1319175 1235882 1130003 1045750 917104 967771 987969
3692 987969 954676 1064778 1130699 1181370 1026184 1016524 1131111 878580 841902 910135 986794
3681 986794 931181 988441 893583 821760 815209 831683 887097 1061891 1094193 858834 840756
3670 840756 1040092 856842 899291 984953 868703 916014 1022776 1016861 884840 805959 985706
3659 985706 991563 1108454 1161316 1284721 1266645 1224082 1324911 1388875 1263484 1295001 1423697
3648 1423697 1407757 1456082 1375554 1352269 1226086 1208338 1287879 1313898 1157908 1064699 925703
$$ packed form
3724A201483L9156j20695k16993J99854M9798k15393q4157J89223p5525J21133
3714A087884L3533L3991J19101J2370k04624j7750O0801M9552J01157M6666j36968
3703A185713j22722M068J35798K2788R3530q3293j05879q4253j28646N0667K0198
3692I87969l3293J10102O5921N0671j55186r660J14587k52531l6678O8233P6659
3681I86794n5613N7260r4858p1823o551J6474N5414J74794L2302k35359j8078
3670H40756J99336j83250M2449Q5662j16250M7311J06762n915j32021p8881J79747
3659I85706N857J16891N2862J23405j8076m2563J00829O3964j25391L1517J28696
3648A423697j5940M8325q0528k3285j26183j7748P9541K6019j55990r3209j38996
$$ plain form
3637 925703 1009976 1104426 973392 1021665 1106296 1119761 923006 789475 969480 996463 1081912
3626 1081912 1180896 1163007 1098628 1032485 1082775 1077842 1054474 987311 977393 1145759 1054521 986184
3614 986184 1086546 926904 819588 745075 974476 1075423 1038575 981161 912522 1002307 1022281
3603 1022281 841563 1002196 1056512 883749 918326 983105 1078873 922259 972909 890183 813282
3592 813282 839381 820160 812811 827765 944198 1033110 972445 1015930 983075 955848 1016536 1046086
3580 1046086 1079700 819909 857108 882613 825280 862673 934678 1032083 1006288 809347 866863
3569 866863 964930 921054 860084 823290 1004645 1013475 935854 895185 988923 902929 809352 883671
3557 883671 891608 887641 816064 741500 950663 896107 861155 906155 976500 793582 730622 795929
$$ packed form
3637I25703Q4273R4450j31034M8273Q4631J3465j96755j33531J80005K6983Q5449
3626A081912R8984j7889o4379o6143N0290m933k3368o7163r918J68366r1238o8337
3614I86184J00362j59642j07316p4513K29401J00947l6848n7414o8639Q9785J9974
3603A022281j80718J60633N4316j72763L4577O4779R5768j56614N0650q2726p6901
3592H13282K6099j9221p349J4954J16433Q8912o0665M3485l2855k7227O0688K9550
3580A046086L3614k59791L7199K5505n7333L7393P2005R7405k5795j96941N7516
3569H66863R8067m3876o0970l6794J81355Q830p7621m0669R3738q5994r3577P4319
3557H83671P937l967p1577p4564K09163n4556l4952M5000P0345j82918o2960O5307
$$ plain form
3545 795929 664787 732835 690842 569273 618474 722273 714861 568726 595333 703164 618386
3534 618386 587764 823698 726549 676939 648004 500173 671431 422451 348343 761315 792168
3523 792168 762183 610509 784838 796741 613650 782412 761421 575316 738778 804534
3513 804534 646990 748683 765093 767101 827171 713483 754753 747056 651166 760175 773669
3502 773669 618962 530888 666196 615309 676016 663155 711130 813506 853247 839747 824592
3491 824592 853545 861133 737108 597200 569278 743436 769032 720487 723138 616477 553704
3480 553704 512726 649616 717487 803454 988214 863416 794834 808110 791632 832746 780956
3469 780956 811677 932513 854280 761721 706633 662074 664810 829593 773494 852589 761896
$$ packed form
3545G95929j31142O8048m1993j21569M9201J03799p412j46135K6607J07831q4778
3534F18386l0622K35934r7149m9610k8935j47831J71258k48980p4108M12972L0853
3523G92168k9985j51674J74329J1903j83091J68762k0991j86105J63462O5756
3513H04534j57544J01693J6410K008O0070j13688M1270p697r5890J09009J3494
3502G73669j54707q8074J35308n0887O0707j2861M7975J02376L9741j3500j5155
3491H24592K8953P588j24025j39908k7922J74158K5596m8545K651j06661o2773
3480E53704m0978J36890O7871Q5967J84760j24798o8582J3276j6478M1114n1790
3469G80956L0721J20836p8233r2559n5088m4559K736J64783n6099P9095r0693
$$ plain form
3458 761896 857948 1005761 919978 685294 567492 624825 704416 695558 703609 760417 758565 749710
3446 749710 827267 806033 798780 783072 635714 578582 715868 928013 833197 1019854 988666
3435 988666 897061 928367 1009909 896816 816332 944422 880015 820529 1054294 969915 881466
3424 881466 828258 730201 885422 917391 1029585 1028960 1031576 880122 791860 803763 900927 1195534
3412 1195534 1077193 985267 1050365 820426 936527 1121908 1152392 1150413 1069365 1041021 1025703
3401 1025703 1079157 1062429 1096223 1010584 1149602 1186141 1153141 1125267 1140341 1236656 1179941
3390 1179941 1085243 1236095 1187118 1162825 1216144 1112187 1072302 1023136 1028613 949381 1065363
3379 1065363 1197857 1001558 937145 1006982 1135334 1180682 1239663 1195943 1216328 1087401 1039690
$$ packed form
3458G61896R6052J47813q5783k34684j17802N7333P9591q858Q051N6808j852q855
3446G49710P7557k1234p253j5708j47358n7132J37286K12145r4816J86657l1188
3435I88666r1605L1306Q1542j13093q0484J28090o4407n9486K33765q4379q8449
3424H81466n3208r8057J55221L1969J12194o25K616j51454q8262J1903R7164K94607
3412A195534j18341r1926O5098k29939J16101J85381L0484j979q1048k8344j5318
3401A025703N3454j6728L3794q5639J39018L6539l3000k7874J5074R6315n6715
3390A179941r4698J50852m8977k4293N3319j03957l9885m9166N477p9232J15982
3379A065363J32494j96299o4413O9837J28352M5348N8981m3720K0385j28927m7711
$$ plain form
3368 1039690 1308963 1347866 1331972 1280030 1070585 950700 1129349 1552223 1405146 1258775
3358 1258775 1260362 1376990 1380339 1229997 1232461 1264956 1347741 1310198 1368985 1402824 1434210 1228395
3346 1228395 1183232 1062534 1146244 1380007 1249354 1352915 1241435 1095942 987138 1048266
3336 1048266 1112862 1092238 1158884 1173174 1125161 1217130 1183322 1230733 1333372 1275528 1247330
3325 1247330 1213421 1220896 1235379 1140689 1022052 1257643 1236547 1356399 1335169 1359114 1314147
3314 1314147 1200093 1247445 1311842 1265553 1324302 1361989 1405388 1326677 1263315 1051126 1247730
3303 1247730 1311697 1336789 1351445 1204387 1273440 1227425 1376055 1449266 1332727 1322541 1012859
3292 1012859 1078561 1217138 1364187 1398038 1413358 1427013 1449625 1335131 1227550 1319594 1372402
$$ packed form
3368A039690K69273L8903j5894n1942k09445j19885J78649M22874j47077j46371
3358A258775J587J16628L349j50342K464L2495Q2785l7543N8787L3839L1386k05815
3346A228395m5163j20698Q3710K33763j30653J03561j11480j45493j08804O1128
3336A048266O4596k0624O6646J4290m8013R1969l3808M7411J02639n7844k8198
3325A247330l3909P475J4483r4690j18637K35591k1096J19852k1230K3945m4967
3314A314147j14054M7352O4397m6289N8749L7687M3399p8711o3362k12189J96604
3303A247730O3967K5092J4656j47058O9053m6015J48630P3211j16539j0186l09682
3292A012859O5702J38577J47049L3851J5320J3655K2612j14494j07581R2044N2808
$$ plain form
3281 1372402 1423391 1417301 1328632 1308141 1431560 1292659 1333810 1410427 1377798 1293911 1480619
3270 1480619 1465654 1434517 1375519 1381930 1321866 1411740 1425954 1294304 1429217 1609541 1679378
3259 1679378 1640547 1659692 1645009 1489116 1554570 1759527 1757534 1698556 1596757 1647559 1661923
3248 1661923 1821918 1901542 1848406 1835088 1887471 1764928 1752655 1888665 1721580 1811144 1870739
3237 1870739 1733131 1723053 1942116 1999683 1798259 1939593 2074322 1941344 1962207 1772427
3227 1772427 1854215 1693571 1679521 1739016 1717459 1967156 1931198 1798177 1927352 1754330
3217 1754330 1865975 1745281 1889043 1922520 1957815 1976026 1839759 1636461 1613697 1707784
3207 1707784 1759380 1696202 1830230 1959793 2062942 2224566 2125902 2016057 2054014 2189789
$$ packed form
3281A372402N0989o090q8669k0491J23419j38901M1151P6617l2629q3887J86708
3270A480619j4965l1137n8998O411o0064Q9874J4214j31650J34913J80324O9837
3259A679378l8831J9145j4683j55893O5454K04957j993n8978j01799N0802J4364
3248A661923J59995P9624n3136j3318N2383j22543j2273J36010j67085Q9564N9595
3237A870739j37608j0078K19063N7567k01424J41334J34729j32978K0863j89780
3227A772427Q1788j60644j4050N9495k1557K49697l5958j33021J29175j73022
3217A754330J11645j20694J43762L3477L5295J8211j36267k03298k2764R4087
3207A707784N1596o3178J34028J29563J03149J61624r8664j09845L7957J35775
$$ plain form
3197 2189789 2124062 1972823 1993976 2061859 2095140 2137938 2003774 1912846 2003389 2063147 1969734
3186 1969734 1977042 1940138 2082548 2067608 2081289 1999191 1989310 2004321 2145888 2016461 1955980
3175 1955980 2027733 2052718 1913631 1977048 2113265 1933369 2009687 2168424 2088815 2301801
3165 2301801 2112958 1905809 2094318 2342705 2277585 2228531 2242774 2127740 2048849 1979957
3155 1979957 2012125 2253237 2245840 2190685 2218443 2441926 2249865 2304638 2402768 2244422 2289771
3144 2289771 2213288 2357261 2410412 2290680 2138820 2359312 2346256 2374950 2484030 2458658
3134 2458658 2450878 2377981 2607906 2460802 2430797 2181236 2242636 2507659 2498694 2609356 2621346
3123 2621346 2759148 2670651 2740242 2957535 2919889 2909586 2954190 2940254 3005724 2979916 3024836
$$ packed form
3197B189789o5727j51239K1153O7883L3281M2798j34164r0928R0543N9758r3413
3186A969734P308l6904J42410j4940J3681q2098r881J5011J41567j29427o0481
3175A955980P1753K4985j39087O3417J36217j79896P6318J58737p9609K12986
3165B301801j88843k07149J88509K48387o5120m9054J4243j15034p8891o8892
3155A979957L2168K41112p397n5155K7758K23483j92061N4773R8130j58346M5349
3144B289771p6483J43973N3151j19732j51860K20492j3056K8694J09080k5372
3134B458658p780p2897K29925j47104l0005k49561O1400K65023q965J10662J1990
3123B621346J37802q8497O9591K17293l7646j0303M4604j3936O5470k5808M4920
$$ plain form
3112 3024836 2888499 2881119 3139631 3301531 3249183 3290944 3259462 3253747 3296642 3507635 3477470
3101 3477470 3350108 3415596 3318996 3386346 3370103 3366144 3366174 3448686 3517196 3560697 3483887 3385305
3089 3385305 3632250 3687848 3888160 3908337 3781838 4024120 3944897 3988441 4127964 4147227
3079 4147227 4194718 4405572 4477736 4429904 4517459 4478350 4514524 4623344 4826215 4791891 4918189
3068 4918189 4840803 4859282 5062359 5128534 5256875 5480386 5488180 5501979 5696142 5839494 5923271
3057 5923271 6044543 6083509 6290482 6481691 6612641 6611492 6547424 6795006 7038204 7113558
3047 7113558 7229003 7324981 7436622 7819692 7972244 8092347 8335948 8547672 8638128 8801792
3037 8801792 9039419 9227123 9432682 9575173 9764867 10099042 10167520 10492632 10726608 10748783
$$ packed form
3112C024836j36337p380K58512J61900n2348M1761l1482n715M2895K10993l0165
3101C477470j27362O5488r6600O7350j6243l959L0Q2512O8510M3501p6810r8582
3089C385305K46945N5598K00312K0177j26499K42282p9223M3544J39523J9263
3079D147227M7491K10854P2164m7832Q7555l9109L6174J08820K02871l4324J26298
3068D918189p7386J8479K03077O6175J28341K23511P794J3799J94163J43352Q3777
3057E923271J21272L8966K06973J91209J30950j149o4068K47582K43198P5354
3047G113558J15445R5978J11641L83070J52552J20103K43601K11724R0456J63664
3037H801792K37627J87704K05559J42491J89694L34175O8478L25112K33976K2175
$$ plain form
3027 10748783 10844545 11137408 11461214 11662183 11814161 11994441 12269958 12470655 12789070 13107446
3017 13107446 13390629 13449553 13799347 14228361 14528718 14749328 14965213 15397537 15785116 16305113
3007 16305113 16688412 17061819 17789288 18306543 18976467 19548679 20191669 21113102 22116120
2998 22116120 23094184 24059568 25070559 26318492 27537522 28917301 30479288 32091191
2990 32091191 33685245 35400519 37048081 38751770 40412652 41993553 43365880 44374370
2982 44374370 45004347 44973766 44194842 42913292 41219154 39317460 37594256 35932806 34335622
2973 34335622 32984226 31671105 30745339 29804521 28809714 28002326 27253792 26574908 26080606
2964 26080606 25668134 25226676 24882100 24212682 23993420 23617205 23483672 23144899 22989142
$$ packed form
3027A0748783R5762K92863L23806K00969J51978J80280K75517K00697L18415L18376
3017A3107446K83183N8924L49794M29014L00357K20610K15885M32324L87579N19997
3007A6305113L83299L73407P27469N17255O69924N72212O42990R21433J003018
2998B2116120R78064R65384J010991J247933J219030J379779J561987J611903
2990C2091191J594054J715274J647562J703689J660882J580901J372327J008490
2982D4374370O29977l0581p78924j281550j694138j901694j723204j661450j597184
2973C4335622j351396j313121r25766r40818r94807q07388p48534o78884m94302
2964B6080606m12472m41458l44576o69418k19262l76215j33533l38773j55757
$$ plain form
2955 22989142 22918980 22725035 22631258 22604147 22366333 21984551 21530049 21222902 20696181 20107420
2945 20107420 19405144 18877384 18231882 17440233 16883398 16239799 15717300 15402803 15007540
2936 15007540 14708945 14300129 13880131 13649321 13459940 13182868 13051259 12867373 12783430 12625630
2926 12625630 12633101 12733874 12905559 13228802 13413586 13587828 13661255 13670788 13441508 13238075
2916 13238075 13224082 13041254 12647534 12307637 11684905 10878323 10206392 9736411 9555153 9297162
2906 9297162 9125346 9020939 8718451 8463731 8173619 8120096 8055158 7796194 7562353 7709522
2896 7709522 7675076 7847470 7969328 7919810 7994765 8066333 8078112 8261646 8388472 8334565 8006497
2885 8006497 8266920 8085796 7955867 7892729 7591175 7183451 6805517 6506876 6331697 6296781
$$ packed form
2955B2989142p0162j93945r3777k7111k37814l81782m54502l07147n26721n88761
2945B0107420p02276n27760o45502p91649n56835o43599n22499l14497l95263
2936A5007540k98595m08816m19998k30810j89381k77072j31609j83886q3943j57800
2926A2625630P471J00773J71685L23243J84784J74242P3427R533k29280k03433
2916A3238075j3993j82828l93720l39897o22732q06582o71931m69981j81258k57991
2906I297162j71816j04407l02488k54720k90112n3523o4938k58964k33841J47169
2896G709522l4446J72394J21858m9518P4955P1568J1779J83534J26826n3907l28068
2885H006497K60423j81124j29929o3138l01554m07724l77934k98641j75179l4916
$$ plain form
2875 6296781 6034012 6044846 5895349 5772072 5669493 5550543 5402120 5313666 5361888 5241098
2865 5241098 5261992 5206771 5178277 5042696 5058839 5059000 5060596 5046991 4947582 4870378 4916910 4716620
2853 4716620 4663570 4810056 4797465 4704038 4512205 4502919 4374207 4381387 4298484 4395083 4375035
2842 4375035 4323216 4250458 4281970 4414689 4273685 4106766 4158720 4209345 4191555 4204268 4256128
2831 4256128 4265421 4025851 3896119 4300957 4156106 4010060 4040829 4167168 4020288 4013748
2821 4013748 3838785 3751532 3742348 3537936 3527543 3581421 3755877 3612571 3624621 3623785 3812432
2810 3812432 3826846 3736694 3610140 3543178 3529296 3460979 3487782 3571390 3573085 3271788 3065998
2799 3065998 3170279 3250402 3260052 3172074 3174183 3318025 3274230 3240811 3235994 3108299 3234929
$$ packed form
2875F296781k62769J0834j49497j23277j02579j18950j48423q8454M8222j20790
2865E241098K0894n5221k8494j35581J6143J61J596j3605r9409p7204M6532k00290
2853D716620n3050J46486j2591r3427j91833r286j28712P180q2903R6599k0048
2842D375035n1819p2758L1512J32719j41004j66919N1954N0625j7790J2713N1860
2831D256128R293k39570j29732M04838j44851j46046L0769J26339j46880o540
2821D013748j74963q7253r184k04412j0393N3878J74456j43306J2050q36J88647
2810C812432J4414r0152j26554o6962j3882o8317K6803Q3608J695l01297k05790
2799C065998J04281Q0123R650q7978K109J43842m3795l3419m817j27695J26630
$$ plain form
2788 3234929 3147151 3059982 3179364 2938191 2948806 2961432 2803980 2742805 2856927 2902782 2948988
2777 2948988 2983922 2914692 2685700 2457217 2491730 2725903 2679862 2740162 2851518 2636864
2767 2636864 2588820 2501610 2533150 2546681 2597527 2469739 2445745 2512251 2455562 2504414 2330075
2756 2330075 2555471 2650503 2338972 2362236 2320976 2497146 2489006 2378500 2413692 2167290 2194534
2745 2194534 2257770 2270185 2239739 2260832 2329115 2444953 2438984 2525557 2694076 2681628 2596733
2734 2596733 2579898 2626374 2367975 2399249 2532928 2509969 2569914 2571167 2593602 2749565 2758445
2723 2758445 2819243 2753309 2775239 2914986 2808616 2894174 2937753 3049839 2902116 2945761 3167259
2712 3167259 3161950 3272724 3216227 3202677 3216909 3223242 3220165 3267719 3420807 3455591 3600970
$$ packed form
2788C234929q7778q7169J19382k41173J0615J2626j57452o1175J14122M5855M6206
2777B948988L4934o9230k28992k28483L4513K34173m6041O0300J11356k14654
2767B636864m8044q7210L1540J3531N0846j27788k3994O6506n6689M8852j74339
2756B330075K25396R5032l11531K3264m1260J76170q140j10506L5192k46402K7244
2745B194534O3236J2415l0446K1093O8283J15838n969Q6573J68519j2448q4895
2734B596733j6835M6476k58399L1274J33679k2959N9945J253K2435J55963Q880
2723B758445O0798o5934K1930J39747j06370Q5558M3579J12086j47723M3645K21498
2712C167259n309J10774n6497j3550J4232O333l077M7554J53088L4784J45379
$$ plain form
2701 3600970 3626700 3677660 3794186 3644967 3820144 3762833 3793219 3938783 4035592 4103482 4294544
2690 4294544 4290078 4387120 4567259 4652709 4785216 5005811 5161570 5387973 5476474 5568517 5862263
2679 5862263 5958669 6123399 6348183 6533786 6574759 6905802 7229748 7505828 7496238 7592315
2669 7592315 7609046 7796473 7973473 8057937 8048499 8061934 8172071 8430260 8737861 8719208 8721302
2658 8721302 9059095 9229294 9395512 9541159 9800081 10179329 10557331 10886274 11406256 11685816
2648 11685816 12067669 12558894 13090396 13591339 13984370 14338940 14712623 14885189 14880688 14538521
2638 14538521 14090452 13731792 13264666 13017401 12696056 12451396 12282607 12257538 12168920 12368662
2628 12368662 12304919 12460422 12608798 12925378 13230895 13655416 13991628 14258176 14542393 14976316
$$ packed form
2701C600970K5730N0960J16526j49219J75177n7311L0386J45564R6809O7890J91062
2690D294544m466R7042J80139Q5450J32507K20595J55759K26403Q8501R2043K93746
2679E862263R6406J64730K24784J85603M0973L31043L23946K76080r590R6077
2669G592315J6731J87427J77000Q4464r438J3435J10137K58189L07601j8653K094
2658H721302L37793J70199J66218J45647K58922L79248L78002L28943N19982K79560
2648A1685816L81853M91225N31502N00943L93031L54570L73683J72566m501l42167
2638A4538521m48069l58660m67126k47265l21345k44660j68789k5069q8618J99742
2628A2368662o3743J55503J48376L16580L05517M24521L36212K66548K84217M33923
$$ plain form
2618 14976316 15228883 15582444 15594810 15818301 15899133 15759012 15433275 15055485 14828267 14454665
2608 14454665 13960993 13376909 12818916 12259351 11728112 11504164 11239104 11055200 11120546 10877569
2598 10877569 10838455 10912408 10908518 10838144 10838826 10810385 11000242 10865679 10641233 10625886 10477924
2587 10477924 10249446 9949338 9484301 9068757 8656969 8092019 7666196 7484046 7044281
2578 7044281 6734740 6529411 6212231 5992879 5852198 5469951 5273263 5111404 5070771 5027581
2568 5027581 4886104 4526213 4390185 4292625 4169112 4361382 4294719 4080468 4000548 3881256
2558 3881256 3780787 3714065 3610618 3329472 3228991 3128318 2949424 2921861 2994900 2725291
2548 2725291 2558986 2572014 2682277 2557746 2584931 2496419 2304347 2117208 1933762 2039135
$$ packed form
2618A4976316K52567L53561J2366K23491Q0832j40121l25737l77790k27218l73602
2608A4454665m93672n84084n57993n59565n31239k23948k65060j83904O5346k42977
2598A0877569l9114P3953l890p0374O82k8441J89857j34563k24446j5347j47962
2587A0477924k28478l00108m65037m15544m11788n64950m25823j82150m39765
2578G044281l09541k05329l17180k19352j40681l82247j96688j61859m0633m3190
2568E027581j41477l59891j36028r7560j23513J92270o6663k14251p9920j19292
2558C881256j00469o6722j03447k81146j00481j00673j78894k7563P3039k69609
2548B725291j66305J3028J10263j24531K7185q8512j92072j87139j83446J05373
$$ plain form
2538 2039135 2209668 2028100 1909473 2014727 2106727 2023322 1989780 1889907 1729305 1800837
2528 1800837 1670050 1808361 1785009 1685539 1719541 1611075 1488711 1450259 1460172 1413750 1481877
2517 1481877 1469704 1337828 1370267 1292726 1193892 1356230 1386186 1307576 1167901 1039718 1034076
2506 1034076 904042 990564 997569 1138606 1111683 1144777 947589 1019125 912077 884269 816525
2495 816525 1084890 1080943 821127 785810 763169 614682 597169 684914 725514 736689 737895
2484 737895 732959 777965 747456 651552 598292 622203 572293 648580 656743 628874 591197 395919
2472 395919 615395 492367 619537 587904 513456 526594 529990 455787 353592 486282 397581
2461 397581 316170 420912 361654 381312 277374 269427 282365 344403 377682 267066 274973
$$ packed form
2538B039135J70533j81568j18627J05254R2000q3405l3542r9873j60602P1532
2528A800837j30787J38311k3352r9470L4002j08466j22364l8452R913m6422O8127
2517A481877j2173j31876L2439p7541r8834J62338K9956p8610j39675j28183n642
2506A034076j30034Q6522P005J41037k6923L3094j97188P1536j07048k7808o7744
2495H16525K68365l947k59816l5317k2641j48487j7513Q7745M0600J1175J206
2484G37895m936M5006l0509r5904n3260K3911m9910P6287Q163k7869l7677j95278
2472C95919K19476j23028J27170l1633p4448J3138L396p4203j02195J32690q8701
2461C97581q1411J04742n9258J9658j03938p947J2938O2038L3279j10616P907
$$ plain form
2450 274973 294179 223272 352179 443384 277783 324649 398057 315311 189026 155002 377120
2439 377120 335979 277284 390261 298661 268661 322001 315056 151725 -25685 -16204 104593
2428 104593 271504 265796 344883 346661 254526 273218 371918 295434 62879 -51784 -29350
2417 -29350 59808 221930 282517 196402 350476 216934 172832 291080 298697 270031 179952
2406 179952 199361 338440 223495 159443 135831 190058 139696 136076 283151 355396 120605
2395 120605 175793 308818 143717 104154 92213 14769 -55040 63481 53179 102008 186907
2384 186907 438885 336012 180532 -47755 87624 279318 317323 257437 129521 22647
2374 22647 44841 47847 134793 151480 168764 255184 180945 124486 194228 261096 254018 267228
$$ packed form
2450B74973J9206p0907J28907R1205j65601M6866P3408q2746j26285l4024K22118
2439C77120m1141n8695J12977r1600l0000N3340o945j63331j77410R481J20797
2428A04593J66911n708P9087J778r2135J8692R8700p6484k32555j14663K2434
2417b9350Q9158J62122O0587q6115J54074j33542m4102J18248P617k8666r0079
2406A79952J9409J39079j14945o4052k3612N4227n0362l620J47075P2245k34791
2395A20605N5188J33025j65101l9563j1941p7444o9809J18521j0302M8829Q4899
2384A86907K51978j02873j55480k28287J35379J91694L8005n9886j27916j06874
2374B2647K2194L006Q6946J6687J7284Q6420p4239n6459O9742O6868p078J3210
$$ plain form
2362 267228 111485 60786 236611 179744 97830 264938 195324 20422 50294 177279 104803
2351 104803 138660 148259 127891 88808 169582 212414 153730 220122 134357 77104 133373 69654
2339 69654 -100606 207509 151023 111301 216414 191521 46720 126531 115684 6562 113601
2328 113601 115135 102703 55624 111335 67502 91152 135110 224877 93311 54291 74426 202940
2316 202940 137464 179460 142262 42569 315478 310995 212246 78933 56025 126446 133606 431322
2304 431322 373841 327939 189256 91054 228072 215207 201990 131312 108025 -122162 -242808
2293 -242808 25421 84090 99873 140218 -48795 -78315 -51207 88484 189233 -93204 145105
2282 145105 181291 123805 44837 16500 101637 160026 65977 -57143 18135 174882 45566
$$ packed form
2362B67228j55743n0699J75825n6867q1914J67108o9614j74902K9872J26985p2476
2351A04803L3857R599k0368l9083Q0774M2832n8684O6392q5765n7253N6269o3719
2339F9654j70260L08115n6486l9722J05113k4893j44801P9811j0847j09122J07039
2328A13601J534j2432m7079N5711m3833K3650M3958Q9767j31566l9020K0135J28514
2316B02940o5476M1996l7198r9693K72909m483r8749j33313k2908P0421P160K97716
2304D31322n7481m5902j38683r8202J37018j2865j3217p0678k3287k30187j20646
2293b42808K68229N8669J5783M0345j89013k9520K7108J39691J00749k82437K38309
2282A45105L6186n7486p8968k8337Q5137N8389r4049j23120P5278J56747j29316
$$ plain form
2271 45566 88660 31054 34225 98118 77741 96820 -4635 70860 105644 31312 7582 67436
2259 67436 28340 35333 -166415 84931 278887 104634 185598 169002 14623 -155131 -16104
2248 -16104 -134945 -165576 -23698 -30297 23611 -115416 17543 -57318 -128387 -5740 -21664
2237 -21664 -43763 -74468 -61014 36706 -62409 -96018 -145544 -128780 -143626 30178 19071 -80952
2225 -80952 57318 93967 134151 82021 20220 103061 -9353 -112120 -76293 -319467 -274444
2214 -274444 -102956 -153994 -159474 -81217 -24105 45657 8769 38214 -55624 -6918 -28483 -115716
2202 -115716 -222703 -280369 -120339 -187651 -187193 -286537 -96884 5830 35045 -14571 -106896
2191 -106896 7811 73369 -59023 -85483 33917 97449 -24606 -74622 -5565 -26655 -145971
$$ packed form
2271D5566M3094n7606L171O3893k0377J9079j01455P5495L4784p4332k3730N9854
2259F7436l9096O993k01748K51346J93956j74253Q0964j6596j54379j69754J39027
2248a6104j18841l0631J41878o599N3908j39027J32959p4861p1069J22647j5924
2237b1664k2099l0705J3454R7720r9115l3609m9526J6764j4846J73804j1107j00023
2225h0952J38270L6649M0184n2130o1801Q2841j12414j02767L5827k43174M5023
2214b74444J71488n1038n480P8257N7112O9762l6888K9445r3838M8706k1565q7233
2202a15716j06987n7666J60030o7312M58r9344J89653J02714K9215m9616r2325
2191a06896J14707O5558j32392k6460J19400O3532j22055n0016O9057k1090j19316
$$ plain form
2180 -145971 -33910 -153214 91569 77346 6039 -41140 -119766 -112959 -247749 -187725 -88715
2169 -88715 -92445 -134325 -132659 31021 -51774 97279 153256 -38497 619 124573 128553 4942
2157 4942 -13741 20945 44175 106672 -201663 -244577 -15401 213217 211389 -211261 -112897
2146 -112897 -59054 62565 76693 1025 1014 -1778 77449 172996 42875 -46958 -132088 -21839
2134 -21839 -110385 -3378 145557 53219 -138252 -92957 -105975 -34427 -4201 -100059 985
2123 985 140304 224927 290188 178795 90730 149285 227756 232174 60428 158252 150394 156836
2111 156836 104726 73074 192419 103993 221697 213786 183553 261622 108216 -19757 -130717
2100 -130717 -13063 73407 -40053 74476 -48826 54594 92808 188597 156323 27745
$$ packed form
2180a45971J12061j19304K44783j4223p1307m7179p8626O807j34790O0024R9010
2169h8715l730m1880J666J63680q2795J49053N5977j91753L9116J23954L980j23611
2157D942j8683L4686K3230O2497l08335m2914K29176K28618j828m22650R8364
2146a12897N3843J21619J4128p5668j1k792P9227R5547j30121q9833q5130J10249
2134b1839q8546J07007J48935r2338j91471M5295j3018P1548L0226r5858J01044
2123I85J39319Q4623O5261j11393q8065N8555P8471M418j71746R7824p858O442
2111A56836n2110l1652J19345q8426J17704p911l0233P8069j53406j27973j10960
2100a30717J17654Q6470j13460J14529j23302J03420L8214R5789l2274j28578
$$ plain form
2090 27745 -126954 -77766 -27128 -39242 -140821 -92775 -81712 66802 41667 116905 172970
2079 172970 60365 49261 106876 120240 33584 -13038 -61184 -8360 32502 -30550 -180667
2068 -180667 -112092 -139771 -3781 163843 76496 -68355 -25314 -91448 -141769 -65320 116427
2057 116427 -78259 -23652 -23768 -37699 66731 111028 157648 181304 81093 -63052 -13379
2046 -13379 -20142 74954 117662 87693 63430 -64724 51441 128619 140741 109539 154391 283352
2034 283352 116773 61843 224764 64009 -136694 -95068 11203 57605 -67799 -53909
2024 -53909 -60061 -108906 20745 -29083 -70646 -9919 168839 302830 113677 -2698 74435
2013 74435 190108 232707 130068 136495 145588 129608 12036 96893 21483 -153093 -118574
$$ packed form
2090B7745j54699M9188N0638j2114j01579M8046J1063J48514k5135P5238N6065
2079A72970j12605j1104N7615J3364q6656m6622m8146N2824M0862o3052j50117
2068a80667O8575k7679J35990J67624q7347j44851M3041o6134n0321P6449J81747
2057A16427j94686N4607j16j3931J04430M4297M6620K3656j00211j44145M9673
2046a3379o763R5096M2708k9969k4263j28154J16165P7178J2122l1202M4852J28961
2034B83352j66579n4930J62921j60755k00703M1626J06271M6402j25404J3890
2024e3909o152m8845J29651m9828m1563O0727J78758J33991j89153j16375P7133
2013G4435J15673M2599j02639O427R093j5980j17572Q4857p5410j74576L4519
$$ plain form
2002 -118574 -107310 -122844 19929 -154278 -27888 151024 195891 91821 -16500 24700
1992 24700 156069 253684 62343 62626 182515 163884 140323 78296 -14825 -9432 120201 -262
1980 -262 -41463 90397 -31139 -111651 -85254 -46215 52341 31168 52362 152270 140419 128222
1968 128222 6834 104780 317242 247260 107139 76752 129346 174739 176127 181707 98418
1957 98418 161530 92643 84871 92961 177693 166518 183478 139083 78821 185214 117200 109375
1945 109375 182061 33937 173633 212003 161671 151090 207762 272731 323476 186423 9519
1934 9519 151637 333918 248669 202777 301705 190511 192836 182643 159624 319195 426278
1923 426278 363031 378168 494734 426563 373805 448732 386405 486644 475368 555521 618188
$$ packed form
2002a18574J1264j5534J42773j74207J26390J78912M4867j04070j08321M1200
1992B4700J31369R7615j91341K83J19889j8631k3561o2027r3121N393J29633j20463
1980b62m1201J31860j21536q0512K6397L9039R8556k1173K1194R9908j1851j2197
1968A28222j21388R7946K12462o9982j40121l0387N2594M5393J388N580q3289
1957I8418O3112o8887p772Q090Q4732j1175J6960m4395o0262J06393o8014p825
1945A09375P2686j48124J39696L8370n0332j0581N6672O4969N0745j37053j76904
1934I519J42118J82281q5249m5892R8928j11194K325j0193k3019J59571J07083
1923D26278o3247J5137J16566o8171n2758P4927o2327J00239j1276Q0153O2667
$$ plain form
1912 618188 433910 547138 634336 594808 648777 625740 592079 635007 822793 776641 808858
1901 808858 924008 967881 1030854 941978 969117 1003980 972266 1034350 1005710 1015810 1011307 1064154
1889 1064154 1229143 1295993 1203185 1249784 1231434 1297384 1435939 1424430 1611109 1596438 1602396
1878 1602396 1627994 1595906 1830891 1950148 2038467 2076047 2143581 2212963 2167880 2339043 2488743
1867 2488743 2659403 2725931 3009032 3180964 3558958 3747372 4032560 4430275 4851834 5280942
1857 5280942 5861918 6250164 6711381 7437564 8308368 9173917 10349482 11621413 13249685
1848 13249685 15208361 17671954 20322184 23992763 29041259 34750211 36472255 30981690
1840 30981690 24085555 18903355 15192869 12634660 10683425 9308030 8412155 7585088
$$ packed form
1912F18188j84278J13228Q7198l9528N3969k3037l3661M2928J87786m6152L2217
1901H08858J15150M3873O2973q8876K7139L4863l1714O2084k8640J0100m503N2847
1889A064154J64989O6850r2808M6599j8350O5950J38555j1509J86679j4671N958
1878A602396K5598l2088K34985J19257Q8319L7580O7534O9382m5083J71163J49700
1867B488743J70660O6528K83101J71932L77994J88414K85188L97715M21559M29108
1857E280942N80976L88246M61217P26183Q70804Q65549J175565J271931J628272
1848A3249685J958676K463593K650230L670579N048496N708952J722044n490565
1840C0981690o896135n182200l710486k558209j951235j375395q95875q27067
$$ plain form
1832 7585088 7131603 6803886 6410815 5990100 5835423 5601985 5274665 4718470 4231973 3902921
1822 3902921 3603930 3390818 3202246 2912375 2750553 2744668 2661073 2351924 2196868 2099832
1812 2099832 2089814 1989508 1828266 1782539 1702056 1705367 1598240 1495512 1573577 1402576 1353496
1801 1353496 1267349 1260818 1220256 1250696 1116112 1045059 961711 905858 871130 816076 565702
1790 565702 688677 827780 739261 617823 671997 638321 620027 553324 521192 561809 551890
1779 551890 760749 497613 337324 489799 419341 349800 451770 426227 427715 366769 376512
1768 376512 372328 274748 318060 382863 379030 393346 351091 384492 401737 314655 353984 260450
1756 260450 260119 318872 269158 431371 337246 330190 335276 230278 252803 36207 -13895 253009
$$ packed form
1832G585088m53485l27717l93071m20715j54677k33438l27320n56195m86497l29052
1822C902921k98991k13112j88572k89871j61822n885q3595l09149j55056r7036
1812B099832j0018j00306j61242m5727q0483L311j07127j02728P8065j71001m9080
1801A353496q6147o531m0562L0440j34584p1053q3348n5853l4728n5054k50374
1790E65702J22975J39103q8519j21438N4174l3676j8294o6703l2132M0617r919
1779E51890K08859k63136j60289J52475p0458o9541J01970k5543J488o0946R743
1768C76512m184r7580M3312O4803l833J4316m2255L3401J7245q7082L9329r3534
1756B60450l31N8753m9714J62213r4125p056N086j04998K2525k16596n0102K66904
$$ plain form
1744 253009 247438 178974 168000 28759 80443 192388 148335 38060 18992 204275 41755
1733 41755 -59944 137250 298409 190880 295801 269616 257680 266440 282928 150268 67446
1722 67446 -42882 58962 158822 201519 118726 -121042 -97062 -63196 45252 134437 50138
1711 50138 5514 -97697 -27638 153901 176457 166044 44551 183150 136187 22366 -75312
1700 -75312 -79354 193172 140800 107287 -18336 98023 73645 61691 161262 85356 35695
1689 35695 40963 30467 -43224 -50871 -64944 4184 -49813 -95864 -94554 -128222 -14787 41459
1677 41459 47609 5000 -69301 -105332 -180295 -76073 -62309 -97546 -56040 -134167 -42259 69836
1665 69836 -35981 -127991 -15213 31641 69777 84155 65559 132849 -31707 -49555 -52043
$$ packed form
1744B53009n571o8464j0974j39241N1684J11945m4053j10275j9068J85283j62520
1733D1755j01699J97194J61159j07529J04921k6185j1936Q760J6488j32660q2822
1722F7446j10328J01844R9860M2697q2793k39768K3980L3866J08448Q9185q4299
1711E0138m4624j03211P0059J81539K2556j0413j21493J38599m6963j13821r7678
1700g5312m042K72526n2372l3513j25623J16359k4378j1954R9571p5906m9661
1689C5695N268j0496p3691p647j4073O9128n3997m6051J310l3668J13435N6246
1677D1459O150m2609p4301l6031p4963J04222J3764l5237M1506p8127R1908J12095
1665F9836j05817r2010J12778M6854L8136J4378j8596O7290j64556j7848k488
$$ plain form
1654 -52043 -41738 -52576 99074 229537 143290 8514 -56435 -191352 -202185 -197856 -77388
1643 -77388 11229 24593 27043 32989 -11159 98772 -43531 -183538 35896 -83457 -158346
1632 -158346 -149690 -73400 118352 38661 -5264 -13004 -9933 -7903 157032 48296 -39112 55636
1620 55636 60063 -45101 -63381 -93159 -18718 111039 -104051 -154184 -216682 -118878 -38460
1609 -38460 30690 68093 20387 150615 123224 -73828 -114373 -150590 -135361 -145601 -79872
1598 -79872 -122233 -80926 -116525 -238298 -132492 -176669 -63838 -96879 22938 142042 83586
1587 83586 -3344 17160 91006 83009 138313 -93652 -147339 -84481 -86497 -153973 -69903 -97752
1575 -97752 45202 77682 73949 150487 67143 26002 24435 216120 26922 44750 44435 75560
$$ packed form
1654e2043J0305j0838J51650J30463q6247j34776o4949j34917j0833M329J20468
1643g7388Q8617J3364K450N946m4148J09931j42303j40007K19434j19353p4889
1632a58346Q656P6290J91752p9691m3925p740L071K030J64935j08736q7408R4748
1620E5636M427j05164j8280k9778P4441J29757k15090n0133o2498R7804Q0418
1609c8460O9150L7403m7706J30228k7391j97052m0545l6217J5229j0240O5729
1598g9872m2361M1307l5599j21773J05806m4177J12831l3041J19817J19104n8456
1587H3586q6930K0504P3846p997N5304k31965n3687O2858k016o7476Q4070k7849
1575i7752J42954L2480l733P6538q3344m1141j567J91685j89198J7828l15L1125
$$ plain form
1563 75560 98268 -111532 -102203 -39345 -46286 21145 -119790 82102 89212 -66889 -39209 67012
1551 67012 88682 77494 201046 34435 -112657 -298234 -129134 -53734 -93120 -35807 139893
1540 139893 59588 92842 24803 103621 61548 4909 74841 -63896 -168078 -94596 -117621
1529 -117621 -148509 -114257 -120814 -85871 -137444 -107498 -138672 -157900 20464 194802 22477
1518 22477 59745 117427 81827 32925 -57490 -40986 -38683 38367 74376 49794 104681 80861
1506 80861 43418 96205 103678 55230 2995 44078 14452 -6673 -80866 -8874 31155 -791
1494 -791 -16273 18610 -104305 -124341 -56216 -80841 -131579 -152825 -20236 18071 -134715 -127327
1482 -127327 -50823 -188323 -67284 -44705 -67710 -89807 -63491 -38537 -136233 -206950 -83591
$$ packed form
1563G5560K2708k09800R329O2858o941O7431j40935K01892P110j56101K7680J06221
1551F7012K1670j1188J23552j66611j47092j85577J69100P5400l9386N7313J75700
1540A39893q0305L3254o8039P8818m2073n6639O9932j38737j04182P3482k3025
1529a17621l0888L4252o557L4943n1573K9946l1174j9228J78364J74338j72325
1518B2477L7268N7682l5600m8902r0415J6504K303P7050L6009k4582N4887k3820
1506H0861l7443N2787P473m8448n2235M1083k9626k1125p4193P1992M0029l1946
1494g91j5482L4883j22915k0036O8125k4625n0738k1246J32589L8307j52786P388
1482a27327P6504j37500J21039K2579k3005k2097K6316K4954r7696p0717J23359
$$ plain form
1471 -83591 95750 79059 34742 49559 -185619 -56574 94857 225030 113829 -8903
1461 -8903 -37411 -50426 101201 129838 19515 45805 -172468 -258664 -256832 -131676 3159
1450 3159 -137686 -30639 -146658 -150447 -39062 -135327 -165945 -222365 -243665 -56636 -1545
1439 -1545 -231314 -314971 -97289 -38996 -2348 -26986 -61906 31767 -182930 -295724 -182776
1428 -182776 -162894 -133263 42713 -62639 -199451 -109250 -30396 -77849 -130774 -94557 -27149
1417 -27149 -77986 -66957 77818 70425 33587 -95749 -103249 -25243 -43237 -100155 38705 -88736
1405 -88736 -52901 -136579 -140653 -113850 -53373 -102354 -68031 -30418 29319 -50238 -54147 -101036
1393 -101036 -19316 67483 -66143 -272741 -157393 54547 -49772 -42739 96128 107777 60906
$$ packed form
1471h3591J79341j6691m4317J4817k35178J29045J51431J30173j11201j22732
1461h903k8508j3015J51627K8637j10323K6290k18273q6196J832J25156J34835
1450C159j40845J07047j16019l789J11385r6265l0618n6420k1300J87029N5091
1439a545k29769q3657K17682N8293L6648k4638l4920R3673k14697j12794J12948
1428a82776J9882K9631J75976j05352j36812R0201P8854m7453n2925L6217O7408
1417b7149n0837J1029J44775p393l6838j29336p500P8006j7994n6918J38860j27441
1405h8736L5835q3678m074K6803O0477m8981L4323L7613N9737p9557l909m6889
1393a01036Q1720Q6799j33626k06598J15348K11940j04319P033J38867J1649m6871
$$ plain form
1382 60906 -13387 -73485 17812 -145415 -85438 -45434 -112941 -17270 6731 48910 137651 15206
1370 15206 100203 35759 29533 -18602 -50115 -74715 2847 -122955 -112441 -98733 -113098 120423
1358 120423 -156992 -282087 -249420 -181324 -66302 -12461 -48389 -147313 -33195 -83577 -76118
1347 -76118 16410 -5844 13755 37543 61403 -62172 11308 36284 -2264 90897 13355 -71731
1335 -71731 -132179 -13811 -54075 -160517 -170108 -76610 -202151 -142436 -16883 -96683 -153079
1324 -153079 -116559 6906 46221 140042 84945 210917 173616 -58713 -73984 -184772 -135934
1313 -135934 -214624 -167109 84555 250129 159927 57706 -15786 -44726 -146015 -67892 32802
1302 32802 103302 209535 103864 9603 -60423 -66044 -157296 -277947 -209160 -93218 -92012
$$ packed form
1382F0906p4293o0098R1297j63227N9977M0004o7507R5671K4001M2179Q8741j22445
1370A5206Q4997o4444o226m8135l1513k4600P7562j25802J0514J3708j4365K33521
1358A20423k77415j25095L2667O8096J15022N3841l5928r8924J14118n0382P459
1347g6118R2528k2254J9599K3788K3860j23575P3480K4976l8548R3161p7542q5086
1335g1731o0448J18368m0264j06442r591R3498j25541N9715J25553p9800n6396
1324a53079L6520J23465L9315R3821n5097J25972l7301k32329j5271j10788M8838
1313a35934p8690M7515K51664J65574r0202j02221p3492k8940j01289P8123J00694
1302C2802P0500J06233j05671r4261p0026n621r1252j20651O8787J15942J206
$$ [...]
##END NTUPLES=NMR SPECTRUM
##END=
