##TITLE=1H_CG-1204-1
 CDCl3
 8 sc, 
 5.6.2024
##JCAMPDX= 6.0         $$ Bruker NMR JCAMP-DX V2.0
##DATA TYPE= NMR SPECTRUM
##DATA CLASS= NTUPLES
##ORIGIN= UXNMR, Bruker Analytische Messtechnik GmbH
##OWNER= root
$$ XWIN-NMR		Version 3.5
$$ Wed Jun  5 14:08:07 2024 Russian Standard Time (UT+4h)  she@DPX200
##.OBSERVE FREQUENCY= 200.1309
##.OBSERVE NUCLEUS= ^1H
##.ACQUISITION MODE= SIMULTANEOUS
##.ACQUISITION SCHEME= undefined
##.AVERAGES= 8
##.DIGITISER RES= 18
##SPECTROMETER/DATA SYSTEM= spect
##.PULSE SEQUENCE= zg30
##.SOLVENT NAME= CDCl3
##.SHIFT REFERENCE= (INTERNAL, CDCl3, 0, 16.0081)
##AUDIT TRAIL= $$ (NUMBER, WHEN, WHO, WHERE, WHAT)
$$ ##TITLE= Audit trail, XWIN-NMR		Version 3.5
$$ ##JCAMPDX= 5.01
$$ ##ORIGIN= Bruker BioSpin GmbH
$$ ##OWNER= she
$$ F:/spectra/data/she/nmr/H-F/1/pdata/1/auditp.txt
$$ ##AUDIT TRAIL=  $$ (NUMBER, WHEN, WHO, WHERE, WHAT)
(   1,<2024-06-05 14:07:04.06 +0400>,<she>,<DPX200>,
      <created by zg, POWCHK disabled, PULCHK disabled
       configuration hash MD5:
       00 E9 B6 7A A2 85 ED C7 34 08 36 98 17 FE 4E 26
       data hash MD5: 16K
       6D E0 B2 73 58 5C FF F9 48 5A 7D 2B 19 42 05 2B>)
(   2,<2024-06-05 14:07:07.98 +0400>,<she>,<DPX200>,
      <Start of raw data processing
       efp BC_mod = 2 LB = 0.24 FT_mod = 6 PKNL = 1 PHC0 = -25309.4 PHC1 = 4.98748 SI = 16K 
       data hash MD5: 16K
       4D 3A 56 87 85 F5 5D B2 9A A0 50 CC 6E EB 4C 9E>)
(   3,<2024-06-05 14:07:25.45 +0400>,<she>,<DPX200>,
      <pk PHC0 = -2.080411 PHC1 = 4.8 
       data hash MD5: 16K
       A6 D6 99 77 A4 9E 09 E0 1C 64 C4 E2 11 B2 F3 F3>)
(   4,<2024-06-05 14:07:28.89 +0400>,<she>,<DPX200>,
      <abs ABSG = 5 
       data hash MD5: 16K
       96 18 A3 20 E3 F9 89 9F 26 67 70 E7 6C 18 44 C8>)
$$ ##END=
$$ 
$$ hash MD5
$$ A6 71 E9 EB 17 7E 36 6F 22 1C BA D3 82 20 33 AC
##$RELAX= 
##$RELAX= 
##$RELAX= 
##$RELAX= 
##$RELAX= 
##$RELAX= 
$$ Bruker specific parameters
$$ --------------------------
##$DU= <F:/spectra>
##$EXPNO= 1
##$NAME= <H-F>
##$PROCNO= 1
##$TYPE= <nmr>
##$USER= <she>
##$AMP= (0..31)
100 100 100 100 100 100 100 100 100 100 100 100 100 100 100 100 100 100 
100 100 100 100 100 100 100 100 100 100 100 100 100 100 
##$AQSEQ= 0
##$AQ_mod= 1
##$AUNM= <au_zg>
##$AUTOPOS= <>
##$BF1= 200.13
##$BF2= 200.13
##$BF3= 200.13
##$BF4= 200.13
##$BF5= 200.13
##$BF6= 200.13
##$BF7= 200.13
##$BF8= 200.13
##$BYTORDA= 1
##$CFDGTYP= 0
##$CFRGTYP= 5
##$CHEMSTR= <none>
##$CNST= (0..31)
1 1 145 1 1 1 1 1 1 1 1 1 1 1 1 1 1 1 1 1 1 1 1 1 1 1 1 1 1 1 1 1 
##$CPDPRG= <>
##$CPDPRG1= <>
##$CPDPRG2= <>
##$CPDPRG3= <>
##$CPDPRG4= <mlev>
##$CPDPRG5= <mlev>
##$CPDPRG6= <mlev>
##$CPDPRG7= <mlev>
##$CPDPRG8= <mlev>
##$CPDPRGB= <>
##$CPDPRGT= <>
##$D= (0..31)
0 1.2 0 0 0 0 0 0 0 0.06 0 0.03 0 0 0 0 0.0002 0 0 0 0 0 0 0 0 0 0 0 0 
0 0 0 
##$DATE= 1717582023
##$DBL= (0..7)
120 120 120 120 120 120 120 120 
##$DBP= (0..7)
150 150 150 150 150 150 150 150 
##$DBP07= 0
##$DBPNAM0= <>
##$DBPNAM1= <>
##$DBPNAM2= <>
##$DBPNAM3= <>
##$DBPNAM4= <>
##$DBPNAM5= <>
$$ [...]
##$SUBNAM3= <"">
##$SUBNAM4= <"">
##$SUBNAM5= <"">
##$SUBNAM6= <"">
##$SUBNAM7= <"">
##$SUBNAM8= <"">
##$SUBNAM9= <"">
##$SW= 18.0517689322627
##$SWIBOX= (0..15)
0 0 2 0 0 0 0 0 0 0 0 0 0 0 0 0 
##$SW_h= 3612.71676300578
##$TD= 16384
##$TD0= 1
##$TE= 0
##$TE2= 300
##$TE3= 300
##$TEG= 300
##$TL= (0..7)
0 120 120 120 120 120 120 120 
##$TP= (0..7)
150 150 150 150 150 150 150 150 
##$TP07= 0
##$TPNAME0= <>
##$TPNAME1= <>
##$TPNAME2= <>
##$TPNAME3= <>
##$TPNAME4= <>
##$TPNAME5= <>
##$TPNAME6= <>
##$TPNAME7= <>
##$TPOAL= (0..7)
0.5 0.5 0.5 0.5 0.5 0.5 0.5 0.5 
##$TPOFFS= (0..7)
0 0 0 0 0 0 0 0 
##$TUNHIN= 0
##$TUNHOUT= 0
##$TUNXOUT= 0
##$USERA1= <user>
##$USERA2= <user>
##$USERA3= <user>
##$USERA4= <user>
##$USERA5= <user>
##$V9= 5
##$VALIST= <valist>
##$VCLIST= <CCCCCCCCCCCCCCC>
##$VD= 0
##$VDLIST= <DDDDDDDDDDDDDDD>
##$VPLIST= <PPPPPPPPPPPPPPP>
##$VTLIST= <TTTTTTTTTTTTTTT>
##$WBST= 1024
##$WBSW= 4
##$XGAIN= (0..3)
0 0 0 0 
##$XL= 0
##$YL= 0
##$YMAX_a= 709888
##$YMIN_a= -1081619
##$ZGOPTNS= <>
##$ZL1= 120
##$ZL2= 120
##$ZL3= 120
##$ZL4= 120
##$ABSF1= 16.02238
##$ABSF2= -2.029514
##$ABSG= 5
##$ABSL= 3
##$ALPHA= 0
##$AQORDER= 0
##$ASSFAC= 0
##$ASSFACI= 0
##$ASSFACX= 0
##$ASSWID= 0
##$AUNMP= <proc_1d>
##$AZFE= 0.1
##$AZFW= 0.1
##$BCFW= 0
##$BC_mod= 2
##$BYTORDP= 0
##$COROFFS= 0
##$CY= -3
##$DATMOD= 1
##$DC= 0
##$DFILT= <>
##$DTYPP= 0
##$F1P= 0
##$F2P= 0
##$FCOR= 1
##$FTSIZE= 16384
##$FT_mod= 6
##$GAMMA= 0
##$GB= 0
##$INTBC= 1
##$INTSCL= 3.70164e-10
##$ISEN= 128
##$LB= 0.24
##$LEV0= 0
##$LPBIN= 0
##$MAXI= 10000
##$MC2= 0
##$MEAN= 0
##$ME_mod= 0
##$MI= 1.114404
##$NCOEF= 0
##$NC_proc= -6
##$NLEV= 6
##$NOISF1= 3.799351
##$NOISF2= 2.8
##$NSP= 0
##$NTH_PI= 0
##$NZP= 0
##$OFFSET= 16.00805
##$PC= 1
##$PHC0= -25311.48
##$PHC1= 9.78748
##$PH_mod= 1
##$PKNL= yes
##$PPARMOD= 0
##$PSCAL= 0
##$PSIGN= 0
##$REVERSE= no
##$SF= 200.129502674345
##$SI= 16384
##$SIGF1= 3
##$SIGF2= 2
##$SINO= 5.538805
##$SIOLD= 16384
##$SREGLST= <1H.CDCl3>
##$SSB= 0
##$STSI= 16384
##$STSR= 0
##$SW_p= 3612.71676300577
##$SYMM= 0
##$S_DEV= 0
##$TDeff= 16384
##$TDoff= 0
##$TI= <>
##$TILT= no
##$TM1= 0
##$TM2= 0
##$TOPLEV= 0
##$USERP1= <user>
##$USERP2= <user>
##$USERP3= <user>
##$USERP4= <user>
##$USERP5= <user>
##$WDW= 1
##$XDIM= 16384
##$YMAX_p= 482632378
##$YMIN_p= -1228826
$$ End of Bruker specific parameters
$$ ---------------------------------
##NTUPLES= NMR SPECTRUM
##VAR_NAME=  FREQUENCY,     SPECTRUM/REAL,   SPECTRUM/IMAG
##SYMBOL=    X,             R,               I
##VAR_TYPE=  INDEPENDENT,   DEPENDENT,       DEPENDENT
##VAR_FORM=  AFFN,          ASDF,            ASDF
##VAR_DIM=   16384,         16384,           16384
##UNITS=     HZ,            ARBITRARY UNITS, ARBITRARY UNITS
##FACTOR=    0.220516191357247, 1,           1
##FIRST=     3203.68326912083, 0,            0
##LAST=      -409.033493884943, 0,           0
##MIN=       -409.033493884943, -1228826,    0
##MAX=       3203.68326912083, 482632378,    0
$$ Real data points
##PAGE= N=1
##DATA TABLE= (X++(R..R)), XYDATA
$$ [...]
$$ plain form
6894 2315325 2433884 2471303 2640169 2828120 2895637 2888282 2800422 2826171 2958837 3251552 3273372
6883 3273372 3066182 3187552 3377099 3412627 3296976 3469672 3689106 3876849 3953829 4275976
6873 4275976 4759801 5111759 5304445 5299144 5202988 5169033 4958037 4729398 4595619 4684569
6863 4684569 4957210 4870949 4730230 4267965 3998320 3704879 3440969 3106514 2944606 2598757
6853 2598757 2545095 2670281 2558735 2493894 2363928 2301816 2295482 2475924 2424310 2329356 2258967
6842 2258967 2128640 2185042 2257492 2253070 2248002 2320784 2198364 2360610 2505264 2410715 2444216
6831 2444216 2462404 2480673 2804642 2910334 2911893 3041164 3169951 3455461 3620671 4012608
6821 4012608 4371345 4800344 5212263 5305516 5293762 5067249 5000046 4910477 4939519 4921916 4986075
$$ packed form
6894B315325J18559L7419J68866J87951O7517p355q7860K5749J32666K92715K1820
6883C273372k07190J21370J89547L5528j15651J72696K19434J87743P6980L22147
6873D275976M83825L51958J92686n301r6156l3955k10996k28639j33779Q8950
6863D684569K72641q6261j40719m62265k69645k93441k63910l34455j61908l45849
6853B598757n3662J25186j11546o4841j29966o2112o334J80442n1614r4954p0389
6842B258967j30327N6402P2450m422n068P2782j22420J62246J44654r4549L3501
6831B444216J8188J8269L23969J05692J559J29271J28787K85510J65210L91937
6821D012608L58737M28999M11919R3253j1754k26513o7203q9569K9042j7603O4159
$$ plain form
6810 4986075 5062878 4910713 4593856 4285286 3833547 3288538 3004514 2634485 2534165 2437180
6800 2437180 2244996 2140386 2080417 2073285 1867836 1972740 1876849 1738364 1697090 1675428 1938115
6789 1938115 1864460 1782328 1835275 1881950 2042197 1975771 2020291 2092181 2039332 2164668 2334982
6778 2334982 2398123 2298415 2233927 2264724 2445311 2423260 2571585 2715391 2798699 2750688 2710558
6767 2710558 2922607 3248827 3468770 3576941 3627680 3759941 3871568 3988815 4517917 4736694
6757 4736694 4767822 4763705 4664541 4216673 3640628 3412179 3091128 2752098 2485820 2448630
6747 2448630 2084239 1990142 1923799 1886414 1987252 1984321 1878924 1911321 1864946 1914739 1912860
6736 1912860 1911843 1843922 1572222 1546155 1458746 1651915 1533079 1409984 1291800 1195880 1308294
$$ packed form
6810D986075P6803j52165l16857l08570m51739n45009k84024l70029j00320r6985
6800B437180j92184j04610n9969p132k05449J04904r5891j38485m1274k1662K62687
6789A938115p3655q2132N2947M6675J60247o6426M4520P1890n2849J25336J70314
6778B334982O3141r9708o4488L0797J80587k2051J48325J43806Q3308m8011m0130
6767B710558K12049L26220K19943J08171N0739J32261J11627J17247N29102K18777
6757D736694L1128m117r9164m47868n76045k28449l21051l39030k66278l7190
6747B448630l64391r4097o6343l7385J00838k931j05397L2397m6375M9793j879
6736A912860j017o7921k71700k6067q7409J93169j18836j23095j18184r5920J12414
$$ plain form
6725 1308294 1237431 1218305 1258119 1168045 909116 934454 904900 764246 761287 723236 645521
6714 645521 630677 626936 569307 481439 355317 347824 373948 509660 626690 328975 376680
6703 376680 384245 376896 382379 412827 343518 217981 247892 205563 -2208 56614 35340 34307
6691 34307 -43228 67350 200604 71677 33067 107109 -48298 44942 38761 -135405 -139467
6680 -139467 -147909 -192165 -276680 -129033 92067 68794 -44358 18657 -64723 -15494 -113642
6669 -113642 -121725 -280779 -278573 -291087 -270563 -277935 -281288 -387841 -424389 -424272 -622069 -667190
6657 -667190 -639239 -702018 -451802 -475562 -583768 -579262 -449656 -375615 -501127 -614692 -544041
6646 -544041 -522162 -720079 -727116 -655032 -584120 -604671 -742896 -839182 -783312 -501659 -615253
$$ packed form
6725A308294p0863j9126L9814r0074k58929K5338k9554j40654k959l8051p7715
6714F45521j4844l741n7629q7868j26122p493K6124J35712J17030k97715M7705
6703C76680P565p349N483L0448o9309j25537K9911m2329k07771N8822k1274j033
6691C4307p7535J10578J33254j28927l8610P4042j55407R3240o181j74166m062
6680a39467q442m4256q4515J47647K21100k3273j13152O3015q3380M9229r8148
6669a13642q083j59054K206j2514K0524p372l353j06553l6548J17j97797m5121
6657f67190K7951o2779K50216k3760j08206M506J29606P4041j25512j13565P0651
6646e44041K1879j97917p037P2084P0912k0551j38225r6286N5870K81653j13594
$$ plain form
6635 -615253 -715513 -673991 -635027 -793198 -673991 -755469 -794991 -594229 -555257 -638876 -645843
6624 -645843 -564064 -575716 -569303 -490603 -509145 -348536 -379784 -587719 -642507 -716543 -802178
6613 -802178 -907568 -866082 -772522 -655177 -704447 -739539 -571745 -689794 -610734 -763070 -833578
6602 -833578 -707137 -626085 -694675 -682638 -629632 -551911 -324234 -368078 -453269 -687346 -799662
6591 -799662 -704914 -775155 -672397 -679580 -662181 -535841 -670709 -708854 -697220 -658959 -750488
6580 -750488 -602950 -635200 -790392 -736017 -688245 -824566 -787083 -794009 -700815 -841958 -789567
6569 -789567 -787345 -747744 -692405 -663805 -692139 -643678 -709152 -611806 -629691 -713313 -830726 -771479
6557 -771479 -765754 -767089 -753195 -763889 -632452 -584360 -761592 -914428 -802583 -773037 -760362
$$ packed form
6635f15253j00260M1522L8964j58171J19207q1478l9522K00762L8972q3619o967
6624f45843Q1779j1652O413P8700j8542J60609l1248k07935n4788p4036q5635
6613h02178j05390M1486R3560J17345m9270l5092J67794j18049P9060j52336p0508
6602h33578J26441Q1052o8590J2037N3006P7721K27677m3844q5191k34077j12316
6591g99662R4748p0241J02758p183J7399J26340j34868l8145J1634L8261r1529
6580g50488J47538l2250j55192N4375M7772j36321L7483o926R3194j41143N2391
6569g89567K222L9601N5339K8600k8334M8461o5474R7346j7885q3622j17413N9247
6557g71479N725j335J3894j0694J31437M8092j77232j52836J11845K9546J2675
$$ plain form
6546 -760362 -791634 -853458 -959311 -894254 -656698 -568523 -606220 -623073 -718889 -851282 -685368
6535 -685368 -645163 -570976 -661853 -688297 -763143 -775295 -795727 -733283 -708297 -688887 -626359 -618152
6523 -618152 -719462 -670748 -613517 -641726 -726862 -824064 -700549 -739050 -558197 -655392 -676121
6512 -676121 -557043 -531287 -586472 -553398 -535116 -476106 -394293 -371204 -522466 -496334 -394273
6501 -394273 -460832 -383829 -453202 -564717 -569370 -620150 -828961 -921365 -773412 -780807 -830049
6490 -830049 -958034 -754408 -852305 -948815 -912903 -1018394 -1091975 -1075185 -1079068 -919340 -821703
6479 -821703 -939300 -944128 -791137 -811099 -840213 -830009 -795366 -765843 -954894 -933300 -993021
6468 -993021 -1108116 -895294 -879987 -822566 -925315 -941335 -851585 -927584 -992880 -968295 -888763
$$ packed form
6546g60362l1272o1824j05853O5057K37556Q8175l7697j6853r5816j32393J65914
6535f85368M0205P4187r0877k6444p4846j2152k0432O2444K4986J9410O2528Q207
6523f18152j01310M8714N7231k8209q5136r7202J23515l8501J80853r7195k0729
6512f76121J19078K5756n5185L3074J8282N9010Q1813K3089j51262K6132J02061
6501c94273o6559P7003o9373j11515m653n0780k08811r2404J47953p395m9242
6490h30049j27985K03626r7897r6510L5912j05491p3581J6790l883J59728R7637
6479h21703j17597m828J52991j9962k9114J0204L4643K9523j89051K1594n9721
6468i93021j15095K12822J5307N7421j02749j6020Q9750p5999o5296K4585P9532
$$ plain form
6457 -888763 -887475 -896231 -975557 -794626 -713142 -758951 -945492 -969523 -847574 -893268 -939213
6446 -939213 -938146 -857420 -840308 -927679 -874308 -823932 -960315 -932962 -961657 -903930 -908750 -996392
6434 -996392 -1166743 -987463 -854679 -932155 -1011854 -1093043 -899923 -990413 -1067160 -905888 -1005722
6423 -1005722 -1228826 -1099160 -1045549 -986844 -1015195 -1079613 -971764 -1085718 -950997 -881954
6413 -881954 -927146 -956604 -993193 -1022262 -1029292 -1011862 -963143 -959239 -836261 -886585 -930693 -820023
6401 -820023 -908051 -1000528 -1024694 -1043013 -931638 -654600 -663794 -813294 -1017095 -871385 -824438
6390 -824438 -867414 -776457 -840247 -1007485 -842360 -907208 -964086 -885884 -924595 -810346 -876800
6379 -876800 -952701 -902317 -995682 -1081077 -797194 -689157 -790597 -764833 -789086 -848977 -737570
$$ packed form
6457h88763J288q756p9326J80931Q1484m5809j86541k4031J21949m5694m5945
6446i39213J067Q0726J7112q7371N3371N0376j36383K7353k8695N7727m820q7642
6434i96392j70351J79280J32784p7476p9699q1189J93120r0490p6747J61272r9834
6423a005722k23104J29666N3611N8705k8351o4418J07849j13954J34721O9043
6413h81954m5192k9458l6589k9069p030J7430M8719L904J22978n0324m4108J10670
6401h20023q8028r2477k4166j8319J11375K77038r194j49500k03801J45710M6947
6390h24438m2976R0957o3790j67238J65125o4848n6878P8202l8711J14249o6454
6379h76800p5901N0384r3365q5395K83883J08037j01440K5764k4253n9891J11407
$$ plain form
6368 -737570 -733627 -855170 -855313 -932262 -880028 -921480 -878482 -832365 -864416 -1035413 -937440 -963717
6356 -963717 -863370 -764541 -619364 -762087 -897184 -752915 -714770 -614710 -802192 -595579
6346 -595579 -611934 -748255 -803341 -716567 -561345 -568625 -474061 -567937 -722125 -728416 -631674
6335 -631674 -604630 -782971 -824215 -929962 -925615 -901091 -856242 -792836 -880809 -798652 -775372
6324 -775372 -912431 -911191 -838048 -919019 -947037 -1086036 -999037 -930541 -960954 -973410 -858526
6313 -858526 -850226 -919443 -862167 -813320 -873475 -866156 -695493 -912702 -932483 -768870 -798253
6302 -798253 -827170 -870392 -947413 -860218 -774613 -707970 -788061 -927806 -876438 -902447 -954299
6291 -954299 -860538 -701167 -880563 -904987 -819576 -715202 -642261 -737936 -701103 -822255 -960981
$$ packed form
6368g37570L943j21543j43p6949N2234m1452M2998M6117l2051j70997R7973k6277
6356i63717J00347R8829J45177j42723j35097J44269L8145J00060j87482K06613
6346e95579j6355j36321n5086Q6774J55222p280R4564r3876j54188o291R6742
6335f31674K7044j78341m1244j05747M347K4524M4849O3406q7973Q2157K3280
6324g75372j37059J240P3143q0971k8018j38999Q6999O8496l0413j2456J14884
6313h58526Q300o9217N7276M8847o0155P319J70663k17209j9781J63613k9383
6302g98253k8917m3222p7021Q7195Q5605O6643q0091j39745N1368k6009n1852
6291i54299R3761J59371j79396k4424Q5411J04374P2941r5675L6833j21152j38726
$$ plain form
6280 -960981 -847203 -746831 -757720 -754205 -768282 -886019 -931443 -833590 -845014 -853164 -1009404
6269 -1009404 -909346 -944018 -970109 -1072142 -821442 -633243 -742602 -774776 -749081 -828954
6259 -828954 -879523 -771229 -818045 -759764 -805399 -747185 -744194 -702236 -665332 -753820 -554042
6248 -554042 -553753 -607253 -566676 -601663 -704772 -653048 -736435 -643282 -543107 -810679 -888599
6237 -888599 -829251 -804715 -846654 -739332 -739554 -687420 -636038 -776340 -704412 -638937 -530074
6226 -530074 -461527 -517263 -746807 -614378 -543300 -616710 -629317 -660142 -571902 -542603 -595025
6215 -595025 -728679 -681171 -674567 -452240 -499984 -350922 -363114 -448659 -438435 -662403 -532503
6204 -532503 -492975 -508649 -447151 -327041 -213328 -224636 -169379 -305855 -442297 -416406 -456551
$$ packed form
6280i60981J13778J00372j0889L515j4077j17737m5424R7853j1424q150j56240
6269a009404J00058l4672k6091j02033K50700J88199j09359l2174K5695p9873
6259h28954n0569J08294m6816N8281m5635N8214K991M1958L6904q8488J99778
6248e54042K89n3500M0577l4987j03109N1724q3387R3153J00175k67572p7920
6237h88599N9348K4536m1939J07322k22N2134N1382j40302P1928O5475J08863
6226e30074O8547n5736k29544J32429P1078p3410j2607l0825Q8240K9299n2422
6215e95025j33654M7508O604K22327m7744J49062j2192q5545J0224k23968J29900
6204e32503L9528j5674O1498J20110J13713j1308N5257j36476j36442K5891m0145
$$ plain form
6193 -456551 -438259 -264885 -454032 -293345 -474046 -342565 -259698 -491188 -387320 -296391
6183 -296391 -402598 -446070 -339786 -537607 -406567 -343567 -553034 -579489 -624979 -628990 -325321
6172 -325321 -379457 -643792 -591050 -691797 -590582 -421257 -579153 -674764 -726900 -663278 -647731
6161 -647731 -524570 -388403 -455282 -569120 -588066 -405849 -403631 -394473 -525975 -452089 -452651
6150 -452651 -622499 -645670 -777401 -758696 -676273 -617431 -602504 -637875 -687087 -622810 -545066
6139 -545066 -352509 -532715 -521863 -557694 -572660 -722533 -547556 -388457 -366982 -235380
6129 -235380 -342827 -461492 -379032 -329878 -377103 -522382 -540601 -378875 -405182 -377870 -613863
6118 -613863 -584954 -468337 -318501 -227222 -445418 -493503 -462469 -340382 -173801 -245449 -216523
$$ packed form
6193d56551J8292J73374j89147J60687j80701J31481Q2867k31490J03868R0929
6183b96391j06207m3472J06284j97821J31040O3000k09467k6455m5490m011L03669
6172c25321n4136k64335N2742j00747J01215J69325j57896r5611n2136O3622J5547
6161f47731J23161J36167o6879j13838j8946J82217K218R158j31502P3886n62
6150d52651j69848k3171j31731J8705Q2423N8842J4927l5371m9212O4277P7744
6139e45066J92557j80206J0852l5831j4966j49873J74977J59099K1475J31602
6129b35380j07447j18665Q2460M9154m7225j45279j8219J61726k6307K7312k35993
6118f13863K8909J16617J49836R1279k18196m8085L1034J22087J66581p1648K8926
$$ plain form
6107 -216523 -236611 -249843 -84591 -326033 -256944 -112584 -119163 -95432 -137469 22111 -9241
6096 -9241 -18746 -13734 -70278 11374 237960 227728 83613 -64812 63213 85806 93140 351105
6084 351105 409480 422487 495264 508542 430568 397896 606575 580949 640999 1074081 1104201
6073 1104201 1086206 1115434 1145879 808874 687045 674231 769725 778351 487845 249625 286092
6062 286092 228372 187525 410628 257627 134823 -69597 9292 101420 -101874 8703
6052 8703 71690 280 -29700 45020 -195234 -228090 -662 27052 -6873 14745 47369 -10292
6040 -10292 112721 6123 17891 150731 302021 251342 284982 106352 111254 164861 226743
6029 226743 139951 186572 431797 366755 382738 287844 387959 310853 197666 139223 34508
$$ packed form
6107b16523k0088j3232J65252k41442O9089J44360o579K3731m2037J59580l1352
6096i241r505N012n6544Q1652K26586j0232j44115j48425J28025K2593P334K57965
6084C51105N8375J3007P2777J3278p7974l2672K08679k5626O0050M33082L0120
6073A104201j7995K9228L0445l37005j21829j2814R5494Q626k90506k38220L6467
6062B86092n7720m0847K23103j53001j22804k04420P8889R2128k03294J10577
6052H703O2987p1410k9980P4720k40254l2856K27428K7714l3925K1618L2624n7661
6040a0292J23013j06598J1768J32840J51290n0679L3640j78630M902N3607O1882
6029B26743q6792M6621K45225o5042J5983r4894J00115p7106j13187n8443j04715
$$ plain form
6018 34508 81138 198233 158051 152871 83162 -4385 48623 92406 191209 221998 115673 216232
6006 216232 405445 497010 637783 482692 431969 476962 446994 463162 395696 449211 381101
5995 381101 381133 418434 465334 398086 221604 358562 216740 188168 141974 -80862 -94042
5984 -94042 49716 75715 159454 265943 411151 353383 294968 406175 476085 380276 375555
5973 375555 288693 492964 744275 660459 722622 716153 813721 665211 687319 781503 852654
5962 852654 800702 832300 1029410 1235068 1442158 1545868 1658921 1684648 1745019 1729097 1555367
5951 1555367 1480921 1215694 1010308 990430 952231 841464 688522 583474 543144 616405
5941 616405 668675 734527 752773 728363 508044 349983 522001 611385 453715 449317 599125
$$ packed form
6018C4508M6630J17095m0182n180o9709q7547N3008M3783R8803L0789j06325J00559
6006B16232J89213R1565J40773j55091n0723M4993k9968J6168o7466N3515o8110
5995C81101L2L7301M6900o7248j76482J36958j41822k8572m6194k22836j3180
5984i4042J43758K5999Q3739J06489J45208n7768n8415J11207O9910r5809m721
5973C75555q6862K04271K51311q3816O2163o469R7568j48510K2108R4184P1151
5962H52654n1952L1598J97110K05658K07090J03710J13053K5727O0371j5922j73730
5951A555367p4446k65227k05386j9878l8199j10767j52942j05048m0330P3261
5941F16405N2270O5852J8246k4410k20319j58061J72018Q9384j57670m398J49808
$$ plain form
5930 599125 510981 478869 494037 476729 471275 648626 674818 530801 551466 627324 641964
5919 641964 604224 573138 538390 509962 412058 402957 635909 798202 694180 760096 863522
5908 863522 894517 1063722 961063 983723 976940 930607 990325 945997 892258 1008220 1173229
5897 1173229 1066511 916275 1088523 1095890 1141168 1188325 1141929 1094334 1055636 1071094 1171832
5886 1171832 1166863 1284422 1455144 1420652 1394409 1398093 1330196 1391067 1556161 1534256 1529147
5875 1529147 1526597 1629814 1583202 1430537 1409623 1698044 1636657 1684048 1858152 1927611 1832942
5864 1832942 1762775 1927993 2064020 1942916 1905585 1977869 1910620 2072583 2196075 2246295
5854 2246295 2309021 2135974 2243805 2222650 2160075 2350997 2511902 2488642 2303930 2366631
$$ packed form
5930E99125q8144l2112J5168j7308n454J77351K6192j44017K0665P5858J4640
5919F41964l7740l1086l4748k8428r7904r101K32952J62293j04022O5916J03426
5908H63522L0995J69205j02659K2660o783m6333N9718m4328n3739J15962J65009
5897A173229j06718j50236J72248P367M5278M7157m6396m7595l8698J5458J00738
5886A171832m969J17559J70722l4492k6243L684o7897O0871J65094k1905n109
5875A529147k550J03217m6612j52665k0914K88421o1387M7391J74104O9459r4669
5864A832942p0167J65218J36027j21104l7331P2284o7249J61963J23492N0220
5854B246295O2726j73047J07831k1155o2575J90922J60905k3260j84712O2701
$$ plain form
5844 2366631 2550453 2615359 2704730 2578651 2489442 2522386 2561656 2666567 2546306 2566009 2700192
5833 2700192 2722589 2650965 2807981 2857402 2865496 2922456 2859704 2800296 2964056 3010137 3278284
5822 3278284 3432919 3454363 3407936 3544195 3563505 3540088 3602871 3557293 3562552 3726890 4013739
5811 4013739 3999188 4147978 4229047 4311643 4514699 4744692 4942723 5000590 4991505 4927814 5026221
5800 5026221 4962669 4947050 5105553 5060130 5110314 5061455 5281714 5423271 5531096 5597209 5747815
5789 5747815 5811468 5889825 6087182 6285162 6597590 6681753 6713189 6851189 6770842 6902029
5779 6902029 6828081 6867381 6988111 6934236 7006616 7030213 7033049 7104349 7056198 7101727 7270129
5768 7270129 7337840 7506228 7717911 7951002 8089290 8253760 8415786 8637619 8778706 9042142
$$ packed form
5844B366631J83822O4906Q9371j26079q9209L2944L9270J04911j20261J9703J34183
5833B700192K2397p1624J57016M9421Q094N6960o2752n9408J63760M6081K68147
5822C278284J54635K1444m6427J36259J9310k3417O2783m5578N259J64338K86849
5811D013739j4551J48790Q1069Q2596K03056K29993J98031N7867r085o3691R8407
5800E026221o3552j5619J58503m5423N0184m8859K20259J41557J07825O6113J50606
5789E747815O3653P8357J97357J97980L12428Q4163L1436J38000q0347J31187
5779F902029p3948L9300J20730n3875P2380K3597K836P1300m8151M5529J68402
5768G270129O7711J68388K11683K33091J38288J64470J62026K21833J41087K63436
$$ plain form
5758 9042142 9134964 9280400 9294020 9383505 9240193 9123471 9139029 9052122 9197560 9299088
5748 9299088 9246527 9180288 9186446 9226280 9530507 9872441 10013328 10021021 10333128 10511285 10854889
5737 10854889 10954017 11461847 11854812 12120520 12498877 12883830 13092019 12902661 12794643 12548070
5727 12548070 12479427 12402410 12121830 12114747 12271450 12389601 12547302 12625334 12947267 13161443
5717 13161443 13404958 13754385 14259550 14493351 14975443 15421528 15944815 16382068 17010946
5708 17010946 17529960 18278364 18965633 19395895 19949669 20322702 20894622 21293428 21825700
5699 21825700 22664668 23531914 24480614 25576812 26584655 27632321 28682475 29456614 30165220
5690 30165220 30775692 31387486 32267547 33398664 34354367 35300716 36093477 36471495 37052950
$$ packed form
5758I042142R2822J45436J3620Q9485j43312j16722J5558q6907J45438J01528
5748I299088n2561o6239O158L9834L04227L41934J40887P693L12107J78157L43604
5737A0854889R9128N07830L92965K65708L78357L84953K08189j89358j08018k46573
5727A2548070o8643p7017k80580p083J56703J18151J57701P8032L21933K14176
5717A3161443K43515L49427N05165K33801M82092M46085N23287M37253O28878
5708A7010946N19014P48404O87269M30262N53774L73033N71920L98806N32272
5699B1825700Q38968Q67246R48700J096198J007843J047666J050154P74139P08606
5690C0165220O10472O11794Q80061J131117R55703R46349P92761L78018N81455
$$ plain form
5681 37052950 37738249 38405103 39225569 40251370 41378030 42862826 44281487 45911312 47260922
5672 47260922 48327050 49547527 51051311 52798513 54709811 56558005 57789281 59042239
5664 59042239 60198140 61359753 62413768 63331210 63668443 63368718 62567549 61585037 60652531
5655 60652531 59484657 58346817 57052786 55726815 54536028 53563089 53081872 53142754 53663664
5646 53663664 54200939 54987841 55529767 55920458 56361534 56944539 57442293 57913406 58737283
5637 58737283 59490316 60399656 60849880 60223684 58541614 56323209 53701218 51021864 48726450
5628 48726450 46979331 45406599 44162922 43225425 42570576 42059574 41658267 41568521 41436416
5619 41436416 41430054 41696266 41455262 41085053 40591896 40084446 39718276 39385971 39101305 38753629
$$ packed form
5681C7052950O85299O66854Q20466J025801J126660J484796J418661J629825J349610
5672D7260922J066128J220477J503784J747202J911298J848194J231276J252958
5664E9042239J155901J161613J054015R17442L37233k99725q01169r82512r32506
5655F0652531j167874j137840j294031j325971j190787r72939m81217O0882N20910
5646E3663664N37275P86902N41926L90691M41076N83005M97754M71113Q23877
5637E8737283P53033R09340M50224o26196j682070k218405k621991k679354k295414
5628D8726450j747119j572732j243677r37497o54849n11002m01307q9746j32105
5619D1436416o362K66212k41004l70209m93157n07450l66170l32305k84666l47676
$$ plain form
5609 38753629 38497755 38162582 37740679 37091217 36529606 36136350 35535571 34959925 34991655 34820034
5599 34820034 34698525 34970816 35355999 35628946 35888306 36371583 36720116 37057797 37539854
5590 37539854 38152767 38608477 39110832 39512915 40128181 40892105 41572189 42312835 43029464
5581 43029464 43470861 44282141 45281287 46423117 47837302 49611169 51749371 53977311 56660280
5572 56660280 59680825 63094508 66769252 70442477 73677500 76175578 77379463 77411632
5564 77411632 76081554 73903616 71854872 69898470 68547049 67653888 67063199 67030680 67412308
5555 67412308 68183845 69461685 70948204 73157825 75710535 78512307 81794565 85725203
5547 85725203 89998156 95044907 101020827 107480428 114450772 121776480 128547575 133222222
$$ packed form
5609C8753629k55874l35173m21903o49462n61611l93256o00779n75646L1730j71621
5599C4820034j21509K72291L85183K72947K59360M83277L48533L37681M82057
5590C7539854O12913M55710N02355M02083O15266P63924O80084P40646P16629
5581D3029464M41397Q11280R99146J141830J414185J773867K138202K227940K682969
5572E6660280L020545L413683L674744L673225L235023K498078J203885L2169
5564G7411632j330078k177938k048744j956402j351421q93161n90689l2519L81628
5555F7412308P71537J277840J486519K209621K552710K801772L282258L930638
5547H5725203M272953N046751N975920O459601O970344P325708O771095M674647
$$ plain form
5539 133222222 134684244 132044863 125430053 116470468 107575717 99463089 92807273 87416916
5531 87416916 82930656 79554761 77010370 74691324 73040613 71617274 70536247 69797359
5523 69797359 69354617 69418009 70055750 71248577 72815943 74728420 76900735 79218745 81560534
5514 81560534 83210470 83657636 82179190 78841795 74420299 69105759 64071009 59291154
5506 59291154 54910296 51197178 48130643 45329282 42852742 40653685 38563785 36578989
5498 36578989 34840467 33193515 31387995 29841603 28722174 27457446 26191579 25453194
5490 25453194 24587280 23769356 22819977 22226628 21649284 21081726 20651326 20074099 19690766
5481 19690766 19275628 18930517 18460913 18129290 17816575 17514295 17187039 16882816 16513193
$$ packed form
5539A33222222J462022k639381o614810q959585q894751q112628o655816n390357
5531H7416916m486260l375895k544391k319046j650711j423339j081027p38888
5523F9797359m42742O3392O37741J192827J567366J912477K172315K318010K341789
5514H1560534J649936M47166j478446l337395m421496n314540n034750m779855
5506E9291154m380858l713118l066535k801361k476540k199057k089900j984796
5498C6578989j738522j646952j805520j546392j119429j264728j265867p38385
5490B5453194q65914q17924r49379n93349n77344n67558m30400n77227l83333
5481A9690766m15138l45111m69604l31623l12715l02280l27256l04223l69623
$$ plain form
5472 16513193 16437390 16331787 16292667 16044145 15442948 15207197 14896691 14576814 14305726 14026311
5462 14026311 13791552 13768027 13567625 13464763 13191019 12844240 12411472 12011048 11655821 11371766
5452 11371766 11167191 10874089 10817468 10754298 10651970 10654189 10602433 10525513 10376896 10137848
5442 10137848 9965032 10075806 10232842 10371665 10308631 10129007 9928052 9697560 9603229 9504092
5432 9504092 9402364 9328529 9294881 9468782 9558659 9461447 9296117 9296383 9147721 8986236 8980060
5421 8980060 8782859 8854547 9000156 9190507 9301093 9162713 9290350 9449815 9321975 9262605
5411 9262605 9276412 9243852 9005549 8896390 8778329 8553325 8447085 8743282 8662071 8445605
5401 8445605 8375671 8481196 8513482 8399119 8448035 8722786 8998884 8921942 8913120 9231713 9552847
$$ packed form
5472A6513193p5803j05603l9120k48522o01197k35751l10506l19877k71088k79415
5462A4026311k34759k3525k00402j02862k73744l46779m32768m00424l55227k84055
5452A1371766k04575k93102n6621o3170j02328K219n1756p6920j48617k39048
5442A0137848j72816J10774J57036J38823o3034j79624k00955k30492r4331r9137
5432I504092j01728p3835l3648J73901Q9877r7212j65330K66j48662j61485o176
5421H980060j97201P1688J45609J90351J10586j38380J27637J59465j27840n9370
5411I262605J3807l2560k38303j09159j18061k25004j06240K96197q1211k16466
5401H445605o9934J05525L2286j14363M8916K74751K76098p6942q822L18593L21134
$$ plain form
5390 9552847 9873320 10262525 10512702 10411211 10532395 10282885 9878961 9592138 9220541 8998835
5380 8998835 8814320 8770832 8702773 8550783 8453121 8553697 8505555 8329536 8400000 8329678 8445118
5369 8445118 8534418 8662671 8548442 8636840 8783208 8745405 8742608 8826737 8940547 8949038 8842509
5358 8842509 8750725 8677455 8576372 8387459 8253082 8349624 8320779 8389120 8322017 8295610 8334222
5347 8334222 8354016 8168019 8344893 8300265 8265029 8304001 8291358 8194068 8253998 8318064 8484602
5336 8484602 8640729 8781478 8591672 8620028 8685279 8669781 8816207 9074347 9257422 9525760
5326 9525760 9665698 9649203 9862200 9945154 10141362 10174212 10377269 10429550 10514873 10873481
5316 10873481 11146735 11215471 11327596 11625320 11829594 11995600 12006865 12264669 12289374 12356418
$$ packed form
5390I552847L20473L89205K50177j01491J21184k49510m03924k86823l71597k21706
5380H998835j84515m3488o8059j51990r7662J00576m8142j76019P0464p0322J15440
5369H445118Q9300J28253j14229Q8398J46368l7803k797Q4129J13810Q491j06529
5358H842509r1784p3270j01083j88913j34377R6542k8845O8341o7103k6407L8612
5347H334222J9794j85997J76874m4628l5236L8972j2643r7290N9930O4066J66538
5336H484602J56127J40749j89806K8356O5251j5498J46426K58140J83075K68338
5326I525760J39938j6495K12997Q2954J96208L2850K03057N2281Q5323L58608
5316A0873481K73254O8736J12125K97724K04274J66006J1265K57804K4705O7044
$$ plain form
5306 12356418 12552410 12717006 12662248 12892783 13175627 13179378 13246123 13359656 13707752 14005475
5296 14005475 14147383 14476196 14783464 14956057 15132504 15225873 15541294 15970854 16365330 16503807
5286 16503807 16683919 16965655 17287420 17734966 18139026 18237237 18383117 18644864 19043999 19110707
5276 19110707 19439221 19768313 20186982 20690021 21075462 21635293 22125871 22835736 23589745
5267 23589745 24287784 25177145 25975471 27076385 28381309 29578639 30725793 31968313 33565411
5258 33565411 35023596 36616334 38232801 39802076 40992648 41648158 41494571 40868561 40253918
5249 40253918 39610319 39097242 38820742 38857663 39105549 39614683 40229552 41110913 42180038
5240 42180038 43464312 44946236 46476492 48012706 49720098 51571577 53877102 56072659
$$ packed form
5306A2356418J95992J64596n4758K30535K82844L751O6745J13533L48096K97723
5296A4005475J41908L28813L07268J72593J76447R3369L15421M29560L94476J38477
5286A6503807J80112K81736L21765M47546M04060R8211J45880K61747L99135O6708
5276A9110707L28514L29092M18669N03039L85441N59831M90578P09865P54009
5267B3589745O98039Q89361P98326J100914J304924J197330J147154J242520J597098
5258C3565411J458185J592738J616467J569275J190572O55510j53587o26010o14643
5249D0253918o43599n13077k76500L6921K47886N09134O14869Q81361J069125
5240D2180038J284274J481924J530256J536214J707392J851479K305525K195557
$$ plain form
5232 56072659 58465037 61001418 63437596 65372367 66462003 66464590 65342247 63436605 61283485
5223 61283485 59445053 57932324 56731155 56127701 55730040 55755259 56098775 56638475 57268925
5214 57268925 58161415 59280190 60341872 61350711 62686272 64277472 65903052 67590221
5206 67590221 69335516 71265109 73167216 74895760 76665991 77906109 78924280 79705939
5198 79705939 80403333 81151089 82130817 83837010 85659430 87814604 90307169 93277959 96753037
5189 96753037 100811996 105046346 109574466 114119850 119116267 124297439 129784942 135588264
5181 135588264 142001380 148231886 154680533 161414724 168602330 176624593 185749279 195848841
5173 195848841 206437741 217248733 227827929 238063919 248290326 257841011 266998042
$$ packed form
5232E6072659K392378K536381K436178J934771J089636K587j122343j905642k153120
5223F1283485j838432j512729j201169o03454l97661K5219L43516N39700O30450
5214E7268925Q92490J118775J061682J008839J335561J591200J625580J687169
5206F7590221J745295J929593J902107J728544J770231J240118J018171P81659
5198G9705939O97394P47756R79728J706193J822420K155174K492565K970790L475078
5189I6753037M058959M234350M528120M545384M996417N181172N487503N803322
5181A35588264O413116O230506O448647O734191P187606Q022263R124686J0099562
5173A95848841J0588900J0810992J0579196J0235990J0226407R550685R157031
$$ plain form
5166 266998042 275649131 282866219 288239116 290394077 288180773 281617932 271620029 259607478
5158 259607478 246479646 232980315 220179116 207705995 195936828 185162801 175305217
5151 175305217 166571492 158691625 151956537 146059061 140753797 136045131 131790476 127991566
5143 127991566 124350976 120976396 117893100 115076705 112500558 110296571 108215312 106146520
5135 106146520 104204494 102170063 100267854 98370265 96594606 95157541 94074701 92880985
5127 92880985 91989134 91634989 91313964 91017827 90540091 89682085 88598946 87485621 86245161
5118 86245161 85058149 84044561 83220700 82391920 81846584 81421611 81063630 80657321 80093579
5109 80093579 79729834 78943409 78521117 78307839 78087585 77960031 77942490 78133959 78286560 78726207
$$ packed form
5166B66998042Q651089P217088N372897K154961k213304o562841r997903j2012551
5158B59607478j3127832j3499331j2801199j2473121j1769167j0774027r857584
5151A75305217q733725p879867o735088n897476n305264m708666m254655l798910
5143A27991566l640590l374580l083296k816395k576147k203987k081259k068792
5135A06146520j942026k034431j902209j897589j775659j437065j082840j193716
5127I2880985q91851l54145l21025k96137m77736q58006j083139j113325j240460
5118H6245161j187012j013588q23861q28780n45336m24973l57981m06309n63742
5109H0093579l63745p86425m22292k13278k20254j27554j7541J91469J52601M39647
$$ plain form
5099 78726207 79486644 80471473 81608230 83272521 85094862 86968702 89372512 91981407
5091 91981407 94827842 97826083 100692016 104147244 107496817 111049708 115049047 119198799
5083 119198799 123608160 128053683 131894357 134231171 134316626 132673490 129245253 125143301
5075 125143301 120938288 117426004 114717880 113160460 112662184 112984053 114170546 116065485
5067 116065485 118684272 121982217 125097961 128298994 131867346 135679617 140176591 145431441
5059 145431441 151703224 158742895 166363886 174548372 182001654 186971627 187220411 182865483
5051 182865483 175280613 165989992 156096148 146573713 138165744 130243768 123108462 117439964
5043 117439964 113076955 110417172 108874574 108276185 108637490 108758140 108193237 107039357 105738286
$$ packed form
5099G8726207P60437R84829J136757J664291J822341J873840K403810K608895
5091I1981407K846435K998241K865933L455228L349573L552891L999339M149752
5083A19198799M409361M445523L840674K336814Q5455j643136l428237m101952
5075A25143301m205013l512284k708124j557420m98276L21869J186493J894939
5067A16065485K618787L297945L115744L201033L568352L812271M496974N254850
5059A45431441O271783P039671P620991Q184486P453282M969973K48784m354928
5051A82865483p584870r290621r893844r522435q407969p921976p135306n668498
5043A17439964m363009k659783j542598n98389L61305J20650n64903j153880j301071
$$ plain form
5034 105738286 104147040 102762969 102030802 102235354 102940063 104161415 105357085 105772644 104687876
5025 104687876 102046135 98228123 93849159 88991540 84268720 79831690 75480517 71244881
5017 71244881 67361328 64015402 61085796 58502092 56328936 54220456 52399198 50943787
5009 50943787 49650044 48298132 47543215 46669561 45902190 45175624 44509703 44236750 43787877
5000 43787877 43543200 43510926 43400119 43041942 42663140 42501122 42420046 42348137 41943248 41681991
4990 41681991 41225882 40389377 39647654 38779089 38130167 37921580 37664573 37540436 37467072 37310255
4980 37310255 37250250 37246428 37526330 37767236 38113010 38583565 39229060 39940659 40683997 41792375
4970 41792375 42948343 44077774 45287315 46465771 47471974 47905923 47625451 46538770
$$ packed form
5034A05738286j591246j384071p32167K04552P04709J221352J195670M15559j084768
5025A04687876k641741l818012m378964m857619m722820m437030m351173m235636
5017G1244881l883553l345926k929606k583704k173156k108480j821258j455411
5009E0943787j293743j351912p54917q73654p67371p26566o65921k72953m48873
5000D3787877k44677l2274j10807l58177l78802j62018q1076p1909m04889k61257
4990D1681991m56109q36505p41723q68565o48922k08587k57007j24137p3364j56817
4980C7310255o0005l822K79902K40906L45774M70555O45495P11599P43338J108378
4970D1792375J155968J129431J209541J178456J006203M33949k80472j086681
$$ plain form
4962 46538770 44565510 42313238 39937846 37336217 34942045 32963717 30956942 29256385
4954 29256385 27862287 26416688 25207911 24394237 23578338 22697875 21791091 21310440 20942375
4945 20942375 20220381 19684200 19248899 18870510 18365869 17910630 17640335 17149006 16804922
4936 16804922 16698618 16408426 16153380 15954927 15960187 15891503 15842383 15543897 15399276 15336249
4926 15336249 15382020 15506644 15495493 15745550 15965611 16114048 16167551 16263130 16332558 16623713
4916 16623713 16833446 16783245 16966521 17398515 17982098 18408692 18898844 19566818 19862589 19361010
4906 19361010 18263177 17013952 15902605 14810840 14116908 13528326 12863397 12618669 12296440
4897 12296440 12318545 11907838 11507156 11428459 11234220 11027191 10811143 10814794 10724217 10568652
$$ packed form
4962D6538770j973260k252272k375392k601629k394172j978328k006775j700557
4954B9256385j394098j445599j208777q13674q15899q80463r06784m80651l68065
4945B0942375p21994n36181m35301l78389n04641m55239k70295m91329l44084
4936A6804922j06304k90192k55046j98453N260o8684m9120k98486j44621o3027
4926A5336249M5771J24624j1151K50057K20061J48437N3503R5579O9428K91155
4916A6623713K09733n0201J83276M31994N83583M26594M90152O67974K95771n01579
4906A9361010j097833j249225j111347j091765o93932n88582o64929k44728l22229
4897A2296440K2105m10707m00682p8697j94239k07029k16048L651r0577j55565
$$ plain form
4887 10568652 10203124 10124257 9979712 9941730 9730044 9659347 9877341 9585656 9337897 9454267
4877 9454267 9553326 9508754 9426523 9196977 9125889 9369975 9355781 9336948 9480356 9615238 9608642
4866 9608642 9638301 9686470 9709089 9842931 10087468 10096169 10117515 10287697 10552991 10826412 10871264
4855 10871264 10769378 10512062 10242392 10113018 9744756 9496908 9076471 8840750 8869431 8762912
4845 8762912 8653333 8619096 8543819 8582452 8658174 8657598 8657895 8828157 8950112 8984437 8911496 9226683
4833 9226683 9578045 9833676 10086345 10327090 10723552 11147748 11869511 12375731 13031277 13699640
4823 13699640 13582991 12999719 12356098 11703331 10973072 10387279 10046635 9748841 9533693
4814 9533693 9716383 9930618 9989916 10174637 10303644 10386088 10504228 10670174 10449981 10182948
$$ packed form
4887A0568652l65528p8867j44545l7982k11686p0697K17994k91685k47759J16370
4877I454267R9059m4572q2231k29546p1088K44086j4194j8833J43408J34882o596
4866I608642K9659M8169K2619J33842K44537Q701K1346J70182K65294K73421M4852
4855A0871264j01886k57316k69670j29374l68262k47848m20437k35721K8681j06519
4845H762912j09579l4237p5277L8633P5722n76K97J70262J21955L4325p2941L15187
4833I226683L51362K55631K52669K40745L96462M24196P21763N06220O55546O68363
4823A3699640j16649n83272o43621o52767p30259n85793l40644k97794k15148
4814I533693J82690K14235N9298J84721J29007Q2444J18140J65946k20193k67033
$$ plain form
4804 10182948 10052081 10212975 10169152 10115947 10091460 10124850 10363680 10766697 11298988 11757799
4794 11757799 12277817 12910534 13481607 13528365 13036168 12466490 11460049 10848683 10406707
4785 10406707 9890504 9571175 9312977 9138957 9058734 8945329 8923793 8916730 8699160 8803845
4775 8803845 8965710 8849534 8910114 8981308 8892855 9089016 9231324 9307970 9421750 9464003
4765 9464003 9607329 9907667 10218354 10771678 11324124 11441661 11533591 11268330 11102526 10616832
4755 10616832 10103053 9584137 9190278 8810908 8816671 8699492 8593084 8557579 8322697 8288449
4745 8288449 8197974 8204465 8233267 8272884 8372434 8331322 8479007 8202999 8053227 8142769 8192204
4734 8192204 8273224 8135228 8254181 8350497 8405414 8284744 8299065 8343574 8166635 8057532
$$ packed form
4804A0182948j30867J60894m3823n3205k4487L3390K38830M03017N32291M58811
4794A1757799N20018O32717N71073M6758m92197n69678j006441o11366m41976
4785A0406707n16203l19329k58198j74020q0223j13405k1536p063k17570J04685
4775H803845J61865j16176O0580P1194q8453J96161J42308P6646J13780M2253
4765I464003J43326L00338L10687N53324N52446J17537R1930k65261j65804m85694
4755A0616832n13779n18916l93859l79370N763j17179j06408l5505k34882l4248
4745H288449r0475O491K8802L9617R9550m1112J47685k76008j49772Q9542M9435
4734H192204Q1020j37996J18953R6316N4917j20670J4321M4509j76939j09103
$$ plain form
4724 8057532 8240528 8199418 8370891 8317677 8306971 8248453 8329039 8472454 8513739 8756072 8762872
4713 8762872 8638917 8506539 8609687 8679413 8686286 8571568 8469766 8574121 8648916 8675110
4703 8675110 8701562 8635700 8525084 8490756 8579491 8587617 8479696 8456107 8460194 8427400 8344401
4692 8344401 8628326 8639240 8783477 9170354 9163503 9315937 9527881 9261167 9451735 9610040
4682 9610040 9807755 9884148 9983484 10203397 10113118 10134241 10055149 9874173 9828042 9736917 9661845
4671 9661845 9715614 9622313 9523513 9545211 9495251 9378869 9291392 9452008 9500467 9427620 9402000
4660 9402000 9342734 9392759 9493122 9637284 9777298 9949273 10104615 10266529 10288875 10314197
4650 10314197 10504020 10475447 10666440 10787559 10772821 10905465 10933843 11067055 11037031 11083428
$$ packed form
4724H057532J82996m1110J71473n3214j0706n8518Q0586J43415M1285K42333O800
4713H762872j23955j32378J03148O9726O873j14718j01802J04355P4795K6194
4703H675110K6452o5862j10616l4328Q8735Q126j07921k3589M087l2794q2999
4692H344401K83925J0914J44237L86877o851J52434K11944k66714J90568J58305
4682I610040J97715P6393R9336K19913r0279K1123p9092j80976m6131r1125p5072
4671I661845N3769r3301r8800K1698m9960j16382q7477J60616M8459p2847k5620
4660I402000n9266N0025J00363J44162J40014J71975J55342J61914K2346K5322
4650A0314197J89823k8573J90993J21119j4738J32644K8378J33212l0024M6397
$$ plain form
4640 11083428 11277450 11428438 11447790 11567242 11916688 12112003 12492790 12852986 12947494 12730349
4630 12730349 12431184 12143367 12077342 12046295 12024317 11988277 11998441 12026460 12187145 12509603
4620 12509603 12457560 12513133 12665306 12660411 12612798 12640272 12482265 12539603 12677187 12848468 12913716
4609 12913716 13034874 13364709 13652688 13898555 14308243 14773686 15161031 15677304 15805456
4600 15805456 15737155 15650192 15513749 15288657 15250137 15330282 15283224 15420195 15656595 15596321
4590 15596321 15765664 15838331 16066188 16571157 16935115 17099845 17332885 17770820 18013293 18451742
4580 18451742 18970470 19318537 19898589 20531885 21194218 21649118 22300788 22699888 22750066 23068671
4570 23068671 23288924 23425935 23718970 24111134 24534978 25109746 25782240 26340242 26843032
$$ packed form
4640A1083428J94022J50988J9352J19452L49446J95315L80787L60196R4508k17145
4630A2730349k99165k87817o6025l1047k1978l6040J0164K8019J60685L22458
4620A2509603n2043N5573J52173m895m7613K7474j58007N7338J37584J71281O5248
4609A2913716J21158L29835K87979K45867M09688M65443L87345N16273J28152
4600A5805456o8301q6963j36443k25092l8520Q0145m7058J36971K36400o0274
4590A5596321J69343P2667K27857N04969L63958J64730K33040M37935K42473M38449
4580A8451742N18728L48067N80052O33296O62333M54900O51670L99100N0178L18605
4570B3068671K20253J37011K93035L92164M23844N74768O72494N58002N02790
$$ plain form
4561 26843032 27377764 27768521 28073126 28507998 28942983 29114780 29592618 30027843 30471192
4552 30471192 30884529 31443778 32098998 32875071 33577728 34273674 35049019 35957727 36612816
4543 36612816 37402294 38438164 39351724 40120987 40883535 41961507 42980377 43995029 45045797
4534 45045797 46169244 47543984 48757296 50199086 51730079 53417057 54993681 56951369
4526 56951369 58764774 60707070 62794628 65131004 67425441 69882846 72917709 76148743
4518 76148743 79774119 84260162 89237914 95012855 101553289 108895239 117249035 126693565
4510 126693565 137108650 149228559 162990628 178626730 196110303 215881447 238720815
4503 238720815 265860020 299370748 339926586 378322578 411115026 420436933 400674642
$$ packed form
4561B6843032N34732L90757L04605M34872M34985J71797M77838M35225M43349
4552C0471192M13337N59249O55220P76073P02657O95946P75345R08708O55089
4543C6612816P89478J035870R13560P69263P62548J077972J018870J014652J050768
4534D5045797J123447J374740J213312J441790J530993J686978J576624J957688
4526E6951369J813405J942296K087558K336376K294437K457405L034863L231034
4518G6148743L625376M486043M977752N774941O540434P341950Q353796R444530
4510A26693565J0415085J2119909J3762069J5636102J7483573J9771144K2839368
4503B38720815K7139205L3510728M0555838L8395992L2792448R321907j9762291
$$ plain form
4496 400674642 363968011 311514677 262057801 223492278 194911269 174515605 160195122
4489 160195122 149970845 142294000 135942832 131299093 127728679 124675775 122204119 120134686
4481 120134686 118567428 117524943 116745052 116444916 116723617 117367746 118358111 119434817 120697084
4472 120697084 122191848 124174629 126440500 129041822 132230767 135596996 139110493 143215665
4464 143215665 148202634 154005306 160900645 168589330 177339962 186988565 198056016 210548599
4456 210548599 224809739 241105938 260327888 283190623 310838630 346088268 389119787
4449 389119787 425781351 436513091 432287905 419671101 380992099 330288025 288451486
4442 288451486 256556636 232927219 215581050 203362738 193463755 185231756 178447149
$$ packed form
4496D00674642l6706631n2453334m9456876l8565523k8581009k0395664j4320483
4489A60195122j0224277p676845o351168m643739l570414l052904k471656k069433
4481A20134686j567258j042485p79891l00136K78701O44129R90365J076706J262267
4472A20697084J494764J982781K265871K601322L188945L366229L513497M105172
4464A43215665M986969N802672O895339P688685Q750632R648603J1067451J2492583
4456B10548599J4261140J6296199J9221950K2862735K7648007L5249638M3031519
4449C89119787L6661564J0731740m225186j2616804l8679002n0704074m1836539
4442B88451486l1894850k3629417j7346169j2218312r898983q231999o784607
$$ plain form
4435 178447149 172477789 167319379 163063687 158926751 155440021 152645659 150140826 148341217
4427 148341217 147285525 146631561 146208600 146174843 146309508 146271887 145948043 145408218 144800629
4418 144800629 144018796 143469876 142729203 141451325 139056474 135649677 133001079 130822801
4410 130822801 129638141 129121605 129046581 129493217 130304380 131272340 132637760 134549763 136676607
4401 136676607 138854597 141095493 143302797 145534565 148583537 151498435 153556406 153430582
4393 153430582 152471420 151965981 152371587 153687954 156141857 159717649 164199782 169596181
4385 169596181 176184207 183688989 192598600 202550183 213612057 226094096 239830522 254916109
4377 254916109 271267769 289771197 310319276 333194258 358130605 383892495 409443967
$$ packed form
4435A78447149n969360n158410m255692m136936l486730k794362k504833j799609
4427A48341217j055692o53964m22961l3757J34665l7621l23844n39825o07589
4418A44800629p81833n48920p40673j277878k394851l406797k648598k178278
4410A30822801j184660n16536p5024M46636Q11163R67960J365420J912003K126844
4401A36676607K177990K240896K207304K231768L048972K914898K057971j25824
4393A53430582r59162n05439M05606J316367K453903L575792M482133N396399
4385A69596181O588026P504782Q909611R951583J1061874J2482039J3736426J5085587
4377B54916109J6351660J8503428K0548079K2874982K4936347K5761890K5551472
$$ plain form
4370 409443967 431794532 448829164 459803032 463911008 461216309 452706818 440110673
4363 440110673 422366872 398811868 368508279 336808909 308599338 283382683 260913676
4356 260913676 240484378 222439813 206773962 192724946 180400044 169733247 159943613
4349 159943613 151511082 144224317 137565051 131709208 126525449 121634704 117000608 112721458
4341 112721458 109258991 106180818 103405411 100656430 97823433 94193927 90736251 87470376
4333 87470376 84549461 81771002 79078044 76750004 74559946 72594634 70675572 68664094
4325 68664094 66998774 65145815 63495035 62072196 60700519 59530760 58458683 57420145
4317 57420145 56445132 55474049 54460295 53461661 52698202 51922275 51009084 50253158 49669509
$$ packed form
4370D09443967K2350565J7034632J0973868M107976k694699q509491j2596145
4363D40110673j7743801k3555004l0303589l1699370k8209571k5216655k2469007
4356B60913676k0429298j8044565j5665851j4049016j2324902j0666797r789634
4349A59943613q432531p286765o659266n855843n183759m890745m634096m279150
4341A12721458l462467l078173k775407k748981k832997l629506l457676l265875
4333H7470376k920915k778459k692958k328040k190058j965312j919062k011478
4325F8664094j665320j852959j650780j422839j371677j169759j072077j038538
4317E7420145r75013r71083j013754r98634p63459p75927r13191p55926n83649
$$ plain form
4308 49669509 48978070 48301025 47723236 47267539 46928474 46178945 45395414 44822525 44325380
4299 44325380 43600869 42990878 42265599 41634815 41186886 40593018 39994562 39633357 39157250
4290 39157250 38786308 38374851 37871798 37453511 37147744 36934332 36563345 36027118 35674263
4281 35674263 35298122 34812014 34604358 34354274 34108532 33686065 33568468 33519810 33191513 33086728
4271 33086728 32850215 32563474 32442235 32283162 31974635 31759908 31749063 31966589 31983514 32048320
4261 32048320 31903654 31667564 31715018 31872647 32074366 32087626 32118907 32409023 32698514 32875558
4251 32875558 32954515 33142087 33044720 32999228 33218008 33604343 34024035 34351217 34783836 35420039
4241 35420039 35881940 36493951 37410342 38187477 38787264 39764265 40282564 40775640 41199470
$$ packed form
4308D9669509o91439o77045n77789m55697l39065p49529p83531n72889m97145
4299D4325380p24511o09991p25279o30784m47929n93868n98456l61205m76107
4290C9157250l70942m11457n03053m18287l05767k13412l70987n36227l52855
4281C5674263l76141m86108k07656k50084k45742m22467j17597m8658l28297j04785
4271C3086728k36513k86741j21239j59073l08527k14727j0845K17526J6925O4806
4261C2048320j44666k36090M7454J57629K01719J3260L1281K90116K89491J77044
4251C2875558P8957J87572r7367m5492K18780L86335M19692L27182M32619O36203
4241C5420039M61901O12011R16391P77135N99787R77001N18299M93076M23830
$$ plain form
4232 41199470 41602741 42100046 42577792 43267233 44035117 44672967 45290126 45884104 46680146
4223 46680146 47126233 47400954 47889378 48312841 48659369 49092827 49532337 50162896 50762872
4214 50762872 51366125 52219195 53069857 54097948 55328583 56526496 57642707 58958658 60381772
4205 60381772 61575748 63086699 64503606 65955650 67435787 68982724 70497209 71970542
4197 71970542 73643165 74861031 76145238 77537148 79035272 81015400 83254466 85662403
4189 85662403 88581511 91823083 95565568 99797459 104288890 109072481 114516447 120312296
4181 120312296 126852558 134138957 142407898 151865121 162650633 175040565 188894968 203779088
4173 203779088 219792439 237103979 254769196 271632056 287153414 301711088 317367984
$$ packed form
4232D1199470M03271M97305M77746O89441P67884O37850O17159N93978P96042
4223D6680146M46087K74721M88424M23463L46528M33458M39510O30559N99976
4214E0762872O03253Q53070Q50662J028091J230635J197913J116211J315951J423114
4205F0381772J193976J510951J416907J452044J480137J546937J514485J473333
4197G1970542J672623J217866J284207J391910J498124J980128K239066K407937
4189H5662403K919108L241572L742485M231891M491431M783591N443966N795849
4181A20312296O540262P286399Q268941R457223J0785512J2389932J3854403J4884120
4173B03779088J6013351J7311540J7665217J6862860J5521358J4557674J5656896
$$ plain form
4166 317367984 334531436 352569632 371341909 393007993 418752910 446950858 471732564
4159 471732564 482632378 471476435 441735142 403070512 363458620 327445693 296211159
4152 296211159 269972923 248744308 231584037 217679445 206390322 196707232 187798172
4145 187798172 178748144 169047437 159383924 150070041 141441788 133674872 126585496 119914806
4137 119914806 114030458 108940393 104262902 100075837 96349729 92749245 89354231 86153670
4129 86153670 82574482 79177320 76119501 73281066 70722913 68293371 65972164 63685976
4121 63685976 61166683 58566645 56172471 53722201 51316904 49203458 47278048 45693211
4113 45693211 44059489 42660783 41274180 40003257 38634365 37304614 36036369 35072607
$$ packed form
4166C17367984J7163452J8038196J8772277K1666084K5744917K8197948K4781706
4159D71732564J0899814j1155943k9741293l8664630l9611892l6012927l1234534
4152B96211159k6238236k1228615j7160271j3904592j1289123r683090q909060
4145A87798172r050028r700707r663513r313883q628253p766916p089376o670690
4137A19914806n884348n090065m677491m187065l726108l600484l395014l200561
4129H6153670l579188l397162l057819k838435k558153k429542k321207k286188
4121F3685976k519293k600038k394174k450270k405297k113446j925410j584837
4113D5693211j633722j398706j386603j270923j368892j329751j268245r63762
$$ plain form
4105 35072607 34187227 33196552 32314588 31559118 30883877 30044846 29290643 28756845 28218364
4096 28218364 27420932 26995261 26436894 26121598 25844575 25327596 24879717 24566309 24108915
4087 24108915 23697286 23328920 22903785 22411880 22024026 21631193 21286085 21027479 20751451
4078 20751451 20415618 20120803 19806104 19575981 19287483 18979903 18763507 18388232 18405090 18140690
4068 18140690 17980633 17868757 17674240 17669501 17546992 17413091 17249322 16954464 16795264 16607409
4058 16607409 16490864 16586910 16460428 16091660 15801295 15663723 15645850 15408068 15382692 15278734
4048 15278734 15172833 15099242 14968524 14819379 14717956 14559290 14281559 14527631 14670646 14683021
4038 14683021 14744925 14758152 14846039 14712235 14433631 14030748 13933885 13971452 14038945 13851874
$$ packed form
4105C5072607q85380r90675q81964p55470o75241q39031p54203n33798n38481
4096B8218364p97432m25671n58367l15296k77023n16979m47879l13408m57394
4087B4108915m11629l68366m25135m91905l87854l92833l45108k58606k76028
4078B0751451l35833k94815l14699k30123k88498l07580k16396l75275J6858k64400
4068A8140690j60057j11876j94517m739j22509j33901j63769k94858j59200j87855
4058A6607409j16545R6046j26482l68768k90365j37572j7873k37782k5376j03958
4048A5278734j05901p3591j30718j49145j01423j58666k77731K46072J43015J2375
4038A4683021O1904J3227Q7887j33804k78604m02883r6863L7567O7493j87071
$$ plain form
4028 13851874 13699741 13477113 13339153 13316672 13127563 12917557 12864731 12860405 12707780 12527307
4018 12527307 12275490 12129623 12087956 11981164 11935823 11784898 11688654 11692616 11693196 11764670 11736222
4007 11736222 11575677 11466203 11311156 11119955 11061768 11119387 10830262 10759192 10842380 10877720
3997 10877720 10768409 10569342 10321771 10376904 10677979 10497486 10428679 10349595 10252632 10162744
3987 10162744 10226542 10410086 10511655 10588118 10591635 10787031 10975998 10814141 10810221 10749281 10552136
3976 10552136 10343805 10439193 10562004 10623516 10747823 10850923 10886067 10973048 11352991 11656027
3966 11656027 11738102 11871574 12105578 12515292 12742113 12832634 12681897 12264540 11693109 11292950
3956 11292950 10964900 10425169 10305261 10243642 10217698 10160915 10039993 9953792 9988211 10089795
$$ packed form
4028A3851874j52133k22628j37960k2481j89109k10006n2826m326j52625j80473
4018A2527307k51817j45867m1667j06792m5341j50925r6244L962N80P1474k8448
4007A1736222j60545j09474j55047j91201n8187N7619k89125p1070Q3188L5340
3997A0877720j09311j99067k47571N5133L01075j80493o8807p9084r6963q9888
3987A0162744O3798J83544J01569P6463L517J95396J88967j61857l920o0940j97145
3976A0552136k08331R5388J22811O1512J24307J03100L5144Q6981L79943L03036
3966A1656027Q2075J33472K34004M09714K26821R0521j50737m17357n71431m00159
3956A1292950l28050n39731j19908o1619k5944n6783j20922q6201L4419J01584
$$ plain form
3946 10089795 10021247 9940612 9945432 9877241 9808295 9895662 9982081 10049167 10048205 10322286 10677326
3935 10677326 10972880 11012600 11049110 10980311 10800804 10661197 10532305 10332679 10207610 10181530
3925 10181530 10221662 10304580 10369955 10384567 10220265 10087652 10143406 10181100 9954548 9965498 10149631
3914 10149631 10342135 10440397 10883345 11317746 11294276 11166910 11474572 11773702 11894918 12435948
3904 12435948 12672106 13033581 13285904 13278182 13201589 13160805 13071660 13224458 13270431 13535121
3894 13535121 13907578 13990740 13893939 13399277 12732356 12147838 11729482 11463173 10982531 10718005
3884 10718005 10498517 10363731 10318278 10148890 10224451 10212858 10300681 10511550 10650730 10698247
3874 10698247 10834385 10985461 11208529 11356134 11471411 11638905 12022029 12077842 12074295 12158782
$$ packed form
3946A0089795o8548q0635M820o8191o8946Q7367Q6419O7086r62K74081L55040
3935A0677326K95554L9720L6510o8799j79507j39607j28892j99626j25069k6080
3925A0181530M0132Q2918O5375J4612j64302j32613N5754L7694k26552J0950J84133
3914A0149631J92504R8262M42948M34401k3470j27366L07662K99130J21216N41030
3904A2435948K36158L61475K52323p722p6593m0784q9145J52798M5973K64690
3894A3535121L72457Q3162r6801m94662o66921n84518m18356k66309m80642k64526
3884A0718005k19488j34786m5453j69388P5561j1593Q7823K10869J39180M7517
3874A0698247J36138J51076K23068J47605J15277J67494L83124N5813l547Q4487
$$ plain form
3864 12158782 12601975 13095546 13349704 13839899 14309305 14891328 15510727 16047361 16600113
3855 16600113 16771534 16586576 16542639 16580723 16741262 16837162 17070457 17544827 17864712 18161184
3845 18161184 18655115 19034836 19346126 19919531 20650831 21530491 22231687 23015055 23788751
3836 23788751 24603911 25313402 26225729 27272541 28182284 29468203 30723836 31850906 32616031
3827 32616031 32858411 32413339 31208162 29371194 27310145 25008762 23004241 21251533
3819 21251533 19665660 18270339 17071987 16051899 15002759 14139393 13396971 12691157 12047149
3810 12047149 11523128 11086090 10821619 10415729 10036440 9408589 8758249 8343628 8129647
3801 8129647 7803902 7537836 7260367 7023475 6841424 6799343 6610672 6413443 6285727 6172814
$$ packed form
3864A2158782M43193M93571K54158M90195M69406N82023O19399N36634N52752
3855A6600113J71421j84958m3937L8084J60539R5900K33295M74370L19885K96472
3845A8161184M93931L79721L11290N73405P31300Q79660P01196P83368P73696
3836B3788751Q15160P09491R12327J046812R09743J285919J255633J127070P65125
3827C2616031K42380m45072j205177j836968k061049k301383k004521j752708
3819B1251533j585873j395321j198352j020088j049140q63366p42422p05814o44008
3810A2047149n24021m37038k64471m05890l79289o27851o50340m14621k13981
3801H129647l25745k66066k77469k36892j82051m2081j88671j97229j27716j12913
$$ plain form
3791 6172814 5899127 5897713 5515029 5268409 5248362 5271600 5121989 5011147 5029544 4924832
3781 4924832 4920905 4796230 4537393 4379925 4391658 4109149 4219784 4123558 4050127 3963868 3898744
3770 3898744 3702588 3893457 3866982 3818467 3761905 3697950 3639140 3645870 3659939 3679978 3572253
3759 3572253 3407960 3307379 3548200 3762395 3446392 3544281 3506400 3623114 3511810 3463378
3749 3463378 3387272 3452084 3574510 3453741 3382532 3386150 3342981 3274195 3332743 3389034 3457322
3738 3457322 3636378 3651370 3500123 3404443 3472289 3467847 3494927 3516820 3529702 3652721 3696164
3727 3696164 3628620 3528004 3179160 3170235 3294126 3372871 3332433 3213181 3153811 3033095 3027572
3716 3027572 3119528 3179568 3045955 3122124 3047968 3024530 3032955 3123421 3037464 2960787 2865081
$$ packed form
3791F172814k73687j414l82684k46620k0047K3238j49611j10842J8397j04712
3781D924832l927j24675k58837j57468J1733k82509J10635r6226p3431q6259o5124
3770C898744j96156J90869k6475m8515n6562o3955n8810O730J4069K0039j07725
3759C572253j64293j00581K40821K14195l16003R7889l7881J16714j11304m8432
3749C463378p6106O4812J22426j20769p1209L618m3169o8786N8548N6291O8288
3738C457322J79056J4992j51247r5680O7846m442K7080K1893J2882J23019M3443
3727C696164o7544j00616l48844q925J23891P8745m0438j19252n9370j20716n523
3716C027572R1956O0040j33613P6169p4156k3438Q425R0466q5957p6677r5706
$$ plain form
3705 2865081 2973432 2984585 2977493 3008620 2955509 2975142 2977643 2869021 2891453 2922370 2760608
3694 2760608 2634673 2629206 2449557 2482759 2648249 2559716 2357940 2465849 2593562 2568213
3684 2568213 2658642 2637966 2525492 2531555 2674160 2681401 2665764 2732417 2799766 2771625 2704447
3673 2704447 2748576 2867902 2968086 2951346 3112006 3165742 3231379 3124854 3050189 2956922 2924434
3662 2924434 2956189 2937349 3060804 3154812 3243293 3345774 3060588 3055234 3241687 3182531 3113766
3651 3113766 2895826 2967780 3077061 3213597 3051020 3127515 3158514 3380960 3221481 3137113
3641 3137113 3143924 3144028 3224879 3128980 3211329 3292915 3139041 3100177 3273508 3290482 3233840 3237795
3629 3237795 3041416 3039033 3280898 3445430 3435482 3372417 3435141 3375555 3402142 3457369 3564173
$$ packed form
3705B865081J08351J1153p092L1127n3111J9633K501j08622K2432L0917j61762
3694B760608j25935n467j79649L3202J65490q8533k01776J07909J27713k5349
3684B568213R0429k0676j12474O063J42605P241j5637O6653O7349k8141o7178
3673B704447M4129J19326J00184j6740J60660N3736O5637j06525p4665r3267l2488
3662B924434L1755j8840J23455R4008Q8481J02481k85186n354J86453n9156o8765
3651C113766k17940P1954J09281J36536j62577P6495L0999K22446j59479q4368
3641C137113O811J04Q0851r5899Q2349Q1586j53874l8864J73331J6974n6642L955
3629C237795j96379k383K41865J64532r948o3065O2724n9586K6587N5227J06804
$$ plain form
3618 3564173 3450275 3673596 3689123 3630757 3562867 3528236 3507869 3519590 3661439 3825981 3746963
3607 3746963 3631150 3721108 3770285 3828718 3816699 3808819 3654548 3824563 3889582 3910287 3932778
3596 3932778 3990928 3890859 3847975 3921900 3924301 3754159 3813904 3758321 3559252 3805303 3739574
3585 3739574 3598078 3537309 3496567 3647407 3715932 3695065 3531484 3666701 3733862 3408388
3575 3408388 3265644 3297570 3350946 3142207 3106609 3255834 3347862 3252340 3175503 3194437 3129458
3564 3129458 3021988 3129783 3042092 3114157 3131102 2968451 2835600 2630936 2694380 2689082 2555905
3553 2555905 2576625 2661060 2661262 2627841 2569238 2505427 2469748 2490777 2536670 2630816 2621191 2657643
3541 2657643 2566518 2555598 2607185 2712769 2656538 2719961 2663940 2593703 2681917 2611152 2622761
$$ packed form
3618C564173j13898K23321J5527n8366o7890l4631k0367J1721J41849J64542p9018
3607C746963j15813Q9958M9177N8433j2019p880j54271J70015O5019K0705K2491
3596C932778N8150j00069m2884P3925K401j70142N9745n5583j99069K46051o5729
3585C739574j41496o0769m0742J50840O8525k0867j63581J35217O7161l25474
3575C408388j42744L1926N3376k08739l5598J49225R2028r5522p6837J8934o4979
3564C129458j07470J07795q7691P2065J6945j62651j32851k04664O3444n298j33177
3553B555905K0720Q4435K02l3421n8603o3811l5679K1029M5893R4146r625L6452
3541B657643r1125j0920N1587J05584n6231O3423n6021p0237Q8214p0765J1609
$$ plain form
3530 2622761 2725374 2977064 2978876 2769949 2840421 2916516 2919932 2832727 2899416 2872992 2757220
3519 2757220 2669731 2728646 2750547 2727383 2724142 2649271 2507282 2477557 2552242 2586104 2612295
3508 2612295 2625868 2693118 2548469 2542819 2350897 2378629 2430073 2568760 2652774 2784124 2795272
3497 2795272 2659940 2752922 2563906 2620009 2579100 2615456 2656536 2790704 2720803 2574979 2848960
3486 2848960 2850024 2865962 2865909 2755980 2761485 2824736 2706614 2640974 2733489 2912122 2828868 2906560
3474 2906560 2936582 2851165 2921139 2811065 2749908 2875498 2910207 2928037 2898738 2910579 3081337
3463 3081337 3194913 3135189 3162540 3318725 3199615 3134853 3248987 3239553 3338392 3347065 3254475
3452 3254475 3393119 3348014 3440605 3392902 3232087 3341011 3384061 3596741 3519757 3634557
$$ packed form
3530B622761J02613K51690J812k08927P0472P6095L416q7205O6689k6424j15772
3519B757220q7489N8915K1901k3164l241p4871j41989k9725P4685L3862K6191
3508B612295J3573O7250j44649n650j91922K7732N1444J38687Q4014J31350J1148
3497B795272j35332R2982j89016N6103m0909L6356M1080J34168o9901j45824K73981
3486B848960J064J5938n3j09929N505O3251j18122o5640R2515J78633q3254P7692
3474B906560L0022q5417O9974j10074o1157J25590L4709J7830k9299J1841J70758
3463C081337J13576n9724K7351J56185j19110o4762J14134r434R8839Q673r2590
3452C254475J38644m5105R2591m7703j60815J08924M3050K12680p6984J14800
$$ plain form
3442 3634557 3815504 3894804 3959133 3948422 3885938 3918499 3910032 3910311 4097773 4116176 4085617 4010535
3430 4010535 4225853 4266195 4034809 4216674 4282502 4363174 4380305 4334163 4325995 4358883 4268693
3419 4268693 4307588 4324972 4219320 4229673 4178619 4433395 4406242 4405979 4494642 4635716 4685315
3408 4685315 4478114 4605040 4743872 4721348 4639987 4620685 4679127 4580641 4563119 4519742 4614705
3397 4614705 4692336 4584579 4607857 4655540 4834470 4908078 4694708 4746504 4781723 4702841 4762903
3386 4762903 4891012 4919131 4865493 4828771 5236906 5355580 5148258 5091856 5145165 5138791 5189756
3375 5189756 5134268 5242537 5227161 5083801 5144212 4950017 5010776 5086441 5241506 5301122 5499282
3364 5499282 5390211 5163995 5083905 5033373 5057057 5099157 5066459 5215231 5226028 5072317 5297995
$$ packed form
3442C634557J80947P9300O4329j0711o2484L2561q467K79J87462J8403l0559p5082
3430D010535K15318M0342k31386J81865O5828Q0672J7131m6142q168L2888r0190
3419D268693L8895J7384j05652J0353n1054K54776k7153k63Q8663J41074M9599
3408D685315k07201J26926J38832k2524q1361j9302N8442r8486j7522m3377R4963
3397D614705P7631j07757K3278M7683J78930P3608k13370N1796L5219p8882O0062
3386D762903J28109K8119n3638l6722M08135J18674k07322n6402N3309o374N0965
3375E189756n5488J08269j5376j43360O0411j94195O0759P5665J55065N9616J98160
3364E499282j09071k26216q0090n0532K3684M2100l2698J48772J0797j53711K25678
$$ plain form
3353 5297995 5386558 5334708 5340581 5255325 5237020 5416518 5286114 5262655 5235468 5304780 5224578
3342 5224578 5358930 5418595 5505580 5530640 5333479 5341052 5384549 5494276 5546521 5596592 5623011
3331 5623011 5543763 5369815 5353933 5498799 5558005 5450189 5384801 5664104 5601365 5443663
3321 5443663 5443917 5472677 5501721 5558956 5617033 5668357 5572542 5546450 5684398 5776064 5871225 5838653
3309 5838653 5905438 5962080 6014876 5992122 6124457 6143840 6128932 6286672 6250568 6314504 6414360
3298 6414360 6249763 6250920 6249418 6421740 6364497 6311777 6349809 6463420 6490117 6471528 6406264
3287 6406264 6458811 6504454 6540365 6543776 6593972 6602970 6701751 6596347 6616139 6815883 6920465
3276 6920465 6845287 6687158 6773162 6756486 6853194 6767185 6814954 7007609 7104625 7101742 7137765
$$ packed form
3353E297995Q8563n1850N873q5256j8305J79498j30404k3459k7187O9312q0202
3342E224578J34352N9665Q6985K5060j97161P573M3497J09727N2245N0071K6419
3331E623011p9248j73948j5882J44866N9206j07816o5388K79303o2739j57702
3321E443663K54K8760K9044N7235N8077N1324r5815k6092J37948R1666R5161l2572
3309E838653O6785N6642N2796k2754J32335J9383j4908J57740l6104O3936R9856
3298F414360j64597J157j502J72322n7243n2720L8032J13611K6697j8589o5264
3287F406264N2547M5643L5911L411N0196Q998R8781j05404J9792J99744J04582
3276F920465p5178j58129Q6004j6676R6708q6009M7769J92655R7016k883L6023
$$ plain form
3265 7137765 7098576 7125586 7196488 7151416 7190892 7142940 7102074 7223822 7277091 7142491 7152657
3254 7152657 7048290 6977945 7040488 7096868 7224230 7260800 7311421 7136018 7337404 7308993 7240280
3243 7240280 7295493 7526115 7510686 7367718 7354508 7387619 7446111 7438719 7549374 7510453 7463459
3232 7463459 7633511 7709354 7587404 7528725 7619398 7582761 7439972 7462502 7533040 7545851 7419537
3221 7419537 7369053 7546603 7452747 7506634 7705396 7589564 7388758 7570040 7598184 7637942
3211 7637942 7621328 7532660 7726901 7730636 7922954 7884745 7930105 7739940 7657863 7695571 7651460
3200 7651460 7760883 7727960 7788918 7735571 7713646 7900767 7850656 7876849 7871572 7993172 7867136
3189 7867136 7668041 7807381 7848172 7937651 8058464 7989724 7987715 7933237 8067767 7995382 8074883
$$ packed form
3265G137765l9189K7010P0902m5072L9476m7952m0866J21748N3269j34600J0166
3254G152657j04367p0345O2543N6380J27362L6570N0621j75403K01386k8411o8713
3243G240280N5213K30622j5429j42968j3210L3111N8492p392J10655l8921m6994
3232G463459J70052P5843j21950n8679R0673l6637j42789K2530P0538J2811j26314
3221G419537n0484J77550r3856N3887J98762j15832k00806J81282K8144L9758
3211G637942j6614q8668J94241L735J92318l8209M5360j90165q2077L7708m4111
3200G651460J09423l2923O0958n3347k1925J87121n0111K6193n277J21600j26036
3189G867136j99095J39340M0791Q9479J20813o8740k009n4478J34530p2385P9501
$$ plain form
3178 8074883 8021869 8120818 8223811 8228883 8288304 8231279 8347966 8378337 8543900 8597013 8508931
3167 8508931 8576092 8674400 8562682 8614389 8895367 8989637 8815156 8926795 8948836 8861593 8818898
3156 8818898 8826229 9053582 9046164 8998624 9173314 9216585 9241921 9356144 9660495 9701018 9907321
3145 9907321 9991721 9985488 9919711 9937909 10102103 10253440 10339691 10386861 10533245 10542326 10567739
3134 10567739 10715199 10881448 11093896 11236937 11307045 11453759 11541487 11624941 11847418 11991717
3124 11991717 12269119 12515728 12402820 12475685 12664473 12890104 13018877 13052919 13245767 13537469
3114 13537469 13647729 13667267 13830770 14127624 14073956 14138662 14340597 14434475 14711970 14885970
3104 14885970 15121855 15433237 15583759 15650458 15834664 16206572 16477903 16556558 16786240 16967711
$$ packed form
3178H074883n3014R8949J02993N072N9421n7025J16687L0371J65563N3113q8082
3167H508931O7161R8308j11718N1707K80978R4270j74481J11639K2041q7243m2695
3156H818898P331K27353p418m7540J74690M3271K5336J14223L04351M0523K06303
3145I907321Q4400o233o5777J8198J64194J51337Q6251M7170J46384R081K5413
3134A0567739J47460J66249K12448J43041P0108J46714Q7728Q3454K22477J44299
3124A1991717K77402K46609j12908P2865J88788K25631J28773L4042J92848K91702
3114A3537469J10260J9538J63503K96854n3668O4706K01935R3878K77495J74000
3104A4885970K35885L11382J50522O6699J84206L71908K71331P8655K29682J81471
$$ plain form
3094 16967711 17319022 17552227 17724113 18071774 18334492 18672879 18788316 18947368 19581088
3085 19581088 19979914 20223178 20539577 20840886 21218285 21630270 22082069 22519809 22849723
3076 22849723 23188507 23448216 23588721 24078623 24491532 25203536 25746058 26188646 26342930
3067 26342930 26748712 27522623 28219031 28801997 29306611 29637614 29887870 30364933 30843518
3058 30843518 31229927 31744581 32398054 32863842 33303546 33830299 34216121 34879869 35657728
3049 35657728 36413924 37185660 37752296 38432011 39086713 39997281 40571940 41118348 41917054
3040 41917054 42754144 43541553 44327609 45159768 46122118 46804815 47809536 48764683 50061564
3031 50061564 51207108 52047433 52890094 53766875 54426915 55433900 56636498 57985772 59242631
$$ packed form
3094A6967711L51311K33205J71886L47661K62718L38387J15437J59052O33720
3085A9581088L98826K43264L16399L01309L77399M11985M51799M37740L29914
3076B2849723L38784K59709J40505M89902M12909P12004N42522M42588J54284
3067B6342930M05782P73911O96408N82966N04614L31003K50256M77063M78585
3058C0843518L86409N14654O53473M65788M39704N26753L85822O63748P77859
3049C5657728P56196P71736N66636O79715O54702R10568N74659N46408P98706
3040D1917054Q37090P87409P86056Q32159R62350O82697J004721R55147J296881
3031E0061564J145544Q40325Q42661Q76781O60040J006985J202598J349274J256859
$$ plain form
3022 59242631 60520338 62075079 63601541 65470305 67388672 69507102 71643801 74270606
3014 74270606 76995634 79832574 83122510 86493699 89999420 94020262 98256565 102669117
3006 102669117 107359753 112219193 117080037 122304673 127634220 133060618 138100820 142554643
2998 142554643 146485581 149131256 150151123 149352959 146536278 142404467 137089194 131074126
2990 131074126 125121516 119589020 114834325 110495642 106522553 103071586 100066766 97209058
2982 97209058 94741366 92641330 90327396 88253961 86442426 84875136 83684155 82606182
2974 82606182 81606181 80923955 80250288 79511322 78646526 77294169 75460226 73634880 71927804
2965 71927804 70328767 68708235 67130563 65610819 64208737 62787268 61416851 60174135
$$ packed form
3022E9242631J277707J554741J526462J868764J918367K118430K136699K626805
3014G4270606K725028K836940L289936L371189L505721M020842M236303M412552
3006A02669117M690636M859440M860844N224636N329547N426398N040202M453823
2998A42554643L930938K645675J019867p98164k816681m131811n315273o015068
2990A31074126n952610n532496m754695m338683l973089l450967l004820k857708
2982I7209058k467692k100036k313934k073435j811535j567290j190981j077973
2974H2606182j000001o82226o73667p38966q64796j352357j833943j825346j707076
2965G1927804j599037j620532j577672j519744j402082j421469j370417j242716
$$ plain form
2957 60174135 58720326 57595761 56386843 55238027 54204266 53334201 52612667 51629352 50919674
2948 50919674 50369146 49761317 49316277 49125068 48870212 48904518 49107135 49380968 50220565 51165950
2938 51165950 51318581 50149363 48311971 46436148 44446118 42341902 40733241 39609150
2930 39609150 38492102 37403667 36567471 35633007 34815544 34302471 33809598 33299644 32844717
2921 32844717 32440583 32087855 31805527 31590949 31466390 31180358 31110204 30826412 30767003 30661575
2911 30661575 30702984 30971043 30899199 31359157 31747566 31872419 31758631 31068652 30291522 29125242
2901 29125242 28220325 27549217 26642018 26105387 25682281 24937204 24457205 24114268 23738543
2892 23738543 23472097 23246131 22993027 22664029 22278520 22033079 21890275 21799120 21417815 21103514
$$ packed form
2957F0174135j453809j124565j208918j148816j033761q70065p21534r83315p09678
2948E0919674n50528o07829m45040j91209k54856L4306K02617K73833Q39597R45385
2938E1165950J52631j169218j837392j875823j990030k104216j608661j124091
2930C9609150j117048j088435q36196r34464q17463n13073m92873n09954m54927
2921C2844717m04134l52728k82328k14578j24559k86032p0154k83792n9409j05428
2911C0661575M1409K68059p1844M59958L88409J24853j13788o89979p77130j166280
2901B9125242r04917o71108r07199n36631m23106p45077m79999l42937l75725
2892B3738543k66446k25966k53104l28998l85509k45441j42804r1155l81305l14301
$$ plain form
2882 21103514 20806319 20726215 20636794 20463550 20466085 20375545 20026478 19659685 19530022 19334988
2872 19334988 19274037 19164894 19011580 18841644 18663924 18469783 18270154 18078506 18221022 18017367
2862 18017367 17946754 17863546 17860044 17675078 17479180 17406444 17141024 17150014 17073452 16903641 16752823
2851 16752823 16693655 16602531 16380193 16444877 16349300 16237577 15972110 15989340 16062739 15891203
2841 15891203 15963655 15857664 15729971 15841297 15688165 15570179 15464560 15430041 15320591 15222794
2831 15222794 15136503 15245497 15175462 15121692 14965132 14924674 14933477 14730870 14546514 14348098
2821 14348098 14278861 13969703 13960474 14021807 13828549 13710287 13692845 13640415 13500076 13422734 13232143
2810 13232143 13192487 13092912 12888915 12887097 12819168 12823349 12835898 12695197 12559727 12559295 12547641
$$ packed form
2882B1103514k97195q0104q9421j73244K535r0540l49067l66793j29663j95034
2872A9334988o0951j09143j53314j69936j77720j94141j99629j91648J42516k03655
2862A8017367p0613q3208l502j84966j95898p2736k65420Q990p6562j69811j50818
2851A6752823n9168r1124k22338O4684r5577j11723k65467J7230P3399j71536
2841A5891203P2452j05991j27693J11326j53132j17986j05619l4519j09450r7797
2831A5222794q6291J08994p0035n3770j56560m0458Q803k02607j84356j98416
2821A4348098o9237l09158r229O1333j93258j18262j7442n2430j40339p7342j90591
2810A3232143l9656r9575k03997j818o7929M181J2549j40701j35470m32j1654
$$ plain form
2799 12547641 12385929 12523639 12387414 12300103 12223883 12106011 11979023 11783886 11733927 11396617
2789 11396617 11264621 11238344 11284568 11298587 11192456 11145362 11266227 11085278 11107394 11021369
2779 11021369 10954590 11072509 11033540 10757775 10956591 10875386 10788056 10935674 10957350 10839255
2769 10839255 10856483 10832195 10877650 10861412 10819672 10802291 10926185 11125610 11226482 11302556 11244244
2758 11244244 11040698 10973275 11071094 11167646 11222713 11390210 11541392 11642017 11867014 11894142
2748 11894142 11908773 12023488 12335690 12482704 12458784 12543841 12701488 12841152 12957875 13172057
2738 13172057 13570321 13806599 13856191 14089379 14187990 14240548 14359365 14425706 14561170 14524095
2728 14524095 14562880 14800245 15088317 15191783 15253989 15450460 15626768 15750951 15857658 16073070
$$ packed form
2799A2547641j61712J37710j36225q7311p6220j17872j26988j95137m9959l37310
2789A1396617j31996k6277M6224J4019j06131m7094J20865j80949K2116q6025
2779A1021369o6779J17919l8969k75765J98816q1205q7330J47618K1676j18095
2769A0839255J7228k4288M5455j6238m1740j7381J23894J99425J00872P6074n8312
2758A1244244k03546o7423R7819R6552N5067J67497J51182J00625K24997K7128
2748A1894142J4631J14715L12202J47014k3920Q5057J57647J39664J16723K14182
2738A3172057L98264K36278M9592K33188R8611N2558J18817O6341J35464l7075
2728A4524095L8785K37365K88072J03466O2206J96471J76308J24183J06707K15412
$$ plain form
2718 16073070 16224082 16489450 16710817 16816788 16984227 17289723 17449246 17663666 18063006
2709 18063006 18380580 18720489 19152467 19593993 20170265 20597238 20988036 21523234 21882841
2700 21882841 22170431 22472782 22764586 23215783 23685859 24140224 24882623 25448268 26002454
2691 26002454 26557699 27263216 27988908 28642561 29094414 29562068 30142291 30729900 31397741
2682 31397741 31853566 32212642 32491718 32883343 33267457 33532761 34044665 34664799 35197599
2673 35197599 35857173 36505081 37231104 37901779 38832125 39802239 40675304 41706853 42763762
2664 42763762 44055707 45448112 46685739 48102845 49677285 51357978 53002128 54425029
2656 54425029 55751241 56593730 57084058 56836039 56084829 54975425 53461050 51863497 50702129
$$ packed form
2718A6073070J51012K65368K21367J05971J67439L05496J59523K14420L99340
2709A8063006L17574L39909M31978M41526N76272M26973L90798N35198L59607
2700B1882841K87590L02351K91804M51197M70076M54365P42399N65645N54186
2691B6002454N55245P05517P25692O53653M51853M67654N80223N87609O67841
2682C1397741M55825L59076K79076L91625L84114K65304N11904O20134N32800
2673C5197599O59574O47908P26023O70675R30346R70114Q73065J031549J056909
2664D2763762J291945J392405J237627J417106J574440J680693J644150J422901
2656E4425029J326212Q42489M90328k48019p51210j109404j514375j597553j161368
$$ plain form
2647 50702129 49714002 48992771 48481894 48595660 48784154 49065279 49592902 50384616 51161831
2638 51161831 52075940 53045984 53936907 54832351 55872679 56742420 57676411 58464267 59004166
2629 59004166 59381673 59397702 59115118 58218136 57335306 56462751 55064913 53472015 51902118
2620 51902118 50163066 48596780 47032861 45825222 44870764 44009091 43528890 43061476 42606146
2611 42606146 42505631 42405099 42296192 42151830 42173403 42108410 41878238 41185335 40503576 39669834
2601 39669834 38822851 37869637 36567817 35131533 33588970 32259430 30789525 29364066
2593 29364066 28140955 27108044 25970002 25098930 24330028 23752702 22976956 22237521 21613180
2584 21613180 21037524 20658803 20210294 19656831 18992268 18657310 18268310 17876086 17435963
$$ packed form
2647E0702129r88127p21231n10877J13766J88494K81125N27623P91714P77215
2638E1161831R14109R70044Q90923Q95444J040328Q69741R33991P87856N39899
2629E9004166L77507J6029k82584q96982q82830q72555j397838j592898j569897
2620E1902118j739052j566286j563919j207639r54458q61673m80201m67414m55330
2611D2606146j00515j00532j08907j44362K1573o4993k30172o92903o81759q33742
2601C9669834q46983r53214j301820j436284j542563j329540j469905j425459
2593B9364066j223111j032911j138042q71072p68902n77326p75746p39435o24341
2584B1613180n75656l78721m48509n53463o64563l34958l89000l92224m40123
$$ plain form
2575 17435963 17040014 16949315 16520604 16032420 15646773 15181450 14581947 14134623 13847990 13338443
2565 13338443 13106458 12575945 12184205 11953706 11676693 11566816 11395534 11131832 10734646
2556 10734646 10458313 10195952 10006493 9902216 9722217 9545461 9359005 9020772 8952931 8943196
2546 8943196 8677084 8514834 8441112 8255108 8071596 8044941 7951612 7821789 7798515 7572094
2536 7572094 7328789 7303052 7260406 7272152 6979475 6876229 6558671 6444953 6471287 6384735
2526 6384735 6295639 6141004 6017198 5885904 5746927 5634170 5542431 5575835 5344667 5231276
2516 5231276 5256937 5199261 5153785 5190231 5131153 5059598 4895558 4839654 4751927 4657016 4849057
2505 4849057 4658298 4294059 4181226 4227077 4110846 3850868 3903345 3783762 3687809 3846569
$$ packed form
2575A7435963l95949r0699m28711m88184l85647m65323n99503m47324k86633n09547
2565A3338443k31985n30513l91740k30499k77013j09877j71282k63702l97186
2556A0734646k76333k62361j89459j04277j79999j76756j86456l38233o7841r735
2546H943196k66112j62250p3722j86004j83512k6655r3329j29823k3274k26421
2536G572094k43305k5737m2646J1746k92677j03246l17558j13718K6334q6552
2526F384735q9096j54635j23806j31294j38977j12757r1739L3404k31168j13391
2516E231276K5661n7676m5476L6446n9078p1555j64040n5904q7727r4911J92041
2505D849057j90759l64239j12833M5851j16231k59978N2477j19583r5953J58760
$$ plain form
2495 3846569 3795993 3601142 3534722 3546061 3581908 3454934 3156796 3096545 3105265 2891307 2784127
2484 2784127 2839306 2849892 2991920 2900291 2721337 2554126 2628002 2667368 2882696 2689219
2474 2689219 2531144 2469804 2466079 2523759 2547230 2570624 2573767 2498526 2396419 2314052 2264864
2463 2264864 2367735 2215335 2275163 2239352 2222252 2164762 2166332 2255890 2127250 1991760 2078674
2452 2078674 2185232 2079242 2043418 2014204 2011261 2029925 1991652 1890896 1826287 1793573 1787618
2441 1787618 1824118 1602932 1618058 1681150 1703238 1795098 1710860 1658495 1749093 1770711 1586872
2430 1586872 1592962 1623728 1756308 1553287 1438883 1402580 1387625 1434763 1452392 1513494 1473345
2419 1473345 1466573 1529916 1363450 1389316 1393723 1425622 1263668 1304815 1244218 1210792 1246358
$$ packed form
2495C846569n0576j94851o6420J1339L5847j26974k98138o0251Q720k13958j07180
2484B784127N5179J0586J42028r1629j78954j67211P3876L9366K15328j93477
2474B689219j58075o1340l725N7680K3471K3394L143p5241j02107q2367m9188
2463B264864J02871j52400N9828l5811j7100n7490J570Q9558j28640j35490Q6914
2452B078674J06558j05990l5824k9214k943J8664l8273j00756o4609l2714n955
2441A787618L6500k21186J5126O3092K2088R1860q4238n2365R0598K1618j83839
2430A586872O090L0766J32580k03021j14404l6303j4955M7138J7629O1102m0149
2419A473345o772O3343j66466K5866M407L1899j61954M1147o0597l3426L5566
$$ plain form
2408 1246358 1331514 1242520 1349931 1380688 1262877 1265869 1104860 1083331 1077001 1267426 1227804
2397 1227804 1106485 1033843 970997 1092033 1140378 1171958 1192238 1028563 1077791 1355958 1433338
2386 1433338 1279117 1355506 1179578 1250139 1227710 1109498 1059969 1178074 1248907 1247575 1281619
2375 1281619 1164493 1160276 1377402 1432717 1144431 1162239 1125628 1062302 993133 1065778 1098185
2364 1098185 980094 902544 956217 991243 826137 812460 984960 974892 832773 825395 806225
2353 806225 837196 907289 901010 672126 659651 846842 880811 1053311 832060 687344 782455
2342 782455 894061 1083453 864636 835348 725382 966305 1009816 905828 759355 639068
2332 639068 770266 855426 863891 860342 957925 917153 828738 860824 714580 567329 548513
$$ packed form
2408A246358Q5156q8994J07411L0757j17811K992j61009k1529o330J90425l9622
2397A227804j21319p2642o2846J21036M8345L1580K0280j63675M9228K78167P7380
2386A433338j54221P6389j75928P0561k2429j18212m9529J18105P0833j332L4044
2375A281619j17126m217K17126N5315k88286J7808l6611o3326o9169P2645L2407
2364A098185j18091p7550N3673L5026j65106j3677J72500j0068j42119p378j9170
2353H06225L0971P0093o279k28884j2475J87191L3969J72500k21251j44716R5111
2342G82455J11606J89392k18817k9288j09966K40923M3511j03988j46473j20287
2332F39068J31198Q5160Q465l549R7583m0772q8415L2086j46244j47251j8816
$$ plain form
2321 548513 693433 745141 731359 592921 640289 616364 638256 669053 655562 799624 797121
2310 797121 757249 589358 597249 583547 637435 604680 534973 671388 689069 556431 498166
2299 498166 382155 391772 366800 283471 286691 132744 149675 314365 456034 450327 386626
2288 386626 306938 408953 382536 464852 464776 367195 482810 466255 343990 286203 234318 181697
2276 181697 178017 173050 294328 240271 419277 232967 345546 514997 242645 239456 321129
2265 321129 301750 226406 162864 309248 546339 432751 450631 187186 309703 351947 226753
2254 226753 331249 283002 332350 276408 307646 259380 153476 199177 212733 322747 215564
2243 215564 231071 139029 179335 127510 117234 125612 79186 283463 316224 386782 220118
$$ packed form
2321E48513J44920N1708j3782j38438M7368k3925K1892L0797j3491J44062k503
2310G97121l9872j67891P891j3702N3888l2755o9707J36415J7681j32638n8265
2299D98166j16011R617k4972q3329L220j53947J6931J64690J41669n707o3701
2288C86626p9688J02015k6417Q2316p6r7581J15615j6555j22265n7787n1885n2621
2276A81697l680m967J21278n4057J79006j86310J12579J69451k72352l189Q1673
2265C21129j9379p5344o3542J46384K37091j13588J7880k63445J22517M2244j25194
2254B26753J04496m8247M9348n5942L1238m8266j05904M5701J3556J10014j07183
2243B15564J5507r2042M0306n1825j0276Q378m6426K04277L2761P0558j66664
$$ plain form
2232 220118 164852 56202 54269 151709 77157 49174 -48038 51993 161627 -7121 -131096
2221 -131096 -187561 66306 124640 80758 52498 139205 267869 351784 129421 57189 43235
2210 43235 -79155 67371 105511 80830 85227 -91607 -84900 60148 35661 -83709 119743
2199 119743 96774 168040 61791 66182 266822 327507 203175 75906 8297 -111831 -90182
2188 -90182 27719 -154071 -171339 -158123 -196562 -139178 -229980 -217150 -57846 -75792 -92816
2177 -92816 98405 12593 -183015 109950 104453 -49741 -41188 12500 -99713 -89592 -49333
2166 -49333 -24659 -109444 -137875 -117306 -262406 -185643 -116134 -51130 -22659 -64691 -124509 -13196
2154 -13196 -64113 92031 -86607 -204631 -198402 -30562 -61358 -156132 -324863 -264772 -210356
$$ packed form
2232B20118n5266j08650j933R7440p4552k7983r7212J00031J09634j68748j23975
2221a31096n6465K53867N8334m3882k8260Q6707J28664Q3915k22363p2232j3954
2210D3235j22390J46526L8140k4681M397j76834O707J45048k4487j19370K03452
2199A19743k2969P1266j06249M391K00640O0685j24332j27269o7609j20128K1649
2188i0182J17901j81790j7268J3216l8439N7384r0802J2830J59304j7946j7024
2177i2816J91221q5812j95608K92965n497j54194Q553N3688j12213J0121M0259
2166d9333K4674q4785k8431K0569j45100P6763O9509O5004K8471m2032n9818J11313
2154a3196n0917J56144j78638j18024O229J67840l0796r4774j68731O0091N4416
$$ plain form
2143 -210356 -138715 -154387 -70671 21622 -129556 -132142 -65113 -246303 -241423 -146516 -115580 -124025
2131 -124025 -69150 2313 -61069 -92828 -92670 -12506 -37483 -53207 -127927 -118534 -157337 -153278
2119 -153278 -147967 -156131 -232759 -135428 -43687 89877 37598 -93816 -100380 -150781 438 -94400
2107 -94400 -57708 -216534 -257015 -206273 -188052 -230763 -140244 -160984 -326487 -385288 -329431
2096 -329431 -325762 -266125 -305263 -452124 -221177 -169141 -387100 -262372 -244836 -279437 -167374
2085 -167374 -99252 -135905 -108442 -120711 -154184 -111686 -153356 -176501 -265249 -379624 -336321
2074 -336321 -199823 -203119 -275830 -387310 -192252 -227414 -149584 21924 -289628 -549457 -448513
2063 -448513 -393223 -324303 -356716 -351041 -68601 -98899 -195716 -266531 -391027 -432879 -272072
$$ packed form
2143b10356P1641j5672Q3716R2293j51178k586O7029j81190M880R4907L0936q445
2131a24025N4875P1463o3382l1759J58Q0164k4977j5724p4720R393l8803M059
2119a53278N311q164p6628R7331R1741J33564n2279j31414o564n0401J51219r4838
2107i4400L6692j58826m0481N0742J8221m2711R0519k0740j65503n8801N5857
2096c29431L669N9637l9138j46861K30947N2036k17959J24728J7536l4601J12063
2085a67374O8122l6653K7463j2269l3473M2498m1670k3145q8748j14375M3303
2074c36321J36498l296p2711j11480J95058l5162P7830J71508l11552k59829J00944
2063d48513N5290O8920l2413N675K82440l0298r6817p0815j24496m1852J60807
$$ plain form
2052 -272072 -162541 -129641 -214398 -236989 -58114 -128553 -261818 -279697 -281563 -119396 -254758
2041 -254758 -400474 -447853 -432013 -287656 -308543 -297631 -327759 -296563 -320164 -195136 -117835
2030 -117835 -28156 -139145 -177007 -138915 -101320 -306595 -329975 -162918 -233227 -206878 -182827
2019 -182827 -244297 -157460 -263730 -128735 -206383 -279904 -306403 -380257 -391879 -405928 -225399
2008 -225399 -165050 -100224 -262696 -266629 -218385 -202238 -160292 -128481 -140200 -93918 -69437 -229066
1996 -229066 -298797 -209458 -82981 -145556 -124825 -246349 -146667 -78668 109687 63871 -104098
1985 -104098 -130176 -123344 -208800 -283682 -131841 -167807 -286631 -83990 -26456 -20010 -52209
1974 -52209 -202402 -190928 -193525 -177848 -173723 -281181 -214665 -220869 -101483 -52812 -92394 7196
$$ packed form
2052b72072J09531L2900q4757k2591J78875p0439j33265j7879j866J62167j35362
2041b54758j45716m7379J5840J44357k0887J0912l0128L1196k3601J25028P7301
2030a17835Q9679j10989l7862L8092L7595k05275k3380J67057p0309K6349K4051
2019a82827o1470Q6837j06270J34995p7648p3521k6499p3854j1622j4049J80529
2008b25399O0349O4826j62472l933M8244J6147M1946L1811j1719M6282K4481j59629
1996b29066o9731Q9339J26477o2575K0731j21524R9682O7999J88355m5816j67969
1985a04098k6078O832q5456p4882J51841l5966j18824K02641N7534O446l2199
1974e2209j50193J1474k597J5677M125j07458O6516o204J19386M8671l9582R9590
$$ plain form
1962 7196 -114455 -68725 -155241 -100068 -129792 -130365 -172942 -112767 -347009 -159207 -73710 -39421
1950 -39421 79517 -22219 -7166 56823 135551 186272 259907 405871 303711 357759 415533
1939 415533 430751 484809 601127 452218 553347 535528 560170 542842 783229 926210 651300
1928 651300 672603 696291 819245 787421 884231 922639 990298 920690 968918 1165332 1120086
1917 1120086 886856 1015976 1073853 1045859 1101243 1188514 1224037 1285330 1352423 1395521 1450913
1906 1450913 1613113 1551589 1543135 1582549 1558583 1550781 1410387 1584376 1786892 1813760 1814595
1895 1814595 1898340 2028231 1898462 2039099 2281014 2392262 2527671 2579635 2576533 2770890
1885 2770890 2914261 2971809 3101346 3450770 3671507 4003309 4102956 4257155 4546311 4811276
$$ packed form
1962G196j21651M5730q6516N5173k9724n73m2577O0175k34242J87802Q5497L4289
1950c9421J18938j01736J5053O3989P8728N0721P3635J45964j02160N4048N7774
1939D15533J5218N4058J16318j48909J01129j7819K4642j7328K40387J42981k74910
1928F51300K1303K3688J22954l1824R6810L8408O7659o9608M8228J96414m5246
1917A120086k33230J29120N7877k7994N5384Q7271L5523O1293O7093M3098N5392
1906A450913J62200o1524q454L9414k3966p802j40394J73989K02516K6868Q35
1895A814595Q3745J29891j29769J40637K41915J11248J35409N1964l102J94357
1885B770890J43371N7548J29537L49424K20737L31802R9647J54199K89156K64965
$$ plain form
1875 4811276 5130573 5510326 6060492 6777288 7591897 8286112 8949170 9743100 10612416 11455007
1865 11455007 12550428 13779417 15144895 17124684 19596922 22483545 26307440 31084077
1857 31084077 36982579 40867128 38621534 31901778 25232950 20220263 16923773 14142903
1849 14142903 12187170 10632834 9510391 8782497 8041117 7493160 7050059 6738328 6582460
1840 6582460 6288231 5894478 5448091 5065253 4766181 4376806 4166463 3919334 3621230 3186273
1830 3186273 3074164 2932938 2671662 2671665 2542211 2399744 2102068 2034729 1865738 1678991 1757385
1819 1757385 1764077 1815601 1490988 1290097 1481657 1411015 1170697 1074504 1041248 1223723 1187105
1808 1187105 1027932 969786 793611 930507 1013409 785900 529918 561730 652758 676122
$$ packed form
1875D811276L19297L79753N50166P16796Q14609O94215O63058P93930Q69316Q42591
1865A1455007J095421J228989J365478J979789K472238K886623L823895M776637
1857C1084077N898502L884549k245594o719756o668828n012687l296490k780870
1849A4142903j955733j554336j122443p27894p41380n47957m43101l11731j55868
1840F582460k94229l93753m46387l82838k99072l89375k10343k47129k98104m34957
1830C186273j12109j41226k61276Lj29454j42467k97676o7339j68991j86747P8394
1819A757385O692N1524l24613k00891J91560p0642k40318r6193l3256J82475l6618
1808A187105j59173n8146j76175J36896Q2902k27509k55982L1812R1028K3364
$$ plain form
1798 676122 757737 629314 507507 587434 557285 542071 532591 398150 553854 711715 439889
1787 439889 309789 192029 311979 481770 329381 258443 262869 411001 413104 291823 305569
1776 305569 320560 211803 102607 16941 151782 242534 352796 256006 220013 146186 225201
1765 225201 68217 97273 89007 159089 421675 299895 211812 224244 23294 -127700 52068
1754 52068 64405 61319 64667 -26977 123113 82081 68345 67121 141873 207122 280816 285901
1742 285901 119986 26402 -84803 -48263 -85951 -100031 57598 9611 -39397 -107851 -96699
1731 -96699 -75093 -11099 40923 48393 26551 -202076 -313503 -253875 -137682 -188094 -194327 -109479
1719 -109479 1690 -51896 -244547 -168751 -66469 11518 -81798 -226456 -248766 -251452 -302542
$$ packed form
1798F76122Q1615j28423j21807P9927l0149j5214r480j34441J55704J57861k71826
1787D39889j30100j17760J19950J69791j52389p0938M426J48132K103j21281J3746
1776C05569J4991j08757j09196q5666J34841R0752J10262r6790l5993p3827P9015
1765B25201j56984K9056q266P0082K62586j21780q8083J2432k00950j50994J79768
1754E2068J2337l086L348r1644J50090m1032j3736j224P4752O5249P3694N085
1742B85901j65915r3584j11205L6540l7688j4080J57629m7987m9008o8454J1152
1731i6699K1606O3994N2022P470k1842k28627j11427N9628J16193n0412o233Q4848
1719a09479J11169n3586j92651P5796J02282P7987r3316j44658k2310k686n1090
$$ plain form
1708 -302542 -348771 -169505 -225229 -17349 8140 -19910 62391 60621 -65169 -56893 -129767
1697 -129767 -282838 -268517 -271593 -351844 -142256 -125980 -247056 -188324 -317948 -413745 -287165
1686 -287165 -402631 -309318 -198673 -78195 -48304 -173985 -171132 -198559 -228588 -148355 -278020
1675 -278020 -258480 -155906 -199185 -215017 -175687 -58384 -164440 -179508 -234080 -99179 -226500
1664 -226500 -309100 -221487 -233783 -213366 -145635 -268075 -420370 -338858 -253269 -243541 -124586
1653 -124586 -63035 -125635 -284297 -448570 -393685 -297068 -314901 -363273 -288679 -236152 -181449
1642 -181449 -123409 -194427 -264317 -170815 -191033 -362877 -339385 -255975 -188550 -155540 -149539 -169727
1630 -169727 -248972 -133629 -119412 -232612 -259633 -313521 -248760 -193781 -242696 -274083 -277373
$$ packed form
1708c02542m6229J79266n5724K07880K5489k8050Q2301j770j25790Q276p2874
1697a29767j53071J4321l076q0251K09588J6276j21076N8732j29624r5797J26580
1686b87165j15466R3313J10645J20478K9891j25681K853k7427l0029Q0233j29665
1675b78020J9540J02574m3279j5832L9330J17303j06056j5068n4572J34901j27321
1664b26500q2600Q7613j2296K0417O7731j22440j52295Q1512Q5589R728J18955
1653a24586O1551o2600j58662j64273N4885R6617j7833m8372P4594N2527N4703
1642a81449N8040p1018o9890R3502k0218j71844K3492Q3410O7425L3010O001k0188
1630a69727p9245J15343J4217j13200k7021n3888O4761N4979m8915l1387l290
$$ plain form
1619 -277373 -353399 -404797 -181999 -230310 -223242 -219495 -220780 -158824 -143166 -44209 -164468 -288943
1607 -288943 -356729 -414604 -258310 -86720 -151811 -155448 -173191 -251529 -257474 -120979 -179783
1596 -179783 -221598 -262247 -131743 -131924 -67637 -46448 -107892 36732 -25324 -43791 50546 -49746
1584 -49746 -125067 -156835 -184918 -99689 -283834 -286844 -120751 -27979 -74179 -149606 -163826 -131846
1572 -131846 -201824 -493567 -320645 -288833 -197150 -186605 -352639 -335236 -335311 -182075 -107450
1561 -107450 -133142 -205224 -92827 -153974 -112558 -221637 -346957 -403852 -384692 -229640 -387591
1550 -387591 -319634 -337910 -390812 -349083 -324969 -315001 -373602 -326162 -304288 -63949 -170422
1539 -170422 -234519 -342467 -390361 -162411 -327031 -445239 -403833 -372455 -291449 -164726 -184845
$$ packed form
1619b77373p6026n1398K22798m8311P068L747j285O1956J5658R8957j20259j24475
1607b88943o7786n7875J56294J71590o5091l637j7743p8338n945J36495n8804
1596a79783m1815m0649J30504j81O4287K1189o1444J44624o2056j8467R4337j00292
1584d9746p5321l1768k8083Q5229j84145l010J66093R2772m6200p5427j4220L1980
1572a31846o9978k91743J72922L1812R1683J0545j66034J7403p5J53236P4625
1561a07450k5692p2082J12397o1147M1416j09079j25320n6895J9160J55052j57951
1550c87591O7957j8276n2902M1729K4114R968n8601M7440K1874K40339j06473
1539a70422o4097j07948m7894K27950j64620j18208M1406L1378Q1006J26723k0119
$$ plain form
1528 -184845 -271546 -109509 -85737 -120821 -103818 -192188 -134396 -146539 -248451 -197852 -222455
1517 -222455 -359414 -305502 -174433 -111639 -113055 -219450 -279249 -248507 -83880 -85463 -178615
1506 -178615 -132546 -328329 -336880 -230999 -92337 -96226 -46066 -121590 -86458 -151986 -165545
1495 -165545 -243272 -393283 -419189 -251202 -189167 -276346 -199036 -182468 -283333 -278400 -342090
1484 -342090 -268388 -182960 -255578 -403186 -372366 -406222 -444425 -251386 -331047 -386859 -434723
1473 -434723 -299987 -329925 -421119 -339758 -133470 -155328 -111021 -90999 -205827 -337184 -293408
1462 -293408 -352544 -409910 -249981 -248773 -298011 -77140 -137896 -177914 -177186 -75409 -46627 -330351
1450 -330351 -265444 -245646 -245769 -66809 -208516 -343950 -475699 -280214 -194080 -133341 -214393
$$ packed form
1528a84845q6701J62037K3772l5084J7003q8370N7792j2143j01912N0599k4603
1517b22455j36959N3912J31069O2794j416j06395n9799L0742J64627j583r3152
1506a78615M6069j95783q551J05881J38662l889N0160p5524L5132o5528j3559
1495a65545p7727j50011k5906J67987O2035q7179P7310J6568j00865M933o3690
1484c42090P3702Q5428p2618j47608L0820l3856l8203J93039p9661n5812m7864
1473d34723J34736k9938r1194Q1361K06288k1858M4307K0022j14828j31357M3776
1462b93408n9136n7366J59929J208m9238K20871o0756m0018P28J01777K8782k83724
1450c30351O4907J9798j23J78960j41707j35434j31749J95485Q6134O0739q1052
$$ plain form
1439 -214393 -300647 -109917 -26733 25807 -126968 -229787 -371192 -399471 -346676 -161700 -144047
1428 -144047 -268565 -227908 -210364 -215266 -50449 -46997 -272041 -414724 -333412 -304725 -209047
1417 -209047 -155519 -288135 -178498 -178118 -208427 -105146 -153192 -162439 -100234 -58632 -62099 -182604
1405 -182604 -259516 -269971 -77706 -14189 -59006 -64591 -154007 -97807 -192041 -240067 -302080 -298351
1393 -298351 -284565 -334957 -220138 -193802 -276737 -270257 -345004 -310848 -366451 -236795 -216559
1382 -216559 -114543 -191456 -196117 -154279 -189957 -257488 -217579 -152196 -73687 -140899 -186154 -123365
1370 -123365 -213043 -148691 -134104 -203691 -259116 -162589 -159524 -208502 -228863 -331138 -498070
1359 -498070 -80186 -8781 -178360 -285347 -80251 -109998 -452833 -495430 -486081 -436003 -419244
$$ packed form
1439b14393q6254J90730Q3184N2540j52775j02819j41405k8279N2795J84976J7653
1428a44047j24518M0657J7544m902J64817L452k25044j42683Q1312K8687R5678
1417b09047N3528j32616J09637L80l0309J03281m8046r247O2205M1602l467j20505
1405a82604p6912j0455J92265O3517m4817n585q9416N6200r4234m8026o2013L729
1393b98351J3786n0392J14819K6336q2935O480p4747L4156n5603J29656K0236
1382b16559J02016p6913m661M1838l5678o7531L9909O5383P8509o7212m5255O2789
1370a23365q9678O4352J4587o9587n5425R6527L065m8978k0361j02275j66932
1359d98070M17884P1405j69579j06987K05096k9747l42835m2597R349N0078J6759
$$ plain form
1348 -419244 -569095 -263685 -224337 -239465 -115978 -237501 -342185 -274266 -368633 -411717 -421940
1337 -421940 -304553 -206211 -151593 -153967 -168982 -90885 -10363 -91742 -468079 -341002 -262646
1326 -262646 -246242 -218688 -354458 -314651 -211495 -51391 -9984 -97206 -63171 -133056 -311611
1315 -311611 -400252 -275836 -271370 -154796 -277927 -303384 -147831 -212964 -202845 -292106 -394637
1304 -394637 -338481 -222308 -248258 -264988 -334267 -269565 -198476 -338128 -274954 -255654 -327316
1293 -327316 -303701 -202033 -221241 -254835 -308194 -326492 -300188 -190870 -425936 -328694 -333174
1282 -333174 -305173 -208545 -400395 -174719 -102896 -129185 -160479 -257837 -171492 -178268 -224975
1271 -224975 -221072 -188057 -256184 -245175 -243540 -123402 -136476 -243456 -218972 -123043 -127927 -256796
$$ packed form
1348d19244j49851L05410L9348j5128J23487j21523j04684O7919r4367m3084j0223
1337d21940J17387R8342N4618k374j5015P8097Q0522q1379l76337J27077P8356
1326b62646J6404K7554j35770L9807J03156J60104M1407q7222L4035o9885j78555
1315c11611q8641J24416M466J16574j23131k5457J55553o5133J0119q9261j02531
1304c94637N6156J16173k5950j6730o9279O4702P1089j39652O3174J9300p1662
1293c27316K3615J01668j9208l3594n3359j8298K6304J09318k35066R7242m480
1282c33174K8001R6628j91850K25676P1823k6289l1294r7358Q6345o776m6707
1271b24975L903L3015o8127J1009J635J20138j3074j06980K4484R5929m884j28869
$$ plain form
1259 -256796 -165485 -242662 -130589 -104017 -165528 34636 49849 -142836 -301523 -391721 -351785
1248 -351785 -231768 -192709 -243817 -259224 -235535 -201147 -169905 -67097 -80784 -225226 -136946
1237 -136946 -22701 18262 -60272 -80822 -33595 -233764 -301401 -465952 -331684 -211220 -138471
1226 -138471 -199641 -250414 -155737 -173365 -195999 -269736 -213917 -113050 -30066 -113476 22809
$$ packed form
1259b56796R1311p7177J12073K6572o1511K00164J5213j92685j58687r0198L9936
1248c51785J20017L9059n1108j5407K3689L4388L1242J02808j3687j44442Q8280
1237a36946J14245M0963p8534k0550M7227k00169o7637j64551J34268J20464P2749
1226a38471o1170n0773R4677j7628k2634p3737N5819J00867Q2984q3410J36285
$$ [...]
##END NTUPLES=NMR SPECTRUM
##END=
