##TITLE=1H_CG-1203-A2
 CDCl3
 8 sc, 
 27.5.2024
##JCAMPDX= 6.0         $$ Bruker NMR JCAMP-DX V2.0
##DATA TYPE= NMR SPECTRUM
##DATA CLASS= NTUPLES
##ORIGIN= UXNMR, Bruker Analytische Messtechnik GmbH
##OWNER= root
$$ XWIN-NMR		Version 3.5
$$ Mon May 27 13:48:30 2024 Russian Standard Time (UT+4h)  she@DPX200
##.OBSERVE FREQUENCY= 200.1309
##.OBSERVE NUCLEUS= ^1H
##.ACQUISITION MODE= SIMULTANEOUS
##.ACQUISITION SCHEME= undefined
##.AVERAGES= 8
##.DIGITISER RES= 18
##SPECTROMETER/DATA SYSTEM= spect
##.PULSE SEQUENCE= zg30
##.SOLVENT NAME= CDCl3
##.SHIFT REFERENCE= (INTERNAL, CDCl3, 0, 15.9265)
##AUDIT TRAIL= $$ (NUMBER, WHEN, WHO, WHERE, WHAT)
$$ ##TITLE= Audit trail, XWIN-NMR		Version 3.5
$$ ##JCAMPDX= 5.01
$$ ##ORIGIN= Bruker BioSpin GmbH
$$ ##OWNER= she
$$ F:/spectra/data/she/nmr/H-F/1/pdata/1/auditp.txt
$$ ##AUDIT TRAIL=  $$ (NUMBER, WHEN, WHO, WHERE, WHAT)
(   1,<2024-05-27 13:47:23.50 +0400>,<she>,<DPX200>,
      <created by zg, POWCHK disabled, PULCHK disabled
       configuration hash MD5:
       00 E9 B6 7A A2 85 ED C7 34 08 36 98 17 FE 4E 26
       data hash MD5: 16K
       50 A4 5B A8 E1 F6 4D FB C2 57 C4 BD DB D4 53 06>)
(   2,<2024-05-27 13:47:27.78 +0400>,<she>,<DPX200>,
      <Start of raw data processing
       efp BC_mod = 2 LB = 0.24 FT_mod = 6 PKNL = 1 PHC0 = -25293.73 PHC1 = 1.587482 SI = 16K 
       data hash MD5: 16K
       56 68 17 F6 0D 94 42 4E C6 85 26 97 BB 30 45 7D>)
(   3,<2024-05-27 13:47:51.93 +0400>,<she>,<DPX200>,
      <pk PHC0 = -18.72324 PHC1 = 7.2 
       data hash MD5: 16K
       51 1F 80 26 3B FB 1F 59 6E AB C5 0F A0 A0 5E 4D>)
(   4,<2024-05-27 13:47:58.04 +0400>,<she>,<DPX200>,
      <abs ABSG = 5 
       data hash MD5: 16K
       AA 30 31 C0 46 B4 1E E3 1C 8A 71 E1 4A 04 F4 1A>)
$$ ##END=
$$ 
$$ hash MD5
$$ 0B 43 55 E5 51 F0 FD 6B 8C EC 3E FD 72 B6 5D 1C
##$RELAX= 
##$RELAX= 
##$RELAX= 
##$RELAX= 
##$RELAX= 
##$RELAX= 
$$ Bruker specific parameters
$$ --------------------------
##$DU= <F:/spectra>
##$EXPNO= 1
##$NAME= <H-F>
##$PROCNO= 1
##$TYPE= <nmr>
##$USER= <she>
##$AMP= (0..31)
100 100 100 100 100 100 100 100 100 100 100 100 100 100 100 100 100 100 
100 100 100 100 100 100 100 100 100 100 100 100 100 100 
##$AQSEQ= 0
##$AQ_mod= 1
##$AUNM= <au_zg>
##$AUTOPOS= <>
##$BF1= 200.13
##$BF2= 200.13
##$BF3= 200.13
##$BF4= 200.13
##$BF5= 200.13
##$BF6= 200.13
##$BF7= 200.13
##$BF8= 200.13
##$BYTORDA= 1
##$CFDGTYP= 0
##$CFRGTYP= 5
##$CHEMSTR= <none>
##$CNST= (0..31)
1 1 145 1 1 1 1 1 1 1 1 1 1 1 1 1 1 1 1 1 1 1 1 1 1 1 1 1 1 1 1 1 
##$CPDPRG= <>
##$CPDPRG1= <>
##$CPDPRG2= <>
##$CPDPRG3= <>
##$CPDPRG4= <mlev>
##$CPDPRG5= <mlev>
##$CPDPRG6= <mlev>
##$CPDPRG7= <mlev>
##$CPDPRG8= <mlev>
##$CPDPRGB= <>
##$CPDPRGT= <>
##$D= (0..31)
0 1.2 0 0 0 0 0 0 0 0.06 0 0.03 0 0 0 0 0.0002 0 0 0 0 0 0 0 0 0 0 0 0 
0 0 0 
##$DATE= 1716803243
##$DBL= (0..7)
120 120 120 120 120 120 120 120 
##$DBP= (0..7)
150 150 150 150 150 150 150 150 
##$DBP07= 0
##$DBPNAM0= <>
##$DBPNAM1= <>
##$DBPNAM2= <>
##$DBPNAM3= <>
##$DBPNAM4= <>
$$ [...]
##$SUBNAM3= <"">
##$SUBNAM4= <"">
##$SUBNAM5= <"">
##$SUBNAM6= <"">
##$SUBNAM7= <"">
##$SUBNAM8= <"">
##$SUBNAM9= <"">
##$SW= 18.0517689322627
##$SWIBOX= (0..15)
0 0 2 0 0 0 0 0 0 0 0 0 0 0 0 0 
##$SW_h= 3612.71676300578
##$TD= 16384
##$TD0= 1
##$TE= 0
##$TE2= 300
##$TE3= 300
##$TEG= 300
##$TL= (0..7)
0 120 120 120 120 120 120 120 
##$TP= (0..7)
150 150 150 150 150 150 150 150 
##$TP07= 0
##$TPNAME0= <>
##$TPNAME1= <>
##$TPNAME2= <>
##$TPNAME3= <>
##$TPNAME4= <>
##$TPNAME5= <>
##$TPNAME6= <>
##$TPNAME7= <>
##$TPOAL= (0..7)
0.5 0.5 0.5 0.5 0.5 0.5 0.5 0.5 
##$TPOFFS= (0..7)
0 0 0 0 0 0 0 0 
##$TUNHIN= 0
##$TUNHOUT= 0
##$TUNXOUT= 0
##$USERA1= <user>
##$USERA2= <user>
##$USERA3= <user>
##$USERA4= <user>
##$USERA5= <user>
##$V9= 5
##$VALIST= <valist>
##$VCLIST= <CCCCCCCCCCCCCCC>
##$VD= 0
##$VDLIST= <DDDDDDDDDDDDDDD>
##$VPLIST= <PPPPPPPPPPPPPPP>
##$VTLIST= <TTTTTTTTTTTTTTT>
##$WBST= 1024
##$WBSW= 4
##$XGAIN= (0..3)
0 0 0 0 
##$XL= 0
##$YL= 0
##$YMAX_a= 42926
##$YMIN_a= -86244
##$ZGOPTNS= <>
##$ZL1= 120
##$ZL2= 120
##$ZL3= 120
##$ZL4= 120
##$ABSF1= 15.92653
##$ABSF2= -2.125363
##$ABSG= 5
##$ABSL= 3
##$ALPHA= 0
##$AQORDER= 0
##$ASSFAC= 0
##$ASSFACI= 0
##$ASSFACX= 0
##$ASSWID= 0
##$AUNMP= <proc_1d>
##$AZFE= 0.1
##$AZFW= 0.1
##$BCFW= 0
##$BC_mod= 2
##$BYTORDP= 0
##$COROFFS= 0
##$CY= -3
##$DATMOD= 1
##$DC= 0
##$DFILT= <>
##$DTYPP= 0
##$F1P= 0
##$F2P= 0
##$FCOR= 1
##$FTSIZE= 16384
##$FT_mod= 6
##$GAMMA= 0
##$GB= 0
##$INTBC= 1
##$INTSCL= 3.70164e-10
##$ISEN= 128
##$LB= 0.24
##$LEV0= 0
##$LPBIN= 0
##$MAXI= 10000
##$MC2= 0
##$MEAN= 0
##$ME_mod= 0
##$MI= 1.114404
##$NCOEF= 0
##$NC_proc= -9
##$NLEV= 6
##$NOISF1= 3.799351
##$NOISF2= 2.8
##$NSP= 0
##$NTH_PI= 0
##$NZP= 0
##$OFFSET= 15.92653
##$PC= 1
##$PHC0= -25312.45
##$PHC1= 8.787481
##$PH_mod= 1
##$PKNL= yes
##$PPARMOD= 0
##$PSCAL= 0
##$PSIGN= 0
##$REVERSE= no
##$SF= 200.129518990397
##$SI= 16384
##$SIGF1= 3
##$SIGF2= 2
##$SINO= 5.538805
##$SIOLD= 16384
##$SREGLST= <1H.CDCl3>
##$SSB= 0
##$STSI= 16384
##$STSR= 0
##$SW_p= 3612.71676300577
##$SYMM= 0
##$S_DEV= 0
##$TDeff= 16384
##$TDoff= 0
##$TI= <>
##$TILT= no
##$TM1= 0
##$TM2= 0
##$TOPLEV= 0
##$USERP1= <user>
##$USERP2= <user>
##$USERP3= <user>
##$USERP4= <user>
##$USERP5= <user>
##$WDW= 1
##$XDIM= 16384
##$YMAX_p= 386244689
##$YMIN_p= -2346024
$$ End of Bruker specific parameters
$$ ---------------------------------
##NTUPLES= NMR SPECTRUM
##VAR_NAME=  FREQUENCY,     SPECTRUM/REAL,   SPECTRUM/IMAG
##SYMBOL=    X,             R,               I
##VAR_TYPE=  INDEPENDENT,   DEPENDENT,       DEPENDENT
##VAR_FORM=  AFFN,          ASDF,            ASDF
##VAR_DIM=   16384,         16384,           16384
##UNITS=     HZ,            ARBITRARY UNITS, ARBITRARY UNITS
##FACTOR=    0.220516191357247, 1,           1
##FIRST=     3187.36876493882, 0,            0
##LAST=      -425.347998066947, 0,           0
##MIN=       -425.347998066947, -2346024,    0
##MAX=       3187.36876493882, 386244689,    0
$$ Real data points
##PAGE= N=1
##DATA TABLE= (X++(R..R)), XYDATA
$$ [...]
13547d85075m14897R04128M12547l35170J8234L81796j42725o02375m2504n14082
13537h20123P63541O67002l81440N38927q15479j10134l55324j48826p990O52236
13527a7610O5542r20596M78824M99533m24332m97645Q54615L2525K42374O4054
13517C77284l87957K10806J95446o44305l66772L13740o18772l10036R69264O06786
13507C45484P25772m97485k59685k93190q50654Q74600m4797n56859Q16372J17381
13497C76939o56876P05537K50877o98776k81350O18661N98816o66469M87843p92543
13487e7341n88768j69303J64143N32649J34867o63965P8434M8380l97238k44137
13477a162279R09763J038484o12353l65361P9462L26373q23413K57811L1486j98879
$$ y = [-485075, -899972, 4156, 416703, 81533, 99767, 481563, 338838, -263537, -306041, -820123, -56582, 610420, 228980, 767907, -47572, -157706, -513030, -661856, -669846, -17610, 47932, -872664, -393840, 105693, -318639, -816284, 38331, 70856, 313230, 377284, -10673, 200133, 395579, -248726, -615498, -301758, -920530, -1230566, -261302, 345484, 1071256, 573771, 314086, 20896, -829758, 44842, 45, -556814, 259558, 376939, -279937, 425600, 676477, -22299, -303649, 315012, 913828, 247359, 735202, -57341, -646109, -815412, -651269, -118620, 16247, -647718, -569284, -520904, -918142, -1162279, -252516, 785968, 173615, -191746, -112284, 214089, -609324, -351513, -320027, -518906]
13467e18906j3490O38615l75093K24992M62509p12048n01410O07494j51185l28176
13457f66698P39276L27887K05572j69939p02229k87555L51679P01360L85508k79377
13447F05484k00140J090027j54804m70378m40508q28424Q9702P12737k01077j54029
13437D8590K89109J15713j069124q11289O66964N77590L46909L10633k53770L90961
13427F12286j17308n36470M15818k56908k89562J39798o31753L91221k16094J02230
13417c86742J39786k78892J74452o2292O29701j92869J06916j7926l53979J046569
13407H04724l98882l22736n8185J06437K64335M06258m45872n88611M4014R3226
13397i5292O31389J45784o17622O97335o069o92213J4511N26192l83044l03711
$$ y = [-518906, -532396, 106219, -268874, -43882, 418627, -293421, -794831, -187337, -338522, -666698, 72578, 400465, 606037, 436098, -266131, -553686, -202007, 499353, 884861, 605484, 405344, 1495371, 1340567, 870189, 429681, -398743, -309041, 403696, 202619, 48590, 337699, 453412, -615712, -1427001, -760037, -182447, 164462, 475095, 221325, 612286, 494978, -41492, 374326, 117418, -172144, -32346, -664099, -272878, -488972, -386742, -246956, -525848, -351396, -413688, 216013, 23144, 130060, 112134, -241845, 804724, 405842, 83106, 24921, 131358, 395693, 801951, 356079, -232532, -188518, -95292, 536097, 681881, 64259, 761594, 755525, 63312, 77823, 604015, 220971, -82740]
13387h2740L78917Q19614o60367n13187Q70864q34055J234782o47097q52173l70893
13377f56335o8577K91312N58507l08304Q1549N2226J41584j89760O77656m58612
13367A21246K07396o37574l46565M25091O82596K35489j243846r4534L43607P6544
13357b30550J7408J4444m39141L74440J76436N37929M14727r9604m37675l90099
13347f1685J69695M420L24077M14431J14635N46208q48173j388347q11828P51152
13337g85415P24540n55001n37439J023695j2662p48383P11367K50196j91777L05552
13327A84673R3624M1410l46272j199666L99257O25733N04332m34339o40863J027529
13317B55418l39431J44243l42983n34387J206802m89583j73029P11914l27480
$$ y = [-82740, 296177, 1115791, 455424, -57763, 813101, -20954, 1213828, 566731, -285442, -656335, -724912, -433600, 124907, -183397, -101848, -49622, 91962, -97798, 579858, 121246, 328642, -308932, -655497, -230406, 452190, 687679, -556167, -650701, -307094, -230550, -213142, -198698, -637839, -263399, -86963, 450966, 865693, 766089, 328414, -61685, 108010, 112430, 436507, 850938, 965573, 1511781, 663608, -724739, -1536567, -785415, -60875, -615876, -1153315, -129620, -142282, -890665, -179298, 70898, -120879, 184673, 278297, 319707, -26565, -1226231, -826974, -201241, 303091, -131248, -772111, 255418, -84013, 60230, -282753, -817140, 389662, -99921, -272950, 438964, 111484]
13308A11484l05623N54469j57016j60269j368951P73344J343342j00096j505590
13299h14906M09882N50655J32696L99541L5383o0575l87175j86925L35500m47252
13289c3176p17001K4123j97132Q7486O68350N25155j292989Q02656Q13420k33500
13279D47392k03996r01189L61061J369300l77031o84550j14422K01240r34077
13270h36272j69974M46287P2425K41940j50531K59785N40776l51350J63975l32604
13260a15543n49128m7920M29861o48126N30103O04063J24246N9688j149604Q8415
13250f73945K67948k3650K73776P09759j77016q72826K85703q76854L53570J41611
13240e91924J497605J19900j478492N733L73451J08266j13332j65247Q0552L75248
$$ y = [111484, -194139, 360330, 203314, 43045, -1325906, -552562, 790780, 690684, -814906, -405024, 145631, 278327, 677868, 713251, 652676, 265501, 78576, 414076, -33176, -750177, -726054, -923186, -835700, -167350, 357805, -935184, -132528, 680892, 447392, 243396, -657793, -296732, 1072568, 695537, 10987, -103435, 97805, -836272, -1006246, -559959, -487534, -245594, -396125, -136340, 404436, 53086, 217061, -115543, -664671, -712591, -282730, -930856, -400753, 203310, 327556, 387244, -762360, -673945, -405997, -429647, -155871, 553888, 376872, -495954, -210251, -1087105, -733535, -591924, 905681, 1025581, -452911, -447178, -73727, 34539, -78793, -244040, -163488, 211760]
13230B11760k68489K56023l48847o73139o04600J261519N19425k30300J52248
13221B75600n18479K35326r96658j51227O02525M54168O7641l23550K23563L9345
13211i1746J3800P01937k02699o51j07097M59062l79755k21351K37776J18279
13201E27555o36238r76973N17789p30126O9884R03244r8810l62069J97647N61702
13191b6395J12385M23467K15756o01585l44108J50289J76848l24713K24190p37906
13181g31772P23384R7080m16905N65185k44243N5968J96003j083198L65266M53340
13171a9892k17743N027M19257m36719L62067L75094n22405Q58208K12242j020744
13161A4392j9932J36457o82652k00121J01062M16163p16893K4463P26241M00104
$$ y = [211760, -56729, 199294, -149553, -822692, -1427292, -165773, 353652, 123352, 275600, -242879, -7553, -1004211, -1155438, -552913, -98745, -31104, -354654, -131091, -91746, -77946, 623991, 421292, 420641, 313544, 772606, 392851, 171500, 409276, 527555, -108683, -1085656, -567867, -1297993, -1228109, -324865, -423675, -785744, -588097, -26395, 85990, 509457, 725213, 123628, -220480, -70191, 106657, -218056, 6134, -731772, -8388, 88692, -328213, 236972, -7271, 48697, 244700, -838498, -473232, -19892, -237635, -232608, 186649, -250070, 111997, 487091, -35314, 822894, 1035136, 14392, -5540, 130917, -551735, -751856, -650794, -234631, -951524, -927061, -200820, 199284]
13151A99284O47369o25718Q736o44026M06285J03534R0472O7855M91665l43942
13141D01514q5829J18399k73275M71919l39746o81442O27723J68944q1367J266961
13131A593801p63529j07168K23112O9984j567607R42503j23454j338383M14242
13122f56499Q5698Q38566p58474J090976o77303J84427P35139o24185j54602K86557
13112C50300N5481K92595m86287m63388k56998j23636j8798m81729m0020P83898
13102c88582M56621j017629O99330N57262K10152o31380j81226m18121L52881
13093c60692O12744j018880N23534K2161n19902O76331L04670P54785o33754k51028
13083A09969L25498n23105M79210j66365j056801r10928O99647N75129K3864O75677
$$ y = [199284, 846653, 220935, 229671, -414355, -8070, 95464, 185936, 253791, 745456, 401514, 315685, 434084, 160809, 632728, 292982, -388460, 239263, 408207, 326840, 1593801, 830272, 723104, 946216, 1016200, -551407, 391096, 267642, -1070741, -656499, -570801, 267765, -490709, 600267, -77036, 107391, 842530, 218345, 63743, 350300, 405781, 698376, 212089, -251299, -508297, -631933, -650731, -1132460, -1172480, -388582, 68039, -949590, -250260, 307002, 517154, -114226, -295452, -713573, -360692, 252052, -766828, -243294, -221133, -741035, -64704, 239966, 994751, 360997, 109969, 435467, -87638, 391572, 225207, -831594, -1742522, -1042875, -467746, -443882, 231795]
13073B31795L8543j79889l1039j141696m47470J189876M61p00902O0569M91711
13063d88041K02143Q60654K17340r27385k69623L50835n8752M12000j002901K41924
13053d61806J27438O16075j81250l85967j47384l53389J559019m65154q09217
13044e01635m07279M50859O44111O7371j34563q4891O73122n33741j17873L96367
13034D51848m11135k54636k39016m84294J644770l18519q33816J251832j456595
13025f49561l98292L61671k83292K18863Q79242n4820q00534J219892M98845K75152
13015A267166p62915p32027M13450K99964L12101p98723q73860K21815Q8592M45763
13005a18674l0270M10758J73550J63156L64642l28963r69067r16884N66788K24522
$$ y = [231795, 270338, 90449, 59410, -1082286, -1529756, -339880, -339419, -1040321, -979752, -488041, -285898, 574756, 792096, -135289, -404912, -54077, -112829, 299171, -703730, -461806, -334368, 281707, 100457, -285510, -432894, -786283, 772736, 307582, -501635, -908914, -458055, 186056, 253427, 118864, 33973, 707095, 173354, 55481, 451848, 40713, -213923, -452939, -937233, 707537, 389018, -444798, 807034, -649561, -1047853, -686182, -969474, -750611, 128631, 73811, -726723, 493169, 992014, 1267166, 504251, -227776, 185674, 485638, 797739, -984, -874844, -653029, -564437, -118674, -148944, 261814, 435364, 598520, 963162, 634199, -334868, -1251752, -684964, -460442]
12995d60442O624P1382P32029Q8749r32250M01251M38415k88230K23410l9759
12985B41179M35387k18973L01692j27025j254404J257006J28075l46159k51392
12976A65386O91449L28735m26332j03266q42826j4967J75639M23720m37102J08679
12966F9115J60232k81278k84212K36306k43602K17593N5145L5241L15303L36799
12956F16642j30653m19871l76710Q31600O96429q43057k43977p09502M30808P8594
12946f9697l04924L68005l13183O9941o38162M90164k12058l68419L760l92701
12936a367274R39930Q1356L03889k80236m5086Q40370J19150O39951o89667J85199
12926G27582k86858K8014m88883k01753L15870k35561n4473m17591P08617l37670
$$ y = [-460442, -453818, -382436, 349593, 438342, -493908, -92657, 345758, 57528, 280938, 241179, 676566, 457593, 759285, 632260, -622144, 634862, 762937, 416778, 165386, 856835, 1185570, 759238, 655972, -186854, -201821, -26182, 397538, -39564, 69115, 229347, -51931, -336143, -99837, -343439, -125846, -70701, -35460, 279843, 616642, 485989, 66118, -310592, 521008, 1217437, 374380, 130403, -579099, -148291, -69697, -374621, -6616, -319799, -249858, -888020, -397856, -609914, -978333, -974573, -1367274, -427344, -345988, -42099, -322335, -367421, 472949, 592099, 1232050, 542383, 727582, 440724, 468738, -20145, -221898, 93972, -141589, -196062, -613653, 94964, -242706]
12916b42706M58926k67944m93571N87037p64230L38920O74569j095836l37902
12907a142737P34243K68361q7941P02598J12632q61519r97438M10192P59283k4265
12897a26591J32147n64535l32605n6123J47572M87729K47068J67289p3606r95253
12887i66908N01561O33635K69051k61201j10492m52099o1147Q5012k73222L48242
12877b87568J34677P0385O1592L86779j95861l29693O37926K0163n75815q36521
12867i13936N47066O02497k07957q7970Q13250q60015o59126O08539M65716L69415
12857F77479k02321p83008N81509N38750J39578L9612k23064O823o41601L80271
12847E14028m55081P47056l08570l94188J41809m3070M72539l64103p28386J59972
$$ y = [-242706, 216220, -51724, -545295, 41742, -722488, -383568, 291001, -804835, -1142737, -408494, -140133, -228074, 474524, 587156, -274363, -1271801, -861609, -102326, -126591, 5556, -558979, -891584, -947707, -800135, -312406, -65338, 101951, 28345, -966908, -465347, 168288, 437339, 176138, 65646, -386453, -447600, -362588, -635810, -287568, -152891, -82506, -20914, 365865, 170004, -159689, 478237, 498400, -77415, -913936, -366870, 235627, 27670, -60300, 752950, -107065, -766191, -157652, 308064, 677479, 475158, -307850, 273659, 812409, 951987, 991599, 768535, 775358, 133757, 514028, 58947, 806003, 497433, 103245, 245054, 201984, 674523, 310420, -417966, -257994]
12837b57994M90779k48151r75210L17648Q10544L13709k59752P09427m16344N8445
12827E43101k6949Q75305r25187j51641R597m65174O31011J11593K63122o90836
12817A73942o6876O60234n99493J15196l66089n91531J221240L25421j374536
12808e02492P08588K57168K09133P7616j073315k32443J37528J34916j6947M80892
12798A80644J43741o62753l459P78167M53679P98p88585j074143L42399O21385
12788h127n57492j78983N16887j02550k82978N54477m8911o93450L99197l35204
12778g37134n48243M70316Q38622K29439p5196o44114q40016R43362O7327j608
12768b97245k22732l96012M6356P60954K93070k0458j79636L14364q81238J34542
$$ y = [-257994, 232785, -15366, -990576, -672928, 137616, 451325, 191573, 901000, 484656, 543101, 516152, 1391457, 466270, 314629, 324226, -140948, 490063, 601656, 864778, 173942, 107066, 767300, 167807, 283003, -83086, -674617, 546623, 872044, -502492, 206096, 463264, 672397, 750013, -323302, -555745, -418217, -283301, -300248, 180644, 324385, -338368, -341827, 436340, 890019, 890817, 102232, -971911, -629512, -8127, -565619, -744602, -227715, -330265, -613243, -58766, -107677, -801127, -401930, -737134, -1285377, -815061, 23561, 253000, 177804, -466310, -1306326, -362964, -295637, -297245, -519977, -915989, -869633, -108679, 184391, 163933, -15703, 298661, -582577, -448035]
12758d48035M8417K50292M26920k76944J08103J21288N84415l04966l03147k87938
12748h1595p97612K65565j16201K80808J23038L13098q1647K74177r70273J62956
12738f27686K2219O71129l13933J43303P29608q47303J407J017104k35077j341223
12728g80452p1294K56342N91019j42043l31788K989m29763P20618M40465J93734
12718D49827m10719J69582l89023j02560J095365o21913L75418m76874j84174
12709i5071l25742N6514L42577Q3191n49265J13179O86840K86028l60687J21866
12699C59430Q5129l27270q09502m48611N52801K48170o59178M82933J221165j21359
12689E83708j139017J071384Q06932m84431j21703o67609l59681p41261P230J447215
$$ y = [-448035, -399618, -149326, 277594, 650, 108753, 230041, 814456, 509490, 206343, -81595, -879207, -613642, -729843, -449035, -325997, -12899, -94546, 179631, -790642, -627686, -605467, 65662, -248271, -104968, 624640, -222663, -221256, 795848, 560771, -780452, -851746, -595404, -4385, -146428, -478216, -475227, -904990, -184372, 256093, 449827, 39108, 208690, -180333, -282893, 812472, 190559, 565977, 89103, -95071, -420813, -364299, -21722, 61469, -487796, -374617, 312223, 598251, 237564, 359430, 444559, 117289, -692213, -1140824, -588023, -339853, -999031, -516098, 705067, 583708, -555309, 516075, 1323007, 838576, 716873, 49264, -310417, -1051678, -1044448, 402767]
12679D02767k29703n93746P31150K1057r1647J12987r0525L45632M67095l0896
12669A044171l83287m30912p60773m72200M62052J012399n15525K70640n30541
12660c03976M21190O72828P1745m28336l19714k59918p5219L53669L31301r74461
12650e10891J50983K36766N14133M32225p51448J04994n37303K68949n4170l64035
12640e09797n09739R07197n6617N03969k14681M29211j104451L92507L07159L61662
12630E06420n78691p39930K40700n8214k46435o2711J96890k19206N90454J024316
12620F53593j88700M14420J0714p81429L58603j031569m84125M42763M7734K27977
12610c30019j06737o48152K02134K24423k03266J94070N04064J030660l79558
$$ y = [402767, 173064, -420682, 310468, 331525, 239878, 352865, 262340, 607972, 1075067, 1044171, 660884, 229972, -530801, -1003001, -540949, 471450, -44075, 226565, -303976, 117214, 790042, 861787, 433451, 113737, -146181, -221400, 132269, 463570, -510891, -359908, -123142, 390991, 823216, 71768, 176762, -360541, -91592, -145762, -509797, -1019536, -112339, -168956, 335013, 120332, 549543, -554908, -162401, 144758, 506420, -72271, -812201, -571501, -629715, -876150, -938861, -741971, -961177, -370723, 653593, 464893, 879313, 890027, 108598, 467201, -564368, -1048493, -605730, -557996, -330019, -436756, -1084908, -882774, -658351, -861617, -667547, -163483, 867177, 487619]
12601D87619l28811r4012K01506J07203j131004R77306j55286k90101l15137K93212
12591b47505Q1005J61777l4478j67636j1434M09189O33030q47966j88661O38874
12581D26195p26092M39827L03605j8280l58672l14052o3555J086259J38723L26583
12571A240541k04709N13552k46124o72327J31104J48740k23640R003j45303K71964
12561H22801j44417K50160j015960r79814K35228N06114q032m8499L34013l85140
12551d33546l14846m2656M11502o852M45182n99298Q74843k45094j20470p55131
12541g86366L53858N34315j29455k55445L15185M20742k38304k10772l19969N9909
12531b56302l55500Q6269p8443l16103L99518J12493R31105j75723o34820k02139
$$ y = [487619, 158808, 64796, 266302, 373505, -757499, 219807, 64521, -225580, -540717, -247505, -166500, -4723, -39201, -206837, -218271, 190918, 823948, -24018, -212679, 426195, -299897, 139930, 443535, 425255, 66583, -247469, -311024, 775235, 913958, 1240541, 1035832, 1549384, 1303260, 630933, 762037, 910777, 687137, 696140, 550837, 822801, 678384, 928544, -87416, -1067230, -832002, -325888, -333920, -382419, -48406, -433546, -748392, -791048, -379546, -386398, 58784, -540514, 334329, 89235, -31235, -786366, -432508, 101807, -27648, -283093, 32092, 452834, 214530, 3758, -316211, -256302, -611802, -525533, -603976, -920079, -520561, -408068, 523037, 347314, -287506, -489645]
12521d89645R87574Q4436k0644m80088k86723o53436L19570N27447R17270K37693
12511A143454j179110j031984P96337j94205q1617O0952n3827K49779K18775j38480
12501b09926j98596J58209M94921K37698p73328j90531j07049Q45061L41464p61302
12491a63379j026625k94794j21797R66818n4767O07038r6990m08214k9675L97690
12481b24695L59962j47360j67271n00142J65416J178391p66633J25689p51456
12472g28099M21945K61344k02074m05735M49005O36935M64921m60064n76216K98897
12462A60859J131570k99436m27814m7787q70153m10701Q14962K46212o14381P00111
12452C83442j066837M74207M22322r8203J73976j08298q27337j9012M10037M53192
$$ y = [-489645, 497929, 582365, 561721, 81633, -205090, -858526, -538956, -11509, 905761, 1143454, -35656, -1067640, -271303, -465508, -547125, -486173, -540000, -290221, -71446, -209926, -408522, -250313, 244608, 482306, -291022, -481553, -588602, 256459, 597923, -163379, -1190004, -1484798, -1606595, -639777, -694544, -87506, -184496, -592710, -622385, -224695, 135267, -12093, -179364, -679506, -514090, 664301, -102332, 23357, -728099, -306154, -44810, -246884, -652619, -203614, 433321, 898242, 438178, -138038, 160859, 1292429, 992993, 565179, 517392, -352761, -763462, 51500, 297712, -316669, 383442, -683395, -209188, 213134, 114931, 288907, 180609, -646728, -665740, -255703, 197489]
12442A97489R8078K65823K20470P2687l27940l94500l59797K52279n5100k22167
12432b52678l64706l38421P0369Q29218j52864j99128L77040J235813q56348m41634
12422i3339O0663O86755p10521l35667j20696J66400M68858J28925j79355q6679
12412a4656N13044L74346M4598l26744O0679m42128k11498q96542k29010N25014
12402f02897j43757J33055P59818r9121O01068r00308l67050M03400N24115r51920
12392f43597n66683J07841Q88847R3394J03659J02336k87536N22642K82794q43141
12382b39444q08866Q36051j12384o56192o78600M65968N51441L6381R43021N21186
12372H58562l45843n39206O69865m05372j03430n04322l01863N26832R3534L71681
$$ y = [197489, 295567, 561390, 781860, 854547, 526607, 132107, -227690, 24589, -30511, -252678, -617384, -955805, -885436, -56218, -209082, -408210, -31170, 1204643, 348295, -93339, -32676, 654079, -56442, -392109, -512805, -346405, 122453, 251378, 72023, -14656, 498388, 872734, 917332, 590588, 651267, 209139, -2359, -898901, -1127911, -602897, -746654, -613599, 146219, 47098, 648166, -252142, -619192, -215792, 308323, -643597, -1210280, -1102439, -213592, -120198, -16539, 85797, -201739, 320903, 603697, -239444, -1048310, -212259, -324643, -980835, -1659435, -1193467, -642026, -605645, 337376, 858562, 512719, -26487, 643378, 238006, 134576, -369746, -671609, -144777, -51243, 320438]
12362C20438J67344K47302L54883K5809n04078q69407l4579J90955O23354j18164
12352D03857O40984n01990n18320K40119J83090k89075K3219k17240P22040j2650
12342F74034r48768L71488l16855l38909K9840O06765m63274L71490M2096j25137
12332i7230j9992K02441M95831n96727J47680J67214m56710N62974Q00321J46644
12322A352446j88156q80296l8214L3248k88936n45080o8180J89422k77513J018736
12312C07477n52776m58584O70897K56524j34845K98519n12438l02625J05320J12064
12302b10467L48461J21733l15790J38389l2181Q7127q2699K27021k71544N37352
12292E47402p7071k16571m09816M97182j24042M82040K34915p68359O87553k44451
$$ y = [320438, 487782, 735084, 1089967, 1115776, 611698, -257709, -292288, -101333, 522021, 403857, 1044841, 542851, 24531, 264650, 447740, 158665, 181884, -35356, 686684, 674034, -274734, 96754, -220101, -559010, -529170, 77595, -385679, -14189, 27907, -97230, -117222, 85219, 581050, -15677, 132003, 299217, -157493, 405481, 1205802, 1352446, 1164290, 283994, 245780, 279028, -9908, -554988, -623168, -433746, -711259, 307477, -245299, -703883, -32986, 223538, 88693, 387212, -125226, -427851, -322531, -210467, 137994, 259727, -56063, 82326, 50145, 137272, 54573, 281594, 10050, 547402, 470331, 253760, -156056, 341126, 217084, 699124, 934039, 165680, 853233, 608782]
12282F08782k70068K16679n14112l99393l95646R10102R74206K38127o5621q46060
12272D56996n92703J58151P34989M51417n71206q2110j92599n89559q1952M79335
12262A70759k27854m88573P11424l13304j31365j67230N47996l4443P84700n49994
12252C02116k38783J94651l84452P98275L03338j014802k96309k9949N79297J25621
12242C39003M75146q13631o80877Q89166O37017O83725m35656q6779l62203r50417
12232c05506m3780M84041J45405k06058L46648N00849R15576r98688m80249K11977
12222E70215j299409k20849Q96577R2148o90848J133269N7527j94550r2777j18203
12212A33100j0859L37983J91928q98955l08389J82142K88440N40152k95792q3521
$$ y = [608782, 338714, 555393, 41281, -358112, -753758, 156344, 1130550, 1368677, 1303056, 456996, -135707, 22444, 757433, 1208850, 637644, 555534, 362935, -226624, -308576, 170759, -57095, -545668, 165756, -147548, -278913, -446143, 101853, 67410, 852110, 302116, 63333, 257984, -126468, 671807, 975145, -39657, -335966, -365915, 213382, 339003, 814149, 518, -680359, 208807, 845824, 1529549, 1093893, 1007114, 644911, -305506, -349286, 134755, 280160, 74102, 420750, 921599, 1837175, 838487, 358238, 570215, -729194, -950043, -53466, 38682, -652166, 481103, 538630, 344080, 251303, 133100, 122241, 460224, 652152, -246803, -555192, -373050, -84610, 455542, 159750, 76229]
12202G6229J84780l19214Q5201K92364l08013j99804j23728l6191N09339O31167
12192G92130q7973p1312k44686N35825L99232j104789J81951k21643M79906j58380
12182E00261J75417M6882j208802N00375O99801J13678p00973O60492L49992o02488
12172E34635N14596K83596q46361J8444l64150N12413o81538J10806k33163l12975
12162d63697O82544p89914K7429R89419K48454m12142k52621L1033p05180L59321
12152b85354P56334m32839M29883j31578Q8030q2360L20027q86624j73566N25097
12142A27050O5467M0603J80371l80837n48058m6908P5121Q54803k39269n9613
12132F8730n08332P43221K42111m38936K26915n33417l03271r2804O96351J79013
$$ y = [76229, 261009, -58205, 26996, 319360, 11347, -188457, -312185, -348376, 160963, 792130, 704157, 632845, 388159, 923984, 1323216, 218427, 400378, 178735, 658641, 500261, 675678, 722560, -486242, 14133, 713934, 827612, 126639, 787131, 1137123, 534635, 1049231, 1332827, 486466, 504910, 140760, 653173, -28365, 82441, -150722, -463697, 218847, -571067, -543638, 445781, 694235, 282093, 29472, 60505, -644675, -285354, 470980, 38141, 468024, 336446, 424476, 342116, 662143, -224481, -398047, 127050, 192517, 233120, 413491, 32654, -515404, -562312, -487191, 367612, 128343, 68730, -439602, 303619, 545730, 106794, 333709, -199708, -502979, -595783, 100568, 279581]
12122B79581J19850O76881l48753j211266J075173j05909p07734J206006R64266
12113A948095n78665o63178o94920K21790M36062j604k59173m84259N644M54785
12103C84577n37270r22620L24392K55640P33080K37246r18432K21011k6370J27995
12093a20751J026346J14805m65754N51299j264022J89586p39623O2728M06123
12084b39263n08478M95166N76060k11555J9646k31250P4063J182013p23564p3341
12074C59497J08044q4783m59278k52032Q86427J56058n01586K24532Q7792k18257
12064C06414n878L18012n9715k21353L10822K95347n91974j2510j15995M92190
12054G15360o91701m76104O05496J011488K35012n41369n30832r2239o00814l7788
$$ y = [279581, 399431, 1076312, 727559, -483707, 591466, 485557, -222177, 983829, 1948095, 1369430, 706252, 11332, 233122, 669184, 667580, 408407, -75852, -70208, 384577, -152693, -1075313, -750921, -495281, 237799, 475045, -443387, -222376, -248746, -120751, 905595, 1020400, 554646, 1105945, -158077, 31509, -708114, -645386, -239263, -747741, -252575, 323485, 111930, 131576, -99674, -25611, 1156402, 432838, 359497, 467541, 382758, -76520, -328552, 557875, 713933, 212347, 436879, 524671, 306414, 300536, 618548, 558833, 337480, 648302, 943649, 351675, 339165, 223170, 715360, 23659, -452445, 153051, 1164539, 1399551, 858182, 327350, 235111, -365703, -403491]
12044d03491J23173M2508J92034Q2304Q644M93740n92685j10458k6016K57737
12034F7490J60826j04719k56149K51770m04412j34674m6582N16285M71205k9394
12024D91646l45889O524N42662n16816M58669M27674n3123r45758M68708L73505
12014I07802p74340m97538M48736n36850O81630J49216J08802L70545J164433
12005B022436j73589j646974k30592k2418Q04396j000112K83244O4643N1298P57681
11995I10013n12540k81098M80964n24711O30426l35654J77586O3184o22023J37405
11985A23552j64924n21857l6583J498420M09337p54294j211494O58635M16824
11976D17616K21549j111538l35927M68138L43457k11383N6750O73147k0235k92183
$$ y = [-403491, -280318, -237810, -45776, 36528, 45172, 538912, -53773, -164231, -190247, 67490, 228316, 123597, -132552, 119218, -285194, -419868, -466450, 49835, 521040, 491646, 145757, 152281, 694943, 178127, 636796, 1064470, 1011347, 65589, 534297, 907802, 133462, -364076, 84660, -452190, 229440, 378656, 487458, 858003, 2022436, 1848847, 201873, -28719, -51137, 753259, -246853, 36391, 101034, 152332, 910013, 397473, 116375, 597339, 72628, 703054, 367400, 544986, 608170, -13853, 123552, -41372, -563229, -599812, 898608, 1307945, 553651, -657843, 792, 417616, 639165, -472373, -808300, -340162, 3295, -208088, -151338, 521809, 501574, 209391]
11966B09391k53115K60901N9566m29254k23616R56985l77500j14879K0109J017451
11956A126039J50806j071886j36199O3909Q8449o88366L85312L92293R47812l05534
11946I52635n09385K21171k44454k9954M24416l99920P3650L08483l31648K53926
11936G18920n4808r95744O03794l43068J70203P04955K67992o61703n13976Q97681
11926G94246n76824K37296j8897k45803q3187M89085o0761q45484K19130n3892
11916a45091L79644M92922o95447K76294r1873m35292N92639O60671J62178o3892
11906A132753m08786k53453j42795M61614J047672o15465n35684J62534j3917
11897H34473j30381M3469P03229M95732j421925J95318o15009N31379L93079k38249
$$ y = [209391, -43724, 217177, 276743, -152511, -376127, 580858, 203358, 88479, 108588, 1126039, 1276845, 204959, 68760, 132669, 221118, -467248, -81936, 310357, 1258169, 952635, 443250, 664421, 419967, 390013, 814429, 414509, 488159, 796642, 464994, 718920, 664112, -331632, 272162, -70906, 99297, 804252, 1072244, 410541, -103435, 794246, 217422, 454718, 435821, 190018, 106831, 595916, 535155, -310329, -91199, -145091, 234553, 727475, 32028, 308322, 216449, -218843, 373796, 1034467, 1196645, 1132753, 723967, 470514, 327719, 789333, 1837005, 1221540, 685856, 848390, 834473, 704092, 747561, 1450790, 1946522, 524597, 719915, 104906, 636285, 1029364, 791115]
11887G91115N15457j98030l591l73034o5946J19858p09015M96262J57923l33752
11877C97247M05915N24010p76076K60462O12932p77495J35137J03970L59492r5163
11867A150431M99589p43876Q58454j34750m64924n72092K09514L61168l807n0795
11857A108912q83876L97614k31261l2889J019752n88578k17821j57659P88445
11848A202639Q07242K08728m06096J44467J65060k08666k49820o72380j022473
11839c1299o16994N40381J067901N61170j62876N3686j27443l47029j96937K39594
11829I80154l70050j847l48259M76044L01466o46222J160570P3294q08259J31902
11819I48793k55347L83556K80951o47491J22420l24074j41913L02376n83901K01001
$$ y = [791115, 1306572, 1108542, 1104951, 731917, 665971, 785829, 76814, 573076, 730999, 397247, 803162, 1327172, 551096, 811558, 1424490, 646995, 782132, 886102, 1245594, 1150431, 1650020, 906144, 1764598, 1629848, 1164924, 592832, 802346, 1163514, 1159707, 1108912, 225036, 622650, 391389, 358500, 1378252, 789674, 571853, 414194, 1202639, 2009881, 2218609, 1812513, 1956980, 2122040, 1913374, 1663554, 991174, -31299, -648293, -107912, 959989, 1521159, 1358283, 1411969, 1284526, 937497, 740560, 980154, 610104, 608257, 259998, 736042, 1037508, 391286, 1551856, 1625150, 816891, 948793, 693446, 1077002, 1357953, 710462, 832882, 508808, 366895, 669271, 85370, 286371]
11809B86371M25423q9169K62656J65255o98081M28111J371741N14510n22064k09115
11799A935638j5059m13143J52483q28032J69857O22663k19947j21022o8162L09228
11789A524504k07402n92015n63724J9434P79588j02216j4793R94457p99015m95550
11779E43268L65048n09489j0078O18467j79752k27608Q4069J60378P5785p42173
11769A77915j98894J091539m25338k63558L11228M7226k547j43636P99296R20030
11759B313261J23481k68428r18483j142L59238O24214r6274N27588j104917o82428
11749H76110O25945q80622K15490R15365J14410n76810O1887R24636j58238K92363
11739B410536N127k60657j52053N82680L16804j06667k42383m85508N69767o69520
$$ y = [286371, 711794, 622625, 885281, 1050536, 352455, 780566, 2152307, 2666817, 2144753, 1935638, 1920579, 1507436, 1659919, 831887, 1001744, 1624407, 1404460, 1283438, 1215276, 1524504, 1317102, 725087, 161363, 180797, 960385, 858169, 843376, 1837833, 1038818, 543268, 908316, 398827, 388749, 1007216, 827464, 599856, 683925, 844303, 920088, 177915, -20979, 1070560, 645222, 381664, 692892, 740118, 737571, 593935, 1393231, 2313261, 2436742, 2168314, 1249831, 1248689, 1607927, 2232141, 2135867, 2663455, 1558538, 876110, 1502055, 621433, 836923, 1752288, 1866698, 1289888, 1351775, 2276411, 2118173, 2410536, 2415663, 2155006, 2002953, 2585633, 2902437, 2795770, 2553387, 2067879, 2637646, 1968126]
11729A968126n68114L99083k52380j80757P33526K60303J02541J13738p91630
11720A784436p34425P4188P24762N42198q45584p1809N08196J85725m0181M93481
11710B620987R9884J89297n71101m81476l43315J087248M29085q12265r22181
11701A296163J017883m71842j25098N16648P66547Q8833k99652k73472J31173
11692B647183K77920o65463k60072L97309J71281n67205K88775K09753q5585n8038
11682B355858q2780l49580O72235k57631J68438k43224p03838K21546O08776O1195
11672B450995J53336l02142p1913K73987L75196O5744M61086n33903p76951M83899
11662B579334j95930j49664M93253M21457L62236p25694r91999Q76788J150929
$$ y = [1968126, 1400012, 1799095, 1546715, 1365958, 2099484, 2359787, 2462328, 2576066, 1784436, 1050011, 1124199, 1848961, 2391159, 1545575, 1473766, 1981962, 2167687, 2127506, 2620987, 2720871, 2910168, 2339067, 1857591, 1514276, 2601524, 3030609, 2218344, 1296163, 2314046, 1842204, 1717106, 2233754, 3000301, 3089134, 2789482, 2516010, 2647183, 2925103, 2259640, 1999568, 2396877, 2568158, 2000953, 2289728, 2499481, 2413896, 2355858, 2273078, 1923498, 2595733, 2338102, 2506540, 2263316, 1559478, 1781024, 2389800, 2450995, 2604331, 2302189, 2230276, 2504263, 2879459, 2945203, 3406289, 2872386, 2095435, 2579334, 2383404, 2233740, 2726993, 3148450, 3510686, 2784992, 1792993, 2669781, 3820710]
11653C820710r60562n35697O93676L67525k43877M26040l65454J2917j39405p50736
11643B325137M66273K68436M1368M20363p05888N43846M17766L49398l974J13520
11633D236245j80093o62811L80625Q9127p52614j78514J594745j8861j134894
11624C372955J42838J15249J24435J313200q49720P51996l5417n46303m2460M07964
11614D754737L36308p58284M47085N13287N08576m5313k02980N5910O4952M19680
11604F093958j49133m11963K34348r18322m5209K36838M78400L66715K54138L38160
11594F477930k96365n0810O46598J99108J009Q23578m87517P66985L4074l01508
11584G813082l76049Q10487Q56999J88918q3222l95740M62502L05694L23643k64928
$$ y = [3820710, 2860148, 2324451, 3018127, 3385652, 3141775, 3567815, 3202361, 3215278, 3075873, 2325137, 2791410, 3059846, 3101214, 3521577, 2815689, 3359535, 3777301, 4126699, 4122725, 4236245, 4056152, 3393341, 3773966, 3863093, 3110479, 2931965, 4526710, 4507849, 3372955, 3515793, 3631042, 3755477, 5068677, 4218957, 4970953, 4935536, 4389233, 4346773, 4754737, 5091045, 4332761, 4779846, 5293133, 5801709, 5756396, 5553416, 5609326, 5674278, 6093958, 5944825, 5532862, 5767210, 4848888, 4803679, 5040517, 5518917, 5885632, 6139770, 6477930, 6181565, 6130755, 6777353, 6976461, 6977470, 7801048, 7313531, 8080516, 8114590, 7813082, 7437033, 8247520, 9104519, 9293437, 9210215, 8814475, 9276977, 9582671, 9906314, 9641386]
11574I641386P1445k6638N86599N49778O1965K2703O22405l50305P34324M93657
11564A2407319N98246K53300q5900O85842L09966J010394R26227L13510L20100
11555A6739004J48530J273509m39696J72862J630446l04771J371519P01175P53723
11546B2046301P61106J524589L36410O43987J643746J189558P63141J52714J035574
11537C0097126K227724K099375K415973K305746J686193K749074K055989L386489
11529D9023689L442574M303288M063086M484486O734375P372563P894125Q662838
11521I5981024Q474208O987457O815875O622911O493612M130552R16482k825549
11513A33596572l311503m971706q252884q572222q756461q656517o578009o079781
$$ y = [9641386, 9712831, 9686193, 10272792, 10822570, 10884535, 10907238, 11529643, 11179338, 11913662, 12407319, 13005565, 13258865, 13172965, 13858807, 14168773, 15179167, 16105394, 16418904, 16739004, 16887534, 18161043, 17721347, 17894209, 19524655, 19219884, 20591403, 21292578, 22046301, 22807407, 24331996, 24668406, 25312393, 26956139, 28145697, 28908838, 29061552, 30097126, 32324850, 34424225, 36840198, 39145944, 40832137, 43581211, 45637200, 49023689, 52466263, 56769551, 60832637, 65317123, 72051498, 79424061, 87318186, 95981024, 104455232, 111442689, 118258564, 124881475, 131375087, 135505639, 136422121, 133596572, 130285069, 125313363, 117060479, 108488257, 99731796, 91075279, 84497270, 78417489]
11505G8417489n226246l981800l408523k601065j286728j942774K53619M82602
11497F0706574J442916R38847J030723K301634L474136L834974O066923O735269
11489H6531996N942026Q501961Q603771P469524N743729N431629N019607M481173
11481A37725416K320051P15493l460834n342238o550411p835325r932647r736538
11473I7902967j0007554r093289q039379p258751n043466n591416m286836l446435
11465D5135841l461707k278544k197764k117227p27668m31052j377445r9945j275467
11456C1169022q20210J67471k73002o99018P96216j001166j536767L30743j87708
11447B7945581J83111q91675K12932M14345o77158j348474m82663j08239L56395
$$ y = [78417489, 73191243, 69209443, 65800920, 63199855, 61913127, 59970353, 60223972, 60706574, 62149490, 63088337, 64119060, 66420694, 69894830, 73729804, 79796727, 86531996, 92474022, 100975983, 109579754, 117049278, 122793007, 128224636, 133244243, 137725416, 140045467, 140760960, 137300126, 131957888, 125407477, 117572152, 107639505, 97902967, 87895413, 78802124, 70762745, 63503994, 58460528, 52869112, 48582276, 45135841, 41674134, 39395590, 37197826, 35080599, 34352931, 33921879, 32544434, 32444489, 31169022, 30348812, 30516283, 30243281, 29544263, 30340479, 29339313, 27802546, 28133289, 27945581, 28128692, 27237017, 27449949, 27864294, 27187136, 25838662, 25355999, 25247760, 25604155]
11438B5604155Q2958l34412R14972m59576O84612J109908L48089N66631O24346
11429B9141683P9377K07240J85586q74005m84457J91158K64969J832975Q87653
11420C1432179N90586k66410j111778l05532p45782j98986Q3436m12129Q25443
11411B9891027K21122j187663k00132j89914r16902O29998M31139j73682q66432
11402B7638561l39708R74773r26857J095701O90238L67234J154922R02104m02923
11393C1154045J82598J551723J039924J430285J834623K060981K499769J094608
11385D2848556J588554K660964J804642J728092K865312K899917K624325K979425
11377F1999787L023306M755828M641557M728139M806243P045511P947643R232915
$$ y = [25604155, 25687113, 25352701, 26267673, 25808097, 26492709, 27602617, 27950706, 28517337, 29141683, 29221060, 29428300, 29613886, 28739881, 28255424, 28446582, 28711551, 30544526, 31432179, 32022765, 31756355, 30644577, 30339045, 29593263, 29394277, 29477713, 29065584, 29891027, 30112149, 28924486, 28724354, 28534440, 27617538, 28247536, 28678675, 28504993, 27638561, 27298853, 28273626, 27346769, 28442470, 29132708, 29499942, 30654864, 31556968, 31154045, 31336643, 32888366, 33928290, 35358575, 37193198, 39254179, 41753948, 42848556, 44437110, 47098074, 48902716, 50630808, 53496120, 56396037, 59020362, 61999787, 65023093, 69778921, 74420478, 79148617, 83954860, 91000371, 98948014, 108180929]
11369A08180929J1071506J1837453J2574503J1338279Q512730L353107J363312
11362A68231819l158311m448026k127188o67703l7099R53171K81091m906309p404351
11353A46717094j1013354j5267846j4570380j3546708j2988066j0223732q246462
11346F0860546o037852n333084m176297m082863l886064k180055k206991j835584
11338C1121756k457246j634646j235017j202780p82443j423992j011301q80659
11330B0493672j246575o37347o56604j124658r82268j141665K47428K87215r17287
11321A4321911p70271j114271N39259n96856j023139M227Q52041k36715m15841
11312A1560345j180881M84403L21634o96604q52386Q36903q14819m41901N77202
$$ y = [108180929, 119252435, 131089888, 143664391, 155002670, 163515400, 166868507, 168231819, 165073508, 160625482, 158498294, 157830591, 157793492, 158746663, 159027754, 154121445, 146717094, 135703740, 120435894, 105865514, 92318806, 79330740, 69107008, 60860546, 54822694, 49489610, 45313313, 41230450, 37344386, 35164331, 32957340, 31121756, 28664510, 27029864, 25794847, 24592067, 23809624, 22385632, 21374331, 20493672, 19247097, 18609750, 17953146, 16828488, 15846220, 14704555, 14951983, 15239198, 14321911, 13551640, 12437369, 12976628, 12379772, 11356633, 11360860, 12212901, 11976186, 11560345, 10379464, 10863867, 11185501, 10488897, 9636511, 10473414, 9658595, 9216694, 9793896]
11303I793896j018968R6604R6337q94635M65417K03006L04134K71182l84429r16768
11293H015776n93165P89895J23171q22842m36527o5245m43450N82083K97127O3580
11283G510403q56952L37767q21900r06191k24905P5579K9343j54326k96118M89956
11273E182656j44929l07138L9837K45606M65910j230752m70954K53978l63698
11264C670516L53161p04160Q63237N37348j260648M11012K34943k53850n0078
11255C801481Q62315j49546j082309K14626M9604Q60191j06808k04688K11757
11246D456623m50580o67884J50150k32460k23150l87352Q3265J4807j75975K74466
11236B841910J03780O0032k77557j04986O30010k13775j87806P1330l91195J33293
$$ y = [9793896, 8774928, 8871532, 8967869, 8073234, 8538651, 8741657, 9045791, 9316973, 8932544, 8015776, 7422611, 8212506, 8335677, 7512835, 7076308, 7011063, 6567613, 7149696, 7446823, 7510403, 6653451, 6991218, 6169318, 5263127, 5038222, 5113801, 5143144, 4988818, 4692700, 5182656, 5037727, 4730589, 4770426, 5016032, 5481942, 4251190, 3780236, 4034214, 3670516, 4023677, 3319517, 4182754, 4720102, 3459454, 3870466, 4105409, 3851559, 3801481, 4663796, 4514250, 3431941, 3646567, 3696171, 4556362, 4449554, 4244866, 4456623, 4006043, 3338159, 3488309, 3255849, 3032699, 2645347, 2728612, 2743419, 2567444, 2841910, 2945690, 3005722, 2728165, 2623179, 3253189, 3039414, 2851608, 2922938, 2531743, 2665036]
11226B665036P23456p89740j20687j11629j69726J53103J404173o32180o22943
11217B498863j40449K63996L11846J332533M94181l31185m27933P77187J006101
11208E785140r20832l12352k3964q245L50987j404934l92608L1715k07307Q66929
11198C764529J89082J01258o25434k55682p62847j94253k23574R45998M64329
11189C403406j90844j224732N94039M45539M97982o62340K67743N9485l84666
11180B805612K03562J86584k78398n14515K92486k29547p6702L41954k27126O50424
11170C154334M65175o08579K37668Q07685n73558J15054L67547J62883n23961
11161C604248P0062O20540K49801m41658K62970m22775O97007o9157n83628K10217
$$ y = [2665036, 3388492, 2598752, 2478065, 2366436, 2196710, 2349813, 3753986, 3121806, 2498863, 2358414, 2622410, 2934256, 4266789, 4760970, 4429785, 4001852, 4779039, 5785140, 4864308, 4551956, 4527992, 4519747, 4870734, 3465800, 3073192, 3104907, 2897600, 3764529, 3953611, 4054869, 3429435, 3173753, 2410906, 2216653, 1993079, 2939077, 3403406, 3212562, 1987830, 2581869, 3027408, 3525390, 2863050, 3130793, 3190278, 2805612, 3009174, 3195758, 2917360, 2402845, 2695331, 2465784, 2389082, 2731036, 2503910, 3154334, 3619509, 3010930, 3248598, 4056283, 3482725, 3597779, 3965326, 4128209, 3604248, 3674310, 4294850, 4544651, 4102993, 4365963, 3943188, 4640195, 4571038, 3987410, 4197627]
11151D197627p73296m98509O83327K96231J86805o43310L64614J47825m29251
11142C532063L87904j64648k03177o19366M13024n02245K19297L17739P8293M78355
11132C937239o63729j79368M11940j695109j68181J867652M46706l82193j61360
11123C413597j52815K6162p4497J64195Q88588n41097r7698O06674l17702p30958
11113C184449k89178L43907M04895m21362n1143K64507J24645p55477q32559P77939
11103B750623R86664N16203O00957l68149M31622J34728o20513Q26027o13368
11094D644794r7964l53758L2974K80736o19496N15798N52638J00353M17904j19637
11084E354342l38622r06927M46393j308013J27493M42207M00234N6071n74294
$$ y = [4197627, 3424331, 2925822, 3609149, 3905380, 4092185, 3448875, 3813489, 3961314, 3532063, 3919967, 3755319, 3552142, 2932776, 3345800, 2843555, 3062852, 3380591, 3458884, 3937239, 3273510, 3094142, 3506082, 1810973, 1642792, 3510444, 3957150, 3574957, 3413597, 3260782, 3286944, 3212447, 3376642, 4265230, 3724133, 3626435, 4233109, 3915407, 3184449, 2895271, 3239178, 3644073, 3222711, 3171568, 3436075, 3560720, 2805243, 1972684, 2750623, 3737287, 4253490, 4854447, 4486298, 4917920, 5052648, 4432135, 5258162, 4644794, 4546830, 4193072, 4226046, 4506782, 3887286, 4403084, 4955722, 5056075, 5473979, 5354342, 5015720, 4108793, 4555186, 3247173, 3374666, 3816873, 4217107, 4273178, 3698884]
11075C698884L44923O89782j101259j61319L15345j364180R35101O62991m74223
11066C546045J035814n88536N78185n88493j7279M88265J6079k12669M77002p3041
11056D661372n21245o6293l92738L64252P22181P46199l97333r8861j90130N3364
11046D880768P45671o2248n08674m83510R0589L97514k18584O45353n6889Q87826
11036F317816o30213p66002j85570R88620M03582m38618p06684o67169J28813
11027D444575L53379Q35099P43463o32253J86564M92263m26545j41883R13256
11018F767918L82757L02383o19660J47319K42562k87715j05643J57924N34417
11009G522262J33478n16653M6649Q38280P2419K38000j72385j38798Q74108m35422
$$ y = [3698884, 4043807, 4733589, 3632330, 3471011, 3786356, 2422176, 3357277, 4020268, 3546045, 4581859, 3993323, 4571508, 3983015, 3965736, 4454001, 4470080, 4257411, 4734413, 4661372, 4140127, 4073834, 3681096, 4045348, 4767529, 5513728, 5116395, 5017534, 4827404, 4880768, 5626439, 5564191, 5055517, 4572007, 4662596, 5060110, 4841526, 5486879, 5429990, 6317816, 5687603, 4921601, 4736031, 5724651, 6128233, 5689615, 4982931, 4315762, 4444575, 4797954, 5633053, 6376516, 5744263, 5930827, 6423090, 5996545, 5854662, 6767918, 7150675, 7453058, 6833398, 6980717, 7223279, 6935564, 6829921, 6987845, 7522262, 7655740, 7139087, 7185736, 8024016, 8096435, 8334435, 8162050, 8023252, 8897360, 8461938]
10999H461938k42339m0798M62538P2874Q45447N03677n59405L17124N39440M53908
10989A0814404O30356J05196p65404k12631P2273J066702J072824O30965j33496
10980A3281189r47521Q8788n42965L7516J993434m15230r606R97385N62810P21849
10970A5767649l08212m17958P89948p6419M85515Q0796k81749O80711O83550Q06023
10960A8209854Q37752O99654l50905j12287R32040J198630J155956J138048K62938
10951B3971680J061679J614384J988628J389674N88708P60880R27624K061050
10943C4364307J542251J286570R50273J010311J580141K659743J240596R00120
10935D5534312N27115J563835K129110J820388L587107L715111K962999K326221
$$ y = [8461938, 8219599, 8178801, 8641339, 8714213, 9559660, 10063337, 9503932, 9821056, 10360496, 10814404, 11444760, 11549956, 10784552, 10571921, 10644194, 11710896, 12783720, 13414685, 13281189, 12333668, 12422456, 11879491, 11917007, 13910441, 13495211, 13485605, 14482990, 15045800, 15767649, 15459437, 15041479, 15831427, 15755008, 16240523, 16321319, 16039570, 16720281, 17403831, 18209854, 19047606, 19747260, 19396355, 19284068, 20216108, 21414738, 22570694, 23708742, 23971680, 25033359, 26647743, 28636371, 30026045, 30614753, 31375633, 32303257, 34364307, 35906558, 37193128, 38143401, 39153712, 40733853, 43393596, 44634192, 45534312, 46061427, 47625262, 49754372, 51574760, 55161867, 58876978, 61839977, 64166198]
10927F4166198O47037j97438j06623R00662J215874J14627j803526k046107j785365
10918F1105339j479994O6342j36336J114189K771554K261399K961138K220788
10910G0884419J592868J568785K927107L810741L246494K153754K112065J711858
10902I0008091K578550M074318M543071M081163L879150L065090J17946J416458
10894A13763837K294527K757888N659908M890443N39875l687338m980838k817748
10886A18420554r19861j474340n268756n704823n070859m533864k556194j048416
10878I1843441r66913j87144P25699R26427J290032R0215o44563R11358J566985
10869I5555537K088647K009494R75835N50090K191193L072007M221314M446226
$$ y = [64166198, 64813235, 64615797, 64509174, 65409836, 66625710, 66740337, 64936811, 62890704, 61105339, 59625345, 59691687, 59555351, 60669540, 63441094, 65702493, 68663631, 70884419, 72477287, 74046072, 76973179, 80783920, 84030414, 86184168, 88296233, 90008091, 92586641, 96660959, 101204030, 105285193, 109164343, 112229433, 112347379, 113763837, 116058364, 118816252, 124476160, 129366603, 129906478, 126219140, 121238302, 118420554, 117500693, 116026353, 110757597, 105052774, 99981915, 95448051, 92891857, 91843441, 90876528, 90689384, 91415083, 92341510, 93631542, 93721757, 93077194, 93988552, 95555537, 97644184, 99653678, 100629513, 101179603, 103370796, 106442803, 110664117, 115110343]
10861A15110343O245870O572045L090443j359158k800984k184945j304364O16509
10853A23985759k762079n493638o202930p044310n392805l360645k725309r38081
10845I0065962Q63067J720232K016183L089703M366931M385009P051548P255901
10837A20814536P358849J828516m16899k551376l902740k916568m09424J744766
10829A21549660K685592K100201m04540l490949n494353p282672p193802n407396
10821I7061741l733661j715875k272192j190902j83806P5911N84895J862803J620503
10812I2109417L311402L625771L451156M286842N739491N760920O044623O573662
10804A30903284Q235489P953376P267176R031522Q896211R875596J0861979O112722
$$ y = [115110343, 121356213, 127928258, 131018701, 129659543, 126858559, 124673614, 123369250, 123985759, 121223680, 115730042, 109527112, 102482802, 97089997, 93729352, 91004043, 90065962, 90929029, 92649261, 94665444, 97755147, 102122078, 106507087, 113558635, 120814536, 128173385, 130001901, 129585002, 127033626, 123130886, 120214318, 119804894, 121549660, 124235252, 126335453, 125930913, 122439964, 116945611, 109662939, 102469137, 97061741, 93328080, 91612205, 89340013, 88149111, 87965305, 88041216, 88626111, 90488914, 92109417, 95420819, 99046590, 102497746, 106784588, 112524079, 118284999, 124329622, 130903284, 139138773, 147092149, 154359325, 163390847, 172287058, 182162654, 193024633, 199137355]
10796A99137355K89679l452995n449134n422230j519300J338030M791857O584159
10788A96297421M894465m42563m832013p469904q201023p003833m117092m75256
10780A68650202J055993K701112N180802O653926R074832Q110082J0021544J1579284
10772B23027777J1461240P885540M610879m87741k133978l580387o086552o531025
10764B28165753o407251n864393l072492q48526L180608R58365l903716n866234
10756B06342114n728668j967286k536499j727675k712023k782948k063617L01433
10748A87124831R68441J774989L769435N547006R256678J4059121J5976883K0013924
10740B58491308K3381277L1609397L9675212L3087495m647170k2547805k7004855
$$ y = [199137355, 199427034, 195974039, 190524905, 185102675, 183583375, 184921405, 189713262, 196297421, 201191886, 200749323, 195917310, 188447406, 180246383, 173242550, 169125458, 168650202, 169706195, 172407307, 177588109, 184242035, 193316867, 201426949, 211448493, 223027777, 234489017, 242374557, 246985436, 246497695, 244363717, 240783330, 234696778, 228165753, 221758502, 215894109, 212821617, 211973091, 215153699, 216112064, 212208348, 206342114, 200613446, 198646160, 196109661, 194381986, 191669963, 188887015, 186823398, 187124831, 188093272, 189868261, 193637696, 199184702, 208441380, 222500501, 238477384, 258491308, 281872585, 313481982, 353157194, 386244689, 381597519, 359049714, 332044859]
10733C32044859k9099547j9274189j5118108r571872p330630o463839o279786
10726B38906888m821592m792481n723935q293396q945090r566408r291811j1618252
10718A75853923j2593471j2576088j1843659r974875r809739q344889p132728
10711A03578474p184310n943105m528175l854891k727974k506989j429040j067518
10703G4336472j422410q82954j53764k1756P50385J232260K425326K093203K909418
10694H1266180M215658M002322O59760p44293j232313n77506l01839j624138m452746
10685H1211085n416645m196020l913557l171819l362546k874524k839499j783608
10677E3652867j102474j789827j341456j461339n684K38694P4951J9013m18293
$$ y = [332044859, 302945312, 283671123, 268553015, 258981143, 251650513, 245186674, 238906888, 234085296, 229292815, 223568880, 215275484, 206330394, 196763986, 187472175, 175853923, 163260452, 150684364, 138840705, 128865830, 119056091, 110711202, 103578474, 96394164, 90451059, 85922884, 82067993, 79340019, 76833030, 75403990, 74336472, 72914062, 72031108, 71877344, 71855588, 72605973, 73838233, 76263559, 78356762, 81266180, 85481838, 89484160, 90143920, 89399627, 88167314, 87589808, 87287969, 85663831, 81211085, 75794440, 71598420, 67684863, 64513044, 61150498, 58275974, 55436475, 53652867, 52550393, 50760566, 49419110, 47957771, 47952087, 48190781, 48265732, 48284745, 47866452]
10668D7866452m84118j351517q35696j93347o661k476322j86095P52466k33553
10659D2851609K96112k29623J400164P97323J080767J757113J677957K616768
10651E2248190K173087L360266L631490M323425M460716N006637O209972Q591302
10643I0005085Q543568R857377J0558107J0419724Q516479P655388L565893j098315
10635A48023306j817717o323592j1666554j2949117j0777521j1381850j1127215
10628H1979740r035352p657794n444658m683340l955157k812983k233389k356107
10620D3800960k311471n18181N98917o77846j021719K72652M60838J164784J212618
10611D2981552J056736J518224J662479J915853K539307L721032M220930M538841
$$ y = [47866452, 47382334, 46030817, 45195121, 45001774, 44995113, 42518791, 42332696, 43085162, 42851609, 43147721, 42918098, 44318262, 45115585, 46196352, 47953465, 49631422, 52248190, 54421277, 57781543, 61413033, 65736458, 70197174, 75203811, 81413783, 90005085, 98548653, 108406030, 118964137, 129383861, 137900340, 145555728, 149121621, 148023306, 146205589, 139881997, 128215443, 115266326, 104488805, 93106955, 81979740, 72944388, 65286594, 59841936, 55158596, 51203439, 48390456, 46157067, 43800960, 41489489, 40971308, 41570225, 40892379, 39870660, 40143312, 40604150, 41768934, 42981552, 44038288, 45556512, 47218991, 49134844, 51674151, 55395183, 59616113, 64154954]
10603F4154954O008667N808837P075237N896764M839284L967611R12600q60398
10595I7803556l985597o586546q682895r537294q465921p555501p171788n525095
10587D0292919l379216l098516k873674l382067k683310k384829o80530j508409
10579B0302368j003360l10064o53236k09032q79054q24635q52054p87125r67071
10570A3816737n36362K84900j57091p49786j154203P8088j56477k0802j70992
10561A1234012K11724q90227o89499o67895M61947K14815j219878l70148n24598
10552G760253q6483r66963J2960j88092o79440P38961J096034j022082j120389
10543E544759R51524j17738r11446L42386L1405n61764o32457O70286k64848j47832
$$ y = [64154954, 70163621, 75972458, 83047695, 88944459, 93783743, 97751354, 98663954, 97803556, 93817959, 87231413, 78548518, 69011224, 60545303, 52989802, 45818014, 40292919, 36913703, 33815187, 30941513, 27559446, 24876136, 22491307, 21810777, 20302368, 19299008, 18988944, 18335708, 18126676, 17247622, 16422987, 15570933, 14783808, 13816737, 13280375, 13565275, 13408184, 12658398, 11504195, 11582283, 11425806, 11405004, 11234012, 11445736, 10555509, 9866010, 9198115, 9660062, 9874877, 8654999, 8284851, 7760253, 7673770, 6706807, 6719767, 6531675, 5852235, 6591196, 7687230, 6665148, 5544759, 6496283, 6378545, 5467099, 5809485, 5840890, 5279126, 4646669, 5316955, 5052107, 4904275]
10533D904275k21991l7308O40040J065501j387333q15595k83860J97004J72241
10524D232974m22163J8561M43036J30452K10859n67472k78647p51017j81734q1401
10514B753448l93369L43743M67205m08295K02153K50069k80645j20923O96099
10505C509485j29852n27426J36253l35776O30081p24081r12099K54870J70617
10496B072072l01586O1441k19437J12328N09774l81313N81628N10181j25817L07223
10486C126494j384405p8847P33559l56470m19992k1703k17552n0795j3611L89826
10476A706504k39813q5597L21005K8889M60176j66199m03215Q140l73274l16223
10466I40393n51331J40449R05866M35563K28402k61140k65332J63306M54953J5051
$$ y = [4904275, 4682284, 4644976, 5285016, 6350517, 4963184, 4147589, 3863729, 4060733, 4232974, 3810811, 3829372, 4272408, 4402860, 4613719, 4046247, 3767600, 3016583, 2834849, 2753448, 2360079, 2703822, 3171027, 2762732, 2964885, 3214954, 2934309, 2813386, 3509485, 3379633, 2852207, 2988460, 2652684, 3282765, 2558684, 1646585, 1901455, 2072072, 1770486, 1831927, 1612490, 1724818, 2234592, 1853279, 2434907, 2945088, 2819271, 3126494, 1742089, 1663242, 2396801, 2040331, 1620339, 1598636, 1381084, 1330289, 1316678, 1706504, 1466691, 1381094, 1702099, 1730988, 2191164, 2024965, 1621750, 1629890, 1256616, 940393, 389062, 529511, 1435377, 1870940, 2099342, 1838202, 1572870, 1736176, 2191129, 2206180]
10456B206180m71276r4714p90539K98851Q01908r49767p22280J853411N12885
10447B644659j035218N17965P2690m41840N93094m60576K74984r5579j100140
10438I70039k86802J54531K34083q4635M88131K30342j367058J091269P8071j93178
10428A314793N0640J78251p27905M17004L0684l12499j54651j27812K6538n1868
10418F43175Q11762k72709Q1086Q63761J23816j04194r91501p74871J101895J25362
10408A607582j85709J28406l43492M04748n3135n30603l66661Q4354N24808P0779
10398A341077l28690O3714J32813p16490Q5020O23785L70348K38803K81382k09029
10388A882733m73289j365054l70693p4744M38631R65766R86610M23483r02238
$$ y = [2206180, 1734904, 1640190, 849651, 1148502, 1950410, 1000643, 278363, 2131774, 2644659, 1609441, 2127406, 2200096, 1758256, 2351350, 1890774, 2165758, 2070179, 970039, 683237, 837768, 1071851, 987216, 1475347, 1705689, 338631, 1429900, 1507971, 1314793, 1365433, 1543684, 815779, 1232783, 1263467, 950968, 796317, 668505, 695043, 643175, 1454937, 1182228, 1263314, 2127075, 2250891, 2146697, 1155196, 380325, 1482220, 1607582, 1421873, 1550279, 1206787, 1611535, 1558400, 1027797, 661136, 745490, 1270298, 1341077, 1012387, 1076101, 1208914, 492424, 577444, 1201229, 1571577, 1810380, 2091762, 1882733, 1409444, 44390, -326303, -401047, 37584, 1003350, 1989960, 2413443, 1511205]
10379A511205m45764J61474l0630K12800R5341l92021m68071P70335l84809N72331
10369A602191q26502n53625q25236R38981O30757J4208n952j34669p02273k1463
10359A16417L37791L03867l0157L23226n57722j13650K70482L0415k54820P93807
10349A219656r6875j34339K14863J45155K75291r9049L58469n40051j24255q33951
10339C84914O85505M65738j039976k37494J31250m2784q20912R51024P74215m18245
10329H33235n46952R4214M4910j55473p3106k87415N58895k75339J106120p86192
10319E12897l89766N35013P06836m23697p38818o01799K56403l55158M92714o04049
10309f09424P15535m46362L34272k25789p12662Q08573J252876k74435L6623M06601
$$ y = [1511205, 1065441, 1226915, 1196285, 1409085, 1504426, 1112405, 644334, 1414669, 1029860, 1602191, 775689, 222064, -603172, 335809, 966566, 980774, 974822, 840153, 137880, 116417, 454208, 758075, 727918, 1051144, 493422, 379772, 650254, 680669, 425849, 1219656, 1122781, 988442, 1203305, 1348460, 1623751, 1524702, 1883171, 1343120, 1218865, 384914, 1070419, 1536157, 496181, 258687, 389937, 347153, -473759, 477265, 1251480, 833235, 286283, 380497, 425407, 269934, 196828, -90587, 468308, 192969, 1299089, 512897, 123131, 658144, 1364980, 941283, 202465, -399334, -142931, -498089, -5375, -609424, 106111, -340251, -5979, -231768, -944430, -135857, 1117019, 842584, 879207, 1285808]
10299A285808j54614K59553j276553k47312M27749Q55329l35660o21534O92663
10290H85429j08288m72847l23675K53746K8137K23062Q0830k19312R11979p68621
10280D90440p89287m80789N10710P31490L81925O11779J08985o87788O2334P3939
10270A013738p7894n36545l76453K11024N84714J86312M60383J29437M41707l33293
10260A703130p25696O60947j95802q63570N6083l59101q8573N7004K4843r25315
10250f56050K66316M87804L06212J60575n08554N531o2839N26771j78717k19289
10240A27760p69664M53167Q2516M97308o96714j2029Q19578P50424p73378n36732
10230e7764N38936K04424K96944n33945N09634m03687R0353l14730o12695J47110
$$ y = [1285808, 1131194, 1390747, 114194, -133118, 294631, 1149960, 814300, 192766, 885429, 777141, 304294, -19381, 234365, 262502, 485564, 566394, 347082, 1259061, 490440, -298847, -779636, -268926, 462564, 844489, 1456268, 1565253, 877465, 939799, 1013738, 935844, 399299, 22846, 233870, 818584, 1004896, 1465279, 1594716, 2036423, 1703130, 977434, 1638381, 1442579, 579009, 635092, 275991, 187418, 244422, 269265, -656050, -389734, 98070, 404282, 564857, 56303, 61834, -1005, 525766, 347049, 127760, -641904, -188737, -106221, 391087, -305627, -317656, 501922, 1252346, 478968, -57764, 481172, 685596, 982540, 448595, 958229, 554542, 644895, 330165, -282530, -135420]
10220a35420k14674P45532o76769n84037O34751O78662l83868J19847n75281q96282
10210a287539M92918N70331K89540L09735l01144j56176M23685p55040N2516K89724
10200g1450L54460k35763p71562m4489J409535l67448k80667K24385m80K72650
10190D89171M35706p27566J51255L51926n94886N22125K21378j547539m01243
10181a099673L83478j09290M52793K64125o3670K29430j03217n19113P2036J137682
10171F44581o60428L3224K95572k37644n63940M69219j32491j022652O86093j38692
10161f27158K72825q64969L61792J221M01406j90833j000967j7380k36514J52112
10151a748465j26306K14225J281923K11588j56593N04139l09930l42586N77762
$$ y = [-135420, -350094, 395438, -281331, -865368, -230617, 448045, 64177, 184024, -391257, -1287539, -794621, -224290, 65250, 374985, 73841, -82335, 341350, -413690, -361174, -71450, 283010, 47247, -724315, -768804, 640731, 273283, -7384, 217001, 216521, 489171, 924877, 197311, 348566, 700492, 105606, 627731, 849109, -698430, -1099673, -716195, -825485, -372692, -108567, -172237, 57193, -46024, -565137, -493101, 644581, -15847, 17377, 312949, 75305, -488635, -19416, -151907, -1174559, -488466, -627158, -354333, -1219302, -857510, -856289, -454883, -645716, -1646683, -1664063, -1900577, -1748465, -1874771, -1660546, -378623, -167035, -323628, 180511, -129419, -472005, 105757]
10142A05757k28323L41842k54233n61868r6621O57940K02226j10423q00079l98441
10132a142223j68102R93628j88139k33251J54792n13332l23145k62218J377630
10123c04360O32298j16889l41483M70646o15340o19143N58976r3563K04759L74082
10113A49983k84641K95417j40170o77673L64N70747l70685L03558k31007M53725
10103F9618n0006n15719o19097P70145K33236k60173l656L18507L39098m03899
10093a21946P25711k90607k9907m853p01864M1847N24894k01641j28309R14811
10083G28136k14929J10482k08926k84472l25056K35873l32169K91545j92523n13393
10073g05432j183184J10087N98013J053672k58152J97166M32226r84263J370327
$$ y = [105757, -122566, 219276, -34957, -596825, -693446, -35506, 166720, 56297, -743782, -1142223, -1310325, -316697, -504836, -738087, -583295, -1096627, -1419772, -1681990, -304360, 327938, 211049, -130434, 340212, -275128, -894271, -335295, -428858, -224099, 149983, -134658, 160759, 20589, -657084, -656720, -85973, -456658, -153100, -384107, 69618, 19612, -496107, -1115204, -345059, -111823, -371996, -375652, -57145, 281953, -121946, 603765, 313158, 283251, 278398, -423466, -381619, 143275, -58366, -186675, 728136, 513207, 623689, 414763, 130291, -194765, 41108, -291061, 484, -192039, -705432, -1888616, -1778529, -1180516, -126844, -384996, -187830, 244396, -739867, 630460]
10064F30460n02860J53533L50180j96109m98137n88881O3637Q43709m31560n2201
10054b28229n47557k9852k59256K59730J39154N18011m0609n17826l50269L06920
10044g49783J69969l72822K66631J057649o152r82234l78906K97593R75414l74957
10034i7598O05009Q099j004800o73539O93362N96200K29488j039639j079538J382707
10024c80249R51749l11065J94923J9475J4262P92237o21900q87971n45563K80413
10014d93689n19242L9582k64958j66332N53687M64085j014017P10587l6004N61293
10004a65008K59846l54716k10540M7383O67454K55130M728o80715L14865j277568
9994a139141k21389M2003K0977j31279M06081J131673q14575r8156n92743m17151
$$ y = [630460, 127600, 281133, 631313, 435204, -62933, -651814, -588177, 255532, -176028, -228229, -775786, -805638, -1064894, -805164, -666010, -147999, -188608, -706434, -1056703, -749783, -579814, -952636, -686005, 371644, 365492, -616742, -995648, -698055, 277359, -97598, 507411, 515510, -489290, -1162829, -469467, 126733, 356221, -683418, -1762956, -380249, 571500, 260435, 455358, 474833, 489095, 1281332, 659432, -228539, -774102, -493689, -1012931, -973349, -1238307, -1404639, -850952, -386867, -1400884, -690297, -726301, -165008, 94838, -259878, -470418, -423035, 244419, 499549, 504277, -176438, 138427, -1139141, -1360530, -1318527, -1297550, -1428829, -1022748, 108925, -705650, -803806, -1396549, -1813700]
9984a813700J156316k08448l83549J30345l66120L52715P44229N58594r87938
9975h17556P05450O23310n50419P43366o28982j39832p99726K80092L55079L46584
9965A17366O3236j37812M39638m5293o86276L18411j80364o8530l55921n74978
9955a110523M62560Q37361j33493J87843R72964J0016j398933l47357j77151N16629
9945a80084N85155l6849k38712k67353K87023K20954J56793r3924q84300O5771
9935c85526J040170K51n50816j74570j14170K11330l9363n9442K00108o23281
9925d95309j86782P23169m46047N71512O01150j160161N2576Q25186M39137q30850
9915I3581l03626J33730m16409m84298K15079O04769o12719Q36263r7236K39006
$$ y = [-1813700, -657384, -865832, -1249381, -1119036, -1485156, -1132441, -388212, 170382, -817556, -112106, 511204, -39215, 704151, 75169, -64663, -864389, -584297, -229218, 117366, 180602, 42790, 482428, 437135, -249141, 69270, -111094, -179624, -535545, -1110523, -647963, 189398, 55905, 243748, 1216712, 1226728, -172205, -519562, -696713, -180084, 405071, 368222, 129510, -137843, 149180, 370134, 526927, 433003, -451297, -385526, 654644, 654895, 104079, -70491, -184661, 26669, -12694, -72136, 127972, -495309, -682091, 41078, -404969, 166543, 767693, -392468, -339892, 485294, 924431, 93581, -210045, -76315, -492724, -977022, -761943, -157174, -769893, 66370, -30866, 208140]
9905B08140P74899n65805m79996o87241M98260O02621n27766m31165L64540o69979
9895i13492k06863N93419k16126M94662N71405j258789r8430R71829L41982K17909
9885D97506N93771q82286r79854m4038N06651l71229P70862N05795o23494m94539
9875e20855M85978k19290q91694m0914J234612M12179J58279L28409q21572J82579
9865C07711k08016q98215k92995m8715M69918O16910n76592M7973j39681l20974
9855a042676K82447M00549Q1651r23612m3000N26517L9090q24553J82256J86757
9845a134574n26193K75443M55863L07827L22053P37029M06461k84933j301121
9836g42145m48757O77520l23419p5920Q7888N71339L7050O17118j84088n15670
$$ y = [208140, 983039, 417234, -62762, -750003, -251743, 350878, -176888, -608053, -243513, -913492, -1120355, -526936, -743062, -248400, 323005, -935784, -1034214, -62385, 279597, 497506, 1091277, 208991, -770863, -814901, -308250, -679479, 91383, 597178, -26316, -520855, -34877, -254167, -1145861, -1186775, 47837, 460016, 618295, 946704, 125132, 307711, 99695, -798520, -1091515, -1140230, -670312, -53402, -629994, -582021, -721702, -1042676, -760229, -359680, -278029, -1201641, -1244641, -718124, -679034, -1503587, -1321331, -1134574, -1660767, -1385324, -929461, -621634, -299581, 437448, 843909, 558976, -742145, -1190902, -513382, -836801, -912721, -824833, -253494, -216444, 400674, 216586, -299084]
9826b99084m29273p88478M54920K44331P76441l48592J84748J10935k28177m00561
9816g22790M51284q99407J85479L44104N41793Q74823l23894m08267M76593l26305
9806A93413j524711J05445L27232L72263N41701p92901n94111O90848N19564m54924
9796f16181l89911j64274o1622J329869k29918K07166Q1831l49542j90040j92900
9786e75522N46200K54768p72325R18093j22588n90054n77936m11542m50264n1841
9776a833011Q02559Q9336J165071j31747J090379M41010j487582l15613l9771
9767b19369j31136J97761L56467P0418K37474m3737o59549l39460J36603J53480
9757b41048J52003j71433M4062o61790k95389Q6170M14445n41926k07161J66497
$$ y = [-299084, -728357, -1516835, -1061915, -817584, -41143, -389735, -204987, -94052, -322229, -722790, -271506, -1170913, -985434, -641330, -99537, 775286, 451392, 43125, 519718, 193413, -1331298, -1225853, -898621, -526358, 15343, -777558, -1371669, -680821, -161257, -616181, -1006092, -1170366, -1231988, 97881, -132037, 75129, 156960, -192582, -382622, -575522, -29322, 225446, -546879, 371214, 248626, -341428, -919364, -1330906, -1781170, -1833011, -1030452, -941116, 223955, 92208, 1182587, 1623597, 136015, -179598, -219369, -350505, -152744, 203723, 274141, 511615, 467878, -191671, -531131, -394528, -241048, -89045, -260478, -216416, -878206, -1173595, -1087425, -672980, -1214906, -1422067, -1255570]
9747a255570M8298k11535Q05134O95696J52556N04792n48610k8308m4312k54006
9737a35865l44216O38965n4461n2515q46807p4992q9885P47887M93981j090175
9727h08083m658R88600l60700J72334k02789l29839M56010k53607K87957J77552
9717A22777L85070j28130l5774r97159P87453K20402K63162l16632K34916N36109
9707A072194L1727m96299m45506k98079m50289N22129J6670j96436Q17241n30836
9697D2516n38553J041048k91494r4146M48919M74556q83586j33936j73164J189912
9687A082072o46196q6265q23576m64080L96071j84296L10891N26073k27915j26900
9677b44121K02562R61971J03161j095796r80581M87480L72003M39554M08644n81161
$$ y = [-1255570, -1207272, -1418807, -613673, 82023, 234579, 739371, 190761, 162453, 118141, -135865, -480081, 158884, 104423, 51908, -794899, -869891, -959776, -211889, 282092, -808083, -812741, 175859, -184841, -12507, -215296, -545135, -89125, -342732, -54775, 122777, 507847, 379717, 343943, -653216, 134237, 354639, 617801, 301169, 536085, 1072194, 1103921, 607622, 162116, -135963, -586252, -64123, -47453, -243889, 573352, 42516, -496037, 545011, 253517, 159371, 608290, 1082846, 199260, 65324, -107840, 1082072, 435876, 349611, -473965, -938045, -541974, -726270, -415379, 110694, -117221, -244121, -41559, 920412, 1023573, -72223, -1052804, -565324, -193321, 246233, 654877, 73716]
9667G3716J98068L40473J79848q91988l78814J114958o8252m9002N81587l71975
9657G28619r20287l07234P8350O76753J03674O9240k31047k19803o7503J57793
9647F8555o6212n71166K04958k63614j69705j96560K59095k36833L15225k19735
9637h75992K00671K50368L51288p1027l96147p50041L08329Q37426J2527m34431
9627e67029l20183o3001M71528k23272N38722n46615J22789r2361K4280J05210
9617e49932n67299m42298P11909k59418P40062j58177K67939O01407j43087j7427
9607A83679P86073Q09035p51289k18978o86268m78053j07571L55036q7151J49602
9597d5885r5470k01599L12341l3242p44117P68853K51178r83891K49865m0562
$$ y = [73716, 271784, 612257, 792105, -99883, -478697, 636261, 568009, 519007, 1100594, 728619, -191668, -498902, -420552, 256201, 359875, 429115, 198068, -21735, -89238, 68555, 2343, -568823, -363865, -627479, -797184, -993744, -734649, -971482, -656257, -875992, -675321, -424953, -73665, -144692, -540839, -1290880, -982551, -145125, -132598, -567029, -887212, -950213, -478685, -701957, -163235, -709850, -587061, -679422, -655142, -549932, -1117231, -1559529, -847620, -1107038, -366976, -525153, -257214, 344193, 201106, 183679, 969752, 1778787, 1027498, 808520, 122252, -355801, -463372, -108336, -195487, -45885, -141355, -342954, -30613, -63855, -807972, -39119, 212059, -771832, -521967, -562529]
9587e62529J045988o9931l73664n41196M8552J14725n7176k137o19524n48716
9577a565608Q87992R54556l12337k34802k85965Q00370K5681o57305m92495K41400
9567f38513r44900K35970M8773P12369M40792k98564J063862l72991j390928j03486
9557a247616J15317L74950l47748N01322p1630J16309O0194o98129K54707q9906
9547a032230O36433J17479j048307j28600J006562O89196l4794m24784K17894
9538a151q8547J41908j50438r10771M66288r71820M27565J61158M4720N5557Q69130
9527D3599K44539j7455j715418M62403N63782l96566j7348M88173j48406p12518
9517a205215L11019K17284J20158k66823P01492p1285j57543m04523K61140K69675
$$ y = [-562529, 483459, 413528, 39864, -501332, -452780, -338055, -395231, -397368, -1016892, -1565608, -677616, 276940, -35397, -270199, -556164, 244206, 269887, -387418, -879913, -638513, -1583413, -1347443, -1298670, -586301, -145509, -444073, 619789, 246798, -1144130, -1247616, -1132299, -757349, -1105097, -603775, -675405, -559096, -498902, -1197031, -942324, -1032230, -395797, -278318, -1326625, -1455225, -448663, 240533, 205739, -219045, -1151, -89698, 52210, -98228, -1008999, -542711, -1514531, -1086966, -925808, -881088, -825531, 43599, 288138, 270683, -1444735, -982332, -418550, -815116, -832464, -344291, -492697, -1205215, -894196, -676912, -556754, -823577, -122085, -193370, -350913, -755436, -494296, -224621]
9507b24621L59547j4534j94099l61059o54027O56579K61035j70607m55141k38263
9497a035190P07498k12978M91556J75617O45386o40820o64790O90649K84583r33367
9487d91856o1071N37455k76348L86542j27745j154720N11629O62288k41903m36692
9477f92421k43260J41768J368252q12952K11391L74382q53342N4336m49859n23827
9467a425532N32438J093654o62875j198060j97998J172570Q92569l24384N77472
9458D59854M28341J46146o61548q37642O54371K87326m6699O795m00880m34556
9448c98492m91501j91359M01477K47384O2342n32846J77004J063293k71362j018519
9438i52579j03351M49739M61852J8204o1129J80905K92241j35217k28130j73759
$$ y = [-224621, 134926, 120392, -73707, -434766, -1088793, -432214, -171179, -341786, -796927, -1035190, -327692, -540670, -49114, 126503, 771889, 131069, -533721, 156928, 441511, -491856, -552927, -15472, -291820, 94722, -33023, -1187743, -676114, -13826, -255729, -692421, -935681, -793913, 574339, -238613, -27222, 347160, -506182, -451846, -901705, -1425532, -893094, 200560, -462315, -1660375, -1858373, -685803, 206766, -117618, 459854, 888195, 1034341, 372793, -464849, 189522, 476848, 430149, 436944, 36064, -398492, -889993, -1081352, -679875, -432491, -370149, -902995, -725991, 337302, 65940, -952579, -1055930, -606191, -144339, -126135, -187264, -6359, 285882, 150665, -77465, -251224]
9428b51224L60425O55763l41701j89360j041860m39275O75367J70793n0849L38560
9418a13361j6516j93497j5591Q13953k89526n61401O31049l40008j90618N3202
9408b22314R46253m1726j95088P52007j51640k61699m08168p14970J58873J86885
9398D8413J249021o05694p57601N43509J57737j188459q3105J230294r13876m92807
9388h12568P78613P72261o85651k76084m6461l27538N52464k10561J09034M05919
9378B59428j68694q08575K4745O46072m81008K55725L78814n7265J58937p7336
9368A30843r38662N17646O79248m32673J71029R164r17983R82775l92097q40478
9358a031188P59386N01371J049008q68974j170519R65313n15182k13857J229111
$$ y = [-251224, 109201, 764964, 423263, 233903, -807957, -1247232, -571865, -401072, -451921, -113361, -129877, -323374, -338965, 474988, 185462, -375939, 255110, -84898, -275516, -222314, 723939, 682213, 487125, 1239132, 1087492, 825793, 417625, -297345, -138472, 48413, 1297434, 691740, -65861, 477648, 635385, -553074, -636179, 594115, -319761, -812568, -33955, 738306, 52655, -223429, -269890, -597428, -44964, -255525, -146491, 259428, 90734, -717841, -693096, -47024, -528032, -272307, 106507, 49242, 208179, 130843, -807819, -290173, 389075, -43598, 127431, 136595, -781388, 201387, -190710, -1031188, -271802, 229569, 1278577, 409603, -760916, 204397, -310785, -524642, 704469]
9349G04469j12949l48208k64450k83013O14493l27904m09539R6310m17561J85240
9339e63112J284494k03229K4440k96287o89220O61899K56184p0057M04699j3993
9329G95818m88625l22700j54478l19272l47437P16386J84254M2801o89158l4737
9319f17148P22721Q75853j363290k18143p14950j69541R79108O87193l78484r043
9309b05724L49899K97972p30139R17883j02268p37390r49638m70932J107111K23740
9299b99486m29238J74899M35499K216k63132l09520M30625m10136J0063J54359
9289e03851J04968L56833m26941k55652K73645J20950J22129m08620m46788K56885
9279h06442J136750O01010p52831m94904P19581j61829P86323p00950j97194P63828
$$ y = [704469, 591520, 243312, -21138, -304151, 310342, -17562, -427101, -330791, -748352, -563112, 721382, 518153, 542593, 246306, -442914, 218985, 475169, 405112, 809811, 795818, 307193, -15507, -169985, -489257, -836694, -120308, 63946, 106747, -582411, -617148, 105573, 981426, -381864, -600007, -1314957, -1484498, -505390, 181803, -196681, -205724, 144175, 442147, -287992, 629891, 527623, -209767, -1159405, -1630337, -523226, -299486, -728724, -553825, -118326, -116110, -379242, -688762, -258137, -668273, -658210, -503851, -398883, -42050, -468991, -724643, -450998, -330048, -207919, -616539, -1063327, -806442, 330308, 931318, 178487, -316417, 403164, 241335, 1027658, 326708, 129514, 893342]
9269H93342L32309m45061j89773R8304q57335L99950P90454m6541j53483o09265
9259B12901k81758o47110J15239m73360M85033M03246l96671R98215O66576n04454
9249E77857m44328j39788O15632k51187r34745q11654J222203J51898k69162O52497
9239C69223r73033l74354L11238L24811O73425N78722q78054o87631M98824n22735
9229f79564j9207M82474m27156O2635P89293q6549k13139K44095K79742k2811
9219D09813n65192J13685P89061P5724o09504j855379O75285N64499J17082O13088
9209C28162l49274K35447N5315l76894o08439O66298P36147p85467o69926J58815
9199f09816l47098J098064L35362l33371m06294j20147p446j04230o77263J05356
$$ y = [893342, 1225651, 780590, 590817, 689121, -168214, 231736, 1022190, 975649, 822166, 212901, -68857, -715967, -600728, -1074088, -589055, -185809, -582480, 415735, 1082311, 577857, 133529, -6259, 609373, 358186, -576559, -1388213, -166010, -14112, -283274, 369223, -603810, -978164, -666926, -342115, 331310, 910032, 31978, -655653, -156829, -679564, -698771, -216297, -643453, -580818, 208475, 121926, -91213, 152882, 432624, 409813, -155379, -41694, 747367, 823091, 213587, -1641792, -966507, -402008, -284926, 328162, -21112, 214335, 269650, -107244, -715683, -49385, 686762, -98705, -768631, -609816, -956914, 141150, 476512, 143141, -263153, -383300, -390746, -494976, -1172239, -1066883]
9189a066883M07367o35106J70683P28870p58603R82191J02137j062221M58338
9180f73227R98908J0451k16721K48938n02730j41812m47784J90657L83586j32174
9170b81908K84596J95442Q20675j279849n96331J051749L61284K83854p08012
9161A31500k58162k55633p81815O89599O60845q9804o06425n95224J147780M7206
9151H9867n68709j13298M10121J1862R4482M30226L71027p90441q57138P50599
9141a71402l71466m37148L9488J065187J87435O2798k10249p5920k02262K49499
9131A35960L15857N15583r34991r65427L64179N01131M69700r46179k69398L37078
9121d76507l07248M24285K47682K28552m3786k89949j24255R6586l00089M52166
$$ y = [-1066883, -659516, -1294622, -1123939, -395069, -1153672, -171481, -69344, -1131565, -673227, 325681, 336132, 119411, 368349, -134381, -276193, -723977, -533320, -149734, -281908, 2688, 198130, 1018805, -261044, -857375, 194374, 555658, 839512, 131500, -126662, -382295, -1164110, -474511, 186334, 96530, -509895, -1105119, 42661, 89867, -478842, -592140, -182019, -170157, -75675, 354551, 725578, -64863, -922001, -171402, -542868, -980016, -940528, 124659, 312094, 374892, 164643, 88723, -113539, 135960, 451817, 967400, 32409, -933018, -568839, -67708, 401992, -544187, -813585, -476507, -783755, -359470, -111788, 116764, 72978, -216971, -341226, -244640, -544729, -92563]
9111i2563K00316m08285M93509K00370K08514p23689k65597L55036l2995j93733
9101b59117j39777J70963N60621k97401K02998M84748O5188n8597r45306n82819
9091g98499J45218q50058N99984J18261K58439J50573N0221M11155j39060O05086
9081E51320j4719p16675N4736k53779o08815L27613K68605K76725M49417R04177
9071A238605n63646q07726n27306k68002N07713R8664R5395o10431n36820N78437
9061g95117k58590j79051J172744j33040N52411j92672j16550l23104J20335L81069
9051B28435o48046K6042N88672p72387m34064J06438N64880j512272J222490J443338
9041H13526j24188p10088o83873p35496M46731N45194J81831M32350N7318L9904
$$ y = [-92563, 107753, -300532, 192977, 393347, 601861, -121828, -387425, -32389, -65384, -259117, -398894, -227931, 332690, 35289, 238287, 723035, 788223, 729626, -215680, -798499, -653281, -1503339, -903355, -785094, -526655, -376082, -325861, 85294, -53766, 551320, 536601, -180074, -125338, -379117, -987932, -660319, -391714, -114989, 334428, 1238605, 674959, -132767, -660073, -928075, -420362, -321698, -226303, -836734, -1373554, -795117, -1053707, -1232758, -60014, -193054, 359357, 166685, 50135, -272969, -152634, 228435, -419611, -393569, 195103, -577284, -1011348, -904910, -340030, -1852302, -629812, 813526, 689338, -20750, -704623, -1440119, -993388, -448194, -266363, 165987, 223305, 263209]
9031B63209l61510j86865r2019R56926L11580j69060q20452l14750J081878l30980
9021C37957k98835M1958n86583j881k77076k42800Q99700k25647n37983N29903
9011c61287j97261p78831k96751J561012J73619m33826N23257l52731k12410j52123
9001e27332q04166J023360K46993K15225P23830r320k20166P8425r55875n93853
8991h22879n67132J125440O00010k83915L68010K08260j129667P66683l53799
8982h8989j26885J14146l73033j59833J110413j35746p99012k7848K26231n9076
8972c19632m52578O48178J042107j62162L4923j169211n20047J17883L89592L47993
8962d2954K40250q80202M9155n68102L40280R59097o97450N83203l00287N75337
$$ y = [263209, -98301, -285166, -377185, 579741, 891321, 722261, -98191, -412941, 668937, 337957, 39122, 81080, -505503, -507384, -784460, -1027260, -127560, -353207, -891190, -361287, -558548, -1337379, -1634130, -73118, 100501, -333325, 189932, -162799, -375209, -527332, -1331498, -308138, -61145, 154080, 877910, 868590, 648424, 726849, -229026, -822879, -1390011, -264571, 335439, 51524, 419534, 627794, -501873, 264810, -88989, -215874, -101728, -474761, -634594, 475819, 340073, -458939, -486787, -260556, -319632, -772210, -124032, 918075, 755913, 790836, -378375, -898422, -780539, -390947, -42954, 197296, -682906, -633751, -1201853, -861573, 97524, -599926, -16723, -317010, 258327]
8952B58327j018451Q28623K8029j005077O34203J92664r13673q4917R28300p2452
8942b24424k42911j88483n05053k91418L13943o82948N57265j46146L25984L50142
8932g34049J165315J166142j116191o63833m51338K84770n14976K82166J45454
8923d36540n04165l79038J401138L7264o898k36465M36436O75725n61009Q48617
8913A275065M42266j680199k44490O76669K92851p61708N08814k72843p2009J024710
8903A189126q07948o93672O59974l43197n91830J64830L59761P80178m14427k62995
8893C9800K90740j78141L48628N6682q05385O97111J92803j152773J54268L65364
8883I097K76714m55469N12461p10863J65729k03139o47320K4386J63316j55705
$$ y = [258327, -760124, 68499, 96528, -908549, -274346, -81682, -995355, -1080272, -151972, -224424, -467335, -655818, -1160871, -1452289, -1138346, -1821294, -1264029, -1410175, -1084191, -734049, 431266, 1597408, 481217, -182616, -633954, -349184, -864160, -581994, -436540, -940705, -1319743, 81395, 118659, 111761, -124704, 311732, 987457, 426448, 1275065, 1717331, 37132, -207358, 469311, 762162, 454, 509268, 236425, 164416, 1189126, 381178, -312494, 347480, 4283, -587547, -422717, -62956, 717222, 302795, 39800, 330540, 152399, 501027, 557709, -247676, 449435, 642238, -510535, -356267, 9097, 285811, -169658, 342803, -368060, -202331, -405470, -1052790, -1028404, -865088, -1020793]
8873a020793K39349k0615J076759R34222o20636o43300J40830n0017M0028j30932
8863e5105N10366n5282P0600L20640N20183k20414n55992j85675j14395Q8899
8853C23825j14885L55396j10528K23965O4699L18770j59710r0987n54163P879
8843B64261p34896n36507J090141J026182R21953L73659n72497K9028O55452J57304
8833B674080o96232k21780m05047j293078k06998N80333O6955N71938M86819q73024
8823F83966p29476K61297n86642P17414l84682p3354n66931M29310M3724n87457
8813g92831l89244L8066R37004J459690o15387l10692l71517M17034m52380J23727
8803D3470l89009K22898J60244r3714j16623q11785m90627N92316K10645m0340
$$ y = [-1020793, -781444, -802059, 274700, 1208922, 588286, -55014, 85816, 35799, 75827, -55105, 455261, 399979, 470579, 791219, 1311402, 1090988, 534996, 349321, 234926, 323825, 208940, 564336, 453808, 677773, 742472, 1061242, 901532, 810545, 256382, 264261, -470635, -1007142, 82999, 1109181, 2031134, 2404793, 1832296, 1861324, 2516776, 2674080, 1977848, 1756068, 1351021, 57943, -149055, 431278, 498233, 1070171, 1556990, 683966, -45510, 215787, -370855, 346559, -38123, -111477, -678408, -249098, -205374, -792831, -1182075, -1144009, -207005, 1252685, 637298, 326606, -44911, 372123, -80257, 43470, -345539, -122641, 37603, -56111, -172734, -984519, -1475146, -882830, -672185, -712525]
8793g12525r7719j52365M35638Q5890Q11691N681N13658m4835o01907j470259
8783a227052O08492N66046L18648j30187O0771j43436k28311J79812l47592K31227
8773a11582j102380L52631Q19700Q8068j66770M34015K15994L48767K6603l84847
8763E20199L73829j62060j014357n11256Q20880k66268K09940K86402o71378P48277
8753C34208M45682l21871N9880M78415q05069k71483L21249m28137M76698K23438
8743E13010N65000p09553l92810m2955L13328M08571J72703o16714p6734J10940
8733B44786k14800J8572J22640k60485L31222p39684J86010o44997j90746J330744
8723A83262M30336J66700j04315o19971j80023n91614K13888J152673P29875M17837
$$ y = [-712525, -810244, -962609, -526971, -441081, 370610, 376291, 889949, 845114, 243207, -1227052, -618560, -52514, 266134, 135947, 196718, 53282, -175029, 4783, -342809, -111582, -1213962, -861331, -41631, 46437, -120333, 313682, 529676, 878443, 905046, 520199, 894028, 731968, -282389, -793645, 27235, -239033, -29093, 257309, -414069, 334208, 779890, 458019, 517899, 996314, 191245, -80238, 241011, -187126, 289572, 513010, 1078010, 368457, -24353, -67308, 246020, 654591, 827294, 210580, 133846, 244786, 29986, 48558, 171198, -89287, 241935, -497749, -311739, -956736, -1147482, 183262, 613598, 780298, 675983, 56012, -124011, -715625, -501737, 650936, 1380811, 1798648]
8713A798648j771002n33223m32303O979P16742N19532M5054l68677o35577l76478
8703a030305R55517l80698j42461R9235P3134j86050K27718n4202J74251M38134
8693A74273O36179m83926p6004J03570p98332n9045R31477r33226r00800L03372
8683a102462J325224J61755r3246r00343L99962R34395r07541M17980k63852K53647
8673B25519o65986m99632O60216M27734j24219m14504N31838Q69649q1961o48484
8663B80170J29562n53348n799P52432N10454j00353p35053j82121p17197J06841
8653e14412m72994N35500K36305l72752k1825j02688k14761O58102J18421k88674
8643d39778K83096J7119l234L043M12827M95572k27100K30825Q48331j424769
$$ y = [1798648, 27646, -505577, -937880, -930901, -214159, 305373, 350427, -18250, -653827, -1030305, -74788, -455486, -597947, -498712, -425578, -611628, -383910, -438112, -263861, 174273, 810452, 326526, 250522, 354092, -444240, -503285, 428192, -505034, -1405834, -1102462, 222762, 384517, 291271, -609072, -209110, 725285, -182256, 235724, -28128, 225519, -440467, -940099, -279883, 147851, 23632, -390872, 140966, 1010615, 928654, 280170, 409732, -143616, -149415, 603017, 1113471, 1013118, 278065, 95944, -621253, -514412, -987406, -451906, -215601, -588353, -610178, -712866, -927627, -269525, -151104, -439778, -156682, -139563, -142797, -139754, 273073, 768645, 541545, 772370, 1620701, 195932]
8633A95932j825426R61241k26121Q32642J182177q85452m20344m115Q3353r8034
8623b04147l29219J78516l90372O23429R26709n50551Q8427o34654L2042Q53139
8613E93319o81048p67439L02781R63292j080479L62330O91843L65637O82334m57872
8603I74698r0660m28999k31901j90689P27108J11136l62445j24180k67993Q57899
8593I73974l68657K71775P99469j258030o7709O5978J04456K49193o01157p5779
8583I3513r01211r3023m07328j037975J439724K214241j016120m25710j15982
8574b49871J14672j64709J091240J17380p68655K29437p37781l6950O0626N48575
8564B03964M61897N0634K49837j09360o45956k67619l92270R56569q5005p16097
$$ y = [195932, -1629494, -668253, -894374, -61732, 1120445, 234993, -185351, -189466, -106113, -204147, -533366, -354850, -745222, -121793, 804916, 254365, 342792, -291862, -259820, 593319, -87729, -855168, -552387, 410905, -669574, -307244, 384599, 750236, 1432570, 974698, 884038, 455039, 223138, 32449, 759557, 870693, 508248, 384068, 116075, 973974, 605317, 877092, 1676561, 418531, 350822, 416800, 521256, 770449, 169292, 93513, -807698, -900721, -1308049, -2346024, -906300, 1307941, 291821, -133889, -249871, -135199, -299908, 791332, 908712, 140057, 369494, -368287, -405237, -344611, 203964, 665861, 716495, 966332, 856972, 211016, -56603, -448873, 507696, 422691, -293406]
8554b93406l07409n5795J331137L41965k88664k31004J34537J40849K57506l45949
8544F83767n75459O66906p49702p95353J90607j65323m56781J33169O46425N82231
8534A60487J198831p7522n80265K8107L58252l97160o25627k55491O23896R339
8524D42847n72048M28384r88567K28324J083078k37167n26837j82916O76365M70584
8514H22047J4224Q42328j150461l55151m8161k83674j25396P65352M24508j45254
8504G60362Q2418Q2269m31873M2478l10132k52018M66414q11346m6628Q24335
8494D06279J63904l82090k11876n09082j74933J109390k63760k27254N12713O34133
8484A057424o31357j37724o27942j45967J349979M44329o29157k85714J18753
$$ y = [-293406, -600815, -656610, 674527, 1016492, 727828, 496824, 631361, 772210, 1029716, 683767, 108308, 775214, 25512, -769841, -579234, -744557, -1201338, -1068169, -421744, 160487, 1359318, 1281796, 701531, 729638, 1087890, 690730, 65103, -190388, 433508, 442847, -129201, 299183, -689384, -461060, 622018, 384851, -141986, -324902, 351463, 822047, 836271, 1678599, 528138, 172987, 124826, -158848, -284244, 481108, 905616, 760362, 842780, 925049, 493176, 535654, 225522, -26496, 439918, -371428, -418056, 406279, 570183, 188093, -23783, -532865, -707798, 401592, 137832, -89422, 423291, 1057424, 426067, 288343, -339599, -485566, 864413, 1308742, 679585, 393871, 512624]
8475E12624J47740j001585l88147N11453L8121P3549L40437P97009q55182L31992
8465E08011N44513j237363N258M91656N80405K50455k76416j55313k08288m81438
8455B1480j87728R9831O28117m66196O55758L68552l3088m40534M05887j01389
8445I50690J32485l28437k53604Q42130M02714l60141l16980j80512l50658m49188
8435H8499L99197M57813n86235M87361k03016Q80957L45086O87691j043548J03049
8425A616854n38597M49850K90910m78629n47488L56927m68265j65224R3950R6777
8415G07065n67225J882188n38747k43407J42946l73455N45684J71781O6608k32487
8405A560951J1197P3533p28082j74352K81633K12356J083662q78568n36485J92095
$$ y = [512624, 660364, -341221, -729368, -217915, -179794, -106245, 234192, 1031201, 176019, 508011, 1052524, -184839, -179581, 312075, 892480, 1142935, 866519, 711206, 502918, 21480, -166248, -66417, 561700, 95504, 751262, 1119814, 1086726, 646192, 1052079, 950690, 1083175, 754738, 501134, 1343264, 1745978, 1385837, 1068857, 888345, 537687, 88499, 487696, 945509, 359274, 846635, 643619, 1524576, 1869662, 2557353, 1513805, 1616854, 1078257, 1528107, 1819017, 1340388, 792900, 1149827, 681562, 516338, 610288, 707065, 139840, 2022028, 1483281, 1239874, 1382820, 1009365, 1555049, 1726830, 1793438, 1560951, 1572148, 1645681, 917599, 743247, 1024880, 1237236, 2320898, 1442330, 905845, 1097940]
8395A097940Q34527L69418N92330o09322o28899j07441n55377j25100M9012O98949
8385A616037M21391m4774m48042o00664K65846k83830l40019q7475O79993N99907
8375A778370l36868J75977l84061R98173n18681j74587M05428M8048P17343m58132
8365B251010J58879k04344j80472P08889J75626l36313K28555n11737N5971j044191
8355A301873J26237L61166J67980R88186j11866j068273j92320N73849L9200m24693
8345A761339N46775J12249M20940r26204r18806N99621K85130r2752l41478j12183
8335A334631P45990m31446M55413L4469n63753J007022P8081m37602K27507n65312
8325A885000k17971N14767M06004n10008M1540Q94657r28886L15970l55796M95205
$$ y = [1097940, 1932467, 2301885, 2894215, 2284893, 1655994, 1548553, 993176, 868076, 917088, 1616037, 2037428, 1992654, 1544612, 943948, 1209794, 925964, 585945, 498470, 1178463, 1778370, 1441502, 1617479, 1233418, 2231591, 1712910, 1538323, 1943751, 1991799, 2709142, 2251010, 2409889, 2205545, 2025073, 2733962, 2909588, 2573275, 2801830, 2290093, 2346064, 1301873, 1428110, 1789276, 1957256, 2945442, 2833576, 1765303, 1572983, 2146832, 2186032, 1761339, 2308114, 2420363, 2841303, 1915099, 996293, 1595914, 1881044, 1788292, 1446814, 1334631, 2080621, 1649175, 2104588, 2139057, 1575304, 2582326, 2660407, 2222805, 2450312, 1885000, 1667029, 2181796, 2587800, 2077792, 2119332, 3013989, 2085103, 2401073, 2045277, 2540482]
8315B540482P36360j330628M40076l7672o07300o79032K36058R82663K53131l40394
8305B193744r57918N24195P8306k51080L35662N17053l4600o74240L36796j97685
8295A870233L8400M72680j53601N12656O16972l74869j103253J78258k82042j6586
8285A758848L80614L67613l08762n94599L10619j62962P53025J35348l96247R8974
8275B342471m13344L55324q0201N0207K34032l41317N38021p58165J399194N33603
8265C859825j016529r02971n3009j82971J00649R46557L55364m84508K19168J377713
8255D219288r09443m11378p08985q2708l43313k84874P20442O54650n0592l2285
8245B770802k3288j97241L34424O55978n08690o97250k48323j66580O64991n5127
$$ y = [2540482, 3276842, 1946214, 2386290, 2348618, 1741318, 1062286, 1298344, 2281007, 2534138, 2193744, 1235826, 1760021, 1838327, 1587247, 1922909, 2439962, 2405362, 1731122, 2067918, 1870233, 1908633, 2381313, 2227712, 2740368, 3357340, 2982471, 1879218, 2057476, 1775434, 1758848, 2139462, 2507075, 2198313, 1603714, 1914333, 1751371, 2504396, 2639744, 2243497, 2342471, 1929127, 2284451, 2204250, 2254457, 2488489, 2147172, 2685193, 1927028, 3326222, 3859825, 2843296, 1940325, 1887316, 1704345, 1804994, 2751551, 3106915, 2622407, 2841575, 4219288, 3309845, 2898467, 2189482, 2106774, 1763461, 1478587, 2199029, 2853679, 2803087, 2770802, 2747514, 2550273, 2884697, 3540675, 3031985, 2334735, 2086412, 1919832, 2584823, 2529696]
8235B529696M52588K00762j96549n6041J4044K56910j84773J83934Q8770K47385
8225C536726k54940n92849M38695K03379O77929k79416o9432N33734o37181J35719
8215C692364L22096J0335m45695J31771L5505l4629N88906k59214P20319q00992
8205C960766p7776J379637j85148M25594o13278j97731k25586M10512o0082L20671
8195E137579m54443j173952l69084k62301J051089J473856M80331k78498J66571
8186E771148m82549L28643Q00393j60220K51681k47130J12032J86196m4347J295600
8176G811447n33106p03282M40971P55572K0761q1144R07105J1823J37187l01564
8166H465770k77176j0936J066518j16875K79194J067553M77830k90478j2599M55641
$$ y = [2529696, 2982284, 3183046, 2986497, 2930456, 2944500, 3201410, 3016637, 3200571, 3289341, 3536726, 3281786, 2688937, 3127632, 3331011, 4008940, 3729524, 3660092, 4193826, 3556645, 3692364, 4014460, 4024795, 3579100, 3710871, 3746376, 3711747, 4300653, 4041439, 4761758, 3960766, 3882990, 5262627, 5077479, 5503073, 4889795, 4692064, 4466478, 4876990, 4816908, 5137579, 4683136, 3509184, 3140100, 2877799, 3928888, 5402744, 5883075, 5604577, 5771148, 5288599, 5617242, 6417635, 6257415, 6509096, 6261966, 6373998, 6560194, 6515847, 7811447, 7278341, 6575059, 7016030, 7771602, 7792363, 7711219, 8618324, 8630147, 8767334, 8465770, 8188594, 8177658, 9244176, 9127301, 9406495, 10474048, 10951878, 10661400, 10648801, 11104442]
8156A1104442M01151o3279o8846K89727L78854M32486r3792O40295L18519O10469
8146A3950026M0344M17122K71071N76912J01887J746352J391359j0336J230686
8137A9715423l34449j36909N67560l33416M5918J335141J167664N14416J477182
8128B4018530K43703Q54721J843009J387132J107100J663108K263359K293322
8120C5673984J457467J701307K003447K943037L322126K887866L931799M578126
8112E8499159L780985L587663M434626M425356N135507L817711K317206R28045
8104H6926258j90692j327110j337233k457523l585977k289708j290963o11688
8096G3835364j118764N6750J224526J209415M039533M680991L664052M076409
$$ y = [11104442, 11505593, 11442314, 11373468, 11663195, 12042049, 12474535, 12380743, 13021038, 13339557, 13950026, 13990370, 14407492, 14678563, 15255475, 15357362, 17103714, 18495073, 18484737, 19715423, 19380974, 19244065, 19811625, 19478209, 19524127, 20859268, 22026932, 22541348, 24018530, 24262233, 25116954, 26959963, 28347095, 29454195, 31117303, 33380662, 35673984, 37131451, 38832758, 40836205, 43779242, 47101368, 49989234, 53921033, 58499159, 62280144, 65867807, 70302433, 74727789, 79863296, 83681007, 85998213, 86926258, 86735566, 85408456, 84071223, 81613700, 78027723, 75738015, 74447052, 73835364, 72716600, 72773350, 73997876, 75207291, 79246824, 83927815, 87591867, 91668276]
8088I1668276O970868O788202Q075094Q005687R398183J0180552O975599M961670
8080A53024131J113831j472428m093181p957299r047324r951358j0742209q837635
8072A02036528p882583o513862l783772l210255l709398j179196j083895m70397
8064G4203170J401646K003730K490070K749615M063535L984467L140662L169446
8056I7206341K971681J147673m67866k794369m565311n952283n765296o007253
8048G5773317o114766n424745o022029l124121k442486k270052l061483k495246
8040D4818389k54077j249264j079466l04362k79126P76050q7647R0736k01166
8031D2230067M43217M36193r33021l25142j17184n83351r51456k16517p15401
$$ y = [91668276, 98639144, 105427346, 113502440, 121508127, 130906310, 141086862, 148062461, 153024131, 154137962, 152665534, 148572353, 140615054, 131567730, 121616372, 110874163, 102036528, 94153945, 87640083, 83856311, 80646056, 76936658, 75757462, 74673567, 74203170, 75604816, 77608546, 80098616, 82848231, 86911766, 90896233, 94036895, 97206341, 100178022, 101325695, 100857829, 98063460, 93498149, 87545866, 81780570, 75773317, 69658551, 64233806, 58211777, 55087656, 52645170, 50375118, 47313635, 44818389, 44564312, 43315048, 42235582, 41931220, 41652094, 42428144, 42340497, 42431233, 42230067, 42673284, 43109477, 42176456, 41851314, 41734130, 41150779, 40199323, 39982806, 39267405]
8022C9267405O57951O03588Q4625J134763J20422J322822J279251K036738K137398
8013D8644963K230702K691061L565373J940862K995819L549132K348121J870020
8005F9836053K297656J837210l05799J57037o99435j306854k550786j649548j392357
7996F6223177j922340o03006j111558L05902Q86766M67166J510452L751479L564006
7987G3072044L667106N127115M863256O041032N665122L471100L281145J244419
7979A06432339P01132l13521j058119j764061m880486m914059n865903n798212
7971H2539110o440223n043406l952877l896702l328737j18691j639422k231343
7963E5887709R5591M6207J888356J219838J334360K012166J401095Q10869L07024
$$ y = [39267405, 39925356, 40528944, 40613569, 41748332, 41868754, 43191576, 44470827, 46507565, 48644963, 50875665, 53566726, 57132099, 59072961, 62068780, 65617912, 67966033, 69836053, 72133709, 73970919, 73665120, 73822157, 73122722, 71815868, 69265082, 67615534, 66223177, 64300837, 63697831, 62586273, 62892175, 63778941, 64246107, 65756559, 69508038, 73072044, 76739150, 81866265, 86729521, 92770553, 98435675, 101906775, 105187920, 106432339, 107133471, 106819950, 105761831, 103997770, 99117284, 94203225, 88337322, 82539110, 76098887, 71055481, 67102604, 63205902, 59877165, 59758474, 58119052, 55887709, 55983300, 56029507, 57917863, 59137701, 60472061, 62484227, 63885322, 64696191, 65003215]
7954F5003215l53601k161858q61503j904446l195560k715488l677989m551187
7946D5581583l119440k984115l975137l786755k168298k555096k080271k275102
7938B2637369j191064j690011q18037o54047j069896l43457o53563j459399m77537
7929A4280358l33174n68443j017259n77669L64360j194155j97615r98893L53551
7920A0111061P20975k49032j472080o42104j082386N68150m02635l11371j28997
7911G111581K08602L24517j467748P49368m80616o50495J58423l66340k17206
7902E370086j09028j47494L66474P21099m48832o34369J02427p4684j041600l89917
7892C714162L5857J93878n1209j05720l21341l65020j32736Q16718Q35450k6025
$$ y = [65003215, 64649614, 62487756, 61626253, 59721807, 56526247, 53810759, 50132770, 45581583, 42462143, 39478028, 35502891, 31716136, 29547838, 26992742, 24912471, 22637369, 21446305, 19756294, 18938257, 18284210, 17214314, 16870857, 16217294, 14757895, 14280358, 13947184, 13378741, 12361482, 11783813, 12148173, 10954018, 10756403, 9757510, 10111061, 10832036, 10583004, 9110924, 8468820, 7386434, 7954584, 7551949, 7240578, 7111581, 7320183, 7644700, 6176952, 6926320, 6445704, 5795209, 5953632, 5587292, 5370086, 5261058, 5113564, 5480038, 6201137, 5752305, 5117936, 5220363, 5145679, 4104079, 3714162, 3750019, 3943897, 3892688, 3786968, 3465627, 3100607, 2967871, 3784589, 4620039, 4594014]
7882D594014m54053r7909L04146p96869M46604r52276m93057P98431L28400m86662
$$ y = [4594014, 4139961, 4042052, 4346198, 3549329, 3995933, 3043657, 2550600, 3349031, 3677431, 3190769]
$$ [...]
##END NTUPLES=NMR SPECTRUM
##END=
