##TITLE=1H_CG-1202-A
 CDCl3
 8 sc, 
 6.12.2024
##JCAMPDX= 6.0         $$ Bruker NMR JCAMP-DX V2.0
##DATA TYPE= NMR SPECTRUM
##DATA CLASS= NTUPLES
##ORIGIN= UXNMR, Bruker Analytische Messtechnik GmbH
##OWNER= root
$$ XWIN-NMR		Version 3.5
$$ Fri Dec  6 14:12:56 2024 Russian Standard Time (UT+4h)  she@DPX200
##.OBSERVE FREQUENCY= 200.1315
##.OBSERVE NUCLEUS= ^1H
##.ACQUISITION MODE= SIMULTANEOUS
##.ACQUISITION SCHEME= undefined
##.AVERAGES= 8
##.DIGITISER RES= 18
##SPECTROMETER/DATA SYSTEM= spect
##.PULSE SEQUENCE= zg30
##.SOLVENT NAME= CDCl3
##.SHIFT REFERENCE= (INTERNAL, CDCl3, 0, 19.5385)
##AUDIT TRAIL= $$ (NUMBER, WHEN, WHO, WHERE, WHAT)
$$ ##TITLE= Audit trail, XWIN-NMR		Version 3.5
$$ ##JCAMPDX= 5.01
$$ ##ORIGIN= Bruker BioSpin GmbH
$$ ##OWNER= she
$$ F:/spectra/data/she/nmr/H-F/1/pdata/1/auditp.txt
$$ ##AUDIT TRAIL=  $$ (NUMBER, WHEN, WHO, WHERE, WHAT)
(   1,<2024-12-06 14:11:41.35 +0400>,<she>,<DPX200>,
      <created by zg, POWCHK disabled, PULCHK disabled
       configuration hash MD5:
       00 E9 B6 7A A2 85 ED C7 34 08 36 98 17 FE 4E 26
       data hash MD5: 16K
       7F FB 33 14 42 06 92 BA D8 92 DB 93 14 FF 86 3E>)
(   2,<2024-12-06 14:11:44.37 +0400>,<she>,<DPX200>,
      <Start of raw data processing
       efp BC_mod = 2 LB = 0.24 FT_mod = 6 PKNL = 1 PHC0 = -26864.07 PHC1 = 14.58744 SI = 16K 
       data hash MD5: 16K
       D3 3C E5 90 E2 D4 D1 A7 0C 60 66 D4 90 5A 16 A8>)
(   3,<2024-12-06 14:12:03.90 +0400>,<she>,<DPX200>,
      <pk PHC0 = 153.6541 PHC1 = 7.2 
       data hash MD5: 16K
       C7 7B 09 D4 A4 5C E6 6B 20 53 3A B7 A4 28 A2 6F>)
(   4,<2024-12-06 14:12:07.31 +0400>,<she>,<DPX200>,
      <abs ABSG = 5 
       data hash MD5: 16K
       17 E2 DC 56 2E A5 54 65 20 C5 70 20 0D D6 6C D1>)
$$ ##END=
$$ 
$$ hash MD5
$$ 2C 66 40 0B 82 7A 01 F9 24 8B 37 ED EE 11 9B 0B
##$RELAX= 
##$RELAX= 
##$RELAX= 
##$RELAX= 
##$RELAX= 
##$RELAX= 
$$ Bruker specific parameters
$$ --------------------------
##$DU= <F:/spectra>
##$EXPNO= 1
##$NAME= <H-F>
##$PROCNO= 1
##$TYPE= <nmr>
##$USER= <she>
##$AMP= (0..31)
100 100 100 100 100 100 100 100 100 100 100 100 100 100 100 100 100 100 
100 100 100 100 100 100 100 100 100 100 100 100 100 100 
##$AQSEQ= 0
##$AQ_mod= 1
##$AUNM= <au_zg>
##$AUTOPOS= <>
##$BF1= 200.13
##$BF2= 200.13
##$BF3= 200.13
##$BF4= 200.13
##$BF5= 200.13
##$BF6= 200.13
##$BF7= 200.13
##$BF8= 200.13
##$BYTORDA= 1
##$CFDGTYP= 0
##$CFRGTYP= 5
##$CHEMSTR= <none>
##$CNST= (0..31)
1 1 145 1 1 1 1 1 1 1 1 1 1 1 1 1 1 1 1 1 1 1 1 1 1 1 1 1 1 1 1 1 
##$CPDPRG= <>
##$CPDPRG1= <>
##$CPDPRG2= <>
##$CPDPRG3= <>
##$CPDPRG4= <mlev>
##$CPDPRG5= <mlev>
##$CPDPRG6= <mlev>
##$CPDPRG7= <mlev>
##$CPDPRG8= <mlev>
##$CPDPRGB= <>
##$CPDPRGT= <>
##$D= (0..31)
0 1.2 0 0 0 0 0 0 0 0.06 0 0.03 0 0 0 0 0.0002 0 0 0 0 0 0 0 0 0 0 0 0 
0 0 0 
##$DATE= 1733479900
##$DBL= (0..7)
120 120 120 120 120 120 120 120 
##$DBP= (0..7)
150 150 150 150 150 150 150 150 
##$DBP07= 0
##$DBPNAM0= <>
##$DBPNAM1= <>
##$DBPNAM2= <>
##$DBPNAM3= <>
##$DBPNAM4= <>
$$ [...]
##$SUBNAM3= <"">
##$SUBNAM4= <"">
##$SUBNAM5= <"">
##$SUBNAM6= <"">
##$SUBNAM7= <"">
##$SUBNAM8= <"">
##$SUBNAM9= <"">
##$SW= 24.0689530833862
##$SWIBOX= (0..15)
0 0 2 0 0 0 0 0 0 0 0 0 0 0 0 0 
##$SW_h= 4816.95568400771
##$TD= 16384
##$TD0= 1
##$TE= 0
##$TE2= 300
##$TE3= 300
##$TEG= 300
##$TL= (0..7)
0 120 120 120 120 120 120 120 
##$TP= (0..7)
150 150 150 150 150 150 150 150 
##$TP07= 0
##$TPNAME0= <>
##$TPNAME1= <>
##$TPNAME2= <>
##$TPNAME3= <>
##$TPNAME4= <>
##$TPNAME5= <>
##$TPNAME6= <>
##$TPNAME7= <>
##$TPOAL= (0..7)
0.5 0.5 0.5 0.5 0.5 0.5 0.5 0.5 
##$TPOFFS= (0..7)
0 0 0 0 0 0 0 0 
##$TUNHIN= 0
##$TUNHOUT= 0
##$TUNXOUT= 0
##$USERA1= <user>
##$USERA2= <user>
##$USERA3= <user>
##$USERA4= <user>
##$USERA5= <user>
##$V9= 5
##$VALIST= <valist>
##$VCLIST= <CCCCCCCCCCCCCCC>
##$VD= 0
##$VDLIST= <DDDDDDDDDDDDDDD>
##$VPLIST= <PPPPPPPPPPPPPPP>
##$VTLIST= <TTTTTTTTTTTTTTT>
##$WBST= 1024
##$WBSW= 4
##$XGAIN= (0..3)
0 0 0 0 
##$XL= 0
##$YL= 0
##$YMAX_a= 1013471
##$YMIN_a= -583426
##$ZGOPTNS= <>
##$ZL1= 120
##$ZL2= 120
##$ZL3= 120
##$ZL4= 120
##$ABSF1= 19.43424
##$ABSF2= -4.634892
##$ABSG= 5
##$ABSL= 3
##$ALPHA= 0
##$AQORDER= 0
##$ASSFAC= 0
##$ASSFACI= 0
##$ASSFACX= 0
##$ASSWID= 0
##$AUNMP= <proc_1d>
##$AZFE= 0.1
##$AZFW= 0.1
##$BCFW= 0
##$BC_mod= 2
##$BYTORDP= 0
##$COROFFS= 0
##$CY= -3
##$DATMOD= 1
##$DC= 0
##$DFILT= <>
##$DTYPP= 0
##$F1P= 0
##$F2P= 0
##$FCOR= 1
##$FTSIZE= 16384
##$FT_mod= 6
##$GAMMA= 0
##$GB= 0
##$INTBC= 1
##$INTSCL= 2.524811e-10
##$ISEN= 128
##$LB= 0.24
##$LEV0= 0
##$LPBIN= 0
##$MAXI= 10000
##$MC2= 0
##$MEAN= 0
##$ME_mod= 0
##$MI= 1.114404
##$NCOEF= 0
##$NC_proc= -4
##$NLEV= 6
##$NOISF1= 3.799351
##$NOISF2= 2.8
##$NSP= 0
##$NTH_PI= 0
##$NZP= 0
##$OFFSET= 19.53854
##$PC= 1
##$PHC0= -26710.42
##$PHC1= 21.78744
##$PH_mod= 1
##$PKNL= yes
##$PPARMOD= 0
##$PSCAL= 0
##$PSIGN= 0
##$REVERSE= no
##$SF= 200.129998229963
##$SI= 16384
##$SIGF1= 3
##$SIGF2= 2
##$SINO= 5.538805
##$SIOLD= 16384
##$SREGLST= <1H.CDCl3>
##$SSB= 0
##$STSI= 16384
##$STSR= 0
##$SW_p= 4816.95568400771
##$SYMM= 0
##$S_DEV= 0
##$TDeff= 16384
##$TDoff= 0
##$TI= <>
##$TILT= no
##$TM1= 0
##$TM2= 0
##$TOPLEV= 0
##$USERP1= <user>
##$USERP2= <user>
##$USERP3= <user>
##$USERP4= <user>
##$USERP5= <user>
##$WDW= 1
##$XDIM= 16384
##$YMAX_p= 304559679
##$YMIN_p= -96198
$$ End of Bruker specific parameters
$$ ---------------------------------
##NTUPLES= NMR SPECTRUM
##VAR_NAME=  FREQUENCY,     SPECTRUM/REAL,   SPECTRUM/IMAG
##SYMBOL=    X,             R,               I
##VAR_TYPE=  INDEPENDENT,   DEPENDENT,       DEPENDENT
##VAR_FORM=  AFFN,          ASDF,            ASDF
##VAR_DIM=   16384,         16384,           16384
##UNITS=     HZ,            ARBITRARY UNITS, ARBITRARY UNITS
##FACTOR=    0.29402158847633, 1,            1
##FIRST=     3910.24795289623, 0,            0
##LAST=      -906.707731111485, 0,           0
##MIN=       -906.707731111485, -96198,      0
##MAX=       3910.24795289623, 304559679,    0
$$ Real data points
##PAGE= N=1
##DATA TABLE= (X++(R..R)), XYDATA
$$ [...]
$$ plain form
8299 839819 843132 820945 861228 886088 917211 889197 942038 957240 980748 984096 1012727 1068068
8287 1068068 1066326 1116609 1154333 1117872 1156847 1170916 1222382 1250505 1283264 1296827 1324173 1359217
8275 1359217 1421056 1444134 1512030 1552688 1671209 1724847 1765223 1843089 1908771 2009526 2100892
8264 2100892 2231248 2367424 2525977 2664569 2879825 3131519 3444462 3790943 4164558 4592152
8254 4592152 4935806 5301132 5597860 5836707 5976497 5960322 5808321 5597755 5362055 5068200
8244 5068200 4756094 4420443 4144929 3941271 3789700 3715487 3661819 3596902 3638612 3698643
8234 3698643 3815343 3970339 4229749 4540709 4884667 5279436 5630407 5984956 6340091 6568524
8224 6568524 6688655 6666956 6559182 6325227 5985530 5579602 5222260 4798540 4356214 4033960
$$ packed form
8299H39819L313k2187M0283K4860L1123k8014N2841J5202K3508L348K8631N5341
8287A068068j742N0283L7724l6461L8975J4069N1466K8123L2759J3563K7346L5044
8275A359217O1839K3078O7896M0658J18521N3638M0376P7866O5682J00755R1366
8264B100892J30356J36176J58553J38592K15256K51694L12943L46481L73615M27594
8254D592152L43654L65326K96728K38847J39790j6175j52001k10566k35700k93855
8244E068200l12106l35651k75514k03658j51571p4213n3668o4917M1710O0031
8234C698643J16700J54996K59410L10960L43958L94769L50971L54549L55135K28433
8224F568524J20131k1699j07774k33955l39697m05928l57342m23720m42326l22254
$$ plain form
8214 4033960 3796350 3596092 3439374 3286404 3212359 3133291 3125319 3112480 3076206 3087667 3077885
8203 3077885 3077764 3138517 3193371 3266166 3341721 3397252 3428403 3541691 3602758 3732563 3695198
8192 3695198 4258741 4577734 4409473 4495426 4536859 4695808 4780424 4859953 4885059 4930489 4953189
8181 4953189 4990297 4965933 4953777 4954640 5012523 5022756 5167400 5266132 5421147 5622453 5936268
8170 5936268 6298553 6593964 6874493 7166398 7372105 7495876 7543823 7592502 7556089 7488459
8160 7488459 7398450 7292291 7178756 7104418 6950445 6821769 6742428 6679736 6631283 6612333 6671141
8149 6671141 6792938 7002149 7281482 7710293 8071887 8415757 8769766 9136781 9456779 9582133
8139 9582133 9636648 9653972 9505496 9282961 9009260 8790244 8474090 8198708 8040922 8013531
$$ packed form
8214D033960k37610k00258j56718j52970p4045p9068p972j2839l6274J1461r782
8203C077885j21O0753N4854P2795P5555N5531L1151J13288O1067J29805l7365
8192C695198N63543L18993j68261Q5953M1433J58949Q4616P9529K5106M5430K2700
8181D953189L7108k4364j2156Q63N7883J0233J44644R8732J55015K01306L13815
8170E936268L62285K95411K80529K91905K05707J23771M7947M8679l6413o7630
8160G488459r0009j06159j13535p4338j53973j28676p9341o2692m8453j8950N8808
8149F671141J21797K09211K79333M28811L61594L43870L54009L67015L19998J25354
8139I582133N4515J7324j48476k22535k73701k19016l16154k75382j57786k7391
$$ plain form
8129 8013531 8028229 8102765 8169035 8241334 8376485 8433923 8475708 8565080 8566279 8653447 8803067
8118 8803067 8950357 9036811 9080319 9105780 9106666 9047165 8895653 8707993 8510854 8277547 7992188
8107 7992188 7831152 7779506 7753645 7871665 8005334 8171034 8276942 8347220 8355422 8306063 8180384
8096 8180384 7986210 7772284 7547783 7213987 6876986 6654010 6474025 6274019 6169639 6070803
8086 6070803 6002521 6015969 6014851 6003271 6081020 6199644 6300239 6410859 6594729 6788990 7054277
8075 7054277 7292008 7571869 7867261 8255949 8693343 9245022 9853984 10621347 11495497 12555319
8065 12555319 13856769 15568312 17749560 20910091 24469812 26427764 26350780 23466919
8057 23466919 19851664 16795140 14645417 13092809 11965158 11162072 10573721 10192308 9983670
$$ packed form
8129H013531J4698P4536O6270P2299J35151N7438M1785Q9372J199Q7168J49620
8118H803067J47290Q6454M3508K5461Q86n9501j51512j87660j97139k33307k85359
8107G992188j61036n1646k5861J18020J33669J65700J05908P0278Q202m9359j25679
8096H180384j94174k13926k24501l33796l37001k22976j79985k00006j04380r8836
8086F070803o8282J3448j118j1580P7749J18624J00595J10620J83870J94261K65287
8075G054277K37731K79861K95392L88688M37394N51679O08962P67363Q74150J059822
8065A2555319J301450J711543K181248L160531L559721J957952p6984k883861
8057B3466919l615255l056524k149723j552608j127651q03086n88351l81413k08638
$$ plain form
8048 9983670 9816692 9678686 9542110 9424210 9328178 9296728 9336654 9345716 9406953 9508644 9563164
8037 9563164 9725452 9856044 9962628 10077080 10059391 9992820 9699030 9318761 8930599 8463034
8027 8463034 7982854 7532836 7108422 6750814 6464888 6121041 5831138 5621568 5414730 5216040
8017 5216040 5052184 4978475 4878250 4792939 4779528 4818822 4809471 4815840 4870347 4935916 4952375
8006 4952375 4956515 4885345 4860327 4817473 4720453 4587370 4450886 4337495 4193543 4075399 4013780
7995 4013780 3921917 3824639 3773502 3744820 3694145 3639534 3631015 3628912 3623372 3659278 3662022 3653695
7983 3653695 3716505 3799299 3841882 3883669 3924643 3990318 4038662 4061398 4066367 4134131 4152866 4243838
7971 4243838 4331114 4473912 4643261 4804022 4987011 5150897 5309012 5418207 5421037 5429587
$$ packed form
8048I983670j66978j38006j36576j17900r6032l1450L9926R062O1237J01691N4520
8037I563164J62288J30592J06584J14452j7689o6571k93790l80269l88162m67565
8027H463034m80180m50018m24414l57608k85926l43847k89903k09570k06838j98690
8017E216040j63856p3709j00225q5311j3411L9294r351O369N4507O5569J6459
8006D952375M140p1170k5018m2854r7020j33083j36484j13391j43952j18144o1619
7995D013780r1863r7278n1137k8682n0675n4611q519k103n540L5906K744q327
7983C653695O2810Q2794M2583M1787M0974O5675M8344K2736M969O7764J8735R0972
7971D243838Q7276J42798J69349J60761J82989J63886J58115J09195K830Q550
$$ plain form
7961 5429587 5407391 5332091 5220204 5061239 4986157 4921513 4877101 4833480 4835806 4879896 4934745
7950 4934745 5053127 5192558 5396195 5674166 6013693 6332562 6639798 6972468 7187758 7352591
7940 7352591 7431878 7452148 7411978 7249924 7072006 6859437 6606586 6350675 6095162 5901113
7930 5901113 5721849 5559644 5466588 5423750 5390367 5415478 5481935 5540788 5638411 5851134 6121421
7919 6121421 6387880 6644326 6851859 7022174 7167616 7253395 7381680 7496412 7651568 7759046
7909 7759046 7733199 7729725 7681443 7574915 7455846 7289859 7106159 6870049 6550270 6182450
7899 6182450 5822462 5719823 5574272 5473440 5360679 5372962 5341134 5301318 5329671 5364834
7889 5364834 5448191 5575947 5777807 6002045 6272233 6520991 6724679 6855255 6897081 6848407
$$ packed form
7961E429587k2196p5300j11887j58965p5082o4644m4412m3621K326M4090N4849
7950D934745J18382J39431K03637K77971L39527L18869L07236L32670K15290J64833
7940G352591P9287K0270m0170j62054j77918k12569k52851k55911k55513j94049
7930E901113j79264j62205r3056m2838l3383K5111O6457N8853R7623K12723K70287
7919F121421K66459K56446K07533J70315J45442Q5779J28285J14732J55156J07478
7909G759046k5847l474m8282j06528j19069j65987j83700k36110l19779l67820
7899F182450l59988j02639j45551j00832j12761J2283l1828l9816K8353L5163
7889E364834Q3357J27756K01860K24238K70188K48758K03688J30576M1826m8674
$$ plain form
7879 6848407 6705262 6498963 6256136 5918738 5617100 5320259 5057956 4856333 4656669 4501235
7869 4501235 4329864 4179830 4074889 4008714 3944957 3950142 3991343 4071138 4149269 4227221 4280174
7858 4280174 4324592 4290935 4164801 4073609 4037205 3931824 3757170 3611341 3474655 3337422
7848 3337422 3203846 3071716 3008144 2905975 2787820 2729389 2644608 2582202 2509566 2498991 2442464
7837 2442464 2412560 2394872 2385762 2373444 2325682 2310980 2361113 2348672 2385136 2420642 2464301 2502789
7825 2502789 2535035 2526294 2524652 2538389 2480465 2430044 2391444 2301346 2244574 2166485 2141726 2125065
7813 2125065 2114473 2086006 2129536 2141309 2183730 2244321 2287526 2320886 2345677 2449269 2493456
7802 2493456 2525967 2540660 2606131 2736208 2840626 2890282 2881510 2882841 2852840 2756967 2632257
$$ packed form
7879F848407j43145k06299k42827l37398l01638k96841k62303k01623j99664j55434
7869D501235j71371j50034j04941o6175o3757N185M1201P9795P8131P7952N2953
7858D280174M4418l3657j26134r1192l6404j05381j74654j45829j36686j37233
7848C337422j33576j32130o3572j02169j18155n8431q4781o2406p2636j0575n6527
7837B442464k9904j7688r110j2318m7762j4702N0133j2441L6464L5506M3659L8488
7825B502789L2246q741j642J3737n7924n0421l8600r0098n6772p8089k4759j6661
7813B125065j0592k8467M3530J1773M2421O0591M3205L3360K4791J03592M4187
7802B493456L2511J4693O5471J30077J04418M9656q772J331l0001r5873j24710
$$ plain form
7791 2632257 2552185 2503438 2462356 2410018 2382789 2406903 2441853 2495288 2496829 2540638 2612681 2652519
7779 2652519 2672677 2648439 2610288 2684251 2710179 2732336 2768720 2799547 2856558 2905960 2950787
7768 2950787 2995675 3038455 3038836 3044790 3037292 3071489 3108070 3188657 3235707 3314209 3413546 3495950
7756 3495950 3540865 3604127 3663321 3749574 3798084 3888114 4014957 4195825 4383299 4614308 4878706
7745 4878706 5209998 5692368 6248968 6860247 7639621 8319471 8751805 9104099 9083389 8805689
7735 8805689 8471294 8045368 7617858 7350922 7179999 7187691 7344201 7450656 7611835 7761226
7725 7761226 7695553 7573985 7463056 7241277 6977942 6788738 6697186 6669781 6729185 6953063
7715 6953063 7321165 7796109 8365782 8975203 9385439 9733856 9866605 9733730 9574691 9457180
$$ packed form
7791B632257q0072m8747m1082n2338k7229K4114L4950N3435J541M3809P2043L9838
7779B652519K0158k4238l8151P3963K5928K2157L6384L0827N7011M9402M4827
7768B950787M4888M2780L81N954p498L4197L6581Q0587M7050P8502R9337Q2404
7756C495950M4915O3262N9194Q6253M8510R0030J26843J80868J87474K31009K64398
7745D878706L31292M82370N56600O11279P79374O79850M32334L52294k0710k77700
7735H805689l34395m25926m27510k66936j70923P692J56510J06455J61179J49391
7725G761226o5673j21568j10929k21779k63335j89204r1552k7405N9404K23878
7715F953063L68102M74944N69673O09421M10236L48417J32749j32875j59039j17511
$$ plain form
7705 9457180 9438389 9405149 9537995 9687840 9580718 9419873 9114453 8602433 8036487 7448949
7695 7448949 6748742 6188759 5686312 5255948 4884080 4577622 4380588 4239134 4113282 4036362
7685 4036362 4030562 4036779 4089052 4201449 4293273 4468962 4710138 4895805 5077668 5219505 5226565
7674 5226565 5088988 4943850 4692278 4376693 4030166 3739766 3453923 3137733 2928399 2696926
7664 2696926 2538828 2378727 2276031 2136121 2078817 2051335 1983013 1958895 1931830 1877794 1856418
7653 1856418 1842760 1817345 1789089 1807950 1747077 1708772 1700096 1683842 1655794 1587903 1527575 1486664
7641 1486664 1413602 1304286 1209352 1156311 1118659 1055334 996981 984806 985506 951086 909246 897008
7629 897008 885607 875502 833431 828612 845308 818522 799556 769937 744320 721723 701474 694997
$$ packed form
7705I457180j8791l3240J32846J49845j07122j60845l05420n12020n65946n87538
7695G448949p00207n59983n02447m30364l71868l06458j97034j41454j25852p6920
7685D036362n800O217N2273J12397R1824J75689K41176J85667J81863J41837P060
7674E226565j37577j45138k51572l15585l46527k90400k85843l16190k09334k31473
7664B696926j58098j60101j02696j39910n7304k7482o8322k4118k7065n4036k1376
7653A856418j3658k5415k8256J8861o0873l8305q676j6254k8048o7891o0328m0911
7641A486664p3062j09316r4934n3041l7652o3325n8353j2175P00l4420m1840j2238
7629H97008j1401j0105m2071m819J6696k6786j8966k9619k5617k2597k0249o477
$$ plain form
7617 694997 721499 700960 682957 644942 649182 644937 622351 620407 572816 536023 545504 544112 536648
7604 536648 486053 460042 462855 454753 410684 427811 424496 439306 404304 423968 431919 414372
7592 414372 389917 390101 402555 395604 377258 368571 404570 422008 369680 348645 324158 335005
7580 335005 301877 290323 284727 240199 237169 218481 242619 228220 210410 201657 201373 181027 203190
7567 203190 222600 192994 197665 231781 222912 215968 231089 217417 227856 207834 166840 183008
7555 183008 190539 177548 176421 173685 178804 168976 147354 147420 169409 169081 150759 138170 139588 162465
7541 162465 156721 142837 135654 120125 138000 146363 140259 135389 131656 129230 101567 99740 102589
7528 102589 109874 118636 123657 143549 121072 104304 83751 71764 75657 86287 121818 103271
$$ packed form
7617F94997K6502k0539j8003l8015M240m245k2586j944m7591l6793R481j392p464
7604E36648n0595k6011K813q102m4069J7127l315J4810l5002J9664P951j7547
7592D14372k4455J84J2454o951j8346q687L5999J7438n2328k1035k4487J0847
7580C35005l3128j1554n596m4528l030j8688K4138j4399j7810q753k84k0346K2163
7567B03190J9410k9606M671L4116q869o944J5121j3672J0439k0022m0994J6168
7555A83008P531j2991j127k736N119r828k1622O6K1989l28j8322j2589J418K2877
7541A62465n744j3884p183j5529J7875Q363o104m870l733k426k7663j827K849
7528A02589P285Q762N021J9892k2477j6768k0553j1987L893J0630L5531j8547
$$ plain form
7516 103271 48645 56027 80446 71355 75679 127286 147272 121491 102991 100188 54445 83092
7504 83092 62167 38332 27086 49525 56894 64197 82734 86947 24846 54198 42772 29164
7492 29164 41515 19832 68754 83342 99473 85860 67149 79092 64159 57901 62155 84480
7480 84480 88174 83251 89611 71029 56663 25090 55163 78740 91196 46374 33540 82821
7468 82821 71395 121619 134498 94262 78709 74243 87310 55086 90367 58345 35669 33683
7456 33683 49281 80329 97241 47620 59064 81553 47434 45767 94788 89661 74018 48305
7444 48305 67034 12180 16824 18770 2602 43520 70049 70715 29550 30190 59129 54898 67887
7431 67887 71815 51677 81050 70321 50511 86660 41899 22079 544 -24410 -5521 -11488
$$ packed form
7516A03271n4626P382K4419r091M324N1607J9986k5781j8500k803m5743K8647
7504H3092k0925k3835j1246K2439P369P303J8537M213o2101K9352j1426j3608
7492B9164J2351k1683M8922J4588J6131j3613j8711J1943j4933o258M254K2325
7480H4480L694m923O360j8582j4366l1573L0073K3577J2456m4822j2834M9281
7468H2821j1426N0224J2879m0236j5553m466J3067l2224L5281l2022k2676j986
7456C3683J5598L1048J6912m9621J1444K2489l4119j667M9021n127j5643k5713
7444D8305J8729n4854M644J946j6168M0918K6529O66m1165O40K8939m231J2989
7431F7887L928k0138K9373j0729j9810L6149m4761j9820k1535k4954J8889n967
$$ plain form
7419 -11488 -16941 -3659 34624 10567 18368 41122 6128 17641 13561 52918 47107 24821 20044
7406 20044 43645 18550 31755 47531 8306 36229 21099 20891 53331 29528 3112 19151
7394 19151 35849 23219 22737 -7075 -2511 24279 11844 65325 22301 10689 36986 20045
7382 20045 15014 40917 -19732 -2379 -4004 31464 13449 -729 26510 2927 7246 9135 26878
7369 26878 13664 31718 40619 4561 6506 16471 10242 39744 29810 40844 25961 31157 37291
7356 37291 71006 98635 21047 4363 44704 46556 27245 -8220 13231 41419 29384 11242
7344 11242 23546 -5319 8065 26326 22488 -1062 47202 42639 76255 80202 38116 57808
7332 57808 86635 113300 93462 104603 69386 98295 80333 86471 70025 103301 117163 78128
$$ packed form
7419a1488n453J3282L8283k4057P801K2754l4994J1513m080L9357n811k2286m777
7406B0044K3601k5095J3205J5776l9225K7923j5130k08L2440k3803k6416J6039
7394A9151J6698j2630m82k9812M564K6790j2435N3481m3024j1612K6297j6941
7382B0045n031K5903o0649J7353j625L5468j8015j4178K7239k3583M319J889J7743
7369B6878j3214J8054Q901l6058J945R965o229K9502r934J1034j4883N196O134
7356C7291L3715K7629p7588j6684M0341J852j9311l5465K1451K8188j2035j8142
7344A1242J2304k8865J3384J8261l838k3550M8264m563L3616L947m2086J9692
7332E7808K8827K6665j9838J1141l5217K8909j7962O138j6446L3276J3862l9035
$$ plain form
7320 78128 60106 73542 110068 117340 78588 71881 86147 81221 72460 66401 84354 97002 117145
7307 117145 96094 77344 86462 89021 104389 112369 106008 130599 144884 130371 139091 145805 112436
7294 112436 108814 110170 84426 106914 119502 126943 113146 165072 184115 156012 126314 93262
7282 93262 37923 47354 45055 15959 11664 54020 34689 13067 40991 37592 36145 48773 28048
7269 28048 25994 13984 36449 31837 -10286 10039 5390 -850 6915 26235 19835 43998 80905
7256 80905 28526 34969 38367 12086 54961 59823 24894 45190 30532 40256 -9006 -3980 10649
7243 10649 30534 25847 26225 19962 18033 1700 -7756 24768 3201 19759 23635 36872 30038
7230 30038 33710 20876 33117 31967 -825 38174 37162 -10644 47510 38935 29036 -10262 -14476
$$ packed form
7320G8128j8022J3436L6526P272l8752o707J4266m926q761o059J7953J2648K0143
7307A17145k1051j8750R118K559J5368P980o361K4591J4285j4513Q720O714l3369
7294A12436l622J356k5744K2488J2588P441j3797N1926J9043k8103k9698l3052
7282I3262n5339R431k299k9096m295M2356j9331k1622K7924l399j447J2628k0725
7269B8048k054j2010K2465m612m2123K0325m649o240P765J9320o400K4163L6907
7256H0905n2379O443L398k6281M2875M862l4929K0296j4658R724m9262N026J4629
7243A0649J9885m687L78o263j929j6333r456L2524k1567J6558L876J3237o834
7230C0038L672j2834J2241j150l2792L8999j012m7806N8154q575r899l9298m214
$$ plain form
7217 -14476 -15993 2176 -21649 15921 43597 7235 37593 29046 9429 54724 36667 45360
7205 45360 86118 30223 38773 44810 56128 65655 46658 31577 41118 70240 26956 71170 93516
7192 93516 80131 104801 84401 79818 96749 78837 103363 89619 118485 98757 125342 129665
7180 129665 105408 84563 87284 92923 115335 129886 121549 83798 79367 97904 87342 50407
7168 50407 22502 44553 34799 43040 40027 73897 93355 61360 70670 74846 36242 33069 63892
7155 63892 33885 34801 38443 52745 83234 52299 43456 43485 76472 68499 51882 71145 69840 57391
7141 57391 57443 84542 98126 84229 103373 110694 86683 107656 95009 84267 67116 59670 74696
7128 74696 115179 149445 144945 108359 150583 169500 92227 139130 186014 193432 202527 232131
$$ packed form
7217a4476j517J8169k3825L7570K7676l6362L0358q547j9617M5295j8057Q693
7205D5360M0758n5895Q550O037J1318R527j8997j5081R541K9122m3284M4214K2346
7192I3516j3385K4670k0400m583J6931j7912K4526j3744K8866j9728K6585M323
7180A29665k4257k0845K721N639K2412J4551q337l7751m431J8537j0562l6935
7168E0407k7905K2051r754Q241l013L3870J9458l1995R310M176l8604l173L0823
7155F3892l0007R16L642J4302L0489l0935q843K9L2987p973j6617J9263j305j2449
7141E7391N2K7099J3584j3897J9144P321k4011K0973j2647j0742j7151p446J5026
7128G4696M0483L4266m500l6586M2224J8917p7273M6903M6884P418R095K9604
$$ plain form
7116 232131 172484 163983 135917 138536 140419 121238 153435 135313 128886 164340 148863 149736 164145
7103 164145 182994 179567 187408 168906 187272 163350 162318 159742 153353 161277 190014 187969 182905
7090 182905 172510 158938 198507 216988 261298 266551 277586 327414 336103 379122 432158 430341
7078 430341 443741 398471 350143 328735 298612 278425 244367 222134 207827 184220 189236 193519
7066 193519 203688 185993 166329 172785 189862 137780 124273 150639 146525 198067 179294 148573
7054 148573 153855 126926 150915 141679 154584 170405 182882 188221 178322 190917 198714 191648 204267
7041 204267 187773 206252 238414 233365 218624 225207 217311 221851 197044 185202 242953 238002 288593
7028 288593 270568 312727 332668 324368 358736 382000 426147 430037 502076 546082 528216 514500
$$ packed form
7116B32131n9647q501k8066K619J883j9181L2197j8122o427L5454j5477Q73J4409
7103A64145J8849l427P841j8502J8366k3922j032k576o389P924K8737k045n064
7090A82905j0395j3572L9569J8481M4310N253J1035M9828Q689M3019N3036j817
7078D30341J3400m5270m8328k1408l0123k0187l4058k2233j4307k3607N016M283
7066A93519J0169j7695j9664O456J7077n2082j3507K6366m114N1542j8773l0721
7054A48573N282k6929K3989r236J2905J5821J2477N339r899J2595P797p066J2619
7041B04267j6494J8479L2162n049j4741O583p896M540k4807j1842N7751m951N0591
7028B88593j8025M2159J9941q300L4368K3264M4147L890P2039M4006j7866j3716
$$ plain form
7016 514500 468930 443032 438464 419117 440866 392736 355217 437349 421988 387518 391466 371895
7004 371895 355353 352525 341035 325219 318710 279133 306140 327391 340187 325272 305532 282386
6992 282386 308344 301000 306108 371702 353172 313300 302149 333419 327253 314400 329247 342254
6980 342254 362476 361189 416661 380514 444079 482660 476135 516859 578453 590575 639858 643876
6968 643876 636410 683128 675684 689338 618345 644637 621890 613394 609213 570553 563771 570086 551516
6955 551516 549885 520329 524268 487753 539148 557575 506640 519513 519726 543129 550049 523062 549297
6942 549297 572295 611786 608975 610575 599916 662448 692013 719554 743361 789974 831007 836393
6930 836393 882222 914013 955793 969918 978984 1021725 1013956 991039 1005584 976612 946468 962227
$$ packed form
7016E14500m5570k5898m568j9347K1749m8130l7519Q2132j5361l4470L948j9571
7004C71895j6542k828j1490j5816o509l9577K7007K1251J2796j4915j9740k3146
6992B82386K5958p344N108O5594j8530l9872j1151L1270o166j2853J4847J3007
6980C42254K0222j287N5472l6147O3565L8581o525M0724O1594J2122M9283M018
6968F43876p466M6718p444J3654p0993K6292k2747q496m181l8660o782O315j8570
6955E51516j631k9556L939l6515N1395J8427n0935J2873K13K3403O920k6987K6235
6942E49297K2998L9491k811J600j0659O2532K9565K7541K3807M6613M1033N386
6930H36393M5829L1791M1780J4125R066M2741p769k2917J4545k8972l0144J5759
$$ plain form
6918 962227 995715 999174 1001618 1053244 1063565 1048786 1096995 1131352 1153284 1183000 1174539 1207089
6906 1207089 1221956 1212468 1236191 1288541 1305854 1336095 1374696 1392478 1446104 1563392 1608113
6895 1608113 1632655 1698478 1732055 1838795 1919133 1992863 2072088 2165915 2244139 2339693 2395622
6884 2395622 2542963 2675417 2795892 2896021 3082391 3248620 3393376 3507556 3716179 3918943
6874 3918943 4044813 4203645 4344318 4499238 4597162 4689434 4739283 4760250 4838558 4861288 4807934
6863 4807934 4758811 4712151 4649415 4544359 4413379 4304916 4158249 4031565 3885035 3741282
6853 3741282 3563793 3419180 3277620 3170603 3055190 2926514 2816504 2714345 2594676 2494613
6843 2494613 2406262 2311870 2260901 2199185 2131134 2059262 1958546 1939652 1933011 1901251 1840667
$$ packed form
6918I62227L3488L459K444N1626J0321j4779M8209L4357K1932K9716q461L2550
6906A207089J4867r488K3723N2350J7313L0241L8601J7782N3626J17288M4721
6895A608113K4542O5823L3577J06740Q0338P3730P9225R3827P8224R5554N5929
6884B395622J47341J32454J20475J00129J86370J66229J44756J14180K08623K02764
6874C918943J25870J58832J40673J54920R7924R2272M9849K0967P8308K2730n3354
6863D807934m9123m6660o2736j05056j30980j08463j46667j26684j46530j43753
6853C741282j77489j44613j41560j07017j15413j28676j10010j02159j19669j00063
6843B494613q8351r4392n0969o1716o8051p1872j00716j8894o641l1760o0584
$$ plain form
6832 1840667 1850540 1825693 1758320 1777762 1792818 1770461 1733923 1728281 1687382 1680213 1646849 1623480
6820 1623480 1582323 1599197 1581756 1526357 1505461 1506668 1463575 1490613 1464652 1401537 1417726 1406322
6808 1406322 1376348 1346430 1326088 1304036 1312052 1306904 1288742 1260285 1223340 1198803 1199969 1185581
6796 1185581 1230897 1192402 1170328 1169338 1181214 1191294 1260494 1306827 1375676 1468499 1523790 1609742
6784 1609742 1660241 1670164 1673856 1656487 1577104 1513360 1468895 1334197 1216991 1172301 1095267
6773 1095267 1067318 1016900 1024073 981649 955292 949787 929342 900445 929949 923106 923769 915127 980452
6760 980452 977358 968777 1009661 1015346 1011601 1019285 977784 1012460 1024965 1022359 963972 974972 981949
6747 981949 1001511 999303 961432 984313 1020964 1036446 1031734 1071748 1132737 1195678 1256110 1359525
$$ packed form
6832A840667R873k4847o7373J9442J5056k2357l6538n642m0899p169l3364k3369
6820A623480m1157J6874j7441n5399k0896J207m3093K7038k5961o3115J6189j1404
6808A406322k9974k9918k0342k2052Q016n148j8162k8457l6945k4537J166j4388
6796A185581M5316l8495k2074r90J1876J0080O9200M6333O8849R2823N5291Q5952
6784A609742N0499R923L692j7369p9383o3744m4465j34698j17206m4690p7034
6773A095267k7949n0418P173m2424k6357n505k0445k8897K9504o843O63q642O5325
6760I80452l094q581M0884N685l745P684m1501L4676J2505k606n8387J1000O977
6747I81949J9562k208l7871K2881L6651J5482m712M0014O0989O2941O0432J03415
$$ plain form
6735 1359525 1433653 1457514 1484308 1517097 1536453 1519123 1466575 1396051 1346732 1259465 1209137
6724 1209137 1184120 1135541 1119539 1108435 1122696 1050670 997362 974921 893876 864901 856136 785340
6712 785340 695806 616251 632523 579487 528847 536772 509590 460855 426449 426272 411778 428183
6700 428183 440562 441092 436525 418544 434172 418210 410568 386205 410312 369360 396260 421872
6688 421872 399464 429272 442930 419939 484873 541659 486795 492261 516836 518459 494461 477190
6676 477190 409165 393797 371853 345471 312917 294772 302503 269730 284976 275189 224742 228924
6664 228924 264625 233973 235856 248385 220161 202659 195859 194158 231056 219910 198424 169249
6652 169249 205685 211841 180660 145335 136803 170641 184289 226464 194923 191733 167776 178527
$$ packed form
6735A359525P4128K3861K6794L2789J9356j7330n2548p0524m9319q7267n0328
6724A209137k5017m8579j6002j1104J4261p2026n3308k2441q1045k8975q765p0796
6712G85340q9534p9555J6272n3036n0640P925k7182m8735l4406j77j4494J6405
6700D28183J2379N30m567j7981J5628j5962p642k4363K4107m0952K6900K5612
6688D21872k2408K9808J3658k2991O4934N6786n4864N466K4575J623k3998j7271
6676D77190o8025j5368k1944k6382l2554j8145P731l2773J5246r787n0447M182
6664B28924L5701l0652J883J2529k8224j7502o800j701L6898j1146k1486k9175
6652A69249L6436O156l1181l5325q532L3838J3648M2175l1541l190k3957J0751
$$ plain form
6640 178527 248247 188712 148664 146415 131915 127288 170267 185786 201216 166651 129879 142796
6628 142796 162876 163596 134386 109525 106298 134636 124872 132987 171799 149015 123504 134648 103151
6615 103151 114849 133754 120207 114803 116412 135153 152763 146297 100922 98236 143581 110738
6603 110738 111886 144193 143514 153130 140666 152100 114313 95533 129223 146681 136561 132694 110977
6590 110977 104067 125937 120887 112775 133332 134132 140557 129337 135372 109907 82470 73296 67566
6577 67566 64618 92388 126039 94810 59924 68308 98797 132630 95393 119829 96213 117307
6565 117307 127569 125475 146202 147612 142129 113589 142354 131683 130766 157132 164245 124608 105905
6552 105905 108238 133169 176294 184627 161082 189295 206210 190514 190373 178823 185578 205231 174869
$$ packed form
6640A78527O9720n9535m0048k249j4500m627M2979J5519J5430l4565l6772J2917
6628A42796K0080P20k9210k4861l227K8338r764Q115L8812k2784k5511J1144l1497
6615A03151J1698J8905j3547n404J609J8741J7610o466m5375k686M5345l2843
6603A10738J148L2307o79R616j2464J1434l7787j8780L3690J7458j0120l867k1717
6590A10977o910K1870n050q112K0557Q00O425j1220O035k5465k7437r174n730
6577F7566k948K7770L3651l1229l4886Q384L0489L3833l7237K4436k3616K1094
6565A17307J0262k094K0727J410n483k8540K8765j0671r17K6366P113l9637j8703
6552A05905K333K4931M3125Q333k3545K8213J6915j5696j41j1550O755J9653l0362
$$ plain form
6539 174869 179405 190205 178507 158978 177385 180754 150190 153485 176492 174292 151506 80675
6527 80675 135382 167188 172536 173592 188921 208846 165712 143910 134106 119228 147830 169626
6515 169626 159921 166753 155091 132556 122501 147903 172844 142700 162507 178940 203685 184765
6503 184765 169556 181264 178214 227295 216453 200634 235279 249859 244524 243492 266607 232641
6491 232641 261969 268803 256080 250133 292883 300015 289795 274433 276146 325617 360729 399673
6479 399673 367951 362396 390171 418870 426665 399497 413290 444268 454064 451498 469204 452938
6467 452938 479770 508615 559674 610231 619081 644533 727551 776586 794907 863512 884964 926430
6455 926430 928919 944156 950916 954049 959464 958570 940795 906267 853276 821891 776629 732856 717032
$$ packed form
6539A74869M536J0800j1698j9529J8407L369l0564L295K3007k200k2786p0831
6527H0675N4707L1806N348J056J5329J9925m3134k1802r804j4878K8602K1796
6515A69626r705O832j1662k2535j0055K5402K4941l0144J9807J6433K4745j8920
6503A84765j5209J1708l050M9081j0842j5819L4645J4580n335j032K3115l3966
6491B32641K9328O834j2723n947M2750P132j0220j5362J713M9471L5112L8944
6479C99673l1722n555K7775K8699P795k7168J3793L0978R796k566J7706j6266
6467D52938K6832K8845N1059N0557Q850K5452Q3018M9035J8321O8605K1452M1466
6455I26430K489J5237O760L133N415q94j7775l4528n2991l1385m5262m3773j5824
$$ plain form
6442 717032 703690 720748 663616 651563 685283 673613 648126 633128 623828 574656 585323 620001
6430 620001 587572 602161 602863 622352 632294 647556 676058 679450 702262 753701 761744 790737 824592
6417 824592 818284 866099 909393 948694 981702 1049636 1134352 1207330 1283779 1347648 1362454 1406747
6405 1406747 1419117 1397902 1402745 1409220 1395617 1357468 1285654 1252486 1207185 1175463 1060772 1018550
6393 1018550 1033829 983176 912783 895248 806345 767389 783161 755734 728361 677968 676012 683339
6381 683339 676379 676588 665171 651125 653349 640460 683138 668217 637997 670145 654098 598171
6369 598171 600070 588722 571833 591804 554387 555234 558672 557760 552418 561573 553452 569700 569711 565458
6355 565458 554562 563475 589308 579012 572889 591692 560811 553871 579164 614526 661382 627156
$$ packed form
6442G17032j3342J7058n7132j2053L3720j1670k5487j4998r300m9172J0667L4678
6430F20001l2429J4589P02J9489R942J5262K8502L392K2812N1439Q043K8993L3855
6417H24592o308M7815M3294L9301L3008O7934Q4716P2978P6449O3869J4806M4293
6405A406747J2370k1215M843O475j3603l8149p1814l3168m5301l1722j14691m2222
6393A018550J5279n0653p0393j7535q8903l8956J5772k7427k7373n0393j956P327
6381F83339o960K09j1417j4046K224j2889M2678j4921l0220L2148j6047n5927
6369E98171J899j1348j6889J9971l7417Q47L438r12n342R155q121J6248J1m253
6355E65458j0896Q913K5833j0296o123J8803l0881o940K5293L5362M6856l4226
$$ plain form
6343 627156 611865 679044 670582 675179 715095 726997 700325 697076 713533 669617 690806 719879
6331 719879 777369 792385 764825 774668 792398 794818 813540 842195 866477 871320 928944 933792
6319 933792 928369 943454 938602 953515 934914 949952 947604 977444 991748 1051287 1029825 1033869
6307 1033869 1046069 1062347 1056830 1058949 1080253 1090742 1099796 1084539 1057056 1040869 1039110 1029527
6295 1029527 1082305 1109677 1127238 1111228 1101043 1088486 1126600 1113493 1109040 1058294 993443 984854
6283 984854 943147 926773 934871 936419 971002 980320 992051 990520 957269 994104 1067614 1050075
6271 1050075 1039897 1051407 1122874 1117451 1147336 1179710 1182489 1194799 1217096 1235964 1280761 1263559
6259 1263559 1268242 1274937 1310883 1345459 1379869 1438064 1489038 1525967 1563476 1645139 1692693 1752533
$$ packed form
6343F27156j5291O7179q462M597L9916J1902k6672l249J6457m3916K1189K9073
6331G19879N7490J5016k7560R843J7730K420J8722K8655K4282M843N7624M848
6319I33792n423J5085m852J4913j8601J5038k348K9840J4304N9539k1462M044
6307A033869J2200J6278n517K119K1304J0489R054j5257k7483j6187j759r583
6295A029527N2778K7372J7561j6010j0185j2557L8114j3107m453n0746o4851q589
6283I84854m1707j6374Q098J548L4583R318J1731j531l3251L6835P3510j7539
6271A050075j0178J1510P1467n423K9885L2374K779J2310K2297J8868M4797j7202
6259A263559M683O695L5946L4576L4410N8195N0974L6929L7509Q1663M7554N9840
$$ plain form
6247 1752533 1820604 1905120 1953571 2052949 2113690 2166847 2201014 2292401 2340551 2314435 2302333
6236 2302333 2253946 2189453 2125678 2102112 2063696 2025764 1993137 1928766 1879090 1833854 1822950
6225 1822950 1826687 1805143 1764570 1787599 1804756 1798003 1760323 1719789 1731000 1713809 1712980 1678714
6213 1678714 1679375 1718744 1716533 1690472 1749434 1744382 1757462 1788285 1793118 1853595 1897645 1903936 1983356
6200 1983356 2033179 2045133 2093349 2160848 2184313 2240411 2300645 2358814 2416049 2456705 2483710
6189 2483710 2502996 2509582 2514098 2494751 2451146 2411006 2388514 2338901 2312068 2268876 2252944 2242540
6177 2242540 2227934 2265933 2220481 2191917 2220378 2270537 2217153 2233788 2221301 2245708 2267430
6166 2267430 2266695 2286511 2278404 2276020 2287281 2345683 2334356 2336159 2370199 2366460 2365116 2405984 2434918
$$ packed form
6247A752533O8071Q4516M8451R9378O0741N3157L4167R1387M8150k6116j2102
6236B302333m8387o4493o3775k3566l8416l7932l2627o4371m9676m5236j0904
6225A822950L737k1544m0573K3029J7157o753l7680m0534J1211j7191q29l4266
6213A678714O61L9369k211k6061N8962n052J3080L0823M833O0477M4050O291P9420
6200A983356M9823J1954M8216O7499K3465N6098O0234N8169N7235M0656K7005
6189B483710J9286O586M516j9347m3605m0140k2492m9613k6833m3192j5932j0404
6177B242540j4606L7999m5452k8564K8461N0159n3384J6635j2487K4407K1722
6166B267430p35J9816q107k384J1261N8402j1327J803L4040l739j344M0868K8934
$$ plain form
6153 2434918 2444806 2490359 2507537 2560699 2597794 2587736 2641178 2683484 2698803 2783764 2849014 2943613
6141 2943613 2989157 3051568 3161505 3241110 3301050 3397545 3467090 3544764 3608421 3695477 3777665
6130 3777665 3822953 3861956 3937981 4007978 4078913 4157063 4256306 4342391 4421113 4543654 4689642
6119 4689642 4849964 5043301 5262920 5386629 5537965 5685295 5871185 6052081 6209528 6458407
6109 6458407 6704032 6924740 7172473 7475993 7752714 8034752 8357269 8713291 9002748 9354325
6099 9354325 9695645 10055678 10481447 10934205 11381698 11743235 12178740 12684950 13247603 13830369
6089 13830369 14456168 15124159 15818601 16527502 17274150 18036938 18905658 19876499 20927967
6080 20927967 22136830 23483993 25012178 26732556 28631492 30907817 33534782 36573996
$$ packed form
6153B434918R888M5553J7178N3162L7095j0058N3442M2306J5319Q4961O5250R4599
6141B943613M5544O2411J09937P9605N9940R6495O9545P7674O3657Q7056Q2188
6130C777665M5288L9003P6025O9997P0935P8150R9243Q6085P8722J22541J45988
6119D689642J60322J93337K19619J23709J51336J47330J85890J80896J57447K48879
6109F458407K45625K20708K47733L03520K76721K82038L22517L56022K89457L51577
6099I354325L41320L60033M25769M52758M47493L61537M35505N06210N62653N82766
6089A3830369O25799O67991O94442P08901P46648P62788Q68720R70841J051468
6080B0927967J208863J347163J528185J720378J898936K276325K626965L039214
$$ plain form
6072 36573996 40262106 44888769 50844526 57788881 63780586 68033276 71330724 72754269
6064 72754269 72060001 71149757 70801039 71297025 73081881 74867694 76762221 79381372 81876934
6055 81876934 84442269 87514340 89521170 90261379 90075974 88558716 86477415 85126350
6047 85126350 84091857 82217755 80330032 78991189 77122801 75285392 74966714 76142303
6039 76142303 78339582 79449240 78995691 77544406 73690001 67512253 61122156 54746255
6031 54746255 48511079 43084553 38623451 34949154 32006992 29550519 27428726 25640287
6023 25640287 24103675 22733328 21455978 20340695 19400688 18586627 17813352 17117585 16447304
6014 16447304 15795036 15181850 14660887 14168434 13693752 13252119 12812183 12422100 12039514
$$ packed form
6072C6573996L688110M626663N955757O944355N991705M252690L297448J423545
6064G2754269o94268r10244l48718M95986J784856J785813J894527K619151K495562
6055H1876934K565335L072071K006830P40209j85405j517258k081301j351065
6047H5126350j034493j874102j887723j338843j868388j837409l18678J175589
6039G6142303K197279J109658m53549j451285l854405o177748o390097o375901
6031E4746255o235176n426526m461102l674297k942162k456473k121793j788439
6023B5640287j536612j370347j277350j115283r40007q14061p73275o95767o70281
6014A6447304o52268o13186n20963m92453m74682m41633m39936l90083l82586
$$ plain form
6005 12039514 11709746 11428221 11162188 10961616 10751510 10585686 10471435 10351639 10258771 10199927
5995 10199927 10145635 10093850 10102344 10135661 10145440 10218708 10303121 10406142 10545630 10631322 10803735
5984 10803735 10994213 11145014 11377028 11616807 11908999 12245288 12658415 13111540 13669190
5975 13669190 14338027 15086341 15791677 16422514 16965293 17488910 17945586 18437499 18773042
5966 18773042 19011413 19185922 19268475 19260384 19233252 19302152 19498315 19947081 20562404 21293371
5956 21293371 22158559 22932021 23537361 23952051 24066956 23851443 23313841 22547927 21721098
5947 21721098 20950482 20276986 19720342 19169065 18746502 18353991 18081185 17921372 17900608 18097391
5937 18097391 18289668 18311477 18173918 17751706 17005380 16067633 15024129 14000584 13083673
$$ packed form
6005A2039514l29768k81525k66033k00572k10106j65824j14251j19796r2868n8844
5995A0199927n4292n1785Q494L3317R779P3268Q4413J03021J39488Q5692J72413
5984A0803735J90478J50801K32014K39779K92192L36289M13127M53125N57650
5975A3669190O68837P48314P05336O30837N42779N23617M56676M91913L35543
5966A8773042K38371J74509Q2553q091k7132O8900J96163M48766O15323P30967
5956B1293371Q65188P73462O05340M14690J14905k15513n37602p65914q26829
5947B1721098p70616o73496n56644n51277m22563l92511k72806j59813k0764J96783
5937A8097391J92277K1809j37559m22212p46326r37747j043504j023545r16911
$$ plain form
5928 13083673 12171792 11417991 10744150 10194704 9667859 9160631 8722089 8337777 7984862
5919 7984862 7605307 7263876 6995707 6737536 6488559 6268461 6080840 5914368 5764981 5647006
5909 5647006 5538101 5449082 5345088 5227302 5131350 4995457 4865741 4778001 4671410 4578844
5899 4578844 4446693 4328199 4277768 4180253 4168516 4087865 3999868 3972295 3959151 3943143 3862608
5888 3862608 3818428 3818886 3790733 3743153 3690388 3661408 3621451 3586998 3566666 3541422 3529714 3511684
5876 3511684 3537108 3512105 3510149 3478014 3467834 3431360 3442664 3395024 3402225 3431176 3406529 3426394
5864 3426394 3435928 3489070 3538959 3598625 3622299 3625890 3646527 3669760 3758725 3793888 3825054 3878175
5852 3878175 3936689 3963309 4004026 4079467 4133714 4251287 4327844 4396948 4503920 4564554 4676391
$$ packed form
5928A3083673r11881p53801o73841n49446n26845n07228m38542l84312l52915
5919G984862l79555l41431k68169k58171k48977k20098j87621j66472j49387j17975
5909E647006j08905q9019j03994j17786r5952j35893j29716q7740j06591r2566
5899D578844j32151j18494n0431r7515j1737q0651q7997k7573j3144j6008q0535
5888C862608m4180M58k8153m7580n2765k8980l9957l4453k0332k5244j1708j8030
5876C511684K5424k5003j956l2135j0180l6474J1304m7640P201K8951k4647J9865
5864C426394R534N3142M9889N9666K3674L591K0637K3233Q8965L5163L1166N3121
5852C878175N8514K6620M0717P5441N4247J17573P6557O9104J06972O0634J11837
$$ plain form
5841 4676391 4760652 4846890 4938478 5041890 5104639 5174365 5257048 5317785 5427221 5530040 5654035
5830 5654035 5756847 5850077 5942700 6043995 6132082 6191179 6274138 6361318 6404914 6448203 6535798
5819 6535798 6576082 6587601 6609984 6600681 6611204 6670728 6658580 6634380 6647573 6652457 6621978 6567532
5807 6567532 6586757 6514180 6468159 6480331 6464253 6440030 6421270 6396823 6400887 6415712 6438236 6403518
5795 6403518 6383586 6402365 6400625 6405805 6417411 6450991 6494521 6547299 6615517 6720300 6803448 6919575
5783 6919575 7039185 7147466 7234737 7290651 7369866 7399271 7336179 7341106 7323528 7267781 7216086
5772 7216086 7171600 7142742 7103812 7089606 7067530 7031524 7026646 7044709 7071101 7067895 7078323 7092480
5760 7092480 7129375 7133246 7182368 7214879 7195432 7234382 7219254 7205535 7232253 7240068 7258605 7202292
$$ packed form
5841D676391Q4261Q6238R1588J03412O2749O9726Q2683O0737J09436J02819J23995
5830E654035J02812R3230R2623J01295Q8087N9097Q2959Q7180M3596M3289Q7595
5819F535798M0284J1519K2383r303J0523N9524j2148k4200J3193M884l0479n4446
5807F567532J9225p2577m6021J2172j6078k4223j8760k4447M064J4825K2524l4718
5795F403518j9932J8779j740N180J1606L3580M3530N2778O8218J04783Q3148J16127
5783F919575J19610J08281Q7271N5914P9215K9405o3092M927j7578n5747n1695
5772G216086m4486k8858l8930j4206k2076l6006m878J8063K6392l206J0428J4157
5760G092480L6895L871M9122L2511j9447L8950j5128j3719K6718P815J8537n6313
$$ plain form
5748 7202292 7180699 7131989 7075108 7024089 7002750 6946817 6908526 6925889 6931540 6956737 6996203 7054862
5736 7054862 7093686 7148753 7217700 7276931 7402276 7550331 7699482 7813100 7941914 8024873
5726 8024873 8127948 8209499 8265907 8397869 8507334 8654428 8798530 8911939 9049814 9269403
5716 9269403 9486750 9676948 9830059 10044531 10261345 10449838 10664824 10899546 11154986 11426929
5706 11426929 11689010 11941357 12245751 12569085 12915644 13254789 13586794 13952788 14333850
5697 14333850 14722236 15084471 15485659 15917339 16335534 16747249 17205408 17763056 18370672
5688 18370672 19025166 19720746 20475143 21229801 22007317 22865896 23780555 24762623 25862225
5679 25862225 27060292 28416060 29983690 31743742 33804632 36189584 38888445 42056302
$$ packed form
5748G202292k1593m8710n6881n1019k1339n5933l8291J7363N651K5197L9466N8659
5736G054862L8824N5067O8947N9231J25345J48055J49151J13618J28814Q2959
5726H024873J03075Q1551N6408J31962J09465J47094J44102J13409J37875K19589
5716I269403K17347J90198J53111K14472K16814J88493K14986K34722K55440K71943
5706A1426929K62081K52347L04394L23334L46559L39145L32005L65994L81062
5697A4333850L88386L62235M01188M31680M18195M11715M58159N57648O07616
5688A8370672O54494O95580P54397P54658P77516Q58579R14659R82068J099602
5679B5862225J198067J355768J567630J760052K060890K384952K698861L167857
$$ plain form
5671 42056302 45847261 50539018 56529500 64016242 71693336 77333720 81581123 84542417
5663 84542417 84869832 83662239 83061081 83106024 84000736 84862959 85797575 87493600 89050919
5654 89050919 90583842 93557810 96806412 98897751 100023070 100323596 99408248 97908389
5646 97908389 96295900 93580961 90525688 87790954 84726842 81800332 80208487 79952620
5638 79952620 81158620 82830562 83276373 82916604 81419509 77562466 72463683 67242659
5630 67242659 61680005 56168214 51162706 46784975 43061324 39903124 37163180 34809034
5622 34809034 32783509 31043415 29533163 28223733 27174848 26324946 25689706 25121669 24614601
5613 24614601 24090689 23557472 22900792 22193611 21431104 20608082 19750222 18965364 18203950
$$ packed form
5671D2056302L790959M691757N990482P486742P677094N640384M247403K961294
5663H4542417L27415j207593o01158M4943Q94712Q62223R34616J696025J557319
5654H9050919J532923K973968L248602K091339J125319L00526r15348j499859
5646I7908389j612489k714939l055273k734734l064112k926510j591845k55867
5638G9952620J206000J671942M45811l59769j497095l857043n098783n221024
5630F7242659n562654n511791n005508m377731l723651l158200k739944k354146
5622C4809034k025525j740094j510252j309430j048885q49902o35240n68037n07068
5613B4614601n23912n33217o56680p07181p62507q23022q57860p84858p61414
$$ plain form
5604 18203950 17529083 16903888 16354370 15903187 15481525 15085674 14835316 14548713 14280267
5595 14280267 14109979 13951008 13797827 13632777 13492387 13379737 13285951 13232297 13157150 13191477
5585 13191477 13224426 13255096 13344129 13484841 13615855 13741290 13890753 14064650 14261306 14569618
5575 14569618 14934651 15386506 15894534 16486208 17107401 17759656 18422176 19103272 19657239
5566 19657239 20064720 20198491 20131301 19851660 19354445 18772954 18058517 17205924 16344987 15519309
5556 15519309 14760530 14017962 13273773 12619957 12068503 11585975 11195808 10850190 10567233
5547 10567233 10376437 10188575 10025584 9966726 9938942 9906239 9851336 9833746 9828691 9888224 9973172
5536 9973172 9977176 10074767 10220553 10392337 10713064 11023180 11465952 12070176 12625771 13127014
$$ packed form
5604A8203950o74867o25195n49518m51183m21662l95851k50358k86603k68446
5595A4280267j70288j58971j53181j65050j40390j12650r3786n3654p5147L4327
5585A3191477L2949L0670Q9033J40712J31014J25435J49463J73897J96656L08312
5575A4569618L65033M51855N08028N91674O21193O52255O62520O81096N53967
5566A9657239M07481J33771o7190k79641m97215n81491p14437q52593q60937q25678
5556A5519309p58779p42568p44189o53816n51454m82528l90167l45618k82957
5547A0567233j90796j87862j62991n8858k7784l2703n4903j7590n055N9533Q4948
5536I973172M004R7591J45786J71784L20727L10116M42772O04224N55595N01243
$$ plain form
5526 13127014 13504911 13700069 13683623 13606990 13536783 13442785 13431905 13509934 13582799 13688171 13745907
5515 13745907 13861927 13971682 14107566 14228816 14320935 14303723 14232995 14075416 13897520 13635839
5505 13635839 13312166 12996332 12644715 12329592 12099055 11946278 11905755 11905996 11841531 11719001
5495 11719001 11416282 10921122 10283513 9656150 9045490 8445310 7942742 7505451 7156915
5486 7156915 6796404 6561961 6290897 6066998 5870015 5716403 5544153 5432054 5391738 5324572
5476 5324572 5301434 5244491 5273916 5273052 5280474 5307094 5300996 5356448 5343267 5264398 5193793 5059291
5464 5059291 4986711 4834412 4643089 4481103 4304741 4116595 4016729 3894611 3777839 3680625
5454 3680625 3568397 3475364 3434852 3363461 3296516 3235980 3175800 3152035 3087170 3021495 2968873
$$ packed form
5526A3127014L77897J95158j6446p6633p0207r3998j0880P8029P2865J05372N7736
5515A3745907J16020J09755J35884J21250R2119j7212p0728j57579j77896k61681
5505A3635839l23673l15834l51617l15123k30537j52777m0523K41o4465j22530
5495A1719001l02719m95160o37609o27363o10660o00180n02568m37291l48536
5486G156915l60511k34443k71064k23899j96983j53612j72250j12099m0316o7166
5476E324572k3138n6943K9425q64P422K6620o098N5452j3181p8869p0605j34502
5464E059291p2580j52299j91323j61986j76362j88146r9866j22118j16772r7214
5454C680625j12228r3033m0512p1391o6945o0536o0180k3765o4865o5675n2622
$$ plain form
5443 2968873 2954751 2951875 2907409 2879305 2867059 2833471 2826706 2818169 2792613 2773524 2804076 2802411
5431 2802411 2783209 2792616 2831980 2816098 2820376 2871844 2839693 2863790 2957617 2976573 3005532 3010028
5419 3010028 3060528 3068308 3092387 3076482 3138065 3192107 3190622 3257975 3350821 3432403 3547908 3675666
5407 3675666 3809333 3988957 4186304 4450966 4647835 4750955 4846023 4762520 4606305 4444065
5397 4444065 4295889 4161503 4067957 3981665 3957152 3996937 4023675 4015190 4009328 4026899 4090585
5386 4090585 4145900 4155401 4196799 4237041 4299509 4412783 4491707 4621525 4725061 4880166 5011588
5375 5011588 5185101 5380417 5592721 5810777 6014495 6270176 6554334 6728483 6828655 6951035
5365 6951035 7090006 7148397 7189989 7240398 7270902 7344978 7467047 7648072 7877883 8094255
$$ packed form
5443B968873j4122k876m4466k8104j2246l3588o765q537k5556j9089L0552j665
5431B802411j9202R407L9364j5882M278N1468l2151K4097R3827J8956K8959M496
5419C010028N0500P780K4079j5905O1583N4042j485O7353R2846Q1582J15505J27758
5407C675666J33667J79624J97347K64662J96869J03120R5068q3503j56215j62240
5397D444065j48176j34386r3546q6292k4513L9785K6738q485n862J7571O3686
5386D090585N5315R501M1398M0242O2468J13274P8924J29818J03536J55105J31422
5375E011588J73513J95316K12304K18056K03718K55681K84158J74149J00172J22380
5365F951035J38971N8391M1592N0409L0504P4076J22069J81025K29811K16372
$$ plain form
5355 8094255 8396823 8672850 8938209 9106372 9201353 9236750 9158658 8998126 8769496 8527646
5345 8527646 8236345 7930152 7620282 7362577 7079521 6870551 6641849 6442927 6248220 6144986
5335 6144986 5997288 5932117 5853718 5753190 5705162 5681236 5656367 5578474 5551595 5522670 5505283
5324 5505283 5515447 5538918 5599919 5655447 5692901 5698811 5743327 5717777 5712047 5701038 5628690 5585309
5312 5585309 5583771 5528752 5491456 5437562 5403245 5387483 5355478 5297415 5254173 5216830 5187266 5175355
5300 5175355 5095104 5038258 5028926 5023197 5034640 4978995 4960484 4890512 4831510 4807911 4792410 4710567
5288 4710567 4683261 4625350 4558870 4542424 4562037 4509019 4500630 4463671 4495015 4476876 4476241 4502274
5276 4502274 4513686 4576072 4612316 4644661 4692841 4740186 4802365 4862169 4935488 4920148 4979354
$$ packed form
5355H094255L02568K76027K65359J68163R4981L5397p8092j60532k28630k41850
5345H527646k91301l06193l09870k57705k83056k08970k28702j98922j94707j03234
5335F144986j47698o5171p8399j00528m8028k3926k4869p7893k6879k8925j7387
5324E505283J0164K3471O1001N5528L7454N910M4516k5550n730j1009p2348m3381
5312E585309j538n5019l7296n3894l4317j5762l2005n8063m3242l7343k9564j1911
5300E175355q0251n6846r332n729J1443n5645j8511o9972n9002k3599j5501q1843
5288D710567k7306n7911o6480j6446J9613n3018q389l6959L1344j8139o35K6033
5276D502274J1412O2386L6244L2345M8180M7345O2179N9804P3319j5340N9206
$$ plain form
5265 4979354 4983338 5013145 5001461 5045925 5036204 5017813 5016957 5047948 5121240 5163198 5204912 5223231
5253 5223231 5235864 5339134 5370346 5432129 5521216 5606837 5697687 5753650 5876916 6016203 6202321
5242 6202321 6418883 6582587 6734815 6890267 7073051 7263727 7425538 7565217 7815351 8067733
5232 8067733 8349290 8641728 8954465 9261771 9548574 9910354 10228148 10458075 10764631 11047485
5222 11047485 11361630 11717976 12174977 12772173 13477862 14147108 14516748 14801534 15126428
5213 15126428 15574824 15999591 16428372 16834310 17311337 17876198 18487100 19123196 19883077
5204 19883077 20655344 21397133 22240933 23178400 24149517 25285472 26445306 27650818 28830551
5195 28830551 29953784 31046463 32246179 33543240 35018503 36561917 38216355 39961181
$$ packed form
5265D979354L984K9807j1684M4464r721j8391q56L0991P3292M1958M1714J8319
5253E223231J2633J03270L1212O1783Q9087Q5621R0850N5963J23266J39287J86118
5242F202321K16562J63704J52228J55452J82784J90676J61811J39679K50134K52382
5232H067733K81557K92438L12737L07306K86803L61780L17794K29927L06556K82854
5222A1047485L14145L56346M57001N97196P05689O69246L69640K84786L24894
5213A5126428M48396M24767M28781M05938M77027N64861O10902O36096P59881
5204A9883077P72267P41789Q43800R37467R71117J135955J159834J205512J179733
5195B8830551J123233J092679J199716J297061J475263J543414J654438J744826
$$ plain form
5187 39961181 41837941 43822779 46032247 48375780 51058134 54054376 57579836 61526336
5179 61526336 66353865 71904374 78323047 85765157 94879679 105735495 119333552 135794067
5171 135794067 157900340 188768196 232556630 271399848 291420657 304559679 298930369
5164 298930369 268176600 235313080 201835852 168545008 142576716 122327684 106832919
5157 106832919 94557736 84666817 76061753 69124398 63577567 59235318 55428223 51932523
5149 51932523 48939363 46968275 45615851 45109249 45221152 45718296 45866742 45543468 44304565
5140 44304565 42261854 39671673 37008683 34270590 31686453 29213050 27215334 25500029
5132 25500029 24110168 22830101 21794283 20747385 19858524 19056152 18330685 17604836 17010297
$$ packed form
5187C9961181J876760J984838K209468K343533K682354K996242L525460L946500
5179F1526336M827529N550509O418673P442110R114522J0855816J3598057J6460515
5171A35794067K2106273L0867856M3788434L8843218K0020809J3139022n629310
5164B98930369l0753769l2863520l3477228l3290844k5968292k0249032j5494765
5157A06832919j2275183r890919q605064o937355n546831m342249l807095l495700
5149E1932523k993160j971088j352424n06602J11903M97144J48446l23274j238903
5140D4304565k042711k590181k662990k738093k584137k473403j997716j715305
5132B5500029j389861j280067j035818j046898q88861q02372p25467p25849n94539
$$ plain form
5123 17010297 16411454 15898644 15449922 15028998 14655800 14410465 14124004 13886978 13709594
5114 13709594 13480581 13323393 13204531 13035520 12850854 12572523 12254116 11912662 11613391
5105 11613391 11297314 11078950 10904095 10681028 10478196 10345866 10120317 9964221 9771150
5096 9771150 9643845 9489262 9409782 9255209 9099467 9006028 8969429 8913897 8882232 8829733 8774504
5085 8774504 8783758 8721688 8693795 8688900 8700174 8760751 8780661 8861762 8942506 9041129 9107911 9233090
5073 9233090 9327571 9439800 9518205 9605359 9667579 9691526 9700874 9719388 9850292 9969424 10065221
5062 10065221 10247854 10458109 10744053 11021614 11330453 11667442 12048911 12423706 12746780
5053 12746780 13085341 13364537 13623276 13846200 14111341 14321520 14611295 14859778 15148681
$$ packed form
5123A7010297n98843n12810m48722m20924l73198k45335k86461k37026j77384
5114A3709594k29013j57188j18862j69011j84666k78331l18407l41454k99271
5105A1613391l16077k18364j74855k23067k02832j32330k25549j56096j93071
5096I771150j27305j54583p9480j54573j55742r3439l6599n5532l1665n2499n5229
5085H774504R254o2070k7893m895J1274O0577J9910Q1101Q0744R8623O6782J25179
5073I233090R4481J12229P8405Q7154O2220K3947R348J8514J30904J19132R5797
5062A0065221J82633K10255K85944K77561L08839L36989L81469L74795L23074
5053A2746780L38561K79196K58739K22924K65141K10179K89775K48483K88903
$$ plain form
5044 15148681 15441905 15805345 16165871 16535435 16900742 17249865 17521122 17731293 17913612
5035 17913612 18081507 18291655 18502821 18774019 19144264 19592766 20193616 20767265 21344841
5026 21344841 21879366 22324059 22751534 23263122 23976201 24873461 25402986 25692771 25665198 25109540
5016 25109540 24351533 23627685 22863773 22238403 21663777 21093895 20578149 20208465 19902133
5007 19902133 19736868 19665838 19763757 19872505 20140588 20466160 20952498 21470401 22081578 22714465
4997 22714465 23388228 24101966 25027743 26149957 27514136 29470663 32492240 36031421 38247038
4988 38247038 39347060 39323314 36885640 33662260 30508944 27373855 24853563 22920734
4980 22920734 21390212 20195534 19238227 18489748 17870247 17471630 17186372 17000249 16917630
$$ packed form
5044A5148681K93224L63440L60526L69564L65307L49123K71257K10171J82319
5035A7913612J67895K10148K11166K71198L70245M48502O00850N73649N77576
5026B1344841N34525M44693M27475N11588P13079Q97260N29525K89785k7573n55658
5016B5109540p58007p23848p63912o25370n74626n69882n15746l69684l06332
5007A9902133j65265p1030R7919J08748K68083L25572M86338N17903O11177O32887
4997B2714465O73763P13738R25777J122214J364179J956527L021577L539181K215617
4988C8247038J100022k3746k437674l223380l153316l135089k520292j932829
4980B2920734j530522j194678r57307p48479o19501l98617k85258j86123q2619
$$ plain form
4971 16917630 16932236 17071653 17259070 17540656 17759714 17961992 18046255 18009321 17833067 17594331
4961 17594331 17236127 16903279 16585723 16292947 16019400 15877226 15826642 15939809 16207845 16643547
4951 16643547 17225179 17970449 19042552 20511874 22528547 25280984 28283116 30235733
4943 30235733 31356386 31779722 30678781 28311696 25896709 23309368 20691488 18432349
4935 18432349 16598972 15138426 13938503 13040643 12338857 11801714 11271830 10779976 10196605
4926 10196605 9570978 9004823 8518209 8038430 7641324 7350289 7070582 6787766 6595647
4917 6595647 6423832 6238169 6038487 5840674 5640244 5528503 5437761 5312232 5209703 5131788
4907 5131788 5023024 4961524 4856149 4818952 4733248 4641556 4561881 4516398 4452218 4400254 4351745
$$ packed form
4971A6917630J4606J39417J87417K81586K19058K02278Q4263l6934j76254k38736
4961A7594331l58204l32848l17556k92776k73547j42174n0584J13167K68036M35702
4951A6643547N81632P45270J072103J469322K016673K752437L002132J952617
4943C0235733J120653M23336j100941k367085k414987k587341k617880k259139
4935A8432349j833377j460546j199923q97860p01786n37143n29884m91854n83371
4926A0196605o25627n66155m86614m79779l97106k91035k79707k82816j92119
4917F595647j71815j85663j99682j97813k00430j11741r0742j25529j02529p7915
4907E131788j08764o1500j05375l7197q5704r1692p9675m5483o4180n1964m8509
$$ plain form
4896 4351745 4292566 4225687 4217983 4237726 4240791 4238071 4181142 4154718 4147400 4101558 4068421 4072609
4884 4072609 4068668 4026247 4018251 4008935 4021220 4042182 4068833 4083191 4131807 4176611 4187158 4253067
4872 4253067 4330650 4398297 4475261 4530800 4593867 4610575 4703842 4797229 4904424 5013927 5123028
4861 5123028 5222498 5352430 5523957 5662085 5865766 6085663 6266989 6533200 6777025 7114016
4851 7114016 7488692 7877116 8328537 8845599 9455574 10048594 10679391 11200855 11510013 11695655
4841 11695655 11671511 11542584 11340204 11108955 10940201 10777664 10757368 10830169 11035006 11329580
4831 11329580 11661610 12222636 12814990 13566335 14551550 15573062 16806407 18377513 20289587
4822 20289587 22541246 24904548 26820764 28017494 28355863 27669686 26221679 24527730
$$ packed form
4896D351745n9179o6879p704J9743L065k720n6929k6424p318m5842l3137M188
4884D072609l941m2421p996r316J2285K0962K6651J4358M8616M4804J0547O5909
4872D253067P7583O7647P6964N5539O3067J6708R3267R3387J07195J09503J09101
4861E123028R9470J29932J71527J38128K03681K19897J81326K66211K43825L36991
4851G114016L74676L88424M51421N17062O09975N93020O30797N21464L09158J85642
4841A1695655k4144j28927k02380k31249j68754j62537k0296P2801K04837K94574
4831A1329580L32030N61026N92354P51345R85215J021512J233345J571106J912074
4822B0289587K251659K363302J916216J196730L38369o86177j448007j693949
$$ plain form
4814 24527730 22826848 21225365 19885499 18710783 17691179 16754084 15886221 15103460 14396932
4805 14396932 13820784 13397608 13069784 12802036 12579213 12447979 12320555 12147985 11896557
4796 11896557 11698751 11487521 11236135 11076322 10886285 10734226 10529971 10313065 10078411
4787 10078411 9834063 9610484 9420454 9267394 9131146 9065969 8989650 8978884 8979717 8995994 9110067
4776 9110067 9194195 9226749 9211855 9233074 9114294 8969448 8792359 8556536 8312284 8114401
4766 8114401 7928464 7786298 7698940 7625521 7596086 7623987 7616898 7554780 7516827 7557062 7634307
4755 7634307 7737827 7858725 8001156 8232196 8439745 8722158 9012208 9283798 9531082 9677652
4745 9677652 9808197 9906798 9934386 9944803 9941712 9891702 9886171 9853723 9812500 9814142 9815359 9834189
$$ packed form
4814B4527730j700882j601483j339866j174716j019604r37095q67863p82761p06528
4805A4396932n76148m23176l27824k67748k22823j31234j27424j72570k51428
4796A1896557j97806k11230k51386j59813j90037j52059k04255k16906k34654
4787A0078411k44348k23579j90030j53060j36248o5177p6319j0766Q33J6277J14073
4776I110067Q4128L2554j4894K1219j18780j44846j77089k35823k44252j97883
4766H114401j85937j42166q7358p3419k9435K7901p089o2118l7953M0235P7245
4755G634307J03520J20898J42431K31040K07549K82413K90050K71590K47284J46570
4745I677652J30545R8601K7588J0417l091n0010n531l2448m1223J642J217J8830
$$ plain form
4733 9834189 9955159 10061865 10282247 10549452 10825768 11154663 11630401 12195638 12808014 13522221
4723 13522221 14408107 15453281 16637296 17910549 19347999 20998022 22946095 25337484
4715 25337484 28326929 31820212 35128591 37386662 38479478 38195635 36405665 33594369
4707 33594369 30471202 27299811 24363434 21869691 19840789 18097183 16614938 15270963
4699 15270963 14047256 12943157 12029843 11190333 10466746 9848559 9294321 8899164 8561595
4690 8561595 8177620 7836676 7543297 7290202 7068213 6926406 6782529 6602933 6493338 6389217
4680 6389217 6264222 6171475 6135048 6081297 6125117 6192732 6350270 6491573 6661297 6768357
4670 6768357 6775131 6730737 6647436 6479111 6292311 6136781 5979703 5819453 5765051 5759889 5820882
$$ packed form
4733I834189J20970J06706K20382K67205K76316L28895M75738N65237O12376P14207
4723A3522221Q85886J045174J184015J273253J437450J650023J948073K391389
4715B5337484K989445L493283L308379K258071J092816k83843j789970k811296
4707C3594369l123167l171391k936377k493743k028902j743606j482245j343975
4699A5270963j223707j104099r13314q39510p23587o18187n54238l95157l37569
4690H561595l83975l40944k93379k53095k21989j41807j43877j79596j09595j04121
4680F389217j24995r2747l6427n3751M3820O7615J57538J41303J69724J07060
4670F768357O774m4394q3301j68325j86800j55530j57078j60250n4402n162O0993
$$ plain form
4659 5820882 5828848 5755082 5674318 5597229 5406102 5209613 5011340 4829305 4701520 4555963
4649 4555963 4405427 4354868 4333436 4399013 4495324 4652537 4904683 5214998 5433835 5536920
4639 5536920 5489639 5326818 5048753 4761670 4475989 4273472 4104519 3978117 3882712 3841501
4629 3841501 3862370 3823919 3768903 3671909 3557011 3439225 3305153 3144319 3009404 2852676
4619 2852676 2676070 2571257 2509350 2403210 2274659 2215426 2132452 2093119 2010980 1952375 1906922
4608 1906922 1896700 1843777 1788885 1793286 1757610 1713645 1705631 1694717 1651868 1661253 1639471 1590561
4596 1590561 1591116 1537815 1514488 1513590 1515797 1472614 1421115 1436800 1429657 1381789 1364370 1369304 1333757
4583 1333757 1314957 1295350 1301783 1289348 1256113 1203091 1224977 1242995 1179680 1185977 1177675 1165349
$$ packed form
4659E820882P966p3766q0764p7089j91127j96489j98273j82035j27785j45557
4649D555963j50536n0559k1432O5577R6311J57213K52146L10315K18837J03085
4639E536920m7281j62821k78065k87083k85681k02517j68953j26402r5405m1211
4629C841501K0869l8451n5016r6994j14898j17786j34072j60834j34915j56728
4619B852676j76606j04813o1907j06140j28551n9233q2974l9333q2139n8605m5453
4608A906922j0222n2923n4892M401l5676m3965q014j0914m2849R385k1782m8910
4596A590561N55n3301k3327q98K207m3183n1499J5685p143m7868j7419M934l5547
4583A333757j8800j9607O433j2435l3235n3022K1886J8018o3315O297q302j2326
$$ plain form
4571 1165349 1176652 1159787 1192080 1167245 1186707 1204814 1206574 1163877 1157851 1180104 1193191 1192649
4559 1192649 1211561 1198036 1181504 1174168 1152029 1119764 1117484 1119309 1064530 1069239 1093124 1072803
4547 1072803 1086927 1061071 1024598 990673 979054 983979 1004764 1011189 1016979 1043678 1014508 984935
4535 984935 999095 961489 949214 962409 1033442 981911 970471 1020840 1027038 997967 1016501 1031956
4523 1031956 1040605 1027635 1019429 1036919 1050265 1074465 1069200 1119970 1112036 1099885 1118068 1110383
4511 1110383 1111334 1095204 1104353 1098729 1061048 1066881 1052676 1036740 1057031 1095970 1093935 1131381 1129055
4498 1129055 1159839 1145586 1150122 1175039 1219830 1257513 1257716 1327582 1347764 1396627 1470371 1478352
4486 1478352 1549164 1665377 1761438 1836341 1942795 2058311 2204329 2343079 2480334 2611575
$$ packed form
4571A165349J1303j6865L2293k4835J9462J8107J760m2697o026K2253J3087n42
4559A192649J8912j3525j6532p336k2139l2265k280J825n4779M709K3885k0321
4547A072803J4124k5856l6473l3925j1619M925K0785O425N790K6699k9170k9573
4535I84935J4160l7606j2275J3195P1033n1531j1440N0369O198k9071J8534J5455
4523A031956Q649j2970q206J7490J3346K4200n265N0770p934j2151J8183p685
4511A110383R51j6130R149n624l7681N833j4205j5936K0291L8939k035L7446k326
4498A129055L0784j4253M536K4917M4791L7683K03O9866K0182M8863P3744P981
4486A478352P0812J16213R6061P4903J06454J15516J46018J38750J37255J31241
$$ plain form
4476 2611575 2669948 2714543 2714613 2672010 2569991 2460992 2353302 2248747 2152704 2122036 2093208
4465 2093208 2069515 2063204 2085183 2178799 2253805 2356954 2485464 2616260 2847104 3122803 3386599
4454 3386599 3633013 3864060 4078364 4146249 4122479 3993199 3795149 3563282 3368006 3117564
4444 3117564 2937954 2812362 2687869 2613728 2618663 2615488 2688590 2768250 2840746 2927840 2988306
4433 2988306 3061036 3081245 3064025 3051518 3061079 3067052 3079887 3081439 3063256 2999373 2948403 2877819
4421 2877819 2783101 2630075 2531156 2478810 2443676 2443150 2479986 2558558 2639066 2767812 2887660
4410 2887660 2936024 2967730 2966088 2946757 2858130 2736680 2610697 2444404 2266324 2114347 1948231
4399 1948231 1840601 1736268 1611481 1512694 1481496 1449600 1387146 1342517 1355465 1348861 1363301
$$ packed form
4476B611575N8373M4595P0m2603j02019j08999j07690j04555r6043l0668k8828
4465B093208k3693o311K1979R3616P5006J03149J28510J30796K30844K75699K63796
4454C386599K46414K31047K14304O7885k3770j29280j98050k31867j95276k50442
4444C117564j79610j25592j24493p4141M935l175P3102P9660P2496Q7094O0466
4433B988306P2730K0209j7220j2507R561N973J2835J552j8183o3883n0970p0584
4421B877819r4718j53026r8919n2346l5134n26L6836P8572Q0508J28746J19848
4410B887660M8364L1706j642j9331q8627j21450j25983j66293j78080j51977j66116
4399A948231j07630j04333j24787r8787l1198l1896o2454m4629J2948o604J4440
$$ plain form
4388 1363301 1350751 1401033 1474544 1546137 1572676 1650072 1759484 1750820 1726219 1668186 1638128
4377 1638128 1592895 1506126 1428103 1365887 1284032 1231984 1165676 1071641 1053496 1035263 1029137 1009666
4365 1009666 969587 975270 925548 869072 862000 905925 855285 850298 885406 849410 831536 852434
4353 852434 847246 850091 868861 819614 842032 849856 822513 856798 889282 918327 936849 917905
4341 917905 906276 851276 831747 813301 774427 763438 723568 748477 751279 716270 709916 723935
4329 723935 677010 689041 698976 679321 669882 678115 671913 641117 678940 631882 676363 697165
4317 697165 645532 578260 576974 560070 543481 561386 522551 534543 532307 503841 532667 516984
4305 516984 478389 519518 526751 488455 483496 508545 497502 496226 462562 463587 505451 541288
$$ packed form
4388A363301j2550N0282P3511P1593K6539P7396J09412q664k4601n8033l0058
4377A638128m5233q6769p8023o2216q1855n2048o6308r4035j8145j8233o126j9471
4365A009666m0079N683m9722n6476p072M3925n0640m987L5108l5996j7874K0898
4353H52434n188K845J8770m9247K2418P824k7343L4285L2484K9045J8522j8944
4341I17905j1629n5000j9529j8446l8874j0989l9870K4909K802l5009o354J4019
4329G23935m6925J2031R935j9655r439Q233o202l0796L7823m7058M4481K0802
4317F97165n1633o7272j286j6904j6589J7905l8835J1992k236k8466K8826j5683
4305E16984l8595M1129P233l8296m959K5049j1043j276l3664J025M1864L5837
$$ plain form
4293 541288 498154 500542 504817 499488 518214 499617 495701 507903 520928 527038 484699 504195 482462
4280 482462 481641 504162 500788 522171 533964 507839 511975 501641 515311 501278 509309 536926 544228
4267 544228 572364 559512 545377 524803 552623 558287 580759 587548 561162 581448 576694 551080
4255 551080 558772 575957 578879 564309 558599 613811 582035 571321 559811 529001 546364 538386
4243 538386 582461 561561 524591 543085 565769 573006 547250 532965 533283 557048 513379 548564
4231 548564 575796 552072 528776 555949 572128 587037 582980 537828 570609 562582 568082 589415
4219 589415 600186 623108 571943 584275 572867 540487 555842 555917 587957 603725 612535 585201
4207 585201 553047 553458 565068 559325 598094 601001 564356 593306 580576 570108 575088 575163 585695
$$ packed form
4293E41288m3134K388M275n329J8726j8597l916J2202J3025O110m2339J9496k1733
4280D82462q21K2521l374K1383J1793k6125M136j0334J3670j4033Q031K7617P302
4267E44228K8136j2852j4135k0574K7820N664K2472O789k6386K0286m754k5614
4255E51080P692J7185K922j4570n710N5212l1776j0714j1510l0810J7363p978
4243E38386M4075k0900l6970J8494K2684P237k5756j4285L18K3765m3669L5185
4231E48564K7232k3724k3296K7173J6179J4909m057m5152L2781q027N500K1333
4219E89415J0771K2922n1165J2332j1408l2380J5355P5L2040J5768Q810k7334
4207E85201l2154M11J1610n743L8769K907l6645K8950j2730j0468M980P5J0532
$$ plain form
4194 585695 582542 595087 591533 603395 578931 529057 522783 558761 568805 596771 580738 603883
4182 603883 586384 596646 553759 552063 559119 558263 563086 596575 611996 585027 574818 568945 603280
4169 603280 583739 579828 595235 591293 584956 610189 637488 603511 559617 582767 607714 604987
4157 604987 594937 567004 589325 610438 604663 622756 657207 633939 629083 658922 665663 622673
4145 622673 664848 667618 685432 637465 632188 649894 655527 639648 627538 642765 633875 648780
4133 648780 621568 642659 684883 692708 668637 653205 655541 657258 662100 678530 672827 690898 681514
4120 681514 650185 655060 657925 663853 656641 656385 649305 669406 664864 667354 688002 671601 671690 683867
4106 683867 662377 662656 668997 696580 686984 684313 694416 716802 721728 683221 735952 735475 721020
$$ packed form
4194E85695l153J2545l554J1862k4464m9874o274L5978J0044K7966j6033K3145
4182F03883j7499J0262m2887j696P056q56M823L3489J5421k6969j0209n873L4335
4169F03280j9541l911J5407l942o337K5233K7299l3977m3894K3150K4947k727
4157F04987j0050k7933K2321K1113n775J8093L4451k3268m856K9839O741m2990
4145F22673M2175K770J7814m7967n277J7706N633j5879j2110J5227q890J4905
4133F48780k7212K1091M2224P825k4071j5432K336J717M842J6430n703J8071r384
4120F81514l1329M875K865N928p212k56p080K0101m542K490K0648j6401Q9J2177
4106F83867k1490K79O341K7583r596k671J0103K2386M926l8507N2731m77j4455
$$ plain form
4093 721020 703846 715165 703360 703401 705697 667982 706441 697635 655430 691214 711469 683858 724178
4080 724178 751313 721204 708625 721959 744075 759219 776262 759203 743173 774651 753530 767085
4068 767085 795842 749793 767134 752311 820670 817888 803679 801066 816102 811453 804870 780417
4056 780417 826741 782145 767768 786416 799623 818794 829789 826037 884318 900209 867877 929259
4044 929259 921524 892660 904735 930659 973543 920470 969953 977538 964072 949807 938787 949225
4032 949225 973063 974505 994777 1000928 1037241 1028818 1045947 1092498 1059473 1097701 1107176 1130262
4020 1130262 1153227 1140311 1209078 1223674 1217597 1266142 1244173 1239297 1260280 1308330 1310829 1324710
4008 1324710 1353446 1382245 1393765 1407497 1439501 1483886 1483881 1483964 1511978 1557895 1595744 1613512 1637573
$$ packed form
4093G21020j7174J1319j1805M1K296l7715L8459q806m2205L5784K0255k7611M0320
4080G24178K7135l0109j2579J3334K2116J5144J7043j7059j6030L1478k1121J3555
4068G67085K8757m6049J7341j4823O8359k782j4209k613J5036m649o583k4453
4056G80417M6324m4596j4377J8648J3207J9171J0995l752N8281J5891l2332O1382
4044I29259p735k8864J2075K5924M2884n3073M9483P585j3466j4265j1020J0438
4032I49225K3838J442K0272O151L6313q423J7129M6551l3025L8228R475K3086
4020A130262K2965j2916O8767J4596o077M8545k1969m876K0983M8050K499J3881
4008A324710K8736K8799J1520J3732L2004M4385nQ3K8014M5917L7849J7768K4061
$$ plain form
3995 1637573 1715736 1761002 1768926 1811016 1824648 1882027 1934159 1959945 1980854 2014439 2064295 2152407
3983 2152407 2224161 2226690 2271868 2325013 2379427 2454991 2518824 2574806 2642422 2692110 2783902 2829536
3971 2829536 2924970 2999481 3080924 3132507 3212743 3279362 3373206 3461751 3547048 3689449 3828486
3960 3828486 3916956 4024855 4158580 4315845 4421097 4635714 4827957 5043978 5257611 5535057
3950 5535057 5859074 6192231 6544657 6938347 7352300 7810558 8293921 8693262 9133922 9452550
3940 9452550 9657912 9673978 9499860 9223327 8838546 8482965 8088990 7711192 7369213 7087733
3930 7087733 6880530 6646753 6392269 6219602 6023962 5827715 5664263 5518812 5302159 5135965
3920 5135965 5006144 4830206 4717032 4630484 4545146 4490576 4446021 4358494 4338537 4295986 4229137
$$ packed form
3995A637573P8163M5266P924M2090J3632N7379N2132K5786K0909L3585M9856Q8112
3983B152407P1754K529M5178N3145N4414P5564O3833N5982O7616M9688R1792M5634
3971B829536R5434P4511Q1443N1583Q0236O6619R3844Q8545Q5297J42401J39037
3960C828486Q8470J07899J33725J57265J05252K14617J92243K16021K13633K77446
3950E535057L24017L33157L52426L93690M13953M58258M83363L99341M40660L18628
3940I452550K05362J6066j74118k76533l84781l55581l93975l77798l41979k81480
3930G087733k07203k33777k54484j72667j95640j96247j63452j45451k16653j66194
3920E135965j29821j75938j13174q6548q5338n4570m4555q7527j9957m2551o6849
$$ plain form
3909 4229137 4195422 4232842 4220421 4213043 4177478 4151047 4103226 4039304 3911678 3703637 3564052
3898 3564052 3413753 3251753 3191004 3081522 2946261 2869806 2757969 2739485 2698313 2608225
3888 2608225 2594399 2553437 2530270 2522822 2518763 2518879 2517460 2493622 2522837 2509170 2486775 2406563
3876 2406563 2303532 2247245 2138231 2099628 2050320 1990899 1955589 1882609 1858467 1808876 1801831
3865 1801831 1754950 1737318 1744419 1674937 1611073 1616733 1609703 1601219 1576389 1550882 1518559 1515169
3853 1515169 1529119 1494818 1502841 1463366 1454564 1444065 1404470 1363857 1387632 1374084 1352251 1353766
3841 1353766 1369846 1354652 1321163 1309368 1299175 1274535 1242123 1267689 1259811 1228040 1232964 1216492
3829 1216492 1202462 1215185 1176559 1184653 1176336 1148181 1158648 1171014 1130409 1133671 1154616 1135346
$$ packed form
3909D229137l3715L7420j2421p378l5565k6431m7821o3922j27626k08041j39585
3898C564052j50299j62000o0749j09482j35261p6455j11837j8484m1172r0088
3888B608225j3826m0962k3167p448m059J16j419k3838K9215j3667k2395q0212
3876B406563j03031n6287j09014l8603m9308n9421l5310p2980k4142m9591p045
3865A801831m6881j7632P101o9482o3864N660p030q484k4830k5507l2323l390
3853A515169J3950l4301Q023l9475q802j0499l9595m0613K3775j3548k1833J515
3841A353766J6080j5194l3489j1795j0193k4640l2412K5566p878l1771M924j6472
3829A216492j4030J2723l8626Q094q317k8155J0467J2366m0605L262K0945j9270
$$ plain form
3817 1135346 1167547 1167963 1096468 1045580 1043417 1077199 1064096 1093648 1060169 1022128 1054761 1058880
3805 1058880 1028411 1026510 1013584 1017738 970214 980797 975532 960358 967911 973130 996768 987620 992761
3792 992761 954437 943826 964964 924094 910917 924549 904796 897154 866147 856131 838516 890759
3780 890759 857924 882824 876404 875809 864155 834316 855564 828915 848784 847242 820884 857729
3768 857729 868996 860537 889510 897488 890215 900579 882842 895986 928343 886912 892823 913380
3756 913380 899714 923991 942122 947246 931394 945465 981775 1001968 976378 999935 1037130 1036007
3744 1036007 1042139 1035207 1052648 1121020 1118097 1108977 1132396 1132247 1161308 1172510 1170114 1150807 1175856
3731 1175856 1184813 1205301 1227601 1243898 1282166 1311693 1342455 1408148 1405678 1459160 1512174 1532681
$$ packed form
3817A135346L2201M16p1495n0888k163L3782j3103K9552l3479l8041L2633M119
3805A058880l0469j901j2926M154m7524J0583n265j5174P553N219K3638r148N141
3792I92761l8324j0611K1138m0870j3177J3632j9753p642l1007j0016j7615N2243
3780H90759l2835K4900o420n95j1654k9839K1248k6649J9869j542k6358L6845
3768H57729J1267q459K8973P978p273J0364j7737J3144L2357m1431N911K0557
3756I13380j3666K4277J8131N124j5852J4071L6310K0193k5590K3557L7195j123
3744A036007O132o932J7441O8372k923r120K3419j49K9061J1202k396j9307K5049
3731A175856Q957K0488K2300J6297L8268K9527L0762O5693k470N3482N3014K0507
$$ plain form
3719 1532681 1564702 1567521 1589146 1636555 1645943 1740039 1766735 1778823 1826461 1906581 1984130 2016665
3707 2016665 2048240 2104142 2209119 2242674 2244629 2245581 2328850 2359355 2383791 2419928 2500375 2511476
3695 2511476 2558422 2618256 2686119 2757116 2853760 2960899 3072638 3222431 3353906 3463673
3685 3463673 3571331 3712962 3741849 3740808 3649734 3573590 3563870 3449726 3400322 3335251 3316601
3674 3316601 3337471 3351930 3370793 3433364 3496080 3555117 3598931 3620371 3730113 3813938 3830659
3663 3830659 3799517 3758901 3678233 3647984 3521606 3425851 3317478 3192649 3125894 3039448 2967142
3652 2967142 2930315 2882022 2851849 2810035 2793673 2746890 2699822 2679995 2627587 2551445 2471895
3641 2471895 2385522 2304326 2199256 2093609 2023164 1927982 1858037 1750730 1719707 1662012 1613316
$$ packed form
3719A532681L2021K819K1625M7409R388R4096K6696J2088M7638Q0120P7549L2535
3707B016665L1575N5902J04977L3555J955R52Q3269L0505K4436L6137Q0447J1101
3695B511476M6946N9834O7863P0997R6644J07139J11739J49793J31475J09767
3685C463673J07658J41631K8887j041r1074p6144r720j14144m9404o5071j8650
3674C316601K0870J4459J8863O2571O2716N9037M3814K1440J09742Q3825J6721
3663C830659l1142m0616q0668l0249j26378r5755j08373j24829o6755q6446p2306
3652B967142l6827m8293l0173m1814j6362m6783m7068j9827n2408p6142p9550
3641B471895q6373q1196j05070j05647p0445r5182o9945j07307l1023n7695m8696
$$ plain form
3630 1613316 1536077 1502649 1496651 1418041 1376213 1360819 1311009 1277508 1229599 1228072 1170930 1128621
3618 1128621 1117270 1100093 1050857 1004806 1001104 974773 928911 897598 889817 816326 810457 836939
3606 836939 802511 775180 765153 749976 705770 706425 703276 681948 697592 691915 667615 641859
3594 641859 667734 635634 576107 578337 576417 589926 587172 547005 556940 535027 518532 542767
3582 542767 510232 471839 459663 461967 458909 481830 450097 436061 489609 502578 411266 415636
3570 415636 396660 366618 375757 404215 404332 375072 392567 388863 378952 380138 362777 330642 363097
3557 363097 339533 326941 321635 312266 316910 310178 319240 286967 284878 279007 276358 306296 300799
3544 300799 265258 236539 269041 260760 263374 249521 250599 267099 277191 242377 277470 293927
$$ packed form
3630A613316p7239l3428n998p8610m1828j5394m9810l3501m7909j527n7142m2309
3618A128621j1351j7177m9236m6051l702k6331m5862l1313p781p3491n869K6482
3606H36939l4428k7331j0027j5177m4206O55l149k1328J5644n677k4300k5756
3594F41859K5875l2100n9527K230j920J3509k754m0167R935k1913j6495K4235
3582E42767l2535l8393j2176K304l058K2921l1733j4036N3548J2969r1312M370
3570D15636j8976l0042R139K8458J17k9260J7495l704r911J186j7361l2135L2455
3557C63097k3564j2592n306r369M644o732R062l2273k089n871k649K9938n497
3544C00799l5541k8719L2502q281K614j3853J078J6500J0092l4814L5093J6457
$$ plain form
3532 293927 277245 240233 208038 229876 242574 235334 220073 209861 240014 247055 241798 205944
3520 205944 219901 258508 237932 201275 210960 196912 183124 207934 209321 211686 203380 237992
3508 237992 247377 197981 195053 204288 200702 185430 179778 202463 189850 190469 174033 182467 224356
3495 224356 228817 238487 209529 220383 218431 199987 176860 158000 147828 118772 150270 158548
3483 158548 179434 185827 155417 144414 149866 140528 128060 165526 194893 168753 128836 170719
3471 170719 146124 180616 169312 171776 180796 150282 138489 123212 122879 154011 154153 129758 110736
3458 110736 139306 136075 136743 153800 126913 108590 137546 109918 126561 176887 120545 93688
3446 93688 84299 107200 132506 125975 134258 137804 153402 147080 97315 125266 126043 106346 109091
$$ packed form
3532B93927j6682l7012l2195K1838J2698p240j5261j0212L0153P041n257l5854
3520B05944J3957L8607k0576l6657R685j4048j3788K4810J387K365q306L4612
3508B37992R385m9396k928R235l586j5272n652K2685j2613O19j6436Q434M1889
3495B24356M461R670k8958J0854j952j8444k3127j8860j0172k9056L1498Q278
3483A58548K0886O393l0410j1003N452r338j2468L7466K9367k6140l9917M1883
3471A70719k4595L4492j1304K464R020l0514j1793j5277l33L1132J42k4395j9022
3458A10736K8570l231O68J7057k6887j8323K8956k7628J6643N0326n6342k6857
3446I3688r389K2901K5306o531Q283L546J5598o322m9765K7951P77j9697K745
$$ plain form
3433 109091 128021 111347 100706 95160 140445 134472 147918 151890 141525 162674 172104 141645
3421 141645 136274 130918 122869 122889 111834 94067 132476 124428 112803 85642 75246 87305 91317
3408 91317 69372 64224 22105 47781 104879 103903 92908 105950 56123 111730 79499 67862
3396 67862 99394 109426 113132 109251 95715 104464 76826 75101 124652 95627 59996 79093 65744
3383 65744 119225 88845 66417 91085 30777 24889 55112 33439 42881 84911 73484 72769 86642
3370 86642 112659 111553 123249 99347 91461 96193 80474 71348 125058 79039 39832 72739 109065
3357 109065 65312 85267 63087 97835 92412 96597 107730 89459 51598 72564 78872 76981
3345 76981 85835 87549 51433 46408 50180 95299 74833 51510 59725 62513 58860 36675 76091
$$ packed form
3433A09091J8930j6674j0641n546M5285n973J3446L972j0365K1149R430l0459
3421A41645n371n356q049K0j1055j7767L8409q048j1625k7161j0396J2059M012
3408I1317k1945n148m2119K5676N7098r76j0995J3042m9827N5607l2231j1637
3396F7862L1532J0032L706l881j3536Q749k7638j725M9551k9025l5631J9097j3349
3383F5744N3481l0380k2428K4668o0308n888L0223k1673R442M2030j1427p15J3873
3370H6642K6017j106J1696k3902p886M732j5719r126N3710m6019l9207L2907L6326
3357A09065m3753J9955k2180L4748n423M185J1133j8271l7861K0966O308j891
3345G6981Q854J714l6116n025L772M5119k0466k3323Q215K788l653k2185L9416
$$ plain form
3332 76091 73880 43414 60491 56815 66088 66823 53943 54924 60497 78029 80171 69809 32707 65546
3318 65546 58372 41373 39108 84896 89817 89190 75313 44520 36303 58109 39978 74833 29240
3305 29240 44367 28222 15899 66524 46865 56838 54174 66414 79030 75025 18735 22909 51638
3292 51638 32017 71564 115472 99142 55834 64092 87880 54038 85939 68661 64554 38774
3280 38774 61344 83484 74638 93206 69987 20729 22789 52974 42899 18899 46796 65655
3268 65655 53976 36025 57067 32713 47046 71177 67264 61760 38666 69854 45806 47196
3256 47196 23960 33176 72526 55380 53503 56348 26449 30054 69000 39894 13124 46476 58649
3243 58649 5098 30373 31517 28413 44854 38356 -1456 52617 47371 38019 45788 47084 41768
$$ packed form
3332G6091k211l0466J7077l676R273P35j2880R81N573J7532K142j0362l7102L2839
3318F5546p174j6999k265M5788M921o27j3877l0793q217K1806j8131L4855m5593
3305B9240J5127j6145j2323N0625j9659R973k664J2240J2616m005n6290M174K8729
3292E1638j9621L9547M3908j6330m3308Q258K3788l3842L1901j7278m107k5780
3280C8774K2570K2140q846J8568k3219m9258K060L0185j0075k4000K7897J8859
3268F5655j1679j7951K1042k4354J4333K4131l913n504k3094L1188k4048J390
3256D7196k3236R216L9350j7146j877K845k9899L605L8946k9106k6770L3352J2173
3243E8649n3551K5275J144l104J6441o498l9812N4073n246r352P769J296n316
$$ plain form
3230 41768 56087 50371 39527 71359 77711 55742 47096 12920 17523 36477 46075 71851 67710
3217 67710 37055 26591 62600 65351 65756 48535 53087 29566 15430 15287 60062 61969 45270
3204 45270 32779 62731 55204 35621 36010 65691 68748 38770 32990 46674 63887 34022 4288
3191 4288 26777 27898 84838 80716 78847 30356 39979 44761 26752 53183 68850 57949 77902
3178 77902 72783 43327 14961 33230 64661 96125 80910 57346 49874 71182 64799 50628
3166 50628 63407 42754 54488 55494 77408 99623 114305 99919 79641 71152 88943 106929
3154 106929 115115 91047 81603 71169 79265 107178 115549 98892 137144 125922 129344 95645 112225
3141 112225 130238 136315 133882 132503 155048 131775 171200 198610 202504 204821 206381 205705 221261
$$ packed form
3230D1768J4319n716j0844L1832O352k1969q646l4176M603J8954R598K5776m141
3217F7710l0655j0464L6009K751M05j7221M552k3521j4136j43M4775J907j6699
3204D5270j2491K9952p527j9583L89K9681L057k9978n780J3684J7213k9865k9734
3191D288K2489J121N6940m122j869m8491R623M782j8009K6431J5667j0901J9953
3178G7902n119k9456k8366J8269L1431L1464j5215k3564p472K1308o383j4171
3166E0628J2779k0653J1734J006K1914K2215J4682j4386k0278q489J7791J7986
3154A06929Q186k4068r444j0434Q096K7913Q371j6657L8252j1222L422l3699J6580
3141A12225J8013O077k433j379K2545k3273L9425K7410L894K317J560o76J5556
$$ plain form
3128 221261 212190 207478 227721 269101 243436 228582 252335 291310 266114 308096 351045 334567
3116 334567 356382 390740 409686 398653 382037 416456 460735 494273 491413 519798 570642 605276
3104 605276 651114 697360 725068 768772 831366 899894 969675 1095958 1202163 1292365 1450303
3093 1450303 1591017 1769584 1983715 2301468 2708809 3251601 4084278 4770801 5081557 5235048
3083 5235048 4879311 4176891 3495357 2900426 2445156 2067304 1809411 1621032 1495599 1359407
3073 1359407 1232491 1124421 1022136 947289 891005 838584 735400 704434 652295 634896 614679
3062 614679 530284 517760 520494 499211 497736 466887 449862 402930 395740 348405 371951 325431
3050 325431 333698 318626 320126 312089 263937 251836 226987 245125 191935 206530 196800 194877 164155
$$ packed form
3128B21261r071m712K0243M1380k5665j4854K3753L8975k5196M1982M2949j6478
3116C34567K1815L4358J8946j1033j6616L4419M4279L3538k860K8385N0844L4634
3104F05276M5838M6246K7708M3704O2594O8528O9781J26283J06205R0202J57938
3093A450303J40714J78567K14131L17753M07341N42792Q32677O86523L10756J53491
3083E235048l55737p02420o81534n94931m55270l77852k57893j88379j25433j36192
3073A359407j26916j08070j02285p4847n6284n2421j03184l0966n2139j7399k0217
3062F14679q4395j2524K734k1283j475l0849j7025m6932p190m7335K3546m6520
3050C25431Q267j5072J500q037m8152j2101k4849J8138n3190J4595r730j923l0722
$$ plain form
3037 164155 159661 172332 181421 204224 185604 219378 210530 204815 194779 201005 189724 187306 121911
3024 121911 105641 101990 100953 92356 126410 162301 131394 115945 95567 103920 103531 112379 125009
3011 125009 144071 118201 113045 111720 117666 98807 94158 131130 78450 83681 68260 95604 50223
2998 50223 48249 76835 49252 82458 60992 126948 98275 87993 24047 23219 31495 56986 57772
2985 57772 47547 33160 68851 86899 69483 72985 53670 68171 50986 72812 53782 35645
2973 35645 84521 85104 90586 50197 58846 97283 82310 70937 51723 49035 36343 24087 18507
2960 18507 36839 48464 40313 76791 88895 50947 50199 68532 74358 61628 62444 64160 51244
2947 51244 43651 18098 27179 20560 42787 46733 20418 41441 43867 23270 55929 40637 28641
$$ packed form
3037A64155m494J2671R089K2803j8620L3774q848n715j0036O226j1281k418o5395
3024A21911j6270l651j037q597L4054L5891l0907j5449k0378Q353l89Q848J2630
3011A25009J9062k5870n156j325N946j8859m649L6972n2680N231j5421K7344m5381
2998E0223j974K8586k7583L3206k1466O5956k8673j0282o3946q28Q276K5491P86
2985E7772j0225j4387L5691J8048j7416L502j9315J4501j7185K1826j9030j8137
2973C5645M8876N83N482m0389Q649L8437j4973j1373j9214k688j2692j2256n580
2960A8507J8332J1625q151L6478J2104l7948p48J8333N826j2730Q16J716j2916
2947E1244p593k5553R081o619K2227L946k6315K1023K426k0597L2659j5292j1996
$$ plain form
2934 28641 43844 34148 41113 33804 25596 30029 32426 56738 43268 37823 45321 27571 37874
2921 37874 33195 30819 28020 11747 9284 33348 69428 39967 16382 50257 13396 44844 4917
2908 4917 14508 32834 -21 12743 47062 63590 54192 66032 57096 58289 78971 42462 31232
2895 31232 42700 31168 44818 12429 1306 30897 35703 35116 45827 26399 15138 36851
2883 36851 52308 -11441 4970 9209 52013 73246 68674 26621 48956 62401 45911 61305
2871 61305 29266 40307 32729 42665 61961 55401 57188 50224 48389 14941 -1165 51310 40577
2858 40577 61394 44337 32062 13368 20519 21398 12640 28677 32864 27124 67923 61120 15052
2845 15052 17187 -10197 -15576 -9349 21171 13319 20939 29282 19956 10962 -159 -8084 -9483 32794
$$ packed form
2934B8641J5203r696O965p309q208M433K397K4312j3470n445P498j7750J0303
2921C7874m679k376k799j6273k463K4064L6080k9461k3585L3875l6861L1448l9927
2908D917R591J8326l2855J2764L4319J6528r398J1840q936J193K0682l6509j1230
2895C1232J1468j1532J3650l2389j1123K9591M806n87J0711j9428j1261K1713
2883C6851J5457o3749J6411M239M2804K1233m572m2053K2335J3445j6490J5394
2871F1305l2039J1041p578R936J9296o560J787o964j835l3448j6106N2475j0733
2858D0577K0817j7057j2275j8694P151Q79q758J6037M187n740M0799o803m6068
2845A5052K135k7384n379O227L0520p852P620Q343r326q994j1121p925j399M2277
$$ plain form
2831 32794 36397 28218 -11117 -41688 -42195 47555 40926 4972 23006 32952 47878 19411 -3365
2818 -3365 11066 24317 51016 89127 77291 4442 -1003 19039 16198 183 969 13995 30910
2805 30910 14517 48275 35926 15812 44750 60669 33323 -1197 -31039 -54948 3994 3322
2793 3322 -6959 26286 -24693 31896 23180 -24384 -39502 -32076 6537 -2701 -9585 -15264 16641
2780 16641 -22371 18330 25013 -2652 13983 35866 34310 40662 39520 1262 4589 23531 3355
2767 3355 28249 25261 4841 -4582 51472 12839 16518 25399 22040 13158 11043 55119 22453
2754 22453 19084 35306 29868 13836 6763 29405 28207 27195 -28389 -39026 -4629 32817 30829
2741 30829 49998 40677 -25659 -29603 -4515 -47416 7168 -14105 18997 35760 8404 4285
$$ packed form
2831C2794L603q179l9335l0571n07Q9750o629l5954J8034R946J4926k8467k2776
2818c365J4431J3251K6699L8111j1836p2849n445K0042k841j6015P86J3026J6915
2805C0910j6393L3758j2349k0114K8938J5919k7346l4520k9842k3909N8942o72
2793C322j0281L3245n0979N6589q716m7564j5118P426L8613r238o884n679L1905
2780A6641l9012M0701O683k7665J6635K1883j556O352j142l8258L327J8942k0176
2767C355K4894k988k0420r423N6054l8633L679Q881l359q882k115M4076l2666
2754B2453l369J6222n438j6032p073K2642j198j012n5584j0637L4397L7446j988
2741C0829J9169r321o6336l944K5088m2901N4584k1273L3102J6763k7356m119
$$ plain form
2729 4285 -21753 15908 51312 33707 26577 5468 15 7614 -7627 27965 -19163 26065 63100
2716 63100 69334 -5260 -13731 -12934 6907 -13932 2556 26790 3620 9524 38073 36541 -16943
2703 -16943 -24360 -15363 -45029 137 14630 -32840 -10196 31015 28144 9289 53520 60898 17313
2690 17313 20760 27081 32749 46112 3679 -11123 4367 5257 -12659 -4751 12730 3327 3249 51908
2676 51908 43774 22855 24804 5200 -21720 -22794 2962 4994 38886 -934 879 -1985 -7219
2663 -7219 -28062 25014 16745 19339 30483 37976 10922 32928 12528 -11940 31046 20559 26574
2650 26574 23750 24929 -1310 13873 3552 5245 23189 -32170 -40114 4720 37128 51519 46360
2637 46360 33524 7624 -34131 -51373 -39251 -27041 -32081 -11481 8599 16002 46612 32829
$$ packed form
2729D285k6038L7661L5404j7605p130k1109n453P599j5241L5592m7128M5228L7035
2716F3100O234p4594q471P97J9841k0839J6488K4234k3170N904K8549j532n3484
2703a6943p417Q997k9666M5166J4493m7470K2644M1211k871j8855M4231P378m3585
2690A7313L447O321N668J3363m2433j4802J5490Q90j7916P908J7481r403p8M8659
2676E1908q134k0919J949j9604k6920j074K5756K032L3892l9820J813k864n234
2663g219k0843N3076q269K594J1144P493k7054K2006k0400k4468M2986j0487O015
2650B6574k824J179k6239J5183j0321J693J7944n5359p944M4834L2408J4391n159
2637D6360j2836k5900m1755j7242J2122J2210n040K0600K0080P403L0610j3783
$$ plain form
2625 32829 982 28757 44019 31033 30694 25031 7867 20790 20640 15730 -526 -42314 -26248
2612 -26248 -11055 48311 43679 54558 38782 4984 -15630 -8982 -10792 -23444 -14116 -10615 -35700
2599 -35700 11867 -24396 -31481 -12257 47165 59407 -5668 12420 25952 24329 43431 29567
2587 29567 17693 22501 -16015 -47263 -16031 -17148 21080 -2684 52395 58744 3333 34373
2575 34373 50578 16763 5402 -2384 25493 27190 9474 -6302 29988 4528 -16546 9591
2563 9591 3146 -1281 130 -35638 9849 40215 25425 19366 -13217 -18301 -5927 12916 -3914
2550 -3914 19495 -27687 -20729 -24222 -16910 -34123 12625 31128 12405 -14541 10881 27992 33997
2537 33997 26740 4555 22900 30506 -16153 16418 10480 12352 17386 -5714 -10002 -18138 -24072
$$ packed form
2625C2829l1847K7775J5262j2986l39n663j7164J2923j50m910j6256m1788J6066
2612b6248J5193N9366m632J0879j5776l3798k0614O648j810j2652R328L501k5085
2599c5700M7567l6263p085J9224N9422J2242o5075J8088J3532j623J9102j3864
2587B9567j1874M808l8516l1248L1232j117L8228k3764N5079O349n5411L1040
2575C4373J6205l3815j1361p786K7877J697j7716j5776L6290k5460k1074K6137
2563I591o445m427J411l5768M5487L0366j4790o059l2583n084J2374J8843j6830
2550c914K3409m7182O958l493P312j7213M6748J8503j8723k6946K5422J7111O005
2537C3997p257k2185J8345P606m6659L2571n938J872N034k3100m288q136n934
$$ plain form
2524 -24072 -42879 -43372 -6330 26262 51701 31692 4037 -19767 19476 33544 36205 36155 18122
2511 18122 33597 42628 12950 24338 13940 -11370 10185 40219 8673 -27659 -59 -7176
2499 -7176 -15060 -35766 -21933 -28049 -50406 -37388 -3085 14976 19719 18549 -33471 -1196 2403
2486 2403 8743 10358 -36061 -23206 8045 26737 -7086 6905 -5085 -2725 -34725 -27575 17817
2473 17817 12442 -11471 -26573 22826 8980 -726 -7785 6181 4915 -3988 1204 -10267 21012
2460 21012 45279 28996 -14195 -21220 -7309 -6520 -23573 -11189 -10761 -9249 -25537 -5677 -20625
2447 -20625 -27713 30709 16977 34639 -2823 26353 25455 -27647 -54165 -15765 -5460 -34447
2435 -34447 19194 9481 34782 21058 4760 16721 34373 40016 42923 53824 51042 27748 12283
$$ packed form
2524b4072j8807m93L7042L2592K5439k0009k7655k3804L9243J4068K661n0j8033
2511A8122J5475R031k9678J1388j0398k5310K1555L0034l1546l6332K7600p117
2499g176p884k0706J3833o116k2357J3018L4303J8061M743j170n2020L2275L599
2486B403O340J615m6419J2855L1251J8692l3823J3991j1990K360l2000P150M5392
2473A7817n375k3913j5102M9399j3846r706p059J3966j266q903N192j1471L1279
2460B1012K4267j6283m3191p025J3911P89j7053J2384M28J512j6288J9860j4948
2447b0625p088N8422j3732J7662l7462K9176q98n3102k6518L8400J0305k8987
2435c4447N3641r713K5301j3724j6298J1961J7652N643K907J0901k782k3294j5465
$$ plain form
2422 12283 16971 26082 18049 -29870 9774 36969 86 29192 -5318 10165 25014 17951 -12449
2409 -12449 34474 44136 22728 9508 14549 33571 -11012 -9170 -20646 13007 -5486 18668
2397 18668 29859 17113 -4056 -5346 3983 -12259 2794 2392 35301 26473 28880 31231 23967
2384 23967 32331 -40810 -19216 -19763 -14850 1967 6456 24518 23696 325 -1377 -2643 -34914 -26053
2370 -26053 -20185 3017 5776 9075 -17216 -14403 -38551 -32946 2935 -26670 -60001 -23715 -12048
2357 -12048 -50478 -47886 3650 14722 -20133 -14182 13586 -25842 -2236 33291 -9858 2236
2345 2236 26292 38325 32533 22727 29262 1386 5320 5809 11013 15221 19300 -19071 3588 3537
2331 3537 34766 18432 13039 38267 43692 13431 23715 32537 17488 -7475 10873 20713 -4031
$$ packed form
2422A2283M688R111q033m7919L9644K7195l6883K9106l4510J5483J4849p063l0400
2409a2449M6923R662k1408j3220N041J9022m4583J842j1476L3653j8493K4154
2397A8668J1191j2746k1169j290R329j6242J5053m02L2909q828K407K351p264
2384B3967Q364p3141K1594n47M913J6817M489J8062q22k3371j702j266l2271Q861
2370b6053N868K3202K759L299k6291K813k4148N605L5881k9605l3331L6286J1667
2357a2048l8430K592N1536J1072l4855N951K7768l9428K3606L5527m3149J2094
2345B236K4056J2033n792r806O535k7876L934M89N204M208M079l8371K2659n1
2331C537L1229j6334n393K5228N425l0261J0284Q822j5049k4963J8348R840k4744
$$ plain form
2318 -4031 5930 1 -10973 -11178 -16778 8335 24539 -3093 10941 -42594 -13833 -6454 -14392
2305 -14392 -11999 -5423 -30833 -27397 -15278 27546 17753 3731 13981 -25287 -43140 -29812 -23138
2292 -23138 13977 -22409 9779 5991 -21098 -19695 -30208 -27468 -20268 -45543 -23764 -15077 -21680
2279 -21680 -9726 24145 19473 -6550 -28536 -22796 -22753 -3068 16559 17911 15364 -20968 -15899
2266 -15899 35824 -4490 -2012 -2471 -55548 -24546 -30770 -28496 -40381 -12585 -16224 1108 32835
2253 32835 17764 -3335 -1790 5810 -37512 -6601 39515 2039 5358 -15552 -4888 17715
2241 17715 26892 19851 19466 2321 6484 -20600 2 6033 -6368 -5647 -30160 -28249 -19603 -36094
2227 -36094 -34523 -49458 -13757 -11453 -14160 8847 -10480 9186 -13801 35812 22398 -13117
$$ packed form
2318d031R961n929j0974k05n600K5113J6204k7632J4034n3535K8761P379p938
2305a4392K393O576k5410L436J2119M2824r793j4022J0250l9268j7853J3328O674
2292b3138L7115l6386L2188l788k7089J403j0513K740P200k5275K1779Q687o603
2279b1680J1954L3871m672k6023k1986N740M3J9685J9627J352k547l6332N069
2266a5899N1723m0314K478m59n3077L1002o224K274j1885K7796l639J7332L1727
2253C2835j5071k1099J545P600m3322L0911M6116l7476L319k0910J0664K2603
2241A7715R177p041l85j7145M163k7084K0602O031j2401P21k4513J911Q646j6491
2227c6094J571j4935L5701K304k707K3007j9327J9666k2987M9613j3414l5515
$$ plain form
2215 -13117 -16140 -38500 -4684 9328 2964 6598 -5387 29808 16878 -6914 -21546 -20929 29481
2202 29481 16310 16844 4851 -19129 -10838 24418 42808 13727 -14877 -28003 5563 3250 -7304
2189 -7304 -7992 -19087 -20711 39637 47658 55718 40765 216 285 26900 26849 -15820 -11557 6214
2175 6214 23655 10127 -30626 -31019 12064 436 1135 -12984 -20665 -26479 -7473 24569 -1876
2162 -1876 10943 38691 16578 21738 -11878 -14958 5146 1110 -27168 -29421 -14872 5503 18427
2149 18427 -40019 -28128 11355 21290 11892 -18485 -41489 3947 18511 -1734 16674 17290 17539
2136 17539 3111 8227 -2603 -9000 -23619 -30441 14872 -1321 14398 36063 16228 -10822
2124 -10822 -22454 -16629 17438 5193 -8017 17340 -25086 11293 -20540 -1642 9143 1181
$$ packed form
2215a3117l023k2360L3816J4012o364L634j1985L5195j2930k3792j4632O17N0410
2202B9481j3171N34j1993k3980Q291L5256J8390k9081k8604j3126L3566k313j0554
2189g304o88j1095j624O0348Q021Q060j4953m0549O9K6615n1m2669M263J7771
2175F214J7441j3528m0753l93M3083j1628O99j4119p681n814J9006L2042k6445
2162a876J2819K7748k2113N160l3616l080K0104m036k8278k253J4549K0375J2924
2149A8427n8446J1891L9483R935r398l0377k3004M5436J4564k0245J8408O16K49
2136A7539j4428N116j0830o397j4619o822M5313j6193J5719K1665j9835k7050
2124a0822j1632N825L4067j2245j3210K5357m2426L6379l1833J8898J0785p962
$$ plain form
2112 1181 3103 -10726 13961 -6754 -29993 -47127 -26511 -12790 5474 1902 -4770 13917 15873
2099 15873 28779 13517 -39668 -29251 -2102 -1291 -668 23432 11953 2429 -13822 5018 -6322
2086 -6322 -22819 -34510 -13695 9510 -18192 11180 11336 -6115 20635 -2125 -12713 -23223
2074 -23223 -45083 7920 1712 18837 -7772 -6834 37404 33303 34161 58903 16786 18526 32265
2061 32265 28309 52487 36041 17216 4788 -61839 -46065 23010 4180 19285 3331 2858
2049 2858 18343 17358 -21923 -16352 3694 -26252 -45952 -5465 -7719 -10816 -23000 -43064 -26113
2036 -26113 -26431 -13208 3703 29140 9454 -18365 -25018 -11808 1861 26126 8366 -37100
2024 -37100 21132 -17643 -18360 1560 -28623 -8072 3095 -24443 11693 45438 42591 8564
$$ packed form
2112A181J922j3829K4687k0715k3239j7134K0616J3721J8264l572o672J8687J956
2099A5873J2906j5262n3185J0417K7149Q11O23K4100j1479r524j6251J8840j1340
2086f322j6497j1691K0815K3205k7702K9372J56j7451K6750k2760j0588j0510
2074b3223k1860N3003o208J7125k6609R38M4238m101Q58K4742m2117J740J3739
2061C2265l956K4178j6446j8825j2428o6627J5774O9075j8830J5105j5954m73
2049B858J5485r85l9281N571K0046k9946j9700M0487k254l097j2184k0064J6951
2036b6113l18J3223J6911K5437j9686k7819o653J3210J3669K4265j7760m5466
2024c7100N8232l8775p17J9920l0183K0551J1167k7538L6136L3745k847l4027
$$ plain form
2012 8564 12614 5925 -14576 -15386 20807 22335 -39453 -8562 -10097 12664 15826 22390 18534 8447
1998 8447 -29000 -38782 -10644 19015 -36208 -13376 16235 -3490 -19348 24336 25348 798
1986 798 2653 5587 -36928 -27594 -5037 -38516 -35375 -19890 37882 4935 13313 -20031 -31494
1973 -31494 -14989 41227 37395 8820 22 -2927 21596 5469 3367 31630 14896 21102 -4718
1960 -4718 19831 27361 -10236 13685 -12080 -11811 4135 20167 27660 18816 -29714 -27147 -13940
1947 -13940 490 15531 45287 44021 43020 76467 39433 31338 -373 -24040 -21655 -25959 -38634
1934 -38634 -39295 -8207 16633 13041 23395 -4825 -42193 -4544 28516 25850 45220 15906 12083
1921 12083 449 2128 16453 -5014 5044 -37311 -56110 -6623 -25657 38763 5398 -32609
$$ packed form
2012H564M050o689k0501q10L6193J528o1788L0891j535K2761L162O564l856j0087
1998H447l7447r782K8138K9659n5223K2832K9611j9725j5858M3684J012k4550
1986G98J855K934m2515R334K2557l3479L141J5485N7772l2947Q378l3344j1463
1973c1494J6505N6216l832k8575q798k949K4523j6127k102K8263j6734O206k5820
1960d718K4549P530l7597K3921k5765K69J5946J6032P493q844m8530K567J3207
1947a3940J4430J5041K9756j266j001L3447l7034q095l1711k3667K385m304j2675
1934c8634o61L1088K4840l592J0354k8220l7368L7649L3060k666J9370k9314l823
1921A2083j1634J679J4325k1467J0058m2355j8799M9487j9034O4420l3365l8007
$$ plain form
1909 -32609 -30270 -46784 4187 -20045 1361 -43688 -33582 -22560 4543 19502 -20818 21214
1897 21214 11579 -32055 -2874 -16393 3893 13277 -11066 8705 22508 748 1643 -7795 -12767
1884 -12767 15193 69321 12115 -29790 -929 24537 -8185 -12386 -12124 -29843 -19748 -20727 -39244
1871 -39244 -28085 -9854 6162 24502 8742 15131 17256 25703 21397 26266 -24083 -15022 -17002
1858 -17002 -10542 -4956 25496 29713 -12553 -2626 4236 2234 4107 -9222 -12103 694 -3068 -23674
1844 -23674 -20273 -10587 -4059 -4564 -6031 -17554 -9405 15376 -11850 -11413 45400 31923 2865 -31135
1830 -31135 -38072 -24379 -27822 941 -4491 -37856 -12116 12008 -9059 -15664 -20747 -6752 -12658
1817 -12658 -16243 -2991 28770 52557 56733 -3081 -34270 -42104 10864 43788 10017 2158 10844
$$ packed form
1909c2609K339j6514N0971k4232K1406m5049J0106J1022K7103J4959m0320M2032
1897B1214r635m3634K9181j3519K0286R384k4343J9771J3803k1760Q95r438m972
1884a2767K7960N4128n7206m1905K8861K5466l2722m201K62j7719J0095r79j8517
1871c9244J1159J8231J6016J8340j5760O389K125Q447m306M869n0349R061j980
1858a7002O460N586L0452M217m2266R927O862k002J873j3329k881J2797l762k0606
1844b3674L401R686O528n05j467j1523Q149K4781k7226M37N6813j3477k9058l4000
1830c1135o937J3693l443K8763n432l3365K5740K4124k1067o605n083J3995n906
1817a2658l585J3252L1761K3787M176n9814l1189p834N2968L2924l3771p859Q686
$$ [...]
##END NTUPLES=NMR SPECTRUM
##END=
