##TITLE=1H_CG-1201
 CDCl3
 8 sc, 
 5.4.2024
##JCAMPDX= 6.0         $$ Bruker NMR JCAMP-DX V2.0
##DATA TYPE= NMR FID
##DATA CLASS= NTUPLES
##ORIGIN= UXNMR, Bruker Analytische Messtechnik GmbH
##OWNER= root
$$ XWIN-NMR		Version 3.5
$$ Fri Apr  5 14:33:02 2024 Russian Standard Time (UT+4h)  she@DPX200
##.OBSERVE FREQUENCY= 200.1309
##.OBSERVE NUCLEUS= ^1H
##.DELAY= (6, 6)
##.ACQUISITION MODE= SIMULTANEOUS
##.ACQUISITION SCHEME= undefined
##.AVERAGES= 8
##.DIGITISER RES= 18
##SPECTROMETER/DATA SYSTEM= spect
##.PULSE SEQUENCE= zg30
##.SOLVENT NAME= MeOD
##.SHIFT REFERENCE= (INTERNAL, MeOD, 0, 15.7039)
##AUDIT TRAIL= $$ (NUMBER, WHEN, WHO, WHERE, WHAT)
$$ ##TITLE= Audit trail, XWIN-NMR		Version 3.5
$$ ##JCAMPDX= 5.01
$$ ##ORIGIN= Bruker BioSpin GmbH
$$ ##OWNER= she
$$ F:/spectra/data/she/nmr/H-F/1/audita.txt
$$ ##AUDIT TRAIL=  $$ (NUMBER, WHEN, WHO, WHERE, WHAT)
(   1,<2024-04-05 14:31:53.21 +0400>,<she>,<DPX200>,
      <created by zg, POWCHK disabled, PULCHK disabled
       configuration hash MD5:
       00 E9 B6 7A A2 85 ED C7 34 08 36 98 17 FE 4E 26
       data hash MD5: 16K
       9B AD 65 9B C5 10 A4 9F 1D 6A 83 38 23 10 DC 6A>)
$$ ##END=
$$ 
$$ hash MD5
$$ 01 0A 81 A1 5C 8E F5 23 F6 5B 9D 3E 61 F4 79 4F
##$RELAX= 
##$RELAX= 
##$RELAX= 
##$RELAX= 
##$RELAX= 
##$RELAX= 
$$ Bruker specific parameters
$$ --------------------------
##$DU= <F:/spectra>
##$EXPNO= 1
##$NAME= <H-F>
##$PROCNO= 1
##$TYPE= <nmr>
##$USER= <she>
##$AMP= (0..31)
100 100 100 100 100 100 100 100 100 100 100 100 100 100 100 100 100 100 
100 100 100 100 100 100 100 100 100 100 100 100 100 100 
##$AQSEQ= 0
##$AQ_mod= 1
##$AUNM= <au_zg>
##$AUTOPOS= <>
##$BF1= 200.13
##$BF2= 200.13
##$BF3= 200.13
##$BF4= 200.13
##$BF5= 200.13
##$BF6= 200.13
##$BF7= 200.13
##$BF8= 200.13
##$BYTORDA= 1
##$CFDGTYP= 0
##$CFRGTYP= 5
##$CHEMSTR= <none>
##$CNST= (0..31)
1 1 145 1 1 1 1 1 1 1 1 1 1 1 1 1 1 1 1 1 1 1 1 1 1 1 1 1 1 1 1 1 
##$CPDPRG= <>
##$CPDPRG1= <>
##$CPDPRG2= <>
##$CPDPRG3= <>
##$CPDPRG4= <mlev>
##$CPDPRG5= <mlev>
##$CPDPRG6= <mlev>
##$CPDPRG7= <mlev>
##$CPDPRG8= <mlev>
##$CPDPRGB= <>
##$CPDPRGT= <>
##$D= (0..31)
0 1.2 0 0 0 0 0 0 0 0.06 0 0.03 0 0 0 0 0.0002 0 0 0 0 0 0 0 0 0 0 0 0 
0 0 0 
##$DATE= 1712313112
##$DBL= (0..7)
120 120 120 120 120 120 120 120 
##$DBP= (0..7)
150 150 150 150 150 150 150 150 
##$DBP07= 0
##$DBPNAM0= <>
##$DBPNAM1= <>
##$DBPNAM2= <>
##$DBPNAM3= <>
##$DBPNAM4= <>
##$DBPNAM5= <>
##$DBPNAM6= <>
##$DBPNAM7= <>
##$DBPOAL= (0..7)
0.5 0.5 0.5 0.5 0.5 0.5 0.5 0.5 
##$DBPOFFS= (0..7)
0 0 0 0 0 0 0 0 
##$DE= 6
##$DECBNUC= <off>
##$DECIM= 32
##$DECNUC= <off>
##$DECSTAT= 4
##$DIGMOD= 1
##$DIGTYP= 9
##$DL= (0..7)
0 120 120 120 120 120 120 120 
##$DP= (0..7)
150 150 150 150 150 150 150 150 
##$DP07= 0
##$DPNAME0= <>
##$DPNAME1= <>
##$DPNAME2= <>
##$DPNAME3= <>
##$DPNAME4= <>
##$DPNAME5= <>
##$DPNAME6= <>
##$DPNAME7= <>
##$DPOAL= (0..7)
0.5 0.5 0.5 0.5 0.5 0.5 0.5 0.5 
##$DPOFFS= (0..7)
0 0 0 0 0 0 0 0 
##$DQDMODE= 0
##$DR= 18
##$DS= 0
##$DSLIST= <SSSSSSSSSSSSSSS>
##$DSPFIRM= 0
$$ [...]
##$SUBNAM2= <"">
##$SUBNAM3= <"">
##$SUBNAM4= <"">
##$SUBNAM5= <"">
##$SUBNAM6= <"">
##$SUBNAM7= <"">
##$SUBNAM8= <"">
##$SUBNAM9= <"">
##$SW= 18.0517689322627
##$SWIBOX= (0..15)
0 0 2 0 0 0 0 0 0 0 0 0 0 0 0 0 
##$SW_h= 3612.71676300578
##$TD= 16384
##$TD0= 1
##$TE= 0
##$TE2= 300
##$TE3= 300
##$TEG= 300
##$TL= (0..7)
0 120 120 120 120 120 120 120 
##$TP= (0..7)
150 150 150 150 150 150 150 150 
##$TP07= 0
##$TPNAME0= <>
##$TPNAME1= <>
##$TPNAME2= <>
##$TPNAME3= <>
##$TPNAME4= <>
##$TPNAME5= <>
##$TPNAME6= <>
##$TPNAME7= <>
##$TPOAL= (0..7)
0.5 0.5 0.5 0.5 0.5 0.5 0.5 0.5 
##$TPOFFS= (0..7)
0 0 0 0 0 0 0 0 
##$TUNHIN= 0
##$TUNHOUT= 0
##$TUNXOUT= 0
##$USERA1= <user>
##$USERA2= <user>
##$USERA3= <user>
##$USERA4= <user>
##$USERA5= <user>
##$V9= 5
##$VALIST= <valist>
##$VCLIST= <CCCCCCCCCCCCCCC>
##$VD= 0
##$VDLIST= <DDDDDDDDDDDDDDD>
##$VPLIST= <PPPPPPPPPPPPPPP>
##$VTLIST= <TTTTTTTTTTTTTTT>
##$WBST= 1024
##$WBSW= 4
##$XGAIN= (0..3)
0 0 0 0 
##$XL= 0
##$YL= 0
##$YMAX_a= 709366
##$YMIN_a= -899663
##$ZGOPTNS= <>
##$ZL1= 120
##$ZL2= 120
##$ZL3= 120
##$ZL4= 120
##$ABSF1= 10
##$ABSF2= 0
##$ABSG= 5
##$ABSL= 3
##$ALPHA= 0
##$AQORDER= 0
##$ASSFAC= 0
##$ASSFACI= 0
##$ASSFACX= 0
##$ASSWID= 0
##$AUNMP= <proc_1d>
##$AZFE= 0.1
##$AZFW= 0.1
##$BCFW= 1
##$BC_mod= 2
##$BYTORDP= 1
##$COROFFS= 0
##$CY= 11.3945322036743
##$DATMOD= 1
##$DC= 2
##$DFILT= <>
##$DTYPP= 0
##$F1P= 15.7292609196834
##$F2P= 12.9074282941183
##$FCOR= 0.5
##$FTSIZE= 0
##$FT_mod= 4
##$GAMMA= 1
##$GB= 0.15
##$INTBC= 1
##$INTSCL= 1
##$ISEN= 128
##$LB= 0.24
##$LEV0= 0
##$LPBIN= 0
##$MAXI= 10000
##$MC2= 0
##$MEAN= 0
##$ME_mod= 0
##$MI= 1.114404
##$NCOEF= 0
##$NC_proc= 0
##$NLEV= 6
##$NOISF1= 3.799351
##$NOISF2= 2.8
##$NSP= 1
##$NTH_PI= 0
##$NZP= 0
##$OFFSET= 15.70392
##$PC= 1
##$PHC0= -25296.81
##$PHC1= 9.587311
##$PH_mod= 1
##$PKNL= yes
##$PPARMOD= 0
##$PSCAL= 0
##$PSIGN= 0
##$REVERSE= no
##$SF= 200.130013532006
##$SI= 16384
##$SIGF1= 3
##$SIGF2= 2
##$SINO= 400
##$SIOLD= 16384
##$SREGLST= <1H.CDCl3>
##$SSB= 0
##$STSI= 0
##$STSR= 0
##$SW_p= 3612.71676300578
##$SYMM= 0
##$S_DEV= 0
##$TDeff= 0
##$TDoff= 0
##$TI= <>
##$TILT= no
##$TM1= 0
##$TM2= 0
##$TOPLEV= 0
##$USERP1= <user>
##$USERP2= <user>
##$USERP3= <user>
##$USERP4= <user>
##$USERP5= <user>
##$WDW= 1
##$XDIM= 8192
##$YMAX_p= 0
##$YMIN_p= 0
$$ End of Bruker specific parameters
$$ ---------------------------------
##NTUPLES= NMR FID
##VAR_NAME=  TIME,          FID/REAL,        FID/IMAG
##SYMBOL=    X,             R,               I
##VAR_TYPE=  INDEPENDENT,   DEPENDENT,       DEPENDENT
##VAR_FORM=  AFFN,          ASDF,            ASDF
##VAR_DIM=   8192,          8192,            8192
##UNITS=     SECONDS,       ARBITRARY UNITS, ARBITRARY UNITS
##FACTOR=    0.0002768,     1,               1
##FIRST=     0,             0,               0
##LAST=      2.2672688,     0,               0
##MIN=       0,             -899663,         0
##MAX=       2.2672688,     709366,          0
$$ Real data points
##PAGE= N=1
##DATA TABLE= (X++(R..R)), XYDATA
$$ [...]
1591C24N69j543Q21K191j404o94J453O62n76m02L06M73kk68n67K51M68j376n86
1610A00J725p08j886O23J98p46m63r2K51n51p62N6L51Rr72m30Q40K79p96j12P21
1631b365P45n41k86J740O34j165P52J085R8Q0k25L96M82J5n32L90N51m07j232
1650B15J235N82j690j72J204n77n60k49J77M91q94m52O57M44o54q41Q43O16j052
1669f77m35N42K10k36p79O13Q45p19n03J212J85n9L17K59L90j5k43M28O96j55
1689A876r74L29J364r32q55O88M87o91r2j79j8K06o09j45P05j66r76l07J226L25
1709A262j521j4P86o43l12J34M92n36j425O31Q47o76o36J07M37L81m33k19P59
1728e79K6l24M77J006l16j445N88J246p1n46k21m17M83Q16o73L74m74o68j67J283
$$ plain form
1591 324 893 -650 171 2362 958 264 1717 2379 1803 1401 1707 2180 2178 1910 1343 1594 2062 686 100
1610 100 1825 1117 -769 -146 52 -694 -1157 -1249 -998 -1549 -2311 -2255 -1904 -1895 -2867 -3297 -2457 -2178 -2974 -3086 -2365
1631 -2365 -1620 -2161 -2447 -707 -73 -1238 -486 599 697 777 552 948 1430 1445 913 1303 1854 1447 215
1650 215 1450 2032 342 170 1374 797 237 -12 165 656 -238 -690 -33 411 -243 -1084 -241 375 -677
1669 -677 -1112 -570 -360 -596 -1375 -762 83 -636 -1139 73 258 199 516 775 1165 1150 907 1335 2031 1876
1689 1876 902 1231 2595 1663 808 1496 1983 1292 1200 1021 1003 1209 600 455 1160 994 18 -289 937 1262
1709 1262 -259 -273 513 -130 -442 -308 184 -352 -1777 -1146 -299 -975 -1611 -1504 -1067 -686 -1119 -1338 -579
1728 -579 -553 -877 -400 606 290 -1155 -567 679 608 62 -159 -576 -93 723 50 424 -50 -718 -885 398
1748C98P20j389p77J026M88n20L88rn4k94l7Q41k3j199l32M00P84m44j293J7N82
1769g27l78O01N47o88j101K19J674M95n65o54m44N84Q28K0k20L95q06m59J048
1788C69P96m92j287M53Q75l17j68k22O9P53j05j97J76k79o68Q35R26oj545n96
1808f30Q04l1k03O11o63j399l41M77J380k70j008m43M63O44n2l56J137K46j078
1827g12M48O55j03k26K08J033j56j086l9j5P82M02o62j08j10j104K34J761N43
1846A745j399j123O17R32n85J51N86q95r92L0O51N90q87q97R11J5l99m10N82Q00
1866B3m54J35O58n41n61Q05R63M90p45q42J3N84P34K27o68m76p16o58J289J007
1886A267r75j426j53J051K12m98K97l36n7J08J79L65j65r02P07R47p59r35J06
$$ plain form
1748 398 1118 -271 -1048 -22 466 -54 334 325 271 -23 -60 781 758 -441 -773 -373 411 -33 -1326 -1309 -727
1769 -727 -1105 -504 43 -645 -1746 -1527 147 642 77 -577 -1021 -437 391 411 191 586 -220 -679 369
1788 369 1165 673 -614 -161 714 397 229 7 76 829 724 527 703 424 -244 591 1517 1511 -34 -630
1808 -630 174 143 -60 551 -112 -1511 -1852 -1375 5 -265 -1273 -1716 -1253 -609 -661 -1017 120 366 -712
1827 -712 -264 391 288 62 270 1303 1147 61 22 7 789 1191 529 421 311 -793 -559 1202 1745
1846 1745 346 -777 -160 772 187 338 924 29 -963 -933 -282 308 -579 -1476 -565 -550 -949 -1359 -777 23
1866 23 -431 -296 362 -179 -740 65 1028 1518 773 -69 -56 528 1262 1489 821 345 -371 -1029 260 1267
1886 1267 292 -1134 -1287 -236 -24 -522 -225 -561 -618 -510 -331 34 -131 -1033 -326 621 -138 -1073 -967
1905i67Q36j37m4O47J47j677M7J564J176m58j481k24P77M19O74k10o40l97n37
1924d85O47J096o18j177j04N66r9r2j46j32l58K39J96j4J52m13j10J631L69j268
1944a20l08P02L42Q2l9R5q22q62P76J053j68j023j054R05N35l40J70J10k28n03
1964f97R5J083J41j105K94O05j03n08r1j5L28k71L5m07n2J29l17O48P67p95q46
1985a082P65N31J91m8j63K4n57K10O30o8j10r83k65R36j54q70M63K55o72Q4K60
2006f23M15k76l58R47K02k44l05K09P04K15k69Mn9l54j22K99Q50o48j088L87N59
2027D45k32q5j7k50N4m3j34O91q8l61k63O55L56j074J43O20l04j0j40r0J7l36
2049d46J89M77j43l25k6L28L27m62K27O47l37m99L59L55K49q13j94O89j14l92
$$ plain form
1905 -967 -131 -268 -312 335 482 -1195 -1148 416 1592 1134 -347 -571 206 625 1299 1089 449 52 -485
1924 -485 162 1258 640 -537 -641 -75 -174 -266 -412 -544 -902 -663 -467 -481 -329 -742 -852 779 1148 -120
1944 -120 -428 274 616 698 659 754 -68 -930 -154 899 731 -292 -1346 -441 94 -246 -76 34 -194 -697
1964 -697 -602 481 622 -483 -189 416 313 -195 -286 -301 27 -244 -209 -616 -668 -539 -856 -208 559 -236 -1082
1985 -1082 -317 214 405 357 194 218 -339 -129 501 433 323 -660 -925 11 -143 -1013 -550 -295 -967 -883 -623
2006 -623 -208 -484 -842 105 307 63 -242 -33 671 886 617 621 562 208 86 385 1235 587 -501 -114 445
2027 445 213 128 111 -139 -85 -128 -262 429 341 -20 -283 372 728 -346 -203 417 113 103 -37 -127 -110 -446
2049 -446 -257 220 77 -248 -274 54 381 -81 146 793 456 -43 316 671 920 107 -87 602 488 96
2069I6k15k69J35l36m30N78K31k71l71L51O82m40k61M78J31J05n0J44j96J52n11
2090b67L55M78m63m32J88P1O9l46K26J83p12M2K96M17qo91J73O69m93k34L60P
2112a12l28j77K12N19p78q6L05L33K00m37J00P80k46k92O50Q6j07Mj86O60n5o31
2134D14P5J43J06n17k53L08j17o00Q4J93j98l96k95P11m5o59K86M46%qj99M81
2156d0K29n92J58N05m2k75j23P85j19n74N31L76l43L4j6J02N05l57m68N35J4m30
2178C95k12L10K85q37j23K68m56q9j80k81M17k72l41K22J13J48l54J14Q73l64
2198c64m02O66M82k27j00K66L93j07k17L93J52l62J06m95N66j10p84N83K22n65
2218I6k65L31K02m82l42K81Nj42o6j58L43K62o95J2O97l08m29L38K16M5o32L64
$$ plain form
2069 96 -119 -388 -253 -589 -1019 -441 -210 -481 -852 -501 181 -259 -520 -42 89 194 144 288 92 244 -267
2090 -267 88 566 103 -329 -141 -70 -1 -347 -121 62 -650 -608 -312 105 97 -594 -421 248 -245 -479 -119 -112
2112 -112 -440 -617 -405 114 -664 -750 -445 -112 88 -349 -249 531 285 -7 643 729 622 626 440 1100 1045 414
2134 414 489 632 738 221 -32 276 159 -441 -357 -164 -362 -758 -1053 -342 -387 -1046 -760 -314 -314 -322 -521 -40
2156 -40 189 -403 -245 260 218 -57 -180 605 486 -88 443 819 476 510 494 596 1101 744 276 811 825 395
2178 395 183 493 778 -59 -182 86 -370 -459 -639 -920 -503 -775 -1116 -894 -781 -633 -987 -873 0 -364
2198 -364 -766 -100 382 155 55 321 714 607 390 783 935 573 679 184 750 640 -144 439 661 96
2218 96 -169 162 364 -118 -460 -179 -174 -316 -382 -540 -197 65 -630 -618 79 -229 -658 -320 -104 -59 -691 -327
2240c27N06O1l16K87K16or5M7L85k05k58J16J09J10n47j19P33m45o32P3L36j81
2262a52k34k2L65l21j08q7K05K95k43m41Q80J7o13P75J86j22k47J03K72J86l05
2283C89q4M4N3j46k21J79M02p28J41J31K4k24n33N12N3m20l09L98L0k93O1K28
2305c13K56l37k21K54M37o0k75L48O30o84l26R09J23k06J8p6N20l61k60K28K12
2326H16k44k14j26J80l03l79J95P1l54k88j10L76j4m05M15J1l78J38K42K23j54
2347c02q9J01L77q2K8R5K54j3l50L44M54j36ln1j17L10m05j30M05J7j92m16R8
2370A97L07n95J13K44l10m35J32j65K78k72k90K77L9j89R5K04L00l12j06O11j00
2391B3m14J93M38j31K01m01L75k15q5K72j9L68m50n50M92N44m96j7j97K45j05
$$ plain form
2240 -327 179 240 -76 211 427 421 326 373 758 553 295 411 520 630 83 -36 697 252 -380 -307 29 -152
2262 -152 -386 -408 -43 -364 -472 -559 -354 -59 -302 -743 137 154 -459 316 502 380 133 236 508 694 389
2283 389 305 349 402 256 35 214 616 -112 29 160 184 -40 -573 -61 -8 -428 -737 -339 -309 -602 -541 -313
2305 -313 -57 -394 -615 -361 76 16 -259 89 719 35 -291 618 741 535 553 477 997 636 376 604 816
2326 816 572 358 232 412 109 -270 -75 -4 -358 -646 -756 -380 -394 -799 -384 -373 -751 -613 -371 -148 -302
2347 -302 -391 -290 87 5 33 128 382 369 19 363 817 681 678 627 510 820 415 285 690 707 515 99 197
2370 197 504 -91 22 266 -44 -479 -347 -512 -234 -506 -796 -519 -480 -669 -574 -370 -70 -382 -488 123 23
2391 23 -391 -198 240 109 310 -91 284 69 -16 256 237 605 155 -395 97 641 145 128 -69 176 71
2412G1q7L19N0k35l24K07L17J4l86r9K09j84n0N4kq9j81L16M15n21k52K72L58
2435A92J67l40J8J73k98J11K77j42pm33J67N48r0m96L2K12K23k31K0K69j80l35
2457a43L45L28L9k16l25N69J9k54J0j76K54l67j10K77k26m71P4J01K23j95k40
2478d84J2L13k38J95J21j27j57j64M67J26l76J8K05O1r0O7J94R5l33K6L23p0r9
2501H5Kl6M39j60l65J53J7K3l21K48M1k29l66L36M0j96k39j55K72lk42L61J70
2524a25k10j42L65L80m34j09O49R8l21m5J57r4K7j22K83O2n22j29K27K32j26k37
2546a36J02j0j60J49l2R0k0m31M42K29j86j28m4N7P4j81J29J27k71J05O1L98j49
2569B15l65K08M82k75J23J9o2K48l67q9L82k07n87K57Q4k2j65k84K44j66l95K84
$$ plain form
2412 71 -16 303 353 118 -206 1 318 332 -54 -153 56 -128 -178 -124 -126 -215 -396 -80 335 -186 -438 -166 192
2435 192 359 19 37 210 -88 23 300 158 151 -282 -115 433 343 -153 -121 91 314 83 103 372 192 -143
2457 -143 202 530 569 353 28 597 616 362 372 196 450 83 -27 250 24 -447 -373 -272 -49 -244 -484
2478 -484 -472 -159 -397 -202 -81 -208 -365 -529 -62 64 -312 -294 -89 -28 -118 -51 143 238 -95 -69 254 184 85
2501 85 87 51 490 330 -35 118 135 158 -163 85 126 -103 -469 -133 -93 -289 -528 -683 -411 -414 -656 -295 -125
2524 -125 -335 -477 -112 268 -166 -275 374 472 151 106 263 169 196 74 357 419 -103 -232 -5 227 101 -136
2546 -136 -34 -44 -204 -55 -87 3 -17 -448 -6 223 37 -91 -135 -78 -4 -185 -56 71 -200 -95 -34 364 215
2569 215 -150 58 540 265 388 407 345 593 226 137 519 312 -275 -18 66 44 -121 -405 -161 -327 -722 -438
2591d38J42j72k27J52L81J66m17K15P5K71Q2j18lM06l43J46L92m9l63l31M25K01
2613E93m28M0J6Q5j87P7k5J85k81k42K88o4J80n92L7M25l70n8R2j67j20Q9K12
2636b15Q9j73j22L10RJ14q9k3L02N9j61K93P7j79p0L4K68k35l20K74m8n2j49k82
2660b89L02P5n87K81K11k47O2o0R0K3m07L96k44p5L37J4j90Q2k94L90K9j12O4
2683a49j22K58Mk60K64K04m34L01j50J45P3k81J35K14m1l8l01J34L09m87N5K42
2705G5j43RO6o5J14J2l35M86j80k3j17p2K15Lq5K12l15j62J35MQ6n0k78L26J91
2730A09j72k3L6M9j09J3J18Q4J1L1k20M27k79k32M26M2l56m5J60%q1j02l4L75
2754B28k71r5J52K07k27k48K59k8M6j38r2O7P4j46j49L22j42l53K16J78p5m8O0
$$ plain form
2591 -438 -296 -468 -695 -543 -162 4 -413 -198 -123 148 230 112 109 515 172 318 710 661 298 -33 392 593
2613 593 165 205 221 306 119 196 171 356 75 -167 121 57 237 -355 -318 107 -263 -321 -229 -396 -516 -427 -215
2636 -215 -126 -299 -421 -111 -102 12 -77 -100 202 261 100 393 470 291 221 255 523 288 -32 242 194 142 -7 -289
2660 -289 13 88 -499 -218 -7 -254 -192 -252 -162 -139 -546 -150 -394 -469 -132 -118 -308 -226 -520 -130 -101 -213 -149
2683 -149 -271 -13 -9 -269 -5 199 -235 66 -84 61 134 -147 -12 202 161 123 -178 -44 265 -222 -167 75
2705 75 -68 -59 7 -58 56 68 -267 219 39 16 -101 -173 42 45 -40 172 -143 -305 -170 -166 -80 -130 -408 -82 109
2730 109 -63 -86 -50 -1 -110 -97 21 105 116 147 -73 354 75 -157 269 311 -45 -90 70 70 -11 -113 -147 228
2754 228 -43 -138 14 221 -6 -254 5 -23 23 -115 -207 -140 -66 -212 -361 -39 -181 -534 -318 -140 -215 -263 -203
2777b03L74l21J18J21R6R6o6%M40l32j83M23k97K39k67j14J65l0j95j30R1J85
2799B10j88r3J15P7l08JJ62l2o7j64K65O7k01o5L09r0q7k62M42J07k92j7J50R5
2823A34R7k76J70L01k26m6M00k62J28j39J32J30k29k88J03r8j83%k8R1j58k64
2845e11L43r1k77K86j86K08k4o4P4J03j32n5K33J0J45l84M56m5j13n4O7J34j87
2868f4l5J88q8j04K8J77q8R6k60Q7K19j63r0j09P2K29k42j17J21K3LJ4R4j18m0
2893a67j44L95J55m30L03j1J83l23J11M43l34K2P7j02J05j55k25K87n7J08j77
2914F4j1J9j82p1J74J23l21N8K14O0k23n1L06jr5J73k59J76Q6l24L20j9k82L0
2938c6K25o1n4k22J63R2j7j4q0L0O2j41l3L96l50k25J11Q6j09q7K68j58k75J72
$$ plain form
2777 -203 171 -150 -32 89 185 281 215 215 655 323 140 563 266 505 238 124 289 259 64 -66 25 210
2799 210 22 -71 44 121 -187 -186 -24 -56 -123 -287 -22 45 -156 -221 88 -2 -89 -351 91 198 -94 -111 39 134
2823 134 231 -45 125 426 200 154 554 292 420 281 413 543 314 26 129 31 -152 -152 -180 -89 -247 -511
2845 -511 -168 -259 -536 -250 -436 -228 -252 -316 -242 -139 -271 -326 -93 -83 62 -322 134 89 -24 -78 -11 123 -64
2868 -64 -99 89 1 -103 -75 102 14 110 -150 -63 156 -7 -97 -206 -134 95 -147 -264 -143 -120 -117 -103 -9 -127 -167
2893 -167 -311 84 239 -191 112 101 284 -39 72 515 181 203 280 178 283 128 -97 190 133 241 64
2914 64 53 72 -110 -181 -7 116 -205 -147 67 127 -96 -147 159 158 63 236 -23 153 239 -85 235 216 -66 -36
2938 -36 189 128 74 -148 15 107 90 76 -4 26 88 -53 -86 310 -40 -265 -154 -68 -177 -264 4 -154 -429 -257
2962b57K8M7j6R8m5K42%j78L70n0R8j68J17P4j72p9O3N5j84M3j60K5O5l28P0J46
2988i6Q0k05k03L84J17l47J21Q2J13Qj19K42k75j8J35L65k64l7j01J92l3j85J09
3011F5K37l1k47j21K75m4qj60J1m3Ln5J9K5j74j78J50mj5j44L1K85k27L3O6O8
3037a83R8OJ42J47m1k3J32l4p2J78k09K06K3k73J05J90M9m31J40j41j29k77J70
3060b27J06k94L03j14K6mk01K02Q7j13l5K15j59K59j69l3L80l12J89R8r3J73J10
3083C94l04N23l46K6J4J64n5k60q9K87j38k35J25kj25j20j84J80j55l3J3qK32
3106i6j49j14L77k00j68J80J60J34k90J55J60N5k17J88J52k52K58j11o6J96l44
3127HJ00J22l9j14j37n0J20j83K9J05j50k6J59n7k1j43j7R9O0M2j01K41o8j86
$$ plain form
2962 -257 -229 -182 -198 -100 -145 97 97 -81 289 239 337 169 286 360 188 109 172 227 43 86 -74 -49 16 -312 -242 -96
2988 -96 -16 -221 -424 -40 77 -270 -149 -67 46 54 -65 177 -98 -116 19 384 120 83 -18 174 141 -44 65
3011 65 302 271 24 -97 178 134 126 -34 -23 -66 -63 -118 -99 -74 -248 -426 -276 -280 -295 -439 -408 -123 -350 -317 -251 -183
3037 -183 -85 -79 63 210 169 146 278 244 172 350 141 347 370 97 202 392 441 10 150 9 -120 -397 -227
3060 -227 -121 -415 -112 -226 -200 -204 -405 -203 -116 -229 -264 -49 -208 51 -118 -151 229 -83 106 204 111 284 394
3083 394 90 613 267 293 307 471 416 156 67 354 216 -19 106 104 -21 -141 -325 -145 -300 -333 -320 -328 -96
3106 -96 -245 -359 18 -182 -350 -170 -10 124 -166 -11 149 204 -13 175 327 75 333 222 156 352 8
3127 8 108 230 191 77 -60 -110 10 -173 -144 -39 -189 -215 -56 -113 -134 -277 -294 -195 -135 -93 -194 47 -21 -207
3151b07N0N02k83N4j2j09J69j1J8J32r9m0j78K46K5j07j77J49R4j40J9n5J22j21
3175D1k30J20j1M0J19r8J70j60k15P8J97Q6k58J55J63j04k7l7J31L9j10l7j6N9
3199I5j88J17J7l66J89J03m3J02k65J97l0k43R4J48k7J4q4n4K04J6j25M8J18J62
3223A99m06J39K02q4Q0P3l5K9j17J98K2j32j45l5M9Q8k05k07L12j87n3P7k04K42
3247a00j69o2ML26k40O6J13J31j44r4M04ol31L34O2M0l2k09Q6J76j03J39p4j8
3271B99q1m0P8J1l21R6J04k26P3j7NJ15l03L5l0j5N8p7o0K31j21k08K07L1K34
3296G8k42K9J03l5J1J66l1K1J38j11Q6J39l30K14L5j92K4r5J09k5j97m3J0J07
3320c1o4l91L96P0l34J86J16j37N4n5R2pj3K56j01N8k9j32K4J49J5l6O0m4pj43
$$ plain form
3151 -207 -157 345 62 116 104 -5 164 153 171 303 204 164 -14 232 257 150 -27 122 216 76 95 40 162 41
3175 41 -189 -69 -80 -40 79 -19 151 -9 -224 -146 51 137 -121 34 197 93 66 29 160 199 89 52 36 95
3199 95 -93 24 41 -325 -136 -33 -76 26 -239 -42 -72 -315 -221 -73 -100 -86 -170 -224 -20 -4 -129 -81 37 199
3223 199 -207 -68 134 50 130 203 168 197 80 278 300 168 23 -12 37 125 -80 -287 25 -162 -215 -138 -342 -100
3247 -100 -269 -331 -327 -1 -241 -175 -62 69 -75 -169 235 229 -102 232 294 334 302 93 179 355 252 391 317 299
3271 299 218 178 256 267 -54 42 146 -80 -7 -24 -19 96 -207 -172 -202 -217 -159 -236 -296 -65 -186 -394 -187 -156 78
3296 78 -164 -135 -32 -67 -56 110 79 100 238 127 213 352 22 236 271 79 103 8 117 92 -105 -148 -138 -31
3320 -31 -95 -486 -90 -20 -354 -168 -52 -189 -135 -190 -98 -105 -118 138 37 95 66 -66 -42 107 122 86 146 102 95 -48
3346d8J29J19k04J47K5k33j70R3N8K32k87j27J59j33j58J60J09J14j20j48J04
3367a79J92j37L00n8p6L2O7ROq3Q1l1k4L16n16L75r8j29O4k30J18l2k48J84M6
3392e1P5j44P5n0K3k30L63j3j54q0J46J9jR6n1QR0j03J59K7j54O2j08J3J88k6
3418A79N2lKk35q0K84j75r8J35M2j54j38k7J81j20P9o6p7k9Q5k0K20j33k3M7J01
3444B9q1J44J01q%k28J81k2K3M1q7P6O8k88J78j18K4k3j7j42J32l84L07M5o2J56
3470D5j88J39N7j76jJ82k54R8N3j6K09k11n5J08Q8K3j61J09MK04l01Q0n3J78r8
3495F3j87L66k53l37K87o1pLnJ80o5l34K19J73k43N7L0J40q4o7K08R9j33K04j57
3520I6Q1m8r1J80N8l10J14J71j59Q4p7r6K4j65J00N5l6j24j0m2K27k39q2J58J04
$$ plain form
3346 -48 81 200 -4 143 168 -65 -235 -142 -84 148 -139 -266 -107 -240 -398 -238 -129 -15 -135 -283 -179
3367 -179 13 -124 176 118 42 74 141 150 156 73 154 123 99 415 -101 274 176 47 111 -119 -1 -33 -281 -97 -51
3392 -51 24 -120 -45 -95 -72 -302 61 48 -106 -186 -40 -21 -22 74 23 31 121 18 177 204 50 112 4 17 205 179
3418 179 231 228 230 -5 -85 199 24 -74 61 103 -51 -189 -216 -35 -155 -76 -142 -219 -248 -163 -183 37 -96 -119 -72 29
3444 29 -52 92 193 185 185 -43 138 116 139 180 93 169 237 -51 127 9 33 10 -7 -149 -17 -401 -94 -49 -111 45
3470 45 -143 -4 53 -123 -124 58 -196 -98 -45 -61 148 -63 -118 -10 78 101 -60 49 53 257 -44 36 -17 161 63
3495 63 -124 242 -11 -348 -61 -122 -129 -126 -131 49 -16 -350 -131 42 -201 -144 -114 26 -58 -125 83 182 49 253 96
3520 96 177 129 38 218 276 -34 80 251 92 176 99 3 27 -138 -38 17 -19 -143 -153 -195 32 -207 -289 -131 -27
3545b7j32k6J2K38j10k3J92j64J29j6k6L4J72j72J96j92kJ36k09K51j69j25K16
3568A83mq8O5k41K28j58j44J11QL5Rk85J45J22k58K26p3k3K8j7m0J12Q0m0j09
3593a28J19Q2MJ45K88m08j84M14q0j38J27j09Ql3n5J90k76M3N9l0Q5j89j95J02
3617a59J35or6m4K50k18r5K24k1K1j8q5J01K46j92J83j33N7K8kjk00M6J90pm2
3643A62L1j76N4M0k48K19l8k89L2J74K8J3q4J3m0j41J7Q1J2L25l20J3K84k21M9
3668a0K2L5k5J40r9j3J18l9N7p0j39K12n8j58M4j01j52J10J51n0j28J23m2j65
3692b37R0P1J0j05j49J97J60j95L55k63J51J5q5J54j13o0R7o1j84L95l30P2K23
3715B08j46l7l3J05l03J17R2j28j9o0J6K36J11l21K2P4Qn8OJ64o6Qj06L72l05
$$ plain form
3545 -27 -159 -185 -173 65 -45 -68 124 -40 89 73 47 81 253 81 277 85 83 219 10 261 92 -33 183
3568 183 179 91 156 -85 143 -15 -159 -48 -40 -5 4 -281 -136 -14 -272 -46 -119 -142 -114 -131 -171 -59 21 -19 -128
3593 -128 -9 73 77 222 510 102 -82 332 252 114 241 132 140 107 52 242 -34 9 68 38 123 -66 -261 -159
3617 -159 -24 -30 -126 -170 80 -138 -233 -9 -30 -9 -27 -112 -11 235 43 226 93 150 178 176 175 -25 21 211 204 162
3643 162 193 17 71 111 -137 82 44 -245 -213 -39 -11 2 -82 -69 -109 -250 -233 -152 -140 185 -135 -122 162 -59 -10
3668 -10 12 47 22 162 63 50 168 129 186 116 -23 189 131 -27 17 -84 -236 -126 25 -25 -153 -30 -72 -237
3692 -237 -147 -76 -66 -171 -320 -123 37 -158 197 -66 85 100 15 169 56 -4 93 32 -152 243 -87 -15 208
3715 208 62 25 -8 97 -206 -89 3 -125 -144 -204 -188 48 159 -162 -140 -66 -58 -116 -110 54 -12 -4 -110 262 -43
3740d3q3J47O6J24m7j58K26j39q6K9qP0j12j33K68j09j14N5nk6j13P1O3j03j90
3765c50K46j6OJ83j40p2J10l8J05J34q3j50J20Q1j2j31M0J21O7j56lj52Q6j26
3789a30K29j59Q5j17N1Q8M9k57K26m0q4p0m4J65j27J41k45J74P7j05O0l6M64k57
3813A38q5R2R1qP0l51J98n3o5O9p5j6o1J75k08J35l58K91K2o9J42j80J01Qj97
3838a94J51j1N1l5J78k2R0l78K31J45k35L07l03J74R4q8q7K54k58l4M3k7o9Q2
3862E9k34K93j73P9k8n9J1o2l8j3j02R8qJ13O9r0MQ3j20K39J25k45R7KnJ51R9
3889C45k49Q7q9K00m9j73J08j51K6J64j48j56MQ3p9O8l00L44l02K62j00p6j4J32
3913f3j01n0j26J51k80L49J42O8k97K60Q9j94P2J72R4j82R3j63J79j76K46j84
$$ plain form
3740 -43 -126 21 87 211 164 6 232 93 7 36 28 98 -14 -147 121 12 -102 -47 -52 -78 -191 -120 -57 -160 -350
3765 -350 -104 -120 -114 69 -71 -143 -33 -71 34 168 85 -65 55 136 124 -7 33 154 221 65 62 -90 -4 -130
3789 -130 99 -60 25 -92 -41 47 96 -161 65 25 -59 -129 -173 -8 -135 6 -239 -65 12 -93 -33 -69 395 138
3813 138 53 145 236 228 298 -53 145 92 27 96 21 5 -56 119 -89 46 -312 -21 1 -68 74 -106 -5 3 -194
3838 -194 -43 -54 -3 -38 140 118 208 -170 61 206 -29 278 -25 149 243 155 68 322 64 30 73 46 -23 59
3862 59 -175 118 -55 24 -4 -63 -52 -114 -152 -165 -267 -169 -177 -64 5 -85 -81 2 -118 121 246 1 98 100 95 246 345
3889 345 96 183 94 294 245 72 180 29 55 219 71 -85 -81 2 -77 -9 -309 35 -267 -5 -105 -181 -195 -63
3913 -63 -164 -214 -340 -189 -469 -120 22 90 -207 53 142 -52 20 192 286 104 197 34 213 37 283 99
3935I9P0J2Ol3m8k12J18j41k1J42j38J4o1m7J43l4j7O4Ll5J96j19k1J02k55L96
3961A83k56L3L0K2mN0K1p6J83j62J5N5J23q4p6Mj00J71q9J56r1p8j04m0J54j94
3987a54J09N7o8N8lO3j37M8RJ17n7K05k41j24K17j78J01K25l16J25m2o5QR1j14
4012f6N7j12J00j08K10j40Q5l5J23k2r7r4J15n3J18j35K15J6j33J36o5LL9Qj00
4037F5%L3M8l01J42J50l20K59K6j19R7%K6k52L2J1j5j15K40q4j7P8j50m8J20K5
4063f9J3J6P7J1n2P6M6o4J9PN2LP5j65J08n1r0j19l0K49j59r9J63k21J22k5j91
4090b98J66J29j21O6M6j02q4N2j55J77k7J0J73k22J06l5J04l1l6J84J98l63K05
4113A42q6N0Jj17R4J65k28L8j3m4j24J01N8K0j95J1J25j59n5M9j56K25j34L63
$$ plain form
3935 99 169 181 187 154 106 -106 12 -129 -150 -8 -146 -132 -193 -240 -97 -131 -148 -84 -81 -116 80 -39 -60 42 -213 183
3961 183 -73 -40 -10 12 8 58 79 3 186 24 39 94 217 133 57 61 -39 132 43 199 108 30 -74 -114 40 -154
3987 -154 -45 12 -56 2 -1 62 -75 -27 -18 99 42 247 6 -118 99 -79 22 247 -69 56 14 -51 -43 48 -66
4012 -66 -9 -121 -21 -129 81 -59 26 -9 114 92 -5 -99 16 -37 81 -54 161 177 44 180 115 118 157 165 65
4037 65 65 98 146 -155 -13 137 -183 76 102 -17 80 80 106 -146 -114 -103 -118 -233 7 -77 -94 -16 -166 -214 -94 -69
4063 -69 -56 -40 37 48 -4 72 118 54 73 80 132 135 210 45 153 102 12 -107 -137 112 -47 -146 17 -204 -82 -107 -298
4090 -298 -132 -3 -124 -58 -12 -114 -198 -146 -301 -124 -151 -141 32 -190 -84 -119 -15 -46 -82 102 300 -63 142
4113 142 56 106 107 -10 84 249 21 59 46 2 -122 -21 37 57 -138 -127 -2 -161 -216 -167 -323 -98 -232 131
4137A31m6k01O5qJ28n8J08P9k24P8k5P6p7J26o6j53J78J0n4j20N2j30J09j8l9
4162g9J71j60Q7j71O9Rp5j6J04Lk8j75K44mPJ5L6j78K24L0j79K72k60q3K86k7
4188A22j10J13q4J40j56l1O8M8j20q8K10m7O1k01N3p3P0j30J99p9Q5q5Q5J03j17
4213C6L8P2j11j16L29j47k6M2j27O6l3N9J14r3k7q9q3J54K04k07j56K04j81ml4
4238a16kJ51k6n6k00L55m11K30O4N8J2k14J65J00k22R0J25j28J31j59J21J30j57
4261D1p6J23q7K00q0Jk27k0p8Q4J3J71n3j52J44j36j42K96r8n2J42k26L25j51
4285c8J19Pr5J38n8m3J1K15k54NJ30n3o6m9J75j03R8j00Q2j90J97j94J69j25N1
4310B9K2m9j43J66j55N2R7q6O2j60nJ86m0O5o0j45K77j02n8R5J39j85M0J43j04
$$ plain form
4137 131 85 -116 -51 -59 69 11 119 198 -26 52 27 103 26 152 86 -67 111 121 67 -53 -1 -131 -22 -40 -79
4162 -79 92 -68 19 -152 -83 -74 -149 -165 -61 -58 -86 -261 -17 -21 -14 1 37 -141 83 113 -66 206 -54 -137 149 122
4188 122 12 125 41 181 25 -6 62 110 -10 -98 112 65 126 -75 -22 -95 -25 -155 44 -35 50 -35 50 153 36
4213 36 74 146 35 -81 248 101 75 117 -10 56 23 82 196 103 76 -13 -96 58 262 55 -101 103 -78 -82 -116
4238 -116 -118 33 7 -49 -249 106 -305 -75 -11 47 59 -155 10 110 -112 -22 103 -25 106 -53 68 198 41
4261 41 -35 88 1 201 121 122 -105 -125 -203 -119 -106 65 12 -140 4 -132 -274 22 -76 -128 14 -212 113 -38
4285 -38 81 88 -7 131 73 30 41 256 2 7 137 84 18 -31 144 41 139 39 121 -69 128 -66 103 -22 29
4310 29 51 2 -141 25 -130 -78 19 -67 -5 -165 -170 16 -24 41 -19 -164 113 11 -47 48 187 2 42 185 81
4335H1J28j07J06j67L7oj66k1J56p3k1M4p4k3p7j00L44n4j98J63q6R6L9r8J15
4360C8j46k6K53r4r5K75j17j25J16n9J99q2q7J95k43Q2j12MP3j98P3J33j00n3
4384i6M5j41J03J88l60J65p2J33R8j98j8J33o3J43O7q4K01l31J92P9j09Q6M6j58
4408D9J84k12M4N7K5r7N7k05K21jk99K57k26M2J3Q1j15K0p1K14n0L5r6m3N3J14
4434E1j43r2J23n3k9K45j41J12q2J84o4j06l7Q6m6L6lJ19J17l14J70r9k4m7P7
4459D0k37L18l44K40j45j03K43L2l04J99j38K9J19P8Mj50K26p0n3j17N7K41l00
4482a35R5o3J50k7j07P3nJ16r7o2J28lJ01o2j10p3J30j47J79m1m6N6k37K62j66
4507i1j06J47R8j18L3Pm2O6M5j05K32j15p4OO3p5Q5j33O9r0M9j58Q9P8p7L0J40
$$ plain form
4335 81 209 102 208 41 78 72 -94 -115 41 -32 -53 -9 -83 -106 -183 -283 61 7 -191 -28 -114 -18 21 -77 38
4360 38 -108 -134 119 25 -70 205 88 -37 79 20 219 137 50 245 2 84 -28 -24 49 -149 -76 57 -43 -96
4384 -96 -51 -192 -89 99 -261 -96 -168 -35 63 -135 -153 -20 -83 60 127 43 244 -87 105 184 75 161 207 49
4408 49 233 21 65 122 147 50 107 -98 123 122 -177 80 -146 -104 -91 -10 -125 -105 -176 38 -12 23 -73 -116 -63 51
4434 51 -92 -184 -61 -114 -143 102 -39 73 -9 175 111 5 -32 54 8 44 41 160 277 -37 133 34 10 -37 40
4459 40 -197 121 -223 17 -128 -231 12 44 -260 -61 -199 -170 -51 27 31 -119 107 37 -16 -133 -76 165 -135
4482 -135 -40 -103 47 20 -87 -14 -19 97 0 -62 66 63 164 102 -8 -81 49 -98 81 40 -6 50 -187 75 -91
4507 -91 -197 -50 48 -70 -37 -30 -72 -6 39 -66 166 51 -23 -17 46 -29 56 -77 -8 -98 -49 -207 -118 -40 -117 -87 53
4534E3q7J98k19n1PLN7L9R5J43j79r0R6N1j9k23J14KL0j06K26k8O2k43O8q8K0
4561f9N1QJ06j83J06K3j1l4K2j42K00j19j6Q2r6r5J36P1k11J98J07j51L3Q4Jj05
4587dK09k2j66j9j41L07j78qN7j49N4o0K82l56L50k30J78j84j84K59Q5j12p5L6
4611g1J48j63M5L05j73k20J44J30M1J19j62Lj39p4K16p6j0j70J28J13j32M2J21
4634A65q6k44J50q2O6O0K9j60J11j49k7J72P0m7k66J61K29k74R5p7L12j61N1n2
4658D6J2K24r8k7Rq2M4j98J19J22k38Q3j30J20j43N5M8R7k01J5N0j9j7j07J84
4683c2n4n1R6j96K46N8j17J57q1j50L16j20Ll5P7m8j6pJ56N1j95J02j53Q2m1j52
4709a04J6J23k05m1kJ03Q8j35p5N4L5Q0j69L23j97K4j27L51l36K77j38OJ85k9
$$ plain form
4534 53 -34 164 -55 -106 -99 -96 -39 0 95 238 59 -31 65 116 97 -126 -12 -10 20 -86 140 112 174 -69 -1 -89 -69
4561 -69 -18 -10 96 -87 19 42 31 -3 19 -123 77 -42 -58 24 -72 -167 -31 40 -171 27 134 -17 16 100 101 -4
4587 -4 205 183 17 -2 -143 164 -14 -22 35 -114 -60 -120 162 -194 156 -74 104 -80 -264 -5 80 -32 -107 -71
4611 -71 77 -86 -41 264 91 -129 15 145 186 305 143 146 7 -67 149 73 63 -107 21 134 2 44 165
4634 165 79 -165 -15 -97 -31 29 58 -102 9 -140 -167 5 75 28 -238 -77 152 -122 -27 -104 208 47 98 46
4658 46 58 282 184 157 166 84 128 -70 49 171 -67 16 -114 6 -137 -82 -34 63 -138 -123 -73 -92 -109 -216 -32
4683 -32 -86 -137 -41 -237 9 67 -50 107 26 -124 192 72 75 40 117 69 53 46 202 253 58 160 7 89 48 -104
4709 -104 -88 35 -170 -211 -213 -110 -22 -157 -232 -178 -143 -63 -232 91 -106 -82 -209 142 -194 83 -55 -49 136 107
4733A07j33J39j82J67K5p5n9J53j46K4l5L6j15J23kk2j24K9K96k32l0k6N1N0l0
4758a1l6m2O0K19j96n4qk0J08oR0o6O8P0j8R6k80J20m6Q0k47J44k7n7J30l4j35
4785i8J45Jj88Q4J3NJ8j1J16O3j70J80k23oL4K35k49J35j86L22j19p1Q6O0j31
4810D5N0j03N6K12k89N9J1j55J17m0n4K51j95n0M0l6Q5k23K53o5j7N7j5n7m3k8
4836a34K15j21j52K30L4j60m1Q4KK48j53k21K27Pj39J53j27K82l07J50O8j35R9
4859A09j13Mj8o7Q3J21l00M9R7J06l0N5j91J85j8K1Q4k67J14N7k3K5j5j62J62
4884F8r8J4J50k95K28j67R9O0j37J1j8%J16j74m5J17q5Q1J18R1l44K85lk55K76
4909I3J8j56L1j35L34l5j17L7K1j40J4J97p0j4p2J68j96J65k20J44k0j27q3Q1
$$ plain form
4733 107 -26 113 -69 98 123 48 -11 142 -4 20 -15 21 -94 29 27 5 -119 -90 206 -26 -56 -82 -31 19 -11
4758 -11 -47 -89 -29 190 -6 -60 -68 -88 20 14 104 38 106 176 158 254 -26 94 48 128 -119 25 -2 -59 71 37 -98
4785 -98 47 48 -140 -56 -43 -38 -20 -31 85 148 -22 158 -65 -71 -37 198 -51 84 -102 220 101 30 116 176 45
4810 45 95 -8 48 260 -29 30 41 -114 3 -37 -91 160 -35 -85 -45 -81 4 -219 34 -31 -48 9 -6 -63 -106 -134
4836 -134 81 -40 -192 38 72 -88 -129 -45 -43 205 52 -169 58 65 -74 79 -48 234 -73 77 145 10 109
4859 109 -4 0 -18 -85 -2 119 -181 -132 -35 71 41 96 -95 90 72 93 177 -90 24 81 58 83 68 -94 68
4884 68 -30 -16 134 -161 67 -100 -1 59 -78 -67 -85 -85 31 -143 -188 -71 -156 -75 43 134 -210 75 72 -183 93
4909 93 111 -45 -14 -149 185 150 33 70 91 -49 -35 162 92 78 6 174 -22 143 -77 67 47 -80 -163 -82
4933h2j04J4J71j83Q5J03N4k06Q1J51k6J4m6K6j42J39%P8P0l03K10J0j78J13L6
4958H5O3r6M9k54J30r9L5K4N0N6l0p6J07j21m8m3o2J28l4l0Q9p6J09J2J1J09N3
4985A41l5L4k10m0K34p3K7rl9P5j59J26p9O2j9k12K34j38K56k44N3l0j14Q4M5
5010c0j6k2R2M0j79J66jj47J25Qk49L11p7J2%p9J9J04q7R0j04JO6J8j5J04j63
5037a3J4Qq5oJ9J3M6k9J9J36j70N1r0N0J29j84J09j06j4J24j24Q8M9m3J16p4o4
5064c1l3JM5M5M8k02L9J0p1Q7KJ4k2O8k7k3MjM3N2q7N7K2n4j7M6r4J05J69k26
5094c1L9O0k8Q4j69Q7O7J30k68J77q7P2j16M4lj09p5J58K7j28O7m8J05j92j9K05
5120D9j28k07K77j68Q2N6q5J03J05l8o3J08j01K09j80Q5Q8j06l7m9K52k87J63
$$ plain form
4933 -82 -186 -172 -1 -184 -99 4 58 -148 -67 84 58 72 26 52 -90 49 49 127 197 -106 104 114 -64 49 85
4958 85 148 52 101 -153 -23 -122 -87 -63 -13 43 13 -63 44 -77 -125 -168 -230 -102 -136 -166 -77 -153 -44 -32 -21 88 141
4985 141 106 140 -70 -110 124 51 78 69 30 105 -54 72 -7 55 36 -176 58 -80 176 -68 -15 -45 -159 -75 -30
5010 -30 -46 -68 24 64 -115 51 50 -97 28 36 -213 98 21 33 33 -46 -27 77 -10 80 -24 -23 43 61 46 150 -13
5037 -13 1 9 -76 -82 -63 -50 -4 -33 -14 122 -48 3 -87 -37 92 -92 17 -89 -103 21 -103 -15 34 -9 107 33 -31
5064 -31 -64 -63 -18 27 75 -127 -88 -78 -149 -62 -60 -46 -68 0 -27 -50 -46 -47 -4 48 -39 18 40 -14 -31 15 -79 26 195 -31
5094 -31 8 68 40 124 -45 42 109 239 -29 148 61 133 17 61 58 -51 -126 32 59 -69 -2 -50 55 -137 -156 49
5120 49 -79 -286 -9 -177 -95 -39 -124 -21 84 46 -17 91 -10 199 19 104 192 86 49 0 252 -35 128
5143A28q5P3j39j5j06LK05k07LJ90P1k73J89n2o4R3l9pN1k2jq0m2J89q2l5k6K4
5171e6L05l12J48n5P9L7K5n7j33j05K7J94p6N4k7j31J91j71j5M4q4Q9oK9p7l2
5197a15R4J13r6j5n0r8K12j22L5J17L1l13Q7K06K1r3P9n5r6K23k14J59j05J53
5221A58m4k34L9K1J36j03l86L37O9m3j53r3M24j71R6j66J23j58K3K15p3j0J26
5244A33l2j54J32K4j69m5L12k16%K1k5K29j66o0j03K42j67m4k1J75p1r1K53j46
5268A1j01J94j35j03mM0J75l27K57j86J12L38k79o3J90p7o5r8J40j05K8Q5J3J40
5292A80j76J71l8j08k0j97J38J16O8j09j05k6J78j52l7j4j56L12o1K0j1M0q1J48
5316H0q3L2K0r1P1k02K78r5L4Q5O6j16J19o5k29J60k21OmK20p2N4m4J13k87R9
$$ plain form
5143 128 43 116 -23 -38 -144 -141 64 -143 -140 50 121 -152 37 -15 -79 14 -25 -32 19 -3 -4 -84 -126 63 -19 -54 -80 -56
5171 -56 249 -63 85 30 109 146 171 114 -19 -124 -97 97 21 75 48 -83 108 -63 -78 -34 -118 -29 -35 -6 -83 -115
5197 -115 -21 92 -4 -19 -69 -167 45 -77 -42 75 106 -207 -120 86 107 14 93 38 -58 165 -49 110 5 158
5221 158 114 -120 -81 -60 76 -27 -413 -76 -7 -50 -203 -296 128 -43 53 -113 10 -148 -125 90 17 7 133
5244 133 101 -53 79 103 -66 -111 201 -15 -15 6 -19 210 44 -16 -119 123 -44 -88 -109 66 -5 -96 157 11
5268 11 -90 104 -31 -134 -138 -98 77 -250 7 -179 -67 271 -8 -71 119 42 -23 -121 19 -86 -58 27 40 180
5292 180 4 175 137 29 9 -188 -50 66 134 25 -80 -106 72 -80 -117 -131 -287 25 -36 -16 -27 13 -68 80
5316 80 -3 29 49 -42 29 -173 105 10 44 129 195 79 198 133 -96 64 -157 -151 -155 65 -7 47 3 116 -171 -72
5342g2J73j81O8l5rJ34l5k15L84l61J23J31k03R1M3p4KJ44J2K4j32p7K0P1k0m4
5368c8K6j10P1R7J59j52l6j0lM7j6k85J32K37qj86qJ49K2L3Lk67J75l5l5R3l3
5395B2R2m8Qp0P5jj25J35rj25R6r0P9m3P0K5j20J30k09L4J61m0j34J29l70K93
5421c5J44qj05kn1P7J7nK6j7N9j02O4j2N3K0p5Ok0o0LJ71j27l1Km7PJ10j69J19
5451A2J20l69K75m0l5M3n3J62K7j81K8J35m9QKl5N0m5%P7j11Mn2J06j15n2O3o6
5479i1P2j39K41r8m4p3q5K24q9j85L89j55j2J26j70L2K18k73N3l0J43k71L08L0
5503A21j30J11J7k86K45l8J1l0r2pm9J80j65J04j0m2j05O5K0nk4J36k48P3R6m2
5529i4K2j73J69m0k4Q8P1p3O9Q3j19N6mM5j6Q1j98P7j62lJ06N3j68K04J05p1p6
$$ plain form
5342 -72 101 -80 -12 -47 -56 78 43 -172 212 -149 -26 105 -98 -7 36 -38 -36 108 120 144 12 -65 -45 26 6 -38
5368 -38 -12 -122 -51 46 205 53 17 7 4 51 35 -250 -118 119 111 -75 -83 66 88 121 124 -143 32 -3 -38 55 22
5395 22 114 66 74 4 79 78 -47 88 79 -46 50 -40 39 -4 66 91 -29 101 -108 -74 87 47 -87 42 -328 -35
5421 -35 109 101 -4 -6 -57 20 37 32 58 41 100 -2 62 50 103 123 48 54 34 -26 -23 148 21 -10 -8 -55 -48 62 -107 12
5451 12 132 -237 38 -2 -37 6 -47 115 142 -39 -11 124 75 83 85 50 100 55 55 132 21 25 -27 79 -36 -88 -25 -91
5479 -91 -19 -158 83 -15 -59 -132 -217 7 -82 -267 122 -33 -45 81 -89 -57 161 -112 -59 -89 54 -217 91 121
5503 121 -9 102 119 -167 78 40 51 21 -71 -78 -127 53 -112 -8 -18 -60 -165 -100 -80 -85 -109 27 -221 -148 -52 -94
5529 -94 -72 -245 -76 -116 -140 -52 19 -54 15 98 -21 35 31 76 60 141 -57 20 -142 -145 -39 14 -154 50 155 84 8
5556Hp4PQ0o1J8j36p9K69o9o3O0l3j28J80J07l07K88j3k0J59J0k49qR8P0k36l3
5583a55J45M4o1J13k9q3J06j82K4P6N4k6j06o8J24K35l64K76k88K15p4J57k7n7
5607D9j35Q3q9J52j40O0l1N6O1Oo1N1m3k8R2J7m8p3P7j52m8J25N0o5m1R7K1l7
5635FJ85j81J4k00L78k41O4r3J00r9j52K95j86K78j99J53Mj5n7K07j88j68P0j59
5659a84K57N5j27N9j57j8P8o6Q1L8K6j28m1J22P3q9j78K15o7l2J00j02P0m2J62
5684A05j01MP6J38j01j06j12L5J74n0m8J3k0qj83N3R5J42k34K64l32J65%j39J24
5709d6J17j08L3q1Q2j15J72k7OK6j03J65K7l1j6K4k02JJ98L3j34o5k3J46j6o5
5735bj9k0N1p0n2J24kk67J58K42l53J79j05J86o1k7J1R8j91L6J63j6J4mk5O2J7
$$ plain form
5556 8 -66 -59 21 -40 -22 -158 -237 32 -37 -100 -40 -73 -201 -21 86 -221 67 54 34 193 203 -46 -54 44 114 -122 -155
5583 -155 -10 34 -27 86 57 -26 80 -102 -78 -2 52 26 -80 -148 -24 211 -153 123 -165 50 -24 133 106 49
5607 49 -86 -3 -92 60 -80 -20 -51 5 66 72 11 62 19 -9 83 100 52 -21 56 -96 -144 -19 31 -34 -75 22 43 6
5635 6 191 10 24 -176 202 -39 25 -68 32 -67 -219 76 -110 168 -31 122 126 111 54 261 73 -95 -25 -184
5659 -184 73 128 1 60 -97 -115 -37 -103 -22 16 42 -86 -127 -5 68 -21 -199 16 -51 -83 17 -85 -15 -57 105
5684 105 4 8 84 222 121 15 -97 -62 112 62 14 27 7 -1 -184 -131 -36 106 -128 136 -196 -31 -31 -170 -46
5709 -46 71 -37 -4 -85 -3 -118 54 27 33 59 -44 121 148 117 101 125 -77 -76 122 155 21 -44 -67 79 63 -2
5735 -2 -21 -41 10 -60 -112 12 10 -257 -99 143 -210 -31 -136 50 -11 -38 -27 71 -120 -84 79 63 77 73 48 110 127
5762A27r7J7j94O4O3R2j2Rj68K34j52QJ9K9j36M2M7j6q8J25J56j92o0K6j51J18
5788i0L6o4J46j02O6r8J43L3j01LK2j2J27p0J1L6q3j06J56kM5j16n5l9K52o9k6
5815D3j25J80o0j76J5k8J46j18K02r9J68j36q3K50k06J15j44N8KJ3j01L25l09
5838f8J1J26k28K64j09O1Mj11O6j66P3J09m8J35M5q1j71m7Q8R3o2o0O4n0K54k10
5864a8pn5%J48j21J2J65rj55J56j25K9j3k08J23R7j24J23rj72O9J33j41J27l0
5889ej86J00Q6k01J23j5J93j79k5P4L9r2K02r0j42O0m6J48j27J21O8j47J31j58
5913f8J2j67K91k04J44p3Q6o3j22K30R5k38N0n5Q9p2qN1J30k10J6M6L9K17l01
5938h5K03r4n1J09k07J01J36j34j2R8J09j51Q9r0q9k9o3K99j60M6j12j7J31r9
$$ plain form
5762 127 30 47 -147 -83 -20 72 60 69 -99 135 -17 -9 10 39 -97 -55 -8 -24 -112 13 169 -23 -83 -57 -208 -90
5788 -90 -54 -118 28 -74 -8 -106 37 70 -31 -28 -6 -18 109 39 50 86 3 -103 53 51 96 -20 -75 -114 138 69 43
5815 43 -82 98 38 -138 -123 -151 -5 -123 79 -20 148 12 -71 179 -27 88 -56 2 4 17 -84 241 -68
5838 -68 -57 69 -159 105 -4 57 61 -50 16 -150 -77 32 -16 119 164 83 -88 -135 -47 46 -16 -76 -12 -62 192 -18
5864 -18 -25 -80 -80 68 -53 -41 124 115 -40 116 -9 20 7 -201 -78 19 -105 18 9 -163 -94 39 -102 25 -5
5889 -5 -191 -91 -5 -206 -83 -98 95 -84 -109 -35 4 -88 114 24 -118 -58 -104 44 -83 38 106 -41 90 -68
5913 -68 -56 -223 68 -136 8 -65 21 -42 -164 66 161 -77 -27 -82 7 -65 -73 -22 108 -102 -86 -40 -1 216 -85
5938 -85 118 24 -27 82 -125 -24 112 -22 -34 64 173 22 111 21 -68 -97 -160 139 -21 25 -87 -104 27 -72
5962g2L1r8J37L9m1O8j85R5m5pJ1p4K20q5l0J07j26nN1Qk1N3j9jN4k55K54l3o2
5991c1L0k15J81l3M0M8n0m1J60Lk49N9N1K69m23R0O5K07p5k38J8J87j5j43K82
6016A77j25j6pl1J30j17O6Ok3n9L4L2n0n1n3J34j51J91m1j14J08r0K0L4JJ33o2
6043G6j00Nm4J61J9j88J49p6L2J1M6j66J88j97J80o9l9Qop4o7K54P5k44j8J85
6069A01j95J97k64N1N3O1o2l9K26j02j87J06J76r8r8K4J26l0q0k7M1l7N7L9Q2
6094A21q4O9%l6j0Kj11k1K7m2L4L3m6j05K45o7m6n8L7K00l37K70k01O6K57l12
6120a15k5l2K53%qk43J44o9P0oJ28p9M3k22J48R6j10M8j67K91k28J8M3j1O5r6
6146f4NN7r9L9J51k24J35L6j28j5RP9j5J59j47P3P7k29J83P6k18J66j52J64o2
$$ plain form
5962 -72 -41 -139 -2 37 -4 64 -121 -26 -71 -78 -67 -141 79 -6 -36 71 -55 -60 -9 -1 -22 31 12 11 65 -190 64 31 -31
5991 -31 -1 -216 -35 -68 -28 20 -30 -71 89 92 -157 -98 -47 222 -201 -111 -46 161 86 -152 -134 53 38 -105 177
6016 177 52 36 29 -2 128 11 77 83 60 1 35 67 17 -34 -87 47 -104 87 46 -68 40 -50 -30 4 5 138 76
6043 76 -24 -19 -63 98 117 -71 78 2 34 45 91 -75 113 -84 96 27 -12 -4 -10 -84 -151 103 178 -66 -84 101
6069 101 -94 103 -161 -110 -57 4 -58 -97 129 27 -160 -54 122 24 -74 -50 76 46 -34 -61 -20 -57 0 39 121
6094 121 37 106 106 70 60 62 -49 -70 -43 -85 -51 -18 -64 -169 76 9 -37 -95 -58 142 -195 75 -126 -60 197 -115
6120 -115 -140 -172 81 81 73 -170 -26 -95 -25 -31 97 18 61 -161 -13 83 -27 21 -146 145 -83 -65 -22 -33 32 -64
6146 -64 -59 -2 -101 -62 89 -135 0 36 -92 -107 -98 -19 -34 125 -22 51 128 -101 82 158 -60 106 -46 118 56
6171E6k88L16lj54J05p5o8PK08j58p5N0M6N3j20J20o8M9j68K12M2j26j45J78j57
6196a63J83j0J1k2R3k7P9j12O5Qj67J5J84Lj42J51n7j57J53l1j65kR2N1j9Q6K7
6223A27k95K00J5p1J1j2J92lj91K01j17j33J9P1n6N6nr2J86J6j03j4m8R4j39J64
6249G3q3M0m3K6k38J25J77q9l1o8J37q3l7K98j94o1O3J0j7n3L6O3J85m03J58p0
6275g9K1L9%j1J20q8k5Q7J12k32K33k38J10j86J11j76K65o6P3r4L8k2K7p6l8J87
6301I2k01P8m1OP1N5J15l78L22j01JJ04j01q4J29R2k29N1J17m3K5L4l31J96L0
6326Iq1k8lk5K01k17M6R7N9o5j2n9J7Q5m2N2m1K8J30l15J94n5N1K9L0m6j82K17
6354G4Q8j16Qq4j69K11L5j71J14j08L9j64L03k42K61j27m9oJL7r4L7L54j77k21
$$ plain form
6171 56 -232 84 81 -73 32 -43 -111 -104 104 -54 -129 -79 -33 20 -100 20 -48 1 -167 45 87 -39 -184 -6 -163
6196 -163 20 10 21 -1 92 65 144 32 97 105 -62 -47 137 140 -2 149 92 -65 88 57 -108 -110 -18 33 14 100 127
6223 127 -168 32 47 -24 -13 -25 167 164 -27 174 57 -76 -57 14 -42 14 9 -83 103 119 16 2 -46 48 -91 73
6249 73 -10 30 -13 13 -225 -100 77 -12 -43 -111 26 -57 -94 204 10 -51 12 22 5 -48 -12 51 236 -167 -9 -79
6275 -79 -58 -19 -19 -30 90 2 -23 64 176 -56 177 -61 49 -137 -26 -202 63 -3 70 -24 14 -8 19 -57 -95 92
6301 92 -109 -31 -72 -66 5 60 175 -203 119 18 19 123 22 -62 67 159 -70 -19 98 55 80 114 -217 -21 9
6326 9 -72 -100 -103 -128 73 -144 -98 -1 58 -7 -19 -78 -61 24 -18 34 -7 21 151 -164 30 -25 26 55 85 39 -143 74
6354 74 162 46 54 -30 -199 12 47 -124 -10 -118 -79 -243 60 -182 79 -48 -97 -103 -102 -65 -159 -122 232 55 -166
6379a66K53J00%j39K6n1P9M5n2j8n1Q7p1J07j37L1n5j49J23L1M5j78O2J7j9J87
6405A07j76J16M0jj57j26K00J29j38L0r8P8o5P4j40K79r6L5p4J20j64j43K12r7
6429e5J22J06l07J06J16k65J15Q1q0m2K64p0k6j93K45j59P1l3j10J28J24l20J18
6452f4M4j2J47J91k43K8k6n2J17j21K01k10J08j26K74k27O3k13K10j63KJ35p1
6475h%M5j00m6J5P1M8kj80J54j23O3J82k24J19K50k48p4J20n0q6K09j56O8j44
6500i7J34K4j44J4Q5p6N0J1Ro2R0J4O8k26L5Nj9J05j14K3J51l1r9J46k85N6J62
6527B9P4j96J98j97J16q2J58n7j1K8K3k53K13O9m8o3l3N1l3l6N5k4j06L9R7k9
6553a8n2j1K41j86J4N5k28K57l1k17Q7J47q8J11p2K2q6oJ7Lp4K07mj03J01L0j71
$$ plain form
6379 -166 87 187 187 48 74 23 102 147 95 77 26 113 42 149 12 43 -12 -161 -38 -7 38 -140 -78 -61 -80 107
6405 107 -69 47 87 86 -71 -197 3 132 -6 24 -74 4 -61 13 -127 152 56 91 17 137 -27 -170 42 -55
6429 -55 67 173 -134 -28 88 -177 -62 19 -61 -103 161 91 65 -128 117 -42 29 -4 -114 14 138 -182 -64
6452 -64 -20 -32 115 306 63 91 65 13 130 9 210 0 108 -18 256 29 92 -121 89 -74 -72 63 -8
6475 -8 -8 37 -63 -109 -94 -23 25 23 -157 -3 -126 -63 119 -105 14 264 16 -58 62 12 -74 135 -21 47 -97
6500 -97 37 61 -83 -69 16 -60 -10 1 10 -52 38 52 120 -106 -71 -66 -85 20 -94 -71 80 49 -50 96 -189 -133 29
6527 29 103 -93 105 -92 24 -58 100 43 32 60 83 -170 43 112 64 1 -32 19 -14 -50 5 -19 -125 -86 11 -18
6553 -18 -70 -81 160 -26 -12 43 -185 72 41 -176 -89 58 -30 81 9 31 -55 -61 -44 -41 -115 92 88 -15 86 116 -55
6580e5L8qJ24r5J09P9k68N2n4J16om7N1j24K5J93j72M8KKj19K05j09J49j61J43
6606A18K4j50J02q7K0l5K03k64P0M7j11J29k4mL0n3j25R1L5j21J18j78J93o8J2
6631b8J44j34J1q1J30j29J89k96K48k5Nr3L0M9R5j41J58k02Q5k%%m6NP8J50j77
6658B3N5j50M1oM9Oj03J11M7k38k6J95m6R0l2o2K88k18K7J81k59J02K8k42J01
6683c8L1J8j06J38j88l3L4J42j24J22M2p8k4K5O2j68J24lk05K22n5J47j01n8L4
6708d0o2J97q8j2Q2l3P7k46K9N2R6o2j57P0PJ54j17M7M0j46J12J08j29m8K57j69
6734A9n6KJ5J14j23J41q6p9O2n7N0k5M1j17K51j8q8q3k14L16j54J11K4j9j05K3
6760e5O3n9l8J80j7J17k41J7J0K1K8o7PJ76j69J13n9j07O9J37m7k20J69l3l6J40
$$ plain form
6580 -55 -17 -25 99 4 113 192 -76 -24 -78 38 32 -15 36 -88 -63 130 -42 6 8 10 -109 96 -13 136 -25 118
6606 118 142 -8 94 7 27 -8 195 -69 1 48 -63 66 42 38 68 15 -110 -19 16 -105 13 -165 28 -40 -28
6631 -28 116 -18 -7 -88 42 -87 102 -194 54 29 34 -59 -29 20 115 -26 132 -70 15 13 13 13 -33 -28 50 200 23
6658 23 78 -72 -31 -37 12 18 -85 26 73 -165 -191 4 -42 48 16 -46 242 24 51 232 -27 75 103 -139 -38
6683 -38 -7 11 -95 43 -145 -178 -144 -2 -126 -4 38 -40 -64 -39 23 -145 -21 -24 -229 -7 -62 85 -16 -74 -40
6708 -40 -102 95 7 -5 77 44 121 -125 -96 -44 52 -10 -167 -97 -90 64 -53 -6 34 -112 0 108 -21 -69 188 19
6734 19 -37 -35 -20 94 -29 112 26 -53 9 -48 2 -23 18 -99 152 134 46 -37 -251 65 -89 22 46 27 -78 -55
6760 -55 8 -51 -89 91 74 191 -50 -33 -23 -2 26 -41 -34 142 -27 86 27 -80 -11 126 79 -141 28 -5 -41 99
6786I9O6k61Q6l1O2j0k13K51j01J51j76n2J36Rk08K96q2o1k4N3jp3PQ9M4o7j11
6813a22J59J9j45r7J35jO2J2P5j97K66o7j13l6oJ50q6p0K18j80r6J51O5j53o6
6838a23L5J51j40J26j54mM7Q7N5k97K00Oo2J89l6o1PMK59k42K1M4k3q6j2R5r7
6865a1k2l3O0M1%J03j9k9n8j5j40K32j68m0J58j72J86k9k35J0J81l6J55p9M2K7
6891A09q2KO8q8J36j86j3J12p2J70j54P2p6j11J29q0M5R7j95J05N6o1p6J09m2
6916b6J50k26R4J53k43J3N1K9P7r9p0J7J61N3k33j2J58O3j63L2K1l3M6k28J23
6941i2R2J18j84j0p2J38r2L7J17j14j6R5j10K66k98K38r7Qn4P3r0K15r7R6k9o8
6967G0o8m0K26j58p2k08K39K5lN1P4r1L5j22m4J92k50j5J71m3J11j83Q3O7j26
$$ plain form
6786 99 165 -96 -10 -41 21 11 -202 49 -52 99 -77 -129 7 16 -192 104 22 -39 -63 -10 -11 -84 -77 12 56 -11 -122
6813 -122 37 56 -89 -186 -51 -52 10 22 97 -100 166 99 -14 -50 -56 94 8 -62 156 -24 -120 31 96 -57 -123
6838 -123 -88 63 -77 49 -105 -109 -62 25 80 -217 -17 -11 -73 116 80 19 26 30 289 47 68 112 89 3 -9 86 -11
6865 -11 -33 -66 -6 35 35 138 119 90 32 17 -123 109 -59 -99 59 -113 73 44 -191 -181 0 -36 119 40 82 109
6891 109 27 29 97 9 145 -41 -54 58 -14 156 2 74 -2 -113 16 -64 -19 78 -117 -12 44 -17 -93 16 -26
6916 -26 124 -102 -8 145 -98 -85 -34 -5 72 -27 -97 -80 81 134 -99 -111 47 110 -53 -21 0 -33 13 -215 -92
6941 -92 0 118 -66 -76 -148 -10 -102 -65 52 -62 -78 17 -93 173 -125 113 16 24 -30 43 -47 168 71 167 138 70
6967 70 2 -38 188 30 -42 -250 -11 14 11 62 136 45 80 -42 -86 106 -144 -159 12 -31 80 -103 -20 47 -79
6992g9k3O7m1N7k4J14m0r7M9J07k38J67K1K9J1Ln8o0m4l3K90m0k39o0J10J57K3
7019A29o4l4o5N9k16K20q8J4N2N9k4J14k18K05j94p2R5r5j36K84j18J32l8Q3o5
7044A9l2k7J14j49P4J59j84m9RQ7p0lp5J38j05R2k7m2P0nn6J82j26J16j31K7l7
7071c1K7k3j29J17q0K44l9M4N3q4j22m7J78o4j29J37kl9o2p1K50k33J8K33k35
7096h9K34k08L0J42k08J99N4j80RP3m3q8%J32n8k76K91M7L9j69R7o1o2J19n8P1
7122C7O7J19p4p6k71J08Q9j57J34l4P8k7n9L1j18K7J93r4m5P8q8j02K10l5m2J8
7148c3k5M5K09k02K4r7L9k9K1R8p7J51p4j81J14j8l7r7L11j90l9QJ66r5j13o5
7174a86J73pM2k7j17J68n4j2n5J9j27N6j9J98pp0J72j82J08M7O8j90O8n1L6j9
$$ plain form
6992 -79 -102 -35 -76 -19 -43 71 31 -66 -17 90 -148 19 40 69 80 83 25 -35 -79 -112 178 138 -101 -161 -51 106 129
7019 129 65 31 -34 25 -191 29 -59 -45 7 66 42 156 -62 143 -51 -123 -28 -123 -259 25 -93 39 1 84 19
7044 19 -13 -40 74 -75 -1 158 -26 -75 -66 21 -49 -52 -127 11 -94 -2 -29 -71 -1 -6 -62 120 -6 110 -21 6 -31
7071 -31 -4 -27 -156 -39 -119 125 86 130 183 99 -23 -70 108 44 -85 52 50 11 -51 -122 128 -105 -87 146 -89
7096 -89 145 -63 -33 109 -99 100 154 -26 -17 56 13 -75 -75 57 -1 -277 14 61 100 -69 28 -33 -95 24 -34 37
7122 37 104 223 149 73 -198 -90 -1 -158 -24 -58 20 -7 -66 -35 -153 -126 67 -27 -72 6 -82 -184 26 -9 -51 -33
7148 -33 -58 -13 196 -6 18 -79 -40 -69 -48 50 -27 124 50 -131 -17 -35 -72 -169 142 -48 -87 -79 87 -8 -121 -186
7174 -186 -13 -20 22 -5 -122 46 -8 -20 -75 -56 -183 -127 -146 52 45 -25 147 -35 73 120 188 -2 66 15 51 32
7200C2j96K74p3j34J62j09m7R9q3n0K64j39o7L0K1r9J28nJ23j61Mj01K01q8j5
7225b9M6J73L0m76K51J8ln8P3J07j68k3N4j47L05k17O8J24j51J5J8qR3l3J7j08
7251b9K4NN6r3kj2K13j96M8M1j02j89J78R4k25K23Rj60J16l4J27J3j16J11j12
7276a2J1L4j67J16j10Q9nJ9j13K66k00M6K36j24k44K14j77N5O6n7p2K02k96K71
7300D8j50K30o9p7J35l87K81K4o3J9OJ17r1l6k23J07M2p6J88p4l4N8p2O8O0nP2
7327I8j49O0q4Q8M9k5j18J43q5P0k0j26P0K6K1L4m0j7R2j13j16Q3J04JKj13L6
7354b9p5N4K0m5J72j99J58j50Q9q6N7K9j12K82k42J56m3o7j35J76P3r9Q0p9p4
7379h9K2Q2q3J74N2k54P9j04J35%J3q2R7k56K84j15K2Q9j48J91Jk83L47k27J34
$$ plain form
7200 32 -164 110 37 -97 65 -44 -91 8 -75 -125 139 0 -67 -37 -16 -115 13 8 131 -30 -26 -127 74 -14 -29
7225 -29 17 190 220 -256 -5 13 10 -48 25 132 -36 -59 -5 -152 153 -64 4 128 -23 -8 10 2 95 62 79 -29
7251 -29 -5 0 56 -37 -39 -51 162 -34 14 55 -47 -236 -58 36 -189 34 43 -117 -1 -35 92 105 -11 100 -12
7276 -12 -1 33 -134 -18 -128 -39 -44 -25 -138 128 -72 -26 210 86 -158 56 -121 -66 0 -57 -129 73 -223 48
7300 48 -102 128 59 -18 117 -270 11 35 -28 -9 -3 114 23 -13 -236 -129 -87 -163 25 -49 -83 -25 -97 -29 31 26 98
7327 98 -51 9 -75 13 62 37 -81 62 -23 47 27 -99 -29 -3 18 52 12 -5 87 -26 -142 -59 45 46 48 -65 -29
7354 -29 -104 -50 -30 -75 97 -102 56 -94 -5 -91 -34 -5 -117 165 -77 79 36 -31 -166 10 83 -16 64 -15 -89
7379 -89 -67 15 -68 106 158 -96 -17 -121 14 14 27 -55 42 -214 70 -45 -23 66 -82 109 110 -173 174 -53 81
7404H1j99L3J29r8K42k42O4k78L50J0r6J48n7n0J1j2k11K57l3k03K54J5K0L3q0
7429H8k00j1J35n3j55M54k59n5o3PL5J35n6k15K22J03k6m4k4L6j9p1J47k23J84
7454G2j28L0J56Q4k29L7m1R2o2l6J4k60J16O9N9p6J51j42M0l6L9JM0QNj22K78
7481A59j74J08k23J19J5L1j54J69j57J17K5J45k77m1J56j17J16j45N3R5N2j72
7503a00J53J6n3P9j12R7j51J87k25Q1K32j10l7R3j06J16l82J81K58j99q6K52k87
7526a03J38Q3p3m6p1m4J79O0k06j2pJ79j71L0J23m0K7r2lR3j47P8l1jR1n8Q5J
7554F2L2j10LJ7o2P1M2r7M3j18J40Pj06rn6Q9QN0J7k6j10N7N9K31k24O6P1n5k28
7583a36J99m0J1m4nQ8J5l9j07L16k77M1j01O9mj20J50q5OP5J38p7o5m5j1J5j8
$$ plain form
7404 81 -118 -85 44 -54 188 -54 10 -268 82 92 -4 144 87 37 48 36 -175 82 49 -154 100 115 135 168 88
7429 88 -112 -123 12 -41 -196 258 -1 -56 -119 -112 -77 58 2 -213 9 112 86 42 18 54 35 -36 111 -112 72
7454 72 -56 -26 130 214 -15 22 -19 73 11 -25 -11 -271 -155 -86 -27 -103 48 -94 -54 -90 -51 -50 -10 -2 3 -119 159
7481 159 -15 93 -130 -11 4 35 -119 50 -107 10 35 180 -97 -138 18 -99 17 -128 -75 20 72 -100
7503 -100 53 69 16 95 -17 80 -71 116 -109 -28 204 94 57 150 44 160 -222 -41 217 18 -68 184 -103
7526 -103 35 118 45 -1 -72 -116 63 123 -83 -95 -102 77 -94 -64 59 19 46 -46 -49 44 -103 -25 -56 -57 34 -24 61 62
7554 62 94 -16 -13 4 -58 13 55 -42 1 -117 23 30 -76 -85 -141 -52 -44 6 23 -3 -113 -56 3 234 10 76 147 92 -136
7583 -136 63 23 34 -10 -15 73 88 49 -58 258 -19 22 -79 -10 -14 -134 16 -69 -63 12 150 73 8 -37 -48 -33 -51
7610e1m1J33p2rN7L1k3o6O3K2j72R7j7N4m2K7J31q4r7L7O6j08K22o8n3l6j38J07
7638c0K3j58K22Q5k10k9J21lK9k46J68M4j12O6q0K78O6k75J24j92M4J53r8m1J47
7663I6q1P8p5o8J02j3K0o3l2Q5O6j50J96k31j16N1K73j77NK44j12j06L2L1k9r8
7689g2K1k7k7P9m0P5k2L6N7p2K7m0Q2p8O7l09K49k8N4r3J93j12N0m8m1M3J09j21
7717A2R2L2k52J02j02O2N7O7q6r0J4J96J5j44o4P1M6p9N9o2n3J8O1o2J44r8J5
7744b9J44j93J07J45j04Mj15J73j83R1rm4m2J5J90k21J22k5j8k13J98O6M7q1q6
7769f1K44j11j81J54o2O1r8k5K31j05L6j28r9J73o8L3K13k64K61j68j16M2J61
7792A23j68rj37K38J0j34Q0r2M5K40k38J64k80R5M4m4O0P5j49K24j37q0J00N2
$$ plain form
7610 -51 -92 41 -31 -40 17 48 25 -41 22 44 -128 -31 -48 6 -36 -9 122 38 -59 -22 44 -64 158 90 37 1 -137 -30
7638 -30 -7 -165 57 142 -68 -97 24 21 50 -196 -28 16 -96 -30 -110 168 234 -41 83 -109 -65 88 -10 -51 96
7663 96 15 93 18 -50 52 39 59 -4 -36 49 115 -35 161 -70 -186 -135 138 -39 -34 210 98 -8 24 55 26 -72
7689 -72 -51 -78 -105 -26 -66 9 -13 23 80 8 35 -5 77 -1 66 -243 6 -22 32 -61 132 20 70 22 -19 24 133 12
7717 12 104 136 -116 -14 -116 -54 3 70 -16 -106 -92 104 119 -25 -89 -18 28 -51 8 -54 -107 -89 -28 -90 54 -44 -29
7744 -29 115 -78 29 174 70 74 -41 132 -51 40 31 -13 -55 -40 150 -71 51 26 8 -205 -7 59 106 25 -61
7769 -61 183 72 -109 45 -17 44 -54 -79 152 47 83 -45 -144 29 -39 -6 207 -57 204 36 -80 -38 123
7792 123 -45 -54 -191 47 57 -77 3 -89 -44 196 -42 122 -158 -63 -19 -63 -3 72 -77 147 10 -70 30 82
7816H2j86J14J33l35K41q0J17k84K57o0j3N1k7jL0j56M2J2p0PJ14k10J49J79j4
7841I2j67MJ16q6lO4J14l0k91K50j51K28j88l1J74r9jN3%Lq1r0J82q9r3M8K27
7868A55k66QK05j15J01p2p5r6L09j70N5p3m1k4J79k69J62M8j10J98J73l99O3J45
7892I1O3np9j41n9J52n2N3L9J99k40rJ05R0k78J67q3p1J53o2K0j12M8N3j42%J99
7919I9j12Lk6j6K08j44L2q5J31j59j08K01m0K9L2j8j17J50k25K37P2L1j78m7O6
7944A6k06R7m9R5N9j36K1Q6j0Q2o0J14k57M7L7Q6j3R7k03l8K86k66J47o9K8J48
7970A39j41J01o0j13J91j07k0P1r1M0l6m0J01nj43J22O7j44M3Lj37J23M1N4j63
7995a04m4J61r2K5P4q5O4j52J18J4L2P2n6nq5J52j04j25R8lQ2J39j5j64m7J1J79
$$ plain form
7816 82 -104 10 143 -192 49 -31 86 -198 59 -1 -14 37 10 9 39 -117 -75 -63 -133 -126 -12 -222 -73 106 92
7841 92 -75 -71 45 -41 -44 20 134 104 -187 63 -88 140 -48 -79 95 -4 -5 48 48 51 -30 -120 62 -27 -120 -72 155
7868 155 -111 -103 102 -13 88 16 -59 -155 154 -16 39 -34 -75 -99 80 -189 -27 21 -89 109 282 -117 -54 91
7892 91 154 149 70 -71 -130 22 -30 23 62 261 21 12 117 207 -71 96 13 -58 95 33 53 -59 -11 42 -100 -100 99
7919 99 -13 -10 -36 -52 156 12 44 -41 90 -69 -177 24 -16 13 45 27 -90 60 -165 72 144 175 -3 -50 16
7944 16 -190 -93 -142 -47 12 -124 -103 -17 -27 55 -5 109 -148 -101 -64 22 9 106 -97 -135 151 -115 32 -37 -9 139
7970 139 -2 99 39 -74 117 10 -10 61 -30 10 -26 -66 35 30 -113 9 76 -68 -25 -22 -159 -36 5 59 -104
7995 -104 -148 13 -79 -54 20 -65 -1 -153 -35 -21 11 83 27 22 -63 89 -15 -140 -42 -45 37 176 161 -3 -50 -39 140
8022A40r3M7j43KL4p9J90m9l4m7J32k16p5L8K33q6J3o1j64K31q8J55o2J33j85
8047c4J07n9Mq7M3N4j09M7j99L22k92K40k3r3J31k5k7O3J50k51l3lJ04j19J29
8072D0j47M3J82j38Nk9O6j87J06J26j98Q8J37j1m4k6rJ05j16j02J24j4O8k94J98
8097b7K04o4j47J35j67R1j42K05l7k8Qk1q8R0K52j68q1J49j94K8J6O7J02k50O3
8122dO8p4j07L8M7J05K0j99nL5J68q8q8R9J41j78J65k06r6J69l0J05j48J28j3
8147E2j56J21o5J8J01k5Nrj01j15K01j12L4k7O1R0p2N3l1ln3J27r7m2N1k8k4Q5
8175C9k28K97l1j35K8o5L81l21m6J94k01M8J37j28J6J11
$$ plain form
8022 140 47 94 -49 -47 -13 -92 98 49 15 -32 100 -116 -191 -153 80 -6 7 -54 -218 13 -75 80 18 151 -34
8047 -34 73 14 18 -69 -26 28 -81 -34 -233 89 -203 37 14 -79 52 27 0 63 213 -38 -71 -74 30 -89 40
8072 40 -107 -64 118 -20 -15 -44 22 -165 -59 67 -131 -43 94 83 39 13 4 109 -7 -109 15 1 69 -225 -27
8097 -27 177 113 -34 101 -66 25 -117 88 51 23 31 10 -78 12 264 96 15 164 -30 -2 14 81 183 -67 -4
8122 -4 64 -10 -117 -79 -32 73 93 -106 -111 -76 92 4 -84 15 156 -22 143 -63 -159 10 -20 85 -63 65 52
8147 52 -104 17 -48 -30 71 46 51 42 -59 -174 27 -85 -51 -78 -17 73 1 54 23 20 -33 94 -3 -45 6 -22 -46 39
8175 39 -189 108 77 -58 -30 -95 286 -35 -81 113 -88 -40 97 -31 -15 96
8191I6
$$ Imaginary data points
##PAGE= N=2
##DATA TABLE= (X++(I..I)), XYDATA
0@%%%%%%Qj6J6j6K4l2M0n6P2q8J04j28J60k00K40k86L42m00M72n52O40p44Q64
29D64r93J135j297J475j671J890k130K396k691L009l357L740m159M617n117N662
45B973o256O908p623Q400r252J0195j1233J2378j3651J5076j6677J8490k0566
58a0838K2966k5780K9133l3206L8283m4815N3566o5968Q5030j18329J92756o37720
70e14922Q3161J103838q92793k85101N16587k4594l47282L46519J20369j07373
80a591O3360K3244j88042Q4970J35019N7839m1045j77630m8580L49728J6839m59184
92a85073m6228N20804J02129m60548j84890L26525P6220k47791R6083K43276k54652
103a4145k28737K26461L1032j61506K62337P5580n05502n1450N00934R31l10435
$$ plain form
0 0 0 0 0 0 0 0 8 -8 8 -8 16 -16 24 -32 40 -48 56 -72 88 -112 128 -158 184 -216 256 -296 344 -400 464
29 464 -529 606 -691 784 -887 1003 -1127 1269 -1422 1587 -1770 1970 -2189 2428 -2689 2973
45 2973 -3283 3625 -3998 4402 -4850 5345 -5888 6490 -7161 7915 -8762 9728 -10838
58 -10838 12128 -13652 15481 -17725 20558 -24257 29309 -36659 48371 -69958 122798 -514922
70 -514922 -431761 672077 -220716 -505817 10770 -13824 -361106 -14587 105782 -1591
80 -1591 61769 85013 -103029 -18059 116960 174799 133754 -43876 -92456 257272 274111 -185073
92 -185073 -231301 289503 391632 -68916 -253806 72719 148939 -98852 -2769 240507 -14145
103 -14145 -242882 -16421 14611 -146895 115442 191022 -314480 -365930 135004 135935 -174500
114a74500M0713J08493l579R451q5367L1674K36373o6461k41071J67599J74424
125A97749k17424k9698K31696n6355j20694J13153m4255j78710J25511K17836
135B38809j12680k28033L7917J50387m7669q0783R8993K7017j57019l1757J16760
146A1942J9196j7625J7576p0558l8524R3330O321n1876M9509k0076n5373R0061
158C3903j7235j41355J02031J24659j58675l9938J76687o7755j56442J48683J23435
169A27998j33200m7280P0482k7385j0610O8532M402m5754l0233k3029K1323N8563
181C3809M694n1353k1483J4326l074P519M1659p948o0097J5661O5146l4157m6890
194d2188P7129K2785r9497K6273R1348p6688n4649R0522J950o2185L9182m147
$$ plain form
114 -174500 -133787 -25294 -28873 -19422 -104789 -73115 163258 96797 -144274 23325 197749
125 197749 -19675 -49373 182323 125968 5274 118427 74172 -104538 20973 238809
135 238809 126129 -101904 -63987 86400 38731 -42052 56941 83958 -73061 -104818 11942
146 11942 31138 13513 31089 -39469 -77993 15337 21658 -30218 19291 -785 -56158 33903
158 33903 16668 -124687 -22656 102003 -56672 -96610 80077 12322 -144120 4563 127998
169 127998 -5202 -52482 18000 -9385 -19995 48537 52939 7185 -23048 -46077 -24754 33809
181 33809 38503 -12850 -34333 -20007 -23081 -15562 26097 18149 -41948 -26287 38859 4702 -42188
194 -42188 34941 57726 -41771 -15498 75850 -838 -55487 35035 36985 -25200 13982 9835
206I835q3870L8581Q7064m1776m5520K5588j4682m927M7662o088j6620K8317l7157
219a3593m7096P8138N9386q2674n1363O7339J9310n4236J9079M4310m2284k5051
231b8735N1638K330m9210J9441L8656l5807j2292N0023j8569n2046L1038K6654
243B3121k0454J2630o301m6338K1369M6854k9686k3126K6759j9787k5074M9840
255I807J1118m9766J9591K6689m7520Q654O5749k9752n7386M5514M5045m7023
267G20k2318M2514m041l1767K1699J6303k4328o502O897k635J0915N834k9205
280a5914r428L5202K82l0568K0016J2907l9462R512M2279k5288k4611L4071O73
293I671l2690K5424K7334m3165j3821M6969l724k9723K2114N559k9546J4656K7479
$$ plain form
206 9835 -74035 -35454 51610 9834 -35686 -10098 -24780 -29707 17955 11867 -4753 23564 -13593
219 -13593 -60689 17449 76835 -5839 -57202 10137 29447 -24789 -5710 38600 -3684 -28735
231 -28735 22903 25233 -23977 -4536 34120 -1687 -13979 36044 17475 -34571 -3533 23121
243 23121 2667 15297 8996 -37342 -15973 30881 1195 -21931 4828 -14959 -40033 9807
255 9807 20925 -28841 -9250 17439 -30081 -21427 44322 14570 -42816 2698 47743 720
267 720 -21598 20916 16875 -14892 6807 23110 -1218 -7720 -823 -3458 7457 13291 -15914
280 -15914 -25342 9860 10142 -20426 -410 12497 -26965 -17453 24826 -462 -25073 8998 9671
293 9671 -23019 2405 29739 -13426 -27247 19722 15998 -13725 8389 13948 -15598 -942 26537
306B6537k3370j9525K3703Q201j8763N089N632j4576P115N853j8866J1962J9138
319A8130l3162j6611M5398Q698n0221J405M1869j5297k1011K8594l70k6166J6591
332b153J4590j6948M474J4894j5844n205K6034l435k4326J4903J2652k2029P274
345D881K0343k3232j4919K5660M689k3813R15J0125j3055L589J7747k0228j3113
358b0411K8347l914k6414K2838J9882l1441q441L5607N80k6936J0663J2793j3598
371d45Q554J1744j6708J893J6682j1185n540J9662n229k3740J3762K0667k1836
384H281j3244J9328p155j7656J6160N356k2143r90J2810p821n473J0122j0992
397a3417j5310K2817Q034l0382M406K5285j6238j2073K4417L785k0102P086J6797
$$ plain form
306 26537 3167 -16358 7345 15546 -3217 1872 7504 -7072 43 5896 -12970 -1008 18130
319 18130 -15032 -31643 13755 22453 -27768 -26363 15506 209 -20802 7792 7422 -18744 -2153
332 -2153 12437 -4511 -37 14857 -987 -6192 19842 16407 -7919 6984 19636 -2393 4881
345 4881 25224 1992 -12927 12733 17422 -6391 -5476 4649 -8406 -4817 12930 -7298 -20411
358 -20411 7936 4022 -22392 446 20328 -11113 -19554 16053 16633 -10303 360 13153 -445
371 -445 8109 19853 3145 5038 21720 10535 4995 24657 19428 -4312 9450 30117 8281
384 8281 -4963 14365 7210 -10446 5714 11070 -11073 -12063 747 -7074 -12547 -2425 -13417
397 -13417 -28727 -5910 2124 -28258 -23852 1433 -14805 -26878 -2461 1324 -18778 -11692 5105
410E105n138K621Q014j7115J070K7857r050k1573J8361Q595k3328J997K1937j2768
424F585k0738J5693Q638j9785L64J0934j2063m226J0676m228o949N689k316n777
438a7503J4458O191k5941l113K7879n487j8823J5537O524j7703M737J5964n970
451c250K68J3753p912p930K4047M404k2630J2662J8108k3318r704K1266k702j6623
465D39Q474N757j7631l179J3247n502l689J0164q676j0334J3033L396j1818O634
479C15J1829j2434r578J6107L617j3899R687J1157j6890o308J0822j575J544J0778
493A5172j0005j6807J1354R711j3714Q402K0250k3566k0254K6201J0593j8294
505i57K470Q674j2506m285R683o004l853J4603m025j7004R061N654j3660Q273
$$ plain form
410 5105 -33 2588 10602 -6513 -5443 22414 13364 -8209 10152 18747 -4581 -2584 19353 6585
424 6585 -14153 1540 10178 -9607 -9243 1691 -10372 -14598 -3922 -8150 -15099 -9410 -11726 -17503
438 -17503 -3045 3146 -22795 -25908 1971 -3516 -22339 -6802 -278 -17981 -13244 2720 -3250
451 -3250 -2982 10771 2859 -5071 18976 23380 750 13412 31520 8202 -1502 19764 17062 439
465 439 8913 14670 -2961 -6140 7107 1605 -2084 8080 -596 -10930 2103 5499 -6319 315
479 315 12144 -290 -9868 6239 9856 -4043 5644 16801 -89 -6397 4425 2850 4394 15172
493 15172 5167 -11640 -286 9425 -4289 4113 24363 797 -19457 6744 17337 -957
505 -957 1513 10187 -2319 -6604 3079 -2925 -6778 7825 3800 -13204 -4143 1511 -12149 -3876
519c876J7887r064j3576K002j96N48J7475R323j9845j2936Q724M798P814J3465
533B2543j1961k2775M987J4242o949n023J2560p827k2591J0178J6182j4197n855
546a6486J5011L721l138j413j0995k083K3030J2027j3874m797l139j7815J3170
559f781L6946o754k9804l390K046J584J9940J1114j9518j6155M909L579O227J4707
573A8650o722k1415M434J5074m211j1125J266P150K09j744k064j3114o636J5947
587d301J3235j850p475j5122q357K0011K2458l006q543n293k0108Q0M2556J3057
601C7342l7014j3782J2459l62M813J1271p495r152K528j966l07J0855j887j5491
615h188N693J4504p507j2495l525K967J4257R685j2941j9539j453J6284J1407
$$ plain form
519 -3876 14011 4947 -8629 -6627 -6823 -6275 11200 20523 678 -12258 -3534 1264 9078 22543
533 22543 10582 -12193 -7206 7036 87 -4936 7624 -203 -22794 -12616 3566 -10631 -16486
546 -16486 -1475 2246 -892 -2305 -13300 -15383 7647 19674 5800 1003 -2136 -19951 -6781
559 -6781 30165 23411 -6393 -9783 -7737 -6153 13787 24901 5383 -10772 -5863 -2284 3943 18650
573 18650 11928 -9487 -5053 10021 5810 -5315 -4049 3101 3310 1566 -498 -13612 -20248 -4301
587 -4301 8934 7084 -391 -15513 -23870 -3859 18599 15593 7050 1757 -18351 -18271 24285 37342
601 37342 328 -13454 -995 -1357 3456 14727 7232 -1920 608 -1358 -1665 9190 7303 -8188
615 -8188 -2495 12009 4502 -7993 -11518 -8551 5706 15391 2450 -17089 -18542 -2258 9149
628I149j830j997q757j6444O314K4792L901j2969l645o392q343K1506K2498k3017
642D766k0392J6387P861n965K073l902k346R662m908j0603J1873M567j9498L020
656g405K5534n554k3591K13Q253P079J1143o352j9952k680J2752Q765kk721n193
671B89j0897j557J6045Q745q746j0291m931l85J1955J1939j2512j6396J0139J1160
685D557m081Q21l687o662J3140O508j4717K465J0621j5717n814K7481O130k8144
699g099q784J3948P615P636n92j7509n313J0410M787M383L288j0810j2821L432
713g429J3980M526p342q659m525J972R935N128r841j2177M304J2049j18l444k900
728d541q462N742J6053m483r274M022n533l527J9783R363k1010j2413J0912Q591
$$ plain form
628 9149 7319 5322 -3435 -19879 -13565 11227 15128 2159 -1486 -7878 -16221 5285 27783 4766
642 4766 -15626 761 8622 2657 4730 828 -1518 8144 3236 -7367 4506 9073 -10425 -7405
656 -7405 18129 12575 -11016 -10803 -2550 4529 15672 9320 -10632 -13312 -560 8205 8203 5482 289
671 289 -10608 -12165 3880 12625 3879 -6412 -11343 -11728 227 12166 -346 -16742 -6603 4557
685 4557 476 1297 -2390 -9052 4088 10596 -4121 -1656 8965 -6752 -12566 14915 21045 -7099
699 -7099 -15883 -1935 5680 13316 12724 -4785 -10098 312 5099 9482 12770 1960 -10861 -7429
713 -7429 6551 11077 3735 -4924 -9449 -7477 2458 7586 -2255 -14432 -10128 1921 1803 -1641 -4541
728 -4541 -13003 -7261 8792 4309 -4965 -943 -6476 -10003 9780 19143 -1867 -14280 -3368 5223
742E223M131K349j3777q736J1949M171k134P030n975j7262M919J9236J514j3459
756h21p060K662M498O076J768q556p695K993Q581L436m237m441m012Q89J0244
771D325K463q899j391N51k432R417O253j3497q805R650P430j471j537o893o494
786a1330J1061P217q990J85L846j1289j217J6181L180j1914n452M148L846L111
800B583J216m285k849M044J621p41J545j298j469K751L695k748o849K750O628
815F594l272j064L686o593o529O803N971k630l775m582m909M995Q202n153o277
830h533N061k872n836P939N164n804j512K748o88l48K574K22m99L805p43m818
846d140L070L737l531K807O807m375p905K856Q296o94l689K377j431n539J428
$$ plain form
742 5223 9354 11703 -2074 -10810 1139 5310 3176 10206 4231 -13031 -8112 11124 12638 -821
756 -821 -7881 -5219 -721 5355 7123 -1433 -9128 -6135 2446 5882 1645 -2796 -6808 -5919 4325
771 4325 6788 -2111 -3502 -2951 -5383 4034 10287 -3210 -12015 -2365 5065 3594 2057 -4836 -11330
786 -11330 -269 6948 -2042 -1857 1989 -9300 -10517 5664 8844 -3070 -8522 -4374 -528 2583
800 2583 3799 -486 -3335 709 2330 1589 3134 1836 367 3118 6813 4065 -2784 -34 6594
815 6594 3322 2258 5944 -649 -7178 -375 5596 2966 -809 -5391 -10300 -5305 2897 -2256 -8533
830 -8533 -3472 -6344 -12180 -4241 923 -4881 -6393 -3645 -4333 -4681 -2107 -1885 -2384 1421 678 -4140
846 -4140 -1070 2667 -864 1943 8750 4375 -3530 -674 7622 6928 3239 5616 4185 -1354 74
861G4L617J91Q24l208o360Q05N226r08l921L062R9p604J273O536k454j869K950
878a667j717k035K431P84l37K915O17m627P06N230l444k460P935M18p529K63N029
895B512m05j339K411J161l260j320P93Q99M182j34p524K26N924j598l329L379
911B578K436n584k973N722O71l903J246l8k460J390k57k143J741K061k492j693
927c698L425j105m184N143M171o792k256M780r54j616J853p3j667j71j22p07L703
944b70K634o236j288P741j60n351K999L610j537j906J793J026j415P06R92j257
960B081M30o86k813K525K486l608k224K582L26l752J296M840l609m673M057J555
976H13k215N97l86j187K009j71k700J196L468l249k445N537J156o091J591N703
$$ plain form
861 74 3691 3882 4706 1498 -4862 -4057 1169 261 -3660 -598 -499 -8103 -6830 -294 -2748 -4617 -1667
878 -1667 -3384 -5419 -2988 -2204 -2541 374 991 -3636 -2930 2300 -1144 -3604 4331 4749 -2780 -2517 2512
895 2512 2107 768 3179 4340 1080 -240 553 1452 5634 5500 -2024 -1798 4126 2528 -801 2578
911 2578 5014 -570 -3543 2179 2850 -1053 193 155 -2305 -915 -1172 -3315 -1574 487 -2005 -3698
927 -3698 -273 -1378 -5562 -419 3752 -3040 -5296 -516 -1470 -3086 -1233 -1306 -2973 -3144 -3266 -3973 -270
944 -270 2364 -3872 -5160 2581 2421 -2930 69 3679 2142 236 2029 3055 1640 2346 3338 2081
960 2081 2511 1825 -988 1537 4023 415 -1809 773 1099 -2653 -1357 3483 -126 -4799 -742 813
976 813 -1402 -805 -1191 -2378 -369 -540 -3240 -2044 1424 -1825 -4270 1267 2423 -3668 -2077 3626
992C626j862j588J020k23o5P68M02j08k54o10j954K188L565l434l194L669J735
1009C681k507j001K072N78k616N41J767j977o93R07q53J630J58m100MM102n30
1026A163l227J625K307m532j282O272m86m612Q65J364K37J74j579m46J997O72
1042E12k573j023L112j96l122K622K656l249j983K322K571n7j147M97m75j51J901
1059B217L23l42R42k739j520M290L08m585K43L537j723m070K182J749l678K70
1075b596K143j697n01p27k024L206L189k885k977K077J598j644J831L478l832
1090a361l541L514K458n80r64m90J12O13M04M94j87J528k80k206L079J948m373
1107A68j089M090N41l003q48J99j797N47K742k579j803Q38k608Q26N129j935m426
$$ plain form
992 3626 1764 176 1196 973 908 1676 2078 1970 1716 1106 -848 1340 4905 1471 -1723 1946 3681
1009 3681 1174 173 2245 2823 207 748 2515 538 -155 752 -101 1529 1687 -2413 -2409 1693 1163
1026 1163 -2064 -439 1868 -2664 -3946 2326 1840 -2772 -1907 -543 -306 -132 -1711 -2157 -160 512
1042 512 -2061 -3084 28 -168 -3290 -668 1988 -1261 -3244 -922 1649 1592 445 942 467 316 2217
1059 2217 2540 2198 3140 401 -1119 3171 3479 -1106 -863 2674 951 -3119 -937 812 -2866 -2596
1075 -2596 -453 -2150 -2651 -3378 -5402 -2196 993 -1892 -4869 -2792 -1194 -2838 -1007 2471 -1361
1090 -1361 -4902 -1388 1070 490 -474 -964 -852 -239 165 659 472 2000 1720 -486 2593 4541 168
1107 168 -921 3169 3710 707 -141 58 -1739 -1192 1550 -1029 -2832 -1994 -4602 -3776 1353 -582 -5008
1124e008K224K028j746N84L736p25l448J483K449J1N76j079j365K701L19k459
1140B81M93J568j004j467J898K211l113k239L271J277j292j67l63j196k93J634
1156A499L70j837n34j832j111M196J021n485m57L107p11k14J799o10k142O60K019
1173b62P07O56q62k901K565L919k687j425J966j283j134K538J631l149l405J917
1189a209L038m72j449j984m9K387P77o68Nj387j034M43K981J717m910l208L179
1206a843J915o46R8j851k212J113L248J025j268j607j581J531N536o40m380J017
1222e45J720r51K376K041k597l407J035M014J297k272l868p28M161K344k715j246
1238F59m29j353J616M109M65m491l798L161M568m82j438k389k425O55L365J676
$$ plain form
1124 -5008 -2784 -756 -2502 -1918 1818 1093 -2355 -872 1577 1588 2164 1085 -280 2421 2740 281
1140 281 774 2342 1338 -129 1769 3980 867 -1372 1899 3176 1884 1717 1354 158 -135 1499
1156 1499 1869 32 -502 -2334 -3445 751 1772 -3713 -4170 -1063 -1774 -1988 -189 -799 -2941 -2281 -262
1173 -262 445 1101 239 -2662 -97 3822 1135 -290 1676 393 -741 1797 3428 279 -3126 -1209
1189 -1209 1829 1357 -92 -2076 -2125 262 1039 371 376 -1011 -2045 -1602 1379 3096 -1814 -5022 -1843
1206 -1843 72 -574 -476 -2327 -4539 -3426 -178 847 -421 -2028 -3609 -2078 3458 2818 -1562 -545
1222 -545 1175 224 2600 4641 2044 -1363 -328 3686 4983 2711 -1157 -1885 2276 4620 1905 659
1238 659 230 -1123 493 4602 5067 576 -3222 -61 4507 4025 2587 198 -2227 -1572 1793 3469
1254C469j779l680j838J474M249J451m761j839K867K52N25K223j935k788J536
1269e74L094J069k021k895o40L417L730k453m037O8l1N62M209P74m878m287J222
1286c671N375K128k226k675j846P73K125J287J60j709l040L32K678R03k847j786
1302d039K784J062k311L01nj434K177K968l23k127k539k03M152M272j297m904
1318a466m34J661k11K600K899l520l998K29K395K442p64j916p54M02M08n15N24
1335a8J202p03p71J894n90k922m41L413K912k458l017p3j80J527L249J03k122
1352A005k432j619K889M293L06l326j570J185q3M32L150o37l569J36Q64J82K45
1369A451r90m63J104Qk084j357J922Q20j084J241N59l453j490K803L317L52k609
$$ plain form
1254 3469 1690 -1990 -3828 -2354 1895 3346 -1415 -3254 -387 -135 390 2613 678 -2110 -574
1269 -574 2520 3589 1568 -1327 -1967 1450 5180 2727 -1310 -1242 -1273 -711 3498 4272 -606 -4893 -3671
1286 -3671 1704 3832 1606 -1069 -2915 -2142 -17 1270 1430 -279 -3319 -2987 -309 594 -2253 -4039
1302 -4039 -1255 -193 -2504 -2203 -2208 -3642 -1465 1503 1180 -947 -3486 -3689 463 4735 3438 -1466
1318 -1466 -1900 -239 -450 2150 5049 1529 -2469 -2240 155 2597 1833 -83 -837 -435 -27 -542 -18
1335 -18 1184 481 -290 1604 1014 -1908 -2349 1064 3976 1518 -1499 -1572 -1752 -225 3024 3127 1005
1352 1005 -1427 -3046 -157 4136 4442 1116 -454 731 648 1080 4230 3593 24 160 1024 1206 1451
1369 1451 461 -2 1102 1110 -974 -2331 -409 411 -673 568 1127 -2326 -3816 -1013 2304 2656 47
1386D7j658j80Q64K351J870j343j636j856L10L483R35j819j055R0l05p39K020
1403A379J128k422j129J832n08Nq00r32J797J341k215k224R60J296o50N18J318
1420F94k101k605J924K412O25j11j976n86O54J332J370R1n93j258o11J736J716
1437B713j296r87P94M9r10o25J103K88j224r0J54o36j66p90N55K306j238k728
1455b728N59J635l3k31N92k82k072L99K154P9Q0m44j008J323J17l86Q15L81m01
1474E49p06j40J609k94j292J305O09j059r71R4J291L29q43k51l92l69Q6k62J379
1493F72l9k350k02K241k71j112M66J078p04j168J289N28l72Q7m98R0Q13r71k57
1512f80J864M8j426k15J278L69j164K80J315j081m88K80L31N03k17n43N95N8n76
$$ plain form
1386 47 -1611 -1791 -927 1424 3294 1951 315 -1541 -1231 2252 3187 1368 313 403 98 -641 1379
1403 1379 2507 85 -1044 788 280 285 -515 -1447 350 1691 -524 -2748 -1788 -492 -1142 -624 694
1420 694 -1407 -4012 -2088 324 949 838 -1138 -1724 -1070 262 1632 1723 1130 -128 -739 997 2713
1437 2713 1417 430 1224 1273 363 -262 841 1129 -95 -185 -31 -667 -833 -1623 -1068 1238 0 -2728
1455 -2728 -2169 -534 -567 -798 -206 -488 -2560 -2161 -7 72 152 -292 -1300 23 140 -246 569 950 549
1474 549 -157 -297 1312 1018 -274 1031 1640 581 -390 -296 995 1324 481 230 -162 -531 -445 -707 672
1493 672 633 -1717 -1919 322 51 -1061 -595 483 -221 -1389 -100 428 56 143 -355 -265 548 -423 -680
1512 -680 1184 1232 -194 -409 869 1238 74 354 1669 588 100 380 711 1214 997 454 1049 1107 531
1531E31l29O03R31j482j395J683J45j765K4J065m43j111j24P04l72J78Lp77R86
1550i45J57j772J040J512j496n20J187N57q31J81J285n5m98K93m1R30O18j396
1568B06M79J615n95j260Q94J147n61j339Q31Q97j534n27P83J99r46r89l09M16
1586e93k37p70n44O95L82j455M3K221q45j553J671R94j065j53Q33P00N6n0J75
1605E05O45R57p67n12K024p1j713Q56R36n72n30L68K62l10q23M21J65l51o35p57
1625I8N98j7j484n18M73J4r87r80Q69L60j797M00J339m82m64K83L73N80j67K3
1645a486L53O71j58n72J089J180j569q0J519j92p57L26J09M08m58m15N82M6m58
1664A38q24P79Q25r99r60J209L03j038m04M1R19q45j343J194O8r23K96o5K19Q6
$$ plain form
1531 531 202 805 1736 254 -1141 542 687 -1078 -1054 11 -432 -1543 -1667 -963 -1335 -1157 -1154 -1931 -945
1550 -945 -788 -2560 -1520 -8 -1504 -2024 -837 -280 -1111 -930 355 300 -198 95 54 984 1602 206
1568 206 685 2300 1705 445 1339 2486 1925 586 1417 2314 780 253 1036 1235 289 -700 -1009 -593
1586 -593 -830 -1600 -2144 -1449 -1067 -2522 -2479 -258 -1103 -2656 -985 9 -1056 -1209 -376 324 380 330 505
1605 505 1150 2107 1340 828 2852 2781 1068 1924 2860 2288 1758 2126 2388 2078 1255 1676 1841 1490 855 98
1625 98 696 679 -805 -1323 -850 -836 -1823 -2803 -1934 -1574 -3371 -2971 -1632 -2114 -2578 -2295 -1922 -1342 -1509 -1486
1645 -1486 -1133 -462 -620 -1192 -103 1077 -492 -572 947 755 -2 324 433 841 383 -32 550 596 138
1664 138 -686 93 918 -81 -1041 168 471 -567 -971 -930 -11 -856 -2199 -1005 -937 -1860 -1564 -1629 -1410 -1324
1684a324m41N93N68j3m95K88J258l25j086J153Q76p80O2M96j22N15n48J66O39
1703A480m13m40K3R35J37j232k32J181l7n28M11J44j25j023N78J132j022j009
1721d0K84J46P8o36p56P65r6n10L64K91k34j218M76J751m51q82J45k41N77P97
1741F10m79k62J02n26MJ207K99j351j011J282O25p70kL46m26K86J12O35O4q49
1761a04o0J076N33m35j385M5J088l68r3m0n97j203M88J384L00j459o90L80L60
1780g80R17m35m32J94l51l91J140O33p39q71M32J069l95p65L15Q9M06J09o37J30
1800c62O0k61Q98Q98l40j057k93J573M04l31K77l51j191n1R75P01n80j492l13
1819h36M62J56o5o61L15J41j010l6J202l29l98J69P36j09m78j41N80O38K34m56
$$ plain form
1684 -1324 -1765 -1172 -604 -617 -1112 -824 434 109 -977 176 1052 272 334 830 708 1223 675 841 1480
1703 1480 1067 627 650 1585 1722 490 258 1439 1402 874 1285 1429 1304 281 859 1991 969 -40
1721 -40 244 390 468 -168 -924 -159 -255 -765 -401 -110 -344 -1562 -1086 665 214 -668 -523 -764 -187 610
1741 610 131 -131 -29 -555 -551 656 955 -396 -1407 -125 500 -270 -272 74 -352 -66 46 681 745 -104
1761 -104 -164 912 1445 1010 -375 -330 758 390 297 257 -340 -1543 -1055 329 629 -830 -1520 -1140 -780
1780 -780 137 -298 -730 -536 -887 -1278 -138 495 -244 -1115 -683 386 -9 -774 -459 -370 36 145 -492 -362
1800 -362 -302 -563 335 1233 893 -164 -457 1116 1520 1189 1466 1115 -76 -127 848 1549 969 -523 -836
1819 -836 -374 -218 -283 -944 -629 -488 -1498 -1534 -332 -661 -1059 -890 -154 -263 -741 -882 -302 336 570 114
1839A14o40N81n14L11J310O2j627q61J145J300n66j05O56p73p04Q27N64K97p44
1858F33q81P03P8q70l32O02J75n68o87P02o12o27R03Q01J33r43q29Q98R52N75
1878H06J04o85k65l7j0J300R68j284j423K33J225K76j090M5j15m18J42K38L03
1897C13j63q70L26J484r46j127M83Q68K9o26N9M8j417K68J692M81r86j462R2J468
1917A4M02n6j89o59O8J18O32J057m17j429M59Q34O8j84o08K78j06j69M7m09k36
1938d85k15k20J126r7j419n0J246P89l00l06K46m12k08R56P28l93j104n82P45
1957D5R95n74l37j11k40k49R0R17J14j301J17J020k14k77J57K22K22k18l6j93
1977A49j63J32j35J49N38j355o46R75N57l82j3j88J12j08L86O30R5k40o25K9Q75
$$ plain form
1839 114 -526 55 -459 -148 1162 1224 -403 -1264 -119 1181 615 510 1166 393 -311 516 1080 1377 633
1858 633 -248 455 533 -337 -669 -67 108 -460 -1147 -445 -1057 -1684 -781 20 153 -790 -1619 -721 231 806
1878 806 910 225 -40 -77 -87 1213 2181 897 -526 -293 932 1208 118 163 48 -370 -228 10 313
1897 313 150 -720 -394 1090 144 -983 -500 368 397 -229 -170 -122 -1539 -1271 421 902 -84 -1546 -1454 14
1917 14 416 360 171 -488 -420 -302 330 1387 970 -459 0 834 902 718 110 388 282 113 160 -249 -485
1938 -485 -700 -920 206 109 -1310 -1360 -114 675 375 69 315 -97 -305 651 1379 986 -118 -700 45
1957 45 1040 466 129 18 -222 -471 -381 536 650 -651 -534 486 272 -5 152 374 596 378 342 149
1977 149 -14 118 -17 132 670 -685 -1331 -356 201 -181 -194 -382 -270 -378 8 638 733 493 -132 -103 772
1998G72Q0j013M13J63m78l80P6J54l25m60O12pp94n0M25M72K15m75j05N51m1Q6
2020a09L79M94l82j161Q75Q47o73j95J79j29j09l1j4L82j88l35j69N81K85o93
2040a66k46J088l88k11J99j19j20J41p4R3r6m37p5L77M72n49l33M77l50k19Q90
2061C54L20r6l90j15N56N18o29J30K62j67k10k95Q4M88o93m82J97L96l39o84N02
2082b93M63l11J7J90j23Pj88M64N93o12l81L39K91Q4l35J18K76o32n2M62j46Q8
2104C19o96O7Q40m35n02M49K53l30P3r5K98n38k05L15K6j16p01k2N85k29k62L95
2126e11J99m58L25J3N59J70l94J82M35K61j11j47L70L10p45J05K92p0l01m78M72
2147D78Pq50O6M40k67k57j19R5K83m49p7N88l41k82rL94K32p26J99L74k46J4K10
$$ plain form
1998 772 852 -161 252 415 -63 -443 -367 -213 -538 -998 -386 -393 -1187 -1237 -812 -340 -125 -600 -705 -154 -195 -109
2020 -109 270 764 382 -779 96 943 270 75 254 125 16 -15 -29 353 165 -170 -339 242 527 -166
2040 -166 -412 676 288 77 276 157 37 178 104 197 101 -336 -411 -34 438 -111 -444 33 -317 -536 354
2061 354 674 578 188 73 629 1147 518 648 910 743 533 238 322 810 117 -365 -168 228 -111 -795 -293
2082 -293 170 -141 -124 66 -57 -50 -238 226 819 207 -174 165 456 540 205 323 599 -33 -85 377 231 319
2104 319 -377 -310 530 95 -407 42 295 -35 38 -57 241 -297 -502 -187 -161 -277 -978 -1000 -415 -644 -906 -511
2126 -511 -312 -770 -445 -432 127 297 -97 85 520 781 670 523 893 1203 458 563 855 785 484 6 478
2147 478 485 -365 -299 141 -126 -383 -502 -407 -124 -573 -650 -62 -403 -685 -694 -300 -68 -794 -595 -221 -467 -453 -243
2170b43j05M25R2j55M16L51m19n5L71L68l17l42P78k56k01L2n5j0j6p67M04j56
2192A40k86l63j54N69o92m72L97M99n02r2K91M74l44L4L50K07m49K30O9K72L26
2213E04n91L90O29l92m75L25O44m97m56L48K05n10m0J61P3Q4n27n2N68j97o19
2234d25M43R4p6o87J97M94n08k32J57K65j06n1j4N12j99j10K87K49K40k56k09
2255F5P45N0q35L97J73k04l08J28K92l77m22K54m2K09k74m38L22O5m60K60L59
2276d1j70k92J14M95M3k58p3L03K19q7k66N50P9l68j15L58j5q5k15K27L70l69
2298D04l27L26j02m39O0J76J55o08k43L46N9k93o8%N74n26m75P09L7l50J7L13
2320b55L78k45j22N14K88j52lJ30K82J02n20M19J8m63O1j31J67P2o14L02q0o39
$$ plain form
2170 -243 -348 77 169 14 430 781 362 307 678 1046 729 387 1165 909 708 740 685 675 659 -108 296 140
2192 140 -146 -509 -663 -94 -786 -1258 -861 -362 -864 -956 -665 -191 -535 -501 -151 56 -393 -163 -94 178 504
2213 504 -87 303 932 540 65 390 1034 537 81 429 634 124 84 245 318 402 -125 -177 391 194 -425
2234 -425 18 112 36 -651 -454 40 -468 -700 -543 -278 -384 -435 -449 63 -136 -246 41 290 530 274 65
2255 65 810 860 25 422 595 391 83 211 503 126 -296 -42 -84 125 -149 -587 -265 -200 -660 -400 -41
2276 -41 -211 -503 -389 106 149 -109 -182 121 340 253 -13 537 616 248 133 491 476 391 176 403 773 404
2298 404 77 403 301 -138 -78 98 253 -355 -598 -252 -193 -486 -554 -554 20 -506 -981 -272 -235 -585 -568 -255
2320 -255 123 -122 -244 270 558 406 403 533 815 917 397 816 834 371 432 301 468 540 -74 228 148 -491
2342d91J30K12r7j09l03O8L27k24l59Q9L50J17n74K57N77m75K79J25K7K78j36
2363F8k84N95J44k54K5O1K15k3l6L96j24l54J52J50r0l24k22J9j44l84L48J16
2385E0k36j24k68L23n6l06N8J01J67J38k99K57J03m55M07K55Q0o8m68L37L27k13
2407A10m34K72j3J51k64M49K01p55OL91M18k37l70j81N70r7j28j08ON5j24J3M84
2430D15n95o12N43K29J8l21J2J77j54k5M40p9l93o0MO21j87l28j9J14J24k13J22
2453a67O7ll58M58J31l52j2j04N03M00n43J70K43n7K2j1K84l4n13P9M91p5l45
2476B74k45J2K04j78nK10m78j0j43N91Q8o61j53O94m50J01ll9N7k51K49K86K5
2499A75l86n0K48K70k18k52K31M14l01K42k59L26l17k23N11O5j65j64l25K11P
$$ plain form
2342 -491 -361 -149 -246 -355 -658 -590 -263 -487 -846 -757 -407 -290 -864 -607 -30 -505 -226 -101 -74 204 68
2363 68 -216 379 523 269 294 355 570 547 511 907 783 429 581 731 641 317 95 114 -30 -414 -66 50
2385 50 -186 -310 -578 -255 -311 -617 -559 -458 -291 -153 -452 -195 -92 -547 -140 115 195 127 -341 -4 323 110
2407 110 -324 -52 -65 86 -178 271 472 -283 -277 114 532 295 -75 -256 314 217 89 -19 -13 42 -82 -69 415
2430 415 -180 -792 -249 -20 -2 -323 -311 -134 -288 -313 127 48 -345 -405 -401 220 33 -295 -314 -200 -76 -289 -167
2453 -167 -100 -103 -461 -3 128 -224 -236 -340 163 563 20 190 433 376 398 387 671 637 124 203 694 619 274
2476 274 29 41 245 67 62 272 -206 -216 -359 232 320 -341 -494 200 -250 -149 -152 -191 -134 -385 -136 150 175
2499 175 -211 -261 -13 257 39 -213 18 432 131 373 114 440 123 -100 411 476 311 147 -178 33 40
2520D0l36P6K41n06p0K37P0k94k34O17J17k79J09n5K48j8k14M96J64m26k85M15
2542A13K30j3m04l2K65j71r7J93j39r1k27K19O36n01k87K37k4J3j46l7M06k92
2564a49l56M07n6j38k26j11P54j94j83o1J51M17j88K06K95j36l38L02K33o1l7
2585E31l68J43k1j98J67j29j82j65j16L74p4o31L4K25k00J68j21J08J84k22L22
2606a71L63k60k00j22M92J66k43LK8J40R1o2L7K86l51m8L21j2k13r6J04J71k42
2629A82n8L40k48j85p8J07Pl10l51L44j15K7j55r5M40j18j33K95J89l91j33L51
2651h8L93k08j51L29R2P4r4r1J49n6k51Q1L40m51J2K8J94k25J3k9J29l43J93J01
2675A41k01j1l5p2J41Jj78K57j91J31j75k65M71k72j17K66k2K22j33n3K08J1j45
$$ plain form
2520 40 -296 -220 21 -485 -555 -318 -248 -542 -776 -159 -42 -321 -212 -267 -19 -37 -251 245 409 -17 -302 113
2542 113 343 330 -74 -106 159 -12 -109 84 -55 -146 -373 -154 482 -19 -306 -69 -93 -80 -226 -263 143 -149
2564 -149 -505 -98 -154 -292 -518 -629 125 -69 -252 -313 -162 255 67 273 568 432 94 396 629 568 531
2585 531 163 306 285 87 254 125 -57 -222 -338 36 -38 -669 -635 -410 -610 -442 -563 -455 -271 -493 -171
2606 -171 192 -68 -268 -390 102 268 25 28 56 196 287 225 262 548 197 149 470 458 245 149 253 424 182
2629 182 124 464 216 31 -47 60 67 -243 -594 -250 -365 -338 -493 -588 -148 -266 -399 -104 85 -306 -439 -88
2651 -88 305 97 -54 275 367 441 347 256 405 349 98 179 519 68 80 108 302 77 90 61 190 -153 40 141
2675 141 -60 -71 -106 -178 -37 -36 -214 43 -148 -17 -192 -457 14 -258 -375 -109 -131 91 -42 -95 113 124 -21
2698b1m4J86P3l52L9L18k44p7K57J51k13j59j20K71k4j7n8J14O0j01n8R1K00k99
2722b7J45j85J56j27j04L57l2l70m7J95j38K19k34RJ56j31j28K17J53k4j75J54
2744C9K71k14j40J08P2R0k26q6L67m13o0K17K39j44j11J13KL6j38O7m6l0j13L5
2768f5L40k91k48J72J35j47k55J48K2j02j32l5J89n7j12N6L52r1k99K72J92q5
2790d1L8j05L08K6o7O9K3j8m4n2K76M8l17k4J44k02k0m1n8J27j54j7K59j34k17
2815a93n3K03J42k86k4J77Q2j66j49J07L78j72n3J23J4q7j7K34J68p9q5N3K88
2838F05j83n3J24J50k90j24K69l38N0j61J13J2Rm56K07N9j18k06L8K32Pk69K35
2861h8L7j31L8jJ19n6p6O1J54j89n9J81m3Rk66K65L06l47P5K04r3J10j99j42K31
$$ plain form
2698 -21 -65 121 194 -158 -119 199 -45 -122 135 286 73 -86 -206 65 41 24 -34 80 140 39 -19 72 272 -27
2722 -27 118 -67 89 -38 -142 215 183 -187 -234 -39 -177 42 -192 -183 -27 -158 -286 -69 84 60 -115 39
2744 39 310 96 -44 64 136 226 0 -86 281 -132 -192 25 264 120 9 122 124 160 22 89 43 13 -100 -65
2768 -65 275 -16 -264 -92 43 -104 -359 -211 -189 -291 -423 -458 -269 -326 -438 -382 -30 -121 -420 -148 44 -41
2790 -41 -3 -108 200 226 159 228 251 233 189 137 413 461 144 120 264 62 42 1 -57 70 -84 -101 158 24 -193
2815 -193 -246 -43 99 -187 -211 -34 48 -118 -267 -160 218 46 -7 116 130 43 26 260 428 349 264 317 605
2838 605 422 369 493 643 353 229 498 160 210 49 162 174 183 -273 -66 -7 -125 -331 -293 -61 -54 -323 -88
2861 -88 -51 -182 -144 -145 -26 -82 -158 -97 57 -132 -191 -10 -53 -44 -310 -45 261 -86 -11 193 100 210 11 -131 100
2886A00j53j93M06k10j29q9N7J91j26j87J95j31Q7l2q1L60k7k57K40KJ22Lj82
2909c4K24J26j60j5P3j55j0j71L55m6m02O2K18P1j70p4J26N3j67k7M6o2K14k22
2933a47K41J65k07j89M11j68j04J15r1J48k80J24K08k44J66j76oL85k12j07K10
2954B42K9k18j3J14M3k29k35L65j61j22j60NK00J2j94K14j6Om9O6K91M8l97L52
2978A93J16M7j12j17k6K16k09J28M3k10Q4j22k8J89n43K65K62m76R5nJ23K4k68
3001c31K55J92j43Q0J39j73J72k13k51M24q4j43K31j28K42j49n4J87j24r2L4J47
3023B18J67k80k11M56k77q9j91K13Q3l36L5l9lj50J13J24j12Mj02J13J58j44J97
3046e3j12K52j53K72j1n0K6o6mJ81p1j53J49J43k86o9K26j99O8j06J01J0k86j06
$$ plain form
2886 100 -53 -246 160 -50 -179 -268 -211 -20 -146 -333 -138 -269 -182 -214 -295 65 38 -219 21 23 145 148 -34
2909 -34 190 316 156 141 214 59 49 -122 233 187 -215 -153 65 136 -34 -108 18 71 -96 -123 -77 -139 75 -147
2933 -147 94 259 52 -137 274 106 2 117 26 174 -106 18 226 -18 148 -28 -34 351 139 32 242
2954 242 271 53 40 154 197 -32 -267 98 -63 -185 -345 -340 -140 -128 -322 -108 -124 -118 -167 -101 190 238 -159 193
2978 193 309 356 244 127 101 317 108 236 279 69 153 31 3 192 -351 -86 176 -300 -205 -210 -87 -63 -331
3001 -331 -76 116 -27 53 192 19 191 -22 -273 151 67 -76 155 27 269 120 66 253 129 37 71 218
3023 218 385 105 -106 350 73 -16 -207 6 89 -247 -212 -251 -254 -404 -291 -167 -279 -275 -377 -264 -106 -250 -53
3046 -53 -165 87 -66 206 195 145 171 105 101 282 211 58 207 350 64 -5 221 22 90 -16 85 95 -191 -297
3070b97M7j8J46k43P1K28k17r8J74J07m2k24P1K92l2k08R7J76J13j57k7L82m5
3093B96k16L73L9j99m8K3J86m9l44J67Q2l82J57l7j72J26l22R2k1o0R0k09K68
3116a60j06O0K08lj94O9n9K53J06j72pq6K55m8k4K14k4l08K15J11l11O8nr5L26
3141B83k19l42J62J95j15p7J03J00k62j9K00j17k72J6j17K80j10K03K7K32k29
3162g8P2r1K44j27j35L42j0Qo1Q9n7j07n3L8J15k10M4j01nK68k57p3J95j03n9
3187a12J10l0Q1Q4k5M9n1L2K6k9N1j05J89R0l41O6J63k41J12Mk70K95j91rK24
3212A72k39O3k32K01rj09N2P5rj9r3k46K70J9j06k2m9K49j24J15K25j34k8j9J55
3237A58K8J7r9J44k1q6L6J51l43K4K6L3p3j73J35k19L4L1q5OO2k40K07O1M5j5
$$ plain form
3070 -297 -250 -268 -122 -365 -294 -66 -283 -381 -207 -100 -142 -366 -295 -3 -35 -243 -146 30 143 -14 -41 341 296
3093 296 80 453 492 293 245 268 454 405 61 228 310 -72 85 48 -124 2 -320 -228 -249 -309 -219 -428 -160
3116 -160 -266 -206 2 -1 -195 -126 -185 68 174 2 -5 -91 164 116 92 306 282 -26 189 300 -11 57 52 -43 283
3141 283 64 -278 -116 79 -36 -113 -10 90 -172 -191 9 -108 -380 -364 -481 -201 -311 -108 -81 151 -78
3162 -78 -6 -97 147 20 -115 227 217 225 164 253 196 89 36 74 189 -21 23 -78 -83 185 -72 -145 50 -53 -112
3187 -112 -2 -32 49 133 108 157 106 138 164 135 186 81 270 360 19 85 248 7 119 123 -147 148 -43 -52 172
3212 172 -67 -4 -236 -35 -44 -153 -101 -26 -35 -54 -147 -393 -123 -104 -210 -232 -281 -32 -156 -41 184 50 22 3 158
3237 158 186 203 104 248 227 141 177 328 -15 9 35 68 -5 -178 -43 -262 -228 -197 -282 -276 -214 -454 -247 -186 -141 -156
3263a56j47L19j08N2k1K42j74m1J23l5K09q1j65N0J33P0m9j1J05kk02K04j58R5
3287B52j95j11J61k90L1j9P5p6J20r8p0M9k46K91l6J4Q9j33N3K63o5l0J91j2k2
3312A86J36j02K5o0l3J3q0J68k34J64Q9m42n5L05k73R9o8J98r2k20J09J23j23
3335a67NJ69j38J63k29J44L7m5m4R0KM0J6l29L67K0p9K41k09J38L9k86K15j89
3359b9J70J1j69K6Q6k05J17n3j11P5L3l19J97O2M9N7j57J11j49K33N2q0J87q2
3383A12r1M0M9MP8k1O1N9l67R7k5L3l7j10N8J54o1j90O4N5lO9j58J84j62j60J15
3410a53Q9o6p1r7L94j1k43J59R9o3O2j34K25k05J79J66j93J63j68l1P7j4l90L16
3434I0o2k5L2k02J54k3j05k0K14k08KL5o5J31L8j17J82k96K09P9J13M3j90j2J85
$$ plain form
3263 -156 -303 16 -92 -40 -61 181 7 -34 89 54 263 182 17 67 200 270 221 210 315 313 111 315 157 252
3287 252 57 -54 107 -183 -152 -171 -96 -172 -52 -150 -220 -171 -417 -126 -162 -148 -59 -192 -139 124 59 29 220 208 186
3312 186 322 220 245 185 152 165 85 253 19 183 272 -170 -225 80 -193 -94 -162 36 -56 -276 -167 -44 -167
3335 -167 -162 7 -131 32 -197 -53 -16 -61 -105 -15 -13 27 43 -286 81 101 22 263 54 192 231 -55 160 -29
3359 -29 141 152 -17 9 95 -110 7 -46 -157 -82 -49 -368 -171 -109 -60 -3 -160 -49 -198 35 87 7 194 112
3383 112 21 61 110 114 192 171 232 291 -76 21 -4 29 -8 -118 -60 94 33 -157 -93 -38 -41 28 -130 54 -108 -268 -153
3410 -153 -64 -130 -201 -298 96 85 -158 1 100 37 99 -35 190 -15 164 330 137 300 132 101 178 164 -226 90
3434 90 28 3 35 -167 -13 -36 -141 -161 53 -155 -153 -118 -183 -52 -14 -131 51 -245 -36 43 156 199 9 -3 182
3459A82j03k1j55J18L1L1j16J89j76J14o1k15K95q6j87L94j28q8P6j69oJ4K5J2
3483c0q2M9j15J5K50k68J12R0j3K12p0k28R4P9n8j02J11n3O0J24j04L7m01J92
3507i9N8k40J33J24K1k37r4K12j5p4P6j16J34l7N9j5L34j34p9j2J18J12j57P9
3531A51J84j29j90J08j31R9J23k69K23k28P9p1K18j98j24P5J57j74j82J02R4j11
3553a94j3r9J72Q9p6J21j46J28j7j89L26k27M7K77j59k0L2P9n2J09k18O7NM0J00
3578A82n5j33J06k42K06l6j59R0n3k2R4k47n2J23QO6j76J85L36j83j4O8j95J21
3602A8l6K58l0j81J31k1m2J29M9j57J26j79j50J67J8O2k0k29J45mn2r0%k0N0l5
3628i3J14K8j82J90j07k25L43j26K18N6j25L6J0p7M1k4k1J05j05m4L06j13j21
$$ plain form
3459 182 79 58 -97 21 52 83 -33 156 -20 94 33 -182 113 27 -160 234 106 18 94 -75 -81 -67 -42 -30
3483 -30 -112 -63 -178 -163 87 -181 -69 21 8 220 150 -78 16 95 37 -65 46 -7 53 177 73 110 -291 -99
3507 -99 -41 -281 -148 -24 -3 -240 -334 -122 -137 -211 -135 -251 -117 -154 -95 -110 224 90 11 -1 117 229 72 151
3531 151 335 206 16 124 -7 92 215 -54 169 -59 20 -51 167 -31 -155 -80 77 -97 -279 -177 -83 -194
3553 -194 -207 -306 -134 -45 -121 0 -146 -18 -35 -224 102 -125 -78 199 40 20 52 131 79 188 -30 37 42 82 182
3578 182 127 -6 100 -142 64 28 -131 -41 -94 -116 -22 -269 -321 -198 -190 -124 -300 -115 221 38 24 92 -103 18
3602 18 -18 240 210 29 160 139 97 226 275 118 244 65 -85 82 100 162 142 -87 58 54 2 -88 -88 -108 -58 -93
3628 -93 21 49 -133 57 -50 -275 68 -58 160 216 91 127 137 60 101 77 56 161 56 12 318 205 84
3651H4J19K0l2k71R7J94l12Q3o2J98k12p2R9j17J02k2K1N1J39j31k14L25q7n3
3675e3M4Q1P0Qo5O6j79Q9o4J27q8O7j47N4O5j12K38j45L9m3j41J4R3n1j95K10
3701a8j70Q5k5j10M62k35j17M4J41L6q0n1J46R8n0o4J8O8J1o6O2p5j34J20j45
3726d9J31j01L1o3R0r3J77k46K96l47kK3Qj14Q1J77M4j97j05L53p4j9J36k11J34
3751F0N4k98M30j42kL5Lj50J54k0J33j79j80O5l0M9r2n9J04O6k7q8P4j34J63j22
3777a33j9K2k2M1J38n4J1J1lQ3J09q2j3J24j15J07k65L22j87PO4j07M4Or9J9j78
3804a69J6J65j48J44j43k12K87r0L9J59j88n8J40J20o3Q6j74J49j7Q6j8n7R7K0
3828A71k47K50l4k20lo7K05j03r3R3o1j4J03j54O5P9j66l3K12j8j01J03m9J16
$$ plain form
3651 84 203 223 191 -80 17 211 -101 -18 -80 118 -94 -166 -67 -184 -82 -104 -83 -32 107 -24 -238 87 0 -53
3675 -53 -9 72 142 150 85 151 -28 61 -3 124 36 103 -44 10 75 -37 201 56 95 52 -89 -75 18 -33 -228 -18
3701 -18 -188 -103 -128 -238 224 -11 -128 -84 57 93 13 -38 108 206 156 92 110 178 189 123 185 110 -24 96 -49
3726 -49 82 -19 12 -51 39 -54 123 -123 173 -174 -176 -153 -145 -259 -178 -1 43 -154 -259 94 20 1 137 -74 60
3751 60 114 -184 246 104 102 137 140 -10 144 124 257 78 -102 -37 -67 -18 -110 -169 -65 1 -26 -114 -40 -174 -11 -133
3777 -133 -152 -130 -152 -111 27 -27 -16 -5 -8 75 184 102 89 213 98 205 -60 262 75 82 146 39 83 89 -10 9 -169
3804 -169 -153 12 -136 8 -135 -347 -60 -150 -111 48 -140 -198 -58 62 -1 85 -89 60 43 129 111 54 151 171
3828 171 -76 174 140 -80 -83 -150 55 -48 -141 -48 -109 -123 -20 -174 -109 -30 -196 -229 -17 -35 -136 -33 -82 34
3852C4j64M10j85j42j9Q9J58j26J59j65K14k36J18J00j53J2Q6j47n6K4n3J11j38
3875f9J10K1j81k1l0O3j36O1J15j65k1R7K11k72J38J64k1P7j57J01Q0n0J32k0
3899B27k5l7P8q0KM6N2k18Q7j23k7j37J83q5%J42m09K60p1pL0p4p6J54l21K07
3925b22jM0J59j26N1MJ68o1K32j96K04p1q9L2r5M7L7K9J03m0j97M5L0l8j09J76
3951A12r6k4j93J6R2j42K23j34J91o1j56P1Lj93J02K50j2N1o3k02L03j59O6q4
3975c9j8K39k21J90K9m6n8J95l07K04k83K25j1l6m0n7N9q8qJ2k3J46o6m0p2K46
4001A32o3k7Lq2o1J49j19J34p9oP2K2jO7r0j4K1j56K67k59O9J31p0j54J32j38
4027a20J47n9l5L1O6r9M4J9j16L58k95Q4n1O0k8Q2k9J15k14K46J16j42j38Q1p9
$$ plain form
3852 34 -130 280 95 -47 -66 23 181 55 214 49 263 27 145 245 92 104 190 43 -13 11 -42 69 -69
3875 -69 41 62 -119 -140 -170 -107 -243 -182 -67 -232 -253 -156 55 -217 -79 85 64 141 -16 85 165 115 247 227
3899 227 202 165 243 163 165 211 263 45 132 9 -18 -155 28 -57 -57 85 -324 -64 -135 -142 -112 -186 -262 -108 -429 -222
3925 -222 -223 -183 -24 -150 -99 -95 73 12 244 48 252 181 92 124 29 76 113 142 245 205 8 53 83 45 -64 112
3951 112 16 -8 -201 -185 -93 -235 -12 -146 45 -16 -172 -101 -98 -291 -189 61 49 100 37 -165 138 -21 45 -39
3975 -39 -57 182 -39 151 180 134 76 271 -36 168 -115 110 99 63 23 -34 25 -63 -71 -59 -82 64 -2 -42 -114 132
4001 132 69 42 45 -37 -98 51 -68 66 -13 -19 53 75 74 141 51 37 58 -98 169 -90 -21 110 40 -114 18 -120
4027 -120 27 -32 -67 -36 30 -69 -25 -6 -122 236 -59 25 -26 34 6 88 59 174 -40 206 322 180 42 123 44
4052D4m7p9J20J28k41M4p6n4K04j54q7P3O2P7j1j68K5j26k0J47lK3J27J23j09
4077B2j9J4J25M1o2J16j65J41q9j94J96j61J22q9m1l1J72q8p7K0Q1r0K6R4K1q7
4103bo0P5k60L97l30P4j19J91m7N8p5p4RjK64k83J53J04L8N4J10k27j5%Q2%J6
4130A32m1Nj02Qm2j97K44q5n9K3P7J4K4j36J8l1nJ87o5k9m4J8P0Q4j80K0J10j
4158A7K4j3j1R9j06K1L3n5L9n4P4M5j07j12J72R3n9k26J95Q5j84j61K16j88r0
4183b53L2P6K39j17j64J86m0O3n6P2p9J04oJ29j29J11l1j57K29j84k31K94j61
4206g3Q3p0j69J85N8j64K01n4j92L5j06rJ65J03N6j10O4P5j94J77j8J8k39K08
4230C0KJ54k64J27J62k87J81j61M8n3lL2J06r1k19K05J5Q5l43J87K55j80j69P9
$$ plain form
4052 44 -3 -82 38 166 -75 -31 -107 -161 43 -111 -198 -125 -63 14 3 -165 -140 -266 -286 -139 -142 -119 8 131 22
4077 22 3 17 142 183 121 237 72 213 124 -70 126 -35 87 -2 -43 -74 98 10 -67 -47 34 -56 -30 64 85 -2
4103 -2 -62 13 -247 150 -180 -106 -225 -34 -81 -23 -98 -172 -163 -164 100 -183 -30 74 112 166 276 49 34 34 116 116 132
4130 132 91 96 -6 2 -40 -237 7 -78 -137 -114 -37 -23 1 -135 -117 -148 -153 34 -31 -60 -104 -86 -16 68 -112 -92 18 17
4158 17 41 28 17 116 10 31 64 9 48 -6 68 113 6 -106 66 159 100 -126 69 154 -30 -191 25 -163 -253
4183 -253 -221 -145 94 -23 -187 -1 -41 22 -34 38 -41 63 57 186 57 168 137 -20 209 25 -206 88 -73
4206 -73 10 -60 -229 -44 14 -150 51 -3 -195 -160 -266 -275 -110 -7 49 -61 3 78 -116 61 43 61 -178 30
4230 30 32 186 -78 49 211 -76 105 -56 -8 -61 -64 -32 74 -17 -236 -31 -16 69 -274 -87 168 -12 -181 -102
4254a02K30k35l4J04l3J12j62M7N5J97L5j82K03j18M6j45O4j1l0j94L65k15j56
4277a59K07j39Q9O6l24K12Q0j26K3m5j50O4R2R1Jj67J51R2K7N1j28J7N1k6nk4
4303B1j30K20p9l0J20j67M8J69M2l67J01J26mk75P9K64k4l14K19p6j7o2q3K03
4327a6j11n7J92L5J05m3k42J49J70k29J07p2L0J00k39J31P6R1j00k57L42j17j64
4350a19J11j02O3k8K2n7N6p0J40l2P7k19J66r8j65J79j50J26p4L64j71n4K32j85
4374A2P6M7m9k15L12r8P0Oj08m9Q9j06J1Q5J36j51k87J58n0O5J03k21O1k32J71
4399a64L9J76l6j25J68k08L13l15L48k28O3j45P2J9J13j38J74q0k7K08j76J18
4421A69j29N9j20M7l3M5J6j37J35j55J40L1j90Q0J36l76L08r9N5P3j23j02K50
$$ plain form
4254 -102 128 -107 -141 -37 -70 42 -120 -73 -18 179 214 32 235 117 163 18 82 71 41 -153 212 -3 -159
4277 -159 48 -91 -2 64 -260 -48 32 -94 -71 -116 -266 -202 -110 -19 -18 -185 -34 58 85 136 8 25 76 50 45 21
4303 21 -109 111 32 2 122 -45 3 172 214 -153 -52 74 70 -205 -126 138 114 -200 19 -57 -74 -136 -219 -16
4327 -16 -127 -184 8 43 148 105 -137 12 182 -47 60 -12 18 118 -121 10 86 177 77 -180 162 45 -119
4350 -119 -8 -110 -47 -75 -53 -110 -54 -124 16 -16 61 -158 8 -90 -255 -76 -226 -100 -174 190 19 -35 197 12
4374 12 88 135 86 -129 183 85 155 161 53 4 93 -13 -2 83 219 68 -219 -61 -111 -46 57 -164 -103 -335 -164
4399 -164 -125 51 15 -110 58 -150 163 -152 196 -32 31 -114 -42 -23 90 -48 126 46 19 227 51 169
4421 169 40 99 -21 26 -7 38 54 -83 52 -103 37 68 -122 -42 94 -282 26 -73 -18 55 -68 -170 80
4444H0j35M2n8K2J86k82J07K46j38L8R3k29M7J15j17K18l01J39r7n3J47J4j87
4467a03J16j10r6O8J51n6R0j15K34j76k11K95k92J15R4j35K07j12mr5J77o5K22
4490A99o1j84K95k65J11j03j6L07m20R0K26k73R4J19j5N1k14j41J19J15j91J79
4512B2n6O9r4l8M8q0L52r1j75PQ6M3n1j14M4N4p7oQ0j10N3n8q0K94j71o2O9l8
4540h0L2l5j26J40N5q8K46k36K21j64K0k6j67J88L5r0o1J50p7m6J26j50J70oK6
4565E7M5j09j18O8qL7j6Q4J40k80K0m6m6J01j8j13K20r4m7N0J20O5Mp8k8J12j19
4592CJ44K1k22J68j20J97Nj23N7J2j49L9J30k99K13k44J83j05j02Q4N6M3Q7j15
4616c7J37q5j47o2J75pJ52k51K1p5K12o6j3n5K63j00o3K4j11J57k19K84k3q1M0
$$ plain form
4444 80 -55 -13 -71 -49 137 -145 -38 208 70 108 201 -28 19 134 17 235 -66 73 -24 -77 70 84 -103
4467 -103 13 -97 -193 -125 26 -30 60 -55 179 3 -208 87 -205 -90 4 -131 76 -36 -40 -135 42 -23 199
4490 199 138 -46 249 -16 95 -8 -24 283 -137 -47 179 -94 0 119 104 155 -59 -200 -81 34 -157 22
4512 22 -34 35 -59 -97 -49 -129 223 132 -43 -36 50 93 42 -72 -28 26 -51 -57 23 -87 -34 -92 -172 122 -49 -111 -42 -80
4540 -80 -48 -83 -209 -69 -14 -102 144 -92 129 -35 -15 -41 -208 -20 15 -75 -136 14 -63 -109 17 -133 37 31 57
4565 57 102 -7 -125 -57 -65 -28 -44 40 180 -100 -80 -126 -172 -71 -89 -202 18 -76 -123 -73 47 112 116 38 10 122 3
4592 3 147 168 -54 114 -6 191 196 73 130 142 -7 32 162 -137 76 -168 15 -90 -192 -108 -52 -9 78 -37
4616 -37 100 15 -132 -194 -19 -26 126 -125 -104 -179 33 -33 -46 -101 162 62 -1 23 -88 69 -150 134 111 30 70
4641G0J29j89j7J55j35l9M2j11J01j70L7O4pk01J97n6J37p2l8K20r7k0J77r8M
4666H3p4L6r7K50J2r2j56J49n1m8J3p5r6N9P1o9N5j73J54J12j06J82k37J3J33
4691D8m5M7r6M5m2p0Q8J64l19J75M2k6J68j19P7j13j12J54OQ9jj11J2O5j73%K27
4718A80j64J19r9l03K44R0k43J4J57j33R6j75J44M7J7k58L64k7n7j62J03K68l86
4741a64J47J89K3M3j70j09J37k7j21l3J12J05J5n5J8j40m6PJj05k3J45J11k20
4765a60P0J33l1n7RJ8K93k58r0K03r5J09j6j95N9J48m9l0O8r3N2Q3m3l3q3K27
4791B39k85K2R6k15k4k1J05q8J62l17K97K0p6R2M7k43J08L1K5J41j03J22j26j
4815Hm1k1J4J24m1j77K23k26J52O5j26J8Q4Roj30L7Q8N5q4RJ13k39J8J78k41J51
$$ plain form
4641 70 199 10 -7 148 13 -26 16 -95 6 -164 -127 -63 -70 -271 -74 -130 7 -65 -103 117 20 0 177 79 83
4666 83 9 45 -52 198 210 118 -38 111 60 12 25 -50 -146 -87 -16 -85 -30 -203 -49 63 -43 139 -98 -85 48
4691 48 3 50 -46 -1 -43 -113 -25 139 -180 -5 37 11 179 60 137 24 -88 66 72 161 160 49 61 126 -47 -47 180
4718 180 16 135 36 -267 -23 67 -176 -162 -5 -138 -42 -217 -73 -26 -9 -267 97 70 13 -149 -46 222 -164
4741 -164 -17 172 195 238 68 -41 96 69 -52 -85 27 132 147 92 110 -30 -76 -69 -68 -173 -196 -51 60 -160
4765 -160 -90 43 12 -45 -36 -18 275 17 -73 130 35 144 128 -67 -8 140 91 61 129 36 88 171 128 95 12 239
4791 239 -46 -24 72 -143 -167 -188 -83 -171 -9 -326 -29 -9 -85 7 54 -189 -81 -50 -25 116 13 135 9 8
4815 8 -33 -54 -40 84 43 -134 89 -137 15 80 -46 -28 56 65 59 -71 -34 54 109 25 34 147 -92 -74 104 -137 14
4842A4q4Q8l4l5Q3k0j6J6N0RJ51j48r9K85j84r8J94J6j95m2q9L61j26k41J23K7
4868Fj12P9p2M0NJ1J58m1j16K37k31K5R7j38p9J15K0J46k6k19J96o2L1l7k8Oj04
4895i3N9J58K6k03Q4j53Q6R3j13J03j23J85Pk59N5L1J76j50n5m3J71j96R4N1j13
4920a22K63M5j44L8LlN0k3M2j3j40L5k4r1J51j35N2l1j0P3j39Lk7J00j20J50L5
4947A8r1qL6N7n5k6J8j1j2P9p5J53o6N5j25J36j41J58o7j04K70k84J79o6r5J79
4973A12j01m0O7k25P6K2L5J76k38n2K27k51k1J16%J17j6j59J82K4k8R6o5jn6J14
4999A11r1k0P5O2j39J4N9l2Mr1l7J34k30J26Ro7l1J13J5r2J18k11J62M7p6m9K06
5026H9Q9p5r5o1J32k38K6K09k04N6J50n2N3K4N6r8r6o6L26k27J44Qj25j27N0r4
$$ plain form
4842 14 -70 18 -16 -51 32 12 -4 12 62 71 222 74 -25 260 76 -22 172 188 -7 -49 -138 223 97 -144 -21 6
4868 6 -106 -27 -99 -59 -54 -43 115 74 -42 195 -36 -11 86 -52 -131 -16 4 150 124 -95 101 39 70 33 5 11 -93
4895 -93 -34 124 150 -53 31 -122 -36 57 -56 47 -76 109 116 -143 -88 -57 119 -31 -86 -129 42 -154 -60 -9 -122
4920 -122 141 186 42 80 83 80 130 107 149 136 -4 31 7 -84 67 -68 -16 -47 -57 16 -123 -120 -147 -47 -167 -17 18
4947 18 -73 -81 -45 12 -43 -69 -51 -62 -74 5 -70 83 17 72 -53 83 -58 100 33 -71 199 -85 94 28 -67 112
4973 112 11 -29 38 -187 -111 -89 -54 122 -116 -168 59 -192 -213 -97 -97 20 4 -155 27 51 23 119 54 53 -3 111
4999 111 20 0 75 137 -2 12 71 39 43 -48 -85 49 -181 -55 -46 -113 -144 -31 -16 -108 10 -201 -39 8 -68 -117 89
5026 89 178 103 8 -53 79 -159 -133 76 -128 -72 78 26 79 103 159 61 -35 -101 225 -2 142 150 25 -102 -52 -146
5052a46O2J8q6Q6J69k30jJ34o6L0J5K3op8J27n9J41j23%N5no6M0J9J2L4n4j18
5080g3J28J04j81R4L9j32o6n6J45M9l14L31j13k0q9K45j65J41m7Q5j58J24O0k7
5104A04J18l29J30Q1N7j86J19k47J55Oj24K60j63J14l0k7j14O9J19n5j10O1O1
5127F9k26Q3K45l33j4n4K53j77L04j79o0K33q1l2j59Q9O8j1O6K35l21J23j73L08
5151B56j37q8N2o6l9q6J36M5m3M0n6r6JJ28q8p7J72j34K8O6m8L4R0j22M2l2P2
5178E0P7j65J41Q0k1q6p4J07p3J38j13M1m1L0J5k30%M4M9O6p6J67k47J59R2j82
5204e2j66L81j27r0K03l67L34p1Q2n6J66k84Q5k6kJ07k07K77J8k52K88o3j33J38
5228A83k29P6M2k19K76m5j70J06kj4M1j79rJ01n1P4k3oQN4l7J32j93L3J84R9j75
$$ plain form
5052 -146 -84 -66 -152 -66 103 -127 -128 6 -60 -30 -15 8 2 -76 51 -8 133 10 10 65 60 -6 34 53 65 99 45 -73
5080 -73 55 159 -22 72 111 -21 -87 -143 2 51 -263 68 -45 -65 -154 91 -74 67 20 105 -53 71 131 104
5104 104 222 -107 23 104 161 -25 94 -153 2 8 -116 144 -19 95 65 38 -76 -7 112 57 -53 8 69
5127 69 -157 -74 171 -162 -176 -230 23 -154 150 -29 -89 144 63 31 -128 -39 29 18 84 319 -2 121 -52 256
5151 256 119 31 83 17 -22 -108 28 73 30 70 14 -82 -81 47 -41 -118 54 -80 -52 14 -34 0 90 -32 10 -22 50
5178 50 127 -38 103 183 162 76 2 109 36 174 61 102 61 91 106 -124 -124 -80 -31 35 -41 126 -121 38 130 -52
5204 -52 -218 163 36 -54 149 -218 116 45 127 71 237 -47 38 12 10 117 -90 187 205 -47 241 178 45 183
5228 183 -46 30 72 -147 129 84 -86 20 18 4 45 -134 -143 -42 -93 -19 -42 -48 -40 14 -23 109 -84 -51 133 232 57
5255E7q6m6K31k83K12q6j02J89n9j66J56k01P5L51l45J06N9l6J46l24N1qJ5L4
5279f0J27j43J20q2j02J62J20q1q3J72m5j18j9K21j29j26j6O4J4P7j67K76q6j55
5303e9J88p2m0P2n5k2O1j94J76L5j68N7k9k0L14j83j7R6k00O2P9M6j34oL6J91
5329B14l01J64k24J25P1Oq2J3L3rN2k40J22J34j12J88j10j69J22j46K03l5j45
5352a26R1j34J97J0m6l0p6N6l3K32k15K17o8jqL5R9j02k23J54O7L9k1j45J7R2
5378G8k1l6r4J09Q0l12K69j77J54j47KPR4j08j23K34Ml5J95j88J07k9n6J54k39
5403g8M0jJ12K7j2j33K1K24j90r6R5Mj66K28j6j6m3J07j57K4P4j55K04j57lQ6
5429B3l8o9p2J74K7J12k54R5j13J36Jj66J97j09k0J24k7OP0j01K2M6j27J41j51
$$ plain form
5255 57 -29 -75 156 -127 85 -1 -103 86 27 -139 17 -184 -109 242 -103 3 62 26 172 -152 -101 -109 -94 -60
5279 -60 67 -76 44 -38 -140 22 142 61 -22 150 105 -13 -32 189 60 -66 -82 -18 -4 73 -94 182 96 -59
5303 -59 129 57 17 89 34 12 73 -121 55 90 -78 -21 -50 -70 244 61 44 140 -60 2 81 127 -7 -13 23 214
5329 214 -87 77 -147 -22 49 55 -27 -14 19 10 62 -178 -56 78 -34 154 44 -125 -3 -149 54 19 -126
5352 -126 -35 -169 28 38 -8 -38 -114 -58 -91 141 -74 143 75 74 66 101 200 98 -125 29 96 135 114 -31 -14 78
5378 78 57 21 -73 36 116 -196 73 -104 50 -97 -95 -88 6 -102 -225 9 13 -22 173 -15 92 63 7 161 -78
5403 -78 -38 -39 73 100 88 -45 -24 200 10 -86 9 13 -153 75 59 43 0 107 -50 -26 48 -107 97 -60 -63 23
5429 23 -15 -84 -156 18 45 157 -97 -2 -115 21 22 -144 53 -56 -76 48 21 27 97 -4 18 64 -63 78 -73
5454g3K9P7m4j10qQ8N2o0k4M6k5J19k1k24R4J67N3k58J08p2J83j77J87J16k7k6
5480A70j80L3Q8j86k1J71l7q0K9j4j52K66j86J08k1O0l0M8k0m1j47P1j8N1Q1j61
5506a18J24N0n7J67j15q3J19r6J55m2ML0m9j20P9r2K2K83j23n5j9j24kr7R3M8
5532a8P3j30J17j70j2J46j01P3p9K25p9j23J41o7M4K10k04j09K53j41o7N7j31
5555i2R9M3m6K2J2L0l0k7J2J14k06P7m9K0R3k30Q2m8P6jQ0r9J06m0o4K8p7J86
5583G1K9RJ04j61KJ5J03k9j6p5q4n9o9K38k5k45K58j7pr2K0PJ70k57K46j64p9
5610a07K9m8Q8K0r6K42qj42N6j03J93O8l12J19j7M8n7nO4km5O2k5r2P4r4O1l4
5638f3R8p1j9j44J43j8j43J46R5P5j45j11J43J2l0P2q7J85j08j53J22n5O5jl3
$$ plain form
5454 -73 -44 33 -11 -121 -129 -41 11 -49 -73 -27 -52 67 46 -178 -84 83 136 -122 -14 -86 97 -80 107 223 196 170
5480 170 -10 23 111 -75 -96 75 38 -42 -13 -27 -179 87 -99 9 -12 48 18 66 46 5 -142 -71 -89 -38 43 -118
5506 -118 6 56 -1 166 51 -32 87 -9 146 104 108 138 89 -31 48 -44 -22 261 138 83 64 -60 -62 -159 -66 -18
5532 -18 55 -75 42 -128 -140 6 -95 -22 -101 124 45 -78 63 -4 40 250 46 -63 190 49 -18 39 -92
5555 -92 7 50 4 26 38 68 38 11 23 137 -69 8 -41 -21 72 -158 -76 -124 -48 -49 31 -68 38 -2 -66 -38 -115 71
5583 71 100 109 213 52 54 69 172 143 127 52 -32 -91 -160 78 53 -192 66 49 42 -50 -30 -23 147 -110 136 -28 -107
5610 -107 -78 -126 -38 -18 -114 128 120 -22 34 -69 124 192 -120 -1 -18 30 -27 -32 32 30 -15 47 22 -70 4 -90 -29 -63
5638 -63 35 -36 -55 -199 -56 -74 -217 -71 24 99 -46 -157 -14 -2 -32 40 -47 138 30 -123 -1 -56 9 8 -25
5663b5J36p9Q4j19K1j36K10j58R0K2n0K11o8j34j13J31j66K10m3m3j1J96l96J51
5687g9L5Q9J29j24L2O3j00q7J74n3k2J42K3j67j48J14o8K5J62k29R8J2r4m8P5
5712d6J08j20P0Q6l7k72K15Q5k14J22K7p8K46r4j7L8Op1L2K7J07k91oL06k23L7
5738D3j37O4M2n3J12pj37K5J32n6p8nR7k4k87K81J15j76N3Oj32qM3P4K6k6Q9q7
$$ plain form
5663 -25 111 32 116 -3 18 -118 92 -66 24 46 -4 207 139 5 -108 23 -143 67 24 -19 -30 166 -230 -79
5687 -79 -44 45 174 50 82 145 45 -42 132 79 57 199 222 55 -93 21 -47 -22 140 -89 9 21 -73 -121 -46
5712 -46 62 -58 12 98 61 -211 4 89 -125 -3 24 -54 192 98 81 119 125 54 86 113 220 -71 -77 229 6 43
5738 43 -94 -30 12 -41 71 64 -73 -48 84 28 -50 -55 42 18 -269 12 127 -49 4 10 -122 -130 -87 -13 13 -13 76 -11
$$ [...]
8191d0
##END NTUPLES=NMR FID
##END=
