##TITLE=1H_CG-1201-5
 CDCl3
 8 sc, 
 10.9.2024
##JCAMPDX= 6.0         $$ Bruker NMR JCAMP-DX V2.0
##DATA TYPE= NMR SPECTRUM
##DATA CLASS= NTUPLES
##ORIGIN= UXNMR, Bruker Analytische Messtechnik GmbH
##OWNER= root
$$ XWIN-NMR		Version 3.5
$$ Tue Sep 10 14:05:56 2024 Russian Standard Time (UT+4h)  she@DPX200
##.OBSERVE FREQUENCY= 200.1318
##.OBSERVE NUCLEUS= ^1H
##.ACQUISITION MODE= SIMULTANEOUS
##.ACQUISITION SCHEME= undefined
##.AVERAGES= 8
##.DIGITISER RES= 18
##SPECTROMETER/DATA SYSTEM= spect
##.PULSE SEQUENCE= zg30
##.SOLVENT NAME= CDCl3
##.SHIFT REFERENCE= (INTERNAL, CDCl3, 0, 20.8945)
##AUDIT TRAIL= $$ (NUMBER, WHEN, WHO, WHERE, WHAT)
$$ ##TITLE= Audit trail, XWIN-NMR		Version 3.5
$$ ##JCAMPDX= 5.01
$$ ##ORIGIN= Bruker BioSpin GmbH
$$ ##OWNER= she
$$ F:/spectra/data/she/nmr/H-F/1/pdata/1/auditp.txt
$$ ##AUDIT TRAIL=  $$ (NUMBER, WHEN, WHO, WHERE, WHAT)
(   1,<2024-09-10 14:04:43.98 +0400>,<she>,<DPX200>,
      <created by zg, POWCHK disabled, PULCHK disabled
       configuration hash MD5:
       00 E9 B6 7A A2 85 ED C7 34 08 36 98 17 FE 4E 26
       data hash MD5: 16K
       63 57 62 50 4E AB DA 54 08 F3 3C A7 B0 79 03 84>)
(   2,<2024-09-10 14:04:46.37 +0400>,<she>,<DPX200>,
      <Start of raw data processing
       efp BC_mod = 2 LB = 0.24 FT_mod = 6 PKNL = 1 PHC0 = -25996.3 PHC1 = 15.38748 SI = 16K 
       data hash MD5: 16K
       F8 35 AD A7 AC 71 AC 50 0B 10 D0 A5 20 01 42 84>)
(   3,<2024-09-10 14:05:04.39 +0400>,<she>,<DPX200>,
      <pk PHC0 = -1.939869 PHC1 = 2 
       data hash MD5: 16K
       42 2D 42 BF FC 8D 4B F9 85 5A 11 83 91 53 DD EA>)
(   4,<2024-09-10 14:05:13.62 +0400>,<she>,<DPX200>,
      <abs ABSG = 5 
       data hash MD5: 16K
       FB 3E A8 76 B1 CD 74 52 AF 37 AD CC 53 17 67 AC>)
$$ ##END=
$$ 
$$ hash MD5
$$ 1E C2 60 82 BE 68 2A D5 C9 C7 AB D5 38 D5 C9 0D
##$RELAX= 
##$RELAX= 
##$RELAX= 
##$RELAX= 
##$RELAX= 
##$RELAX= 
$$ Bruker specific parameters
$$ --------------------------
##$DU= <F:/spectra>
##$EXPNO= 1
##$NAME= <H-F>
##$PROCNO= 1
##$TYPE= <nmr>
##$USER= <she>
##$AMP= (0..31)
100 100 100 100 100 100 100 100 100 100 100 100 100 100 100 100 100 100 
100 100 100 100 100 100 100 100 100 100 100 100 100 100 
##$AQSEQ= 0
##$AQ_mod= 1
##$AUNM= <au_zg>
##$AUTOPOS= <>
##$BF1= 200.13
##$BF2= 200.13
##$BF3= 200.13
##$BF4= 200.13
##$BF5= 200.13
##$BF6= 200.13
##$BF7= 200.13
##$BF8= 200.13
##$BYTORDA= 1
##$CFDGTYP= 0
##$CFRGTYP= 5
##$CHEMSTR= <none>
##$CNST= (0..31)
1 1 145 1 1 1 1 1 1 1 1 1 1 1 1 1 1 1 1 1 1 1 1 1 1 1 1 1 1 1 1 1 
##$CPDPRG= <>
##$CPDPRG1= <>
##$CPDPRG2= <>
##$CPDPRG3= <>
##$CPDPRG4= <mlev>
##$CPDPRG5= <mlev>
##$CPDPRG6= <mlev>
##$CPDPRG7= <mlev>
##$CPDPRG8= <mlev>
##$CPDPRGB= <>
##$CPDPRGT= <>
##$D= (0..31)
0 1.2 0 0 0 0 0 0 0 0.06 0 0.03 0 0 0 0 0.0002 0 0 0 0 0 0 0 0 0 0 0 0 
0 0 0 
##$DATE= 1725962683
##$DBL= (0..7)
120 120 120 120 120 120 120 120 
##$DBP= (0..7)
150 150 150 150 150 150 150 150 
##$DBP07= 0
##$DBPNAM0= <>
##$DBPNAM1= <>
##$DBPNAM2= <>
##$DBPNAM3= <>
##$DBPNAM4= <>
##$DBPNAM5= <>
$$ [...]
##$SUBNAM3= <"">
##$SUBNAM4= <"">
##$SUBNAM5= <"">
##$SUBNAM6= <"">
##$SUBNAM7= <"">
##$SUBNAM8= <"">
##$SUBNAM9= <"">
##$SW= 24.0689170037331
##$SWIBOX= (0..15)
0 0 2 0 0 0 0 0 0 0 0 0 0 0 0 0 
##$SW_h= 4816.95568400771
##$TD= 16384
##$TD0= 1
##$TE= 0
##$TE2= 300
##$TE3= 300
##$TEG= 300
##$TL= (0..7)
0 120 120 120 120 120 120 120 
##$TP= (0..7)
150 150 150 150 150 150 150 150 
##$TP07= 0
##$TPNAME0= <>
##$TPNAME1= <>
##$TPNAME2= <>
##$TPNAME3= <>
##$TPNAME4= <>
##$TPNAME5= <>
##$TPNAME6= <>
##$TPNAME7= <>
##$TPOAL= (0..7)
0.5 0.5 0.5 0.5 0.5 0.5 0.5 0.5 
##$TPOFFS= (0..7)
0 0 0 0 0 0 0 0 
##$TUNHIN= 0
##$TUNHOUT= 0
##$TUNXOUT= 0
##$USERA1= <user>
##$USERA2= <user>
##$USERA3= <user>
##$USERA4= <user>
##$USERA5= <user>
##$V9= 5
##$VALIST= <valist>
##$VCLIST= <CCCCCCCCCCCCCCC>
##$VD= 0
##$VDLIST= <DDDDDDDDDDDDDDD>
##$VPLIST= <PPPPPPPPPPPPPPP>
##$VTLIST= <TTTTTTTTTTTTTTT>
##$WBST= 1024
##$WBSW= 4
##$XGAIN= (0..3)
0 0 0 0 
##$XL= 0
##$YL= 0
##$YMAX_a= 573207
##$YMIN_a= -460928
##$ZGOPTNS= <>
##$ZL1= 120
##$ZL2= 120
##$ZL3= 120
##$ZL4= 120
##$ABSF1= 20.99291
##$ABSF2= -3.076221
##$ABSG= 5
##$ABSL= 3
##$ALPHA= 0
##$AQORDER= 0
##$ASSFAC= 0
##$ASSFACI= 0
##$ASSFACX= 0
##$ASSWID= 0
##$AUNMP= <proc_1d>
##$AZFE= 0.1
##$AZFW= 0.1
##$BCFW= 0
##$BC_mod= 2
##$BYTORDP= 0
##$COROFFS= 0
##$CY= -3
##$DATMOD= 1
##$DC= 0
##$DFILT= <>
##$DTYPP= 0
##$F1P= 0
##$F2P= 0
##$FCOR= 1
##$FTSIZE= 16384
##$FT_mod= 6
##$GAMMA= 0
##$GB= 0
##$INTBC= 1
##$INTSCL= 3.70164e-10
##$ISEN= 128
##$LB= 0.24
##$LEV0= 0
##$LPBIN= 0
##$MAXI= 10000
##$MC2= 0
##$MEAN= 0
##$ME_mod= 0
##$MI= 1.114404
##$NCOEF= 0
##$NC_proc= -6
##$NLEV= 6
##$NOISF1= 3.799351
##$NOISF2= 2.8
##$NSP= 0
##$NTH_PI= 0
##$NZP= 0
##$OFFSET= 20.89449
##$PC= 1
##$PHC0= -25998.24
##$PHC1= 17.38748
##$PH_mod= 1
##$PKNL= yes
##$PPARMOD= 0
##$PSCAL= 0
##$PSIGN= 0
##$REVERSE= no
##$SF= 200.130026863499
##$SI= 16384
##$SIGF1= 3
##$SIGF2= 2
##$SINO= 5.538805
##$SIOLD= 16384
##$SREGLST= <1H.CDCl3>
##$SSB= 0
##$STSI= 16384
##$STSR= 0
##$SW_p= 4816.95568400771
##$SYMM= 0
##$S_DEV= 0
##$TDeff= 16384
##$TDoff= 0
##$TI= <>
##$TILT= no
##$TM1= 0
##$TM2= 0
##$TOPLEV= 0
##$USERP1= <user>
##$USERP2= <user>
##$USERP3= <user>
##$USERP4= <user>
##$USERP5= <user>
##$WDW= 1
##$XDIM= 16384
##$YMAX_p= 290463755
##$YMIN_p= -1646417
$$ End of Bruker specific parameters
$$ ---------------------------------
##NTUPLES= NMR SPECTRUM
##VAR_NAME=  FREQUENCY,     SPECTRUM/REAL,   SPECTRUM/IMAG
##SYMBOL=    X,             R,               I
##VAR_TYPE=  INDEPENDENT,   DEPENDENT,       DEPENDENT
##VAR_FORM=  AFFN,          ASDF,            ASDF
##VAR_DIM=   16384,         16384,           16384
##UNITS=     HZ,            ARBITRARY UNITS, ARBITRARY UNITS
##FACTOR=    0.29402158847633, 1,            1
##FIRST=     4181.61470257259, 0,            0
##LAST=      -635.34098143512, 0,            0
##MIN=       -635.34098143512, -1646417,     0
##MAX=       4181.61470257259, 290463755,    0
$$ Real data points
##PAGE= N=1
##DATA TABLE= (X++(R..R)), XYDATA
$$ [...]
6346A30713k35874N8775J12154j30395l9754J33730k855p0451J5166m3548J62625
$$ 130713 -105161 -46386 65768 -64627 -104381 29349 26494 -43957 -28791 -72339 90286
6335I0286l7031o6663N5753J75974l3634j62933J4060O6820J6379m7305P3326
$$ 90286 53255 -13408 42345 218319 184685 21752 35812 102632 119011 71706 145032
6324A45032o2118j13598Q9440J37729r352l5150k9162K6543J34217p9768j21533
$$ 145032 82914 -30684 58756 196485 187133 151983 122821 149364 283581 203813 82280
6313H2280L1125j00861L8103K1947q0640R7666J00179j8383j13354r2165J02321
$$ 82280 113405 12544 50647 72594 -8046 89620 189799 171416 58062 -34103 68218
6302F8218P2710J0716j36790l6937J66641n879k02974J73660Q381O5722p6325
$$ 68218 140928 151644 14854 -22083 144558 138679 -64295 109365 117746 183468 107143
6291A07143o7281R1510j53144N3106O0136l6671O3307j01907J25548L7992r0167
$$ 107143 39862 131372 -21772 31334 91470 54799 118106 16199 141747 179739 89572
6280H9572N4088k1947J96720p8972p8085R9621k3415j35619J62872r4967m5335
$$ 89572 143660 121713 318433 239461 161376 260997 237582 101963 264835 169868 124533
6269A24533n8535L6504r6705J86886r7704J1526Q0445P4058k06444j30515M4225
$$ 124533 65998 102502 5797 192683 94979 106505 186950 261008 54564 -75951 -31726
6258c1726J20147K5412K4295l0962j2379n5158K4898o0533n5206J58446n0138
$$ -31726 88421 113833 138128 107166 94787 39629 64527 3994 -51212 107234 57096
6247E7096O2182r7820J00172Q309j06020Q3636m2923k0639P0719P8921j6411J25053
$$ 57096 119278 21458 121630 129939 23919 107555 64632 43993 114712 193633 177222 302275
6235C02275r5505k29131o131K10031J64877j47743j15666J61239L3119k07923
$$ 302275 206770 -22361 -28492 181539 346416 198673 83007 244246 277365 69442
6225F9442K5813J44116p6610N475J65432r558q7607j21218M3686R4576q8815J4026
$$ 69442 95255 239371 162761 168236 333668 324110 236503 115285 158971 253547 164732 178758
6213A78758P9160j02216Q7150K7107j1161m0795m9876j41719L5971Q5720j01737
$$ 178758 257918 155702 242852 269959 258798 218003 168127 26408 62379 148099 46362
6202D6362L4795q7166O1540J14796K1918j23834J8818P1853j57233m13o8041l0852
$$ 46362 81157 -6009 55531 170327 192245 68411 87229 159082 1849 1436 -66605 -97457
6190i7457N1191J06879n6799N2359r5424P4104l260Q7804q2307q1592L9673p269
$$ -97457 -46266 60613 3814 56173 -39251 34853 31593 119397 37090 -44502 -4829 -12098
6178a2098J05389J30220j04536K2999K1447l4398j36455J5196O4961k9049j13991
$$ -12098 93291 223511 118975 141974 163421 129023 -7432 7764 72725 43676 -70315
6167g0315K1606N1431R455R151p0263Q0461L07908k80983j83851K22103l7258
$$ -70315 -48709 2722 12177 21328 -48935 31526 339434 58451 -125400 96703 59445
6156E9445j96286J6600q5617K03836J20717l4382K40943l86128j8943K1339p7874
$$ 59445 -136841 -120241 -205858 -2022 118695 84313 325256 -60872 -79815 -58476 -136350
6145a36350O5606q8404O0981j8647N6549o054p6053N1594N4415j13634L8611N6527
$$ -136350 -70744 -159148 -98167 -116814 -60265 -66319 -142372 -90778 -36363 -149997 -111386 -54859
6133e4859k2511J9749j29664P3315L4532l0670m7916L3491J7585j8336J74887
$$ -54859 -77370 -57621 -187285 -113970 -79438 -110108 -158024 -124533 -106948 -125284 49603
6122D9603l6254k0590L190J7721l512p4147p905K7230p8742P8441O8612l0082
$$ 49603 13349 -7241 -4051 13670 10158 -63989 -71894 -44664 -123406 -44965 23647 -6435
6110f435J31770j09518j86818J25502Q3375j96293J17873L6880L4241n6823l8376
$$ -6435 125335 15817 -171001 -45499 37876 -158417 -40544 -3664 30577 -26246 -64622
6099f4622j43582P4974J16509r5603L1884J17573k127j7599j66304M8625J52091
$$ -64622 -208204 -133230 -16721 -112324 -80440 37133 35006 17407 -148897 -100272 51819
6088E1819j2284n9630Q9168j07974K4991K31748j50165j24392M9030j33220J46652
$$ 51819 39535 -20095 69073 -38901 -13910 217838 67673 -56719 -7689 -140909 5743
6077E743O0782j54037k11579K03521J128m5063L4062n7240O3439O1283O6261m1981
$$ 5743 66525 -87512 -299091 -95570 -94442 -139505 -105443 -162683 -99244 -37961 28300 -13681
6065a3681n1290M7278q6572o4499k2562P357J01503q9302J45757m7104K4696K7969
$$ -13681 -64971 -17693 -104265 -168764 -191326 -183969 -82466 -171768 -26011 -73115 -48419 -20450
6053b0450q8232q99J6298n9402J8141J56083Q9537p6412k11629m8255R7147j7646
$$ -20450 -108682 -109581 -93283 -152685 -134544 21539 111076 34664 -176965 -225220 -128073 -145719
6041a45719L3495q986l1049J63613Q533O590O6690r5290J44106p0073j48853n4601
$$ -145719 -112224 -121210 -152259 11354 19887 26477 93167 -2123 141983 71910 -76943 -131544
6029a31544Q6039J45873N3670m0821r8475O8698J4910k7259N1243J6647N4681
$$ -131544 -45505 100368 154038 113217 14742 83440 98350 71091 122334 138981 193662
6018A93662j44320L5953N4443q242j62739m5831N0928L6877J33421n381p1556
$$ 193662 49342 85295 139738 131496 -31243 -77074 -26146 10731 144152 138771 67215
6007F7215p435L9383L2887m8031J0896Q7625L0584O4606m2388j27258N9423J8917
$$ 67215 59780 99163 132050 84019 94915 182540 213124 277730 235342 108084 167507 186424
5995A86424l7335L4331o6001k1558Q3540R5619k16862O8735J9352n1584L9858
$$ 186424 149089 183420 117419 95861 179401 275020 58158 126893 146245 94661 134519
5984A34519R4364j85533n6373P7017K27184n9558O0328j00989r1275M2623M42
$$ 134519 228883 43350 -13023 63994 291178 231620 291948 190959 99684 142307 142749
5973A42749r3977O4343J65273j23616j3856o4119L1436M5742p539m6068J76196
$$ 142749 48772 113115 278388 154772 140916 76797 108233 153975 146436 100368 276564
5962B76564q642k15243k5368M0283o6355N0929R4853J7526p4741j7380j7476J1955
$$ 276564 267922 52679 27311 67594 1239 52168 147021 164547 89806 72426 54950 66905
5950F6905o9747m0270J35574O6198K6799n5192J26420J07906k08460o0250J7076
$$ 66905 -2842 -43112 92462 158660 185459 130267 256687 364593 156133 95883 112959
5939A12959o9421K1799J43904j5148r3437J12010J3404j5209j29429j228J87553
$$ 112959 43538 65337 209241 194093 100656 212666 226070 210861 81432 80204 267757
5928B67757r8425j721j46569p9640P8431J69713j83130M5651J94770j69627K7931
$$ 267757 169332 167611 21042 -58598 19833 189546 6416 52067 246837 77210 105141
5917A05141K1797j38549L5854p7293K20198l5748j41337J72525m6203j02903P5412
$$ 105141 126938 -11611 24243 -53050 167148 131400 -9937 162588 116385 13482 88894
5906H8894O9352M8338J2353k405r2305k207j7904m1456L4849m0626q0363k8633
$$ 88894 158246 206584 218937 216532 124227 122020 104116 62660 97509 56883 -23480 -52113
5894e2113J5143K5616j3856j0930l8941J26310O1245j33562j45505O9660K5300
$$ -52113 -36970 -11354 -25210 -36140 -75081 51229 112474 -21088 -166593 -96933 -71633
5883g1633n72K06916n2480k66999r328K05961M9876l9291k29422N1322P574P7247
$$ -71633 -72205 134711 82231 -184768 -194096 11865 61741 22450 -206972 -155650 -148076 -70829
5871g0829j90375j47913J24994J1449P9953J61006O8961r8405l2035P6014L0631
$$ -70829 -261204 -409117 -284123 -272674 -192721 -31715 37246 -61159 -93194 -17180 13451
5860A3451j34735N0793j17910J17552j7646N8183L0789p4685K7024o7656J08405
$$ 13451 -121284 -70491 -188401 -70849 -88495 -30312 477 -74208 -47184 -114840 -6435
5849f435j60m0062R0339j33863J01746o1022K0211r1267j2430l4569j67484K11024
$$ -6435 -6595 -46657 43682 -90181 11565 -49457 -29246 -120513 -132943 -167512 -334996 -123972
5837a23972J29460q7774r2915J75799r2377m2784o7397q0207J80438J44074q1123
$$ -123972 5488 -82286 -175201 598 -91779 -134563 -201960 -282167 -101729 42345 -38778
5826c8778Q4754j51540j18691N3609J17797j4058P5707p0438R027q4665K2948
$$ -38778 45976 -105564 -224255 -170646 -52849 -66907 8800 -61638 -52611 -137276 -114328
5815a14328K5052o3860N5823P1747r868q3806Q4057L8879n8572M649O0352r1928
$$ -114328 -89276 -153136 -97313 -25566 -35434 -119240 -35183 3696 -54876 -50227 10125 -81803
5803h1803p1269O040o2812L4731L5103K8639J70063j45961j23806P3032R5120
$$ -81803 -153072 -147032 -209844 -175113 -140010 -111371 58692 -87269 -211075 -138043 -42923
5792d2923n024L8815M6559p0280J8709j4756J18501l0400j78553m2233k4574l0477
$$ -42923 -47947 -9132 37427 -32853 -14144 -28900 89601 59201 -119352 -161585 -186159 -216636
5780b16636J10606n0882L6563P4996J43654n2972n3593k18135J85774K03946j37795
$$ -216636 -106030 -156912 -120349 -45353 98301 45329 -8264 -226399 -40625 163321 25526
5769B5526r5439J29186Q2068l0014n0876K5140L0193n6507k03284K9609J1169
$$ 25526 -69913 59273 141341 111327 60451 85591 115784 59277 -144007 -114398 -103229
5758a03229L8352L7670o5357n1856k9019M9892j8916J21699l806K3298l4031o006
$$ -103229 -64877 -27207 -92564 -144420 -173439 -123547 -142463 -20764 -24570 -1272 -35303 -41309
5746d1309N233L4045l1333n309P247L6762n9513j881L3741L3917m2073J4316j71317
$$ -41309 -36076 -2031 -33364 -38673 -31426 5336 -54177 -56058 -22317 11600 -30473 -16157 -187474
5733a87474O8272O3859P516m2992L0618Q6887j14295J8735P3706N7374j92528
$$ -187474 -119202 -55343 -47827 -90819 -60201 26686 -87609 -68874 4832 62206 -130322
5722a30322R9623J4922k17R226r9111k4689q502K7368l0249K2480K2651j79l1581
$$ -130322 -30699 -15777 -15994 -6768 -105879 -130568 -139070 -111702 -141951 -119471 -96820 -96999 -128580
5709a28580j067Q7329J34985k71343P5454L4909K0591J9630R868o6927m931Q4282
$$ -128580 -129647 -42318 92667 -178676 -103222 -68313 -47722 -28092 -18224 -85151 -90082 -5800
5697e800j65954O8224M4898J2799J99267j4616j09852J46835q4622r2562M2379
$$ -5800 -171754 -103530 -58632 -45833 153434 138818 28966 175801 91179 -1383 40996
5686D0996J9485m7138j16785j6291P3297J91604m565J34805j50579k00396n2592
$$ 40996 60481 13343 -103442 -119733 -46436 145168 140603 275408 124829 -75567 -128159
5675a28159J29723O1423k9819O6817j32674J26376r92N5916L8360q3783n0772
$$ -128159 1564 62987 33168 99985 -32689 93687 92695 148611 186971 103188 52416
5664E2416p630J3254j51052J86937p4141J2771k5547R4443n1956q2085O5389j54155
$$ 52416 44786 58040 -93012 93925 19784 32555 7008 101451 49495 -32590 32799 -121356
5652a21356J79738Q4391k361K6607J4729j5947q8380P9660o3257L7756Q8151j90859
$$ -121356 58382 142773 140412 167019 181748 165801 77421 157081 93824 131580 219731 28872
5640B8872l3662M0288m7957k3347k2339J34987L1498j45401K47481j4747k9209
$$ 28872 -4790 35498 -12459 -35806 -58145 76842 108340 -37061 210420 195673 166464
5629A66464j6025l6381O1192q1381n3036J64920k6594O7425O8087o1406P179J08858
$$ 166464 150439 114058 175250 93869 40833 205753 179159 246584 314671 253265 260444 369302
5617C69302l2115k12273L7383K8108l2367q1551J55089m7954j13801L9639l3225
$$ 369302 337187 124914 162297 190405 158038 76487 231576 183622 69821 109460 76235
5606G6235P1419J3589j04230M1029J01394r168l9620J79208j39244n2771O569
$$ 76235 147654 161243 57013 98042 199436 190268 150648 329856 190612 137841 144410
5595A44410J15446j05354l2990o0404r8286J31206L4967n873P1735n4932r6634
$$ 144410 259856 154502 121512 61108 -37178 94028 128995 123122 194857 139925 43291
5584D3291O2045m9067J83421m2305m1627j07379r574L4498K9043k6106J22994
$$ 43291 105336 56269 239690 197385 155758 48379 38805 73303 102346 76240 199234
5573A99234L54M2979k4882k20977M0130q156k1611J14700K8136k466j13698J68540
$$ 199234 199588 242567 217685 -3292 36838 28682 7071 121771 149907 147441 33743 202283
5561B02283J6347j76223k5812K21328J3296L7581J4063n0566r0316N4935p4192
$$ 202283 218630 42407 16595 237923 251219 288800 302863 252297 161981 216916 142724
5550A42724m0206k614O2236N6112k02924R0779O8408o0209K6530K10874o1873
$$ 142724 102518 99904 162140 218252 15328 106107 174515 114306 140836 351710 289837
5539B89837j18693k4646Q3199J4120j6197j53041J2558K03728m2084J0858L1008
$$ 289837 171144 146498 229697 243817 227620 74579 87137 290865 248781 259639 290647
5528B90647P420p1334R4617l6054j88750R7433J02197L1003n712j68067Q8292
$$ 290647 298067 226733 321350 285296 96546 193979 296176 327179 321467 153400 241692
5517B41692M3260J70699q1461m7858q9502l0520L4770j9762P9913K839L2500o1335
$$ 241692 284952 455651 374190 326332 236830 206310 241080 221318 301231 304070 336570 275235
5505B75235n8918J04090R3032l4492j5838K1187o511O0344n5857l9209K4399O3335
$$ 275235 216317 320407 413439 378947 363109 384296 377785 438129 382272 343063 367462 430797
5493D30797J11513Q5042q9754p7332K6910q3791K1103N358M8518J0644J7580l8195
$$ 430797 542310 627352 537598 460266 487176 403385 424488 429846 478364 489008 506588 468393
5481D68393P0625q109J4285K2175K6252L1264J6921j33996K17603Q1212J3720
$$ 468393 539018 530909 545194 567369 593621 624885 641806 507810 725413 806625 820345
5470H20345K3127o5918R525K9351P7382J92063N9485r6655o3218N9503J12968
$$ 820345 843472 777554 787079 816430 893812 1085875 1145360 1048705 985487 1044990 1157958
5459A157958O9713j09067K1597J78846J51401o6511O8305J71861j46433j10726
$$ 1157958 1227671 1118604 1140201 1319047 1470448 1403937 1472242 1644103 1497670 1386944
5449A386944J71095r3618p8663N7117n9264r162J11376M9765M3837p2503j66921
$$ 1386944 1558039 1464421 1385758 1442875 1383611 1374449 1485825 1535590 1579427 1506924 1340003
5438A340003r7570l7702p476n0883P8821N7758j00813R0997m2676o560L2792Q0271
$$ 1340003 1242433 1204731 1197255 1146372 1225193 1282951 1182138 1273135 1230459 1223899 1256691 1336962
5426A336962J57682j26174j42493J65230j871j27445J59816p7342n0880P6702
$$ 1336962 1494644 1368470 1225977 1391207 1389336 1261891 1421707 1344365 1293485 1370187
5416A370187J9925r4350j9112L0583O3404P9262k2767j42844q1095L2611n4872
$$ 1370187 1390112 1295762 1276650 1307233 1370637 1449899 1427132 1284288 1203193 1235804 1180932
5405A180932P7134n3963q3028J91236p5386j46323o1106P2931M0878K899J39578
$$ 1180932 1258066 1204103 1121075 1312311 1236925 1090602 1029496 1102427 1143305 1146204 1285782
5394A285782j54234k08728r226n6943J07076J04556k6972Q596l3997M4467l8860
$$ 1285782 1131548 922820 913594 856651 963727 1068283 1041311 1049907 1015910 1060377 1021517
5383A021517O4261r0884M3854P0862j28242N3709K1079j18355P9893M6781Q5634
$$ 1021517 1085778 994894 1038748 1109610 981368 1035077 1056156 937801 1017694 1064475 1150109
5372A150109N5588m8837j17010J1154O8979n6135J21838J521m1723J1112P1134
$$ 1150109 1205697 1156860 1039850 1051004 1119983 1063848 1185686 1187207 1145484 1156596 1227730
5361A227730l4666J86991j69997l7181K942j8777Q7096L6680J3063p4847P9585
$$ 1227730 1193064 1380055 1210058 1172877 1175819 1157042 1244138 1280818 1293881 1219034 1298619
5350A298619n2388j26106j6736J19861k944K4982J10758j90090J3977J20472K3266
$$ 1298619 1246231 1120125 1103389 1223250 1220306 1245288 1356046 1165956 1179933 1300405 1323671
5339A323671K3874P3257k8280k7857j18080J04494p3242P1662M7680M0601q019
$$ 1323671 1347545 1420802 1392522 1364665 1246585 1351079 1277837 1349499 1397179 1437780 1429761
5328A429761o6743l8232J31803o0986M721J5312k01735n7589P7475j493r5619
$$ 1429761 1363018 1324786 1456589 1395603 1400324 1415636 1213901 1156312 1233787 1232294 1136675
5317A136675J75916j8968L96L7276L9475O3789J64502j21929N0390O738k9815
$$ 1136675 1312591 1293623 1294019 1331295 1370770 1434559 1599061 1477132 1527522 1534260 1504445
5306A504445j7933j38000J6293r573Q1053P5553n7832K8261K0998n8354o4166
$$ 1504445 1486512 1348512 1364805 1355232 1436285 1511838 1454006 1482267 1503265 1444911 1380745
5295A380745K69282l1720o5322M0300J8326M5827O2840R5219q4031j66101o6236
$$ 1380745 1650027 1618307 1552985 1593285 1611611 1657438 1720278 1815497 1731466 1565365 1499129
5284A499129J00723n0981q7872J76350o9649N3149J9114m0654N5253R4934J41050
$$ 1499129 1599852 1548871 1460999 1637349 1567700 1620849 1639963 1599309 1654562 1749496 1890546
5273A890546j06242J52700O5114M8118O5040k7420p3280q5142L2573J2542L1956
$$ 1890546 1784304 1937004 2002118 2050236 2115276 2087856 2014576 1929434 1962007 1974549 2006505
5262B006505K2552p4296j22211j8962o7751M3355l8603J49649K2429J1637N4757
$$ 2006505 2029057 1954761 1832550 1813588 1745837 1789192 1750589 1900238 1922667 1934304 1989061
5251A989061J01993J8478r5610j4024P3581J18103j06295q1132j26224q7292r6847
$$ 1989061 2091054 2109532 2013922 1999898 2073479 2191582 2085287 2004155 1877931 1790639 1693792
5240A693792P1735j71076J41654P6663j12100r3922J9856O5720j46203K0477O856
$$ 1693792 1765527 1594451 1736105 1812768 1700668 1606746 1626602 1692322 1546119 1566596 1573452
5229A573452J8642j384O763o66K13711m6476j92677j20389q5062J61960j0201
$$ 1573452 1592094 1590710 1597473 1596807 1810518 1764042 1571365 1450976 1365914 1527874 1517673
5218A517673j14936O939j9783r1694n592O7330J8268n0019J05725K6140J0238
$$ 1517673 1402737 1409676 1389893 1298199 1292607 1359937 1378205 1328186 1433911 1460051 1470289
5207A470289k59j12159K562J35413j22752m4230M9414R345j89599j49150J65758
$$ 1470289 1470030 1357871 1360433 1495846 1373094 1328864 1378278 1387623 1198024 1048874 1214632
5196A214632L181J01355j1593l6457l6326k437J31765K7365L5649n1128P5213
$$ 1214632 1217813 1319168 1307575 1271118 1234792 1232355 1364120 1391485 1427134 1376006 1451219
5185A451219R801o7748N5286o5513J7538J51030j5102q9162j4793K6254Q5849
$$ 1451219 1461020 1393272 1448558 1383045 1400583 1551613 1536511 1447349 1432556 1458810 1544659
5174A544659J47538L0898r6874l4182J02924n8980J30339n0514l7180R0339J28531
$$ 1544659 1692197 1723095 1626221 1592039 1694963 1635983 1766322 1715808 1678628 1768967 1897498
5163A897498M0423J90368m5528J6692N7591k3098r1203K9075L8603O5224j9696
$$ 1897498 1937921 2128289 2082761 2099453 2157044 2133946 2042743 2071818 2110421 2175645 2155949
5152B155949m88M23j5584J97121p1872j04015L6275K51896J06953O2280O0033
$$ 2155949 2155461 2155884 2140300 2337421 2265549 2161534 2197809 2449705 2556658 2618938 2678971
5141B678971R8451J59733R5459R1789L7485O1029J07521j68611J71336K0937J054
$$ 2678971 2777422 2937155 3032614 3124403 3161888 3222917 3330438 3161827 3333163 3354100 3355154
5130C355154n743R5421J35202J9998M0907K34243O9623K45421N1815J77822J56146
$$ 3355154 3349411 3444832 3580034 3600032 3640939 3875182 3944805 4190226 4242041 4419863 4576009
5119D576009L30003J27160K67078R5675Q0745n9981M4269J6321N620r073n3363
$$ 4576009 4906012 5033172 5300250 5395925 5476670 5416689 5460958 5477279 5482899 5473826 5420463
5108E420463q3883R3694J00541K21444J24780Q4513J82557J97824M24305L51878
$$ 5420463 5336580 5430274 5530815 5752259 5877039 5961552 6144109 6341933 6766238 7118116
5098G118116M16235L53022J52131j15438q5953j67906r872r0376m6218j6088q1235
$$ 7118116 7534351 7887373 8039504 7924066 7838113 7670207 7660335 7569959 7523741 7507653 7426418
5087G426418j59163r3664k69450L9823P6013N9509J56660J16209J69552L00863
$$ 7426418 7267255 7173591 6904141 6943964 7019977 7079486 7236146 7352355 7521907 7822770
5077G822770P1992M691j13519J82790M2185J28091P5224J90745q889j63029k11921
$$ 7822770 7894762 7899453 7785934 7968724 8010909 8139000 8214224 8404969 8396080 8233051 8021130
5066H021130l29702l31202l72693l7976j58070j55969j29462k6052K9398n4267
$$ 8021130 7691428 7360226 6987533 6949557 6791487 6635518 6506056 6480004 6509402 6455135
5056F455135L4393N2183n1773J83390J44087J43672J76699K3806o1976j81999
$$ 6455135 6489528 6541711 6489938 6673328 6817415 6961087 7137786 7161592 7099616 6917617
5046F917617J7148j13307K0525k610j8376j36938J3827j10790o0393L5760p0627
$$ 6917617 6934765 6821458 6841983 6839373 6820997 6684059 6697886 6587096 6526703 6562463 6491836
5035F491836K5371o3298L5442J38997L1785K56270Q9061l5935k843L2045J35388
$$ 6491836 6517207 6453909 6489351 6628348 6660133 6916403 7005464 6969529 6966686 6998731 7134119
5024G134119m9064Q8578J0837m3617J9781K9289J4410N1619J55329l3402K03216
$$ 7134119 7085055 7173633 7184470 7140853 7160634 7189923 7204333 7255952 7411281 7377879 7581095
5013G581095P743q0081K47324R3059L2466N3047J41722R5279o4705J31632J72289
$$ 7581095 7588838 7508757 7756081 7849140 7881606 7934653 8076375 8171654 8106949 8238581 8410870
5002H410870Q5684P9543K28927J56610j43576J52296J52769J26664J96493R0351
$$ 8410870 8496554 8576097 8805024 8961634 8818058 8970354 9123123 9249787 9446280 9536631
4992I536631m6935K34669J18227Q2836R0061L02052J41267J01628K88738L23501
$$ 9536631 9489696 9724365 9842592 9925428 10015489 10317541 10458808 10560436 10849174 11172675
4982A1172675M01228K51549L53888L19021J10177J81048M50945K24119J01227
$$ 11172675 11573903 11825452 12179340 12498361 12608538 12789586 13240531 13464650 13565877
4973A3565877K06100J33958J81831K31960J50297M33380M22278L83509K69690
$$ 13565877 13771977 13905935 14087766 14319726 14470023 14903403 15325681 15709190 15978880
4964A5978880M71355L43938M74071L59106N37555N40872M74948N73798M65104
$$ 15978880 16450235 16794173 17268244 17627350 18164905 18705777 19180725 19754523 20219627
4955B0219627N43771L63327O14555N83873O58213N62182P51380O38939Q63321
$$ 20219627 20763398 21126725 21741280 22325153 22983366 23545548 24296928 24935867 25799188
4946B5799188R05160R48304R57805J137143J492957J348059J489751J706109J894548
$$ 25799188 26704348 27652652 28610457 29747600 31240557 32588616 34078367 35784476 37679024
4937C7679024K011241K117576K325473K762823L121873L778032M188408M742816
$$ 37679024 39690265 41807841 44133314 46896137 50018010 53796042 57984450 62727266
4929F2727266N042838M653729L594689J136845p29003j785237j778129j251129
$$ 62727266 67770104 72423833 76018522 77155367 76426364 74641127 72862998 71611869
4921G1611869l90884M30935J271042J874464K583216L423689M120572M944521
$$ 71611869 71220985 71651920 72922962 74797426 77380642 80804331 84924903 89869424
4913H9869424N868493P127719Q718635J0363427J1493907J1928541R939417N078984
$$ 89869424 95737917 102865636 111584271 121947698 133441605 145370146 155309563 160388547
4905A60388547q98172m359984m186641l140417k935502l651319m465876m872097
$$ 160388547 159490375 155130391 150943750 147803333 144867831 141216512 136750636 131878539
4897A31878539m514755l459637k110918r18186P56228K520425L868832N374678
$$ 131878539 127363784 123904147 121793229 120875043 121631271 124151696 128020528 133395206
4889A33395206O864996P724648P324879N977696M633183M465524N147344M852960
$$ 133395206 140260202 147984850 155309729 161287425 165920608 170386132 175533476 180386436
4881A80386436K094269l313270r231098j2647999j3266638j2481594j0532735
$$ 180386436 182480705 179167435 169936337 157288338 144021700 131540106 121007371
4874A21007371q588608o650230n145561l737818k539865j693171r53717j15399
$$ 121007371 112418763 105768533 100622972 96885154 94345289 92652118 91698401 91583002
4866I1583002P38639J702011K932799L645427K965032P10995k620797n368820
$$ 91583002 92321641 94023652 96956451 100601878 103566910 104277905 101657108 96288288
4858I6288288p011806p433567o926127o278817n327941m466054m026997l523665
$$ 96288288 89276482 81842915 74916788 68637971 63310030 58843976 54816979 51293314
4850E1293314k981388k744688k666152k594572k137298k014982j801792j385403
$$ 51293314 48311926 45567238 42901086 40306514 38169216 36154234 34352442 32967039
4842C2967039j292134j035655r01423q69059o34275n57651n61577m28131q92106
$$ 32967039 31674905 30639250 29737827 28868768 28234493 27676842 27115265 26687134 25795028
4833B5795028j007685j078571j030092r19251r69196o16716p10657o82812o04284
$$ 25795028 24787343 23708772 22678680 21759429 20790233 20173517 19462860 18780048 18175764
4824A8175764m30329n55055m84364k49109k60051l78937j04133l60596k81259
$$ 18175764 17745435 17190380 16706016 16456907 16196856 15817919 15713786 15353190 15071931
4815A5071931j02950l24389o79621l14568k35393m51436l85369l68085l05268
$$ 15071931 14968981 14644592 13964971 13650403 13415010 12963574 12578205 12210120 11904852
4806A1904852l13295k90040k46201k79286j15144l56431j83350j2677j94500k98548
$$ 11904852 11591557 11301517 11055316 10776030 10660886 10304455 10121105 10108428 9913928 9615380
4796I615380l3074m3462j83256p6741k70590m7701K5056k01148k59962j6043l1392
$$ 9615380 9582306 9538844 9355588 9278847 9008257 8960556 8985612 8784464 8524502 8508459 8477067
4785H477067o8582k05314l09046m4746o2237J1857n3599j8045k12831L6793J3114
$$ 8477067 8408485 8203171 7894125 7849379 7787142 7798999 7745400 7727355 7514524 7551317 7564431
4774G564431m0048k9044j40977j75149J00005j54041J1543Oj66199j66869L8336
$$ 7564431 7524383 7495339 7354362 7179213 7279218 7125177 7136720 7136726 6970527 6803658 6841994
4763F841994p595n5946J3787j47034P878j4408J80253m9956J23662j62393m0281
$$ 6841994 6834399 6778453 6792240 6645206 6653084 6638676 6818929 6768973 6892635 6730242 6689961
4752F689961j35773n1369n8181j06882J30602r4088j94963M3616K6978J41253
$$ 6689961 6554188 6502819 6444638 6337756 6468358 6374270 6179307 6222923 6249901 6391154
4742F391154k02231j03080n751R597J23360j35825J33478n0406J1430M9721n0649
$$ 6391154 6188923 6085843 6080092 6089689 6213049 6077224 6210702 6160296 6171726 6221447 6170798
4731F170798L3119J7362O1938r4861M5210l9979n6276o8640k2413J3446K01396
$$ 6170798 6203917 6221279 6283217 6188356 6233566 6193587 6137311 6068671 6046258 6059704 6261100
4720F261100Q6877r7899M0436J6754j28294K55650j5653q3833j05970R3957K60791
$$ 6261100 6347977 6250078 6290514 6307268 6178974 6434624 6418971 6335138 6229168 6323125 6583916
4709F583916L4263j09820N0827J01601J09358K44728j33295K18909n8753O5038
$$ 6583916 6618179 6508359 6559186 6660787 6770145 7014873 6881578 7100487 7041734 7106772
4699G106772J18059K9598K95930l2860J76410J22581J35393R7318J91209Q9115
$$ 7106772 7224831 7254429 7550359 7517499 7693909 7816490 7951883 8049201 8240410 8329525
4689H329525Q0075J77914J48145J74760J78426J32103K56161K43889K16809M31678
$$ 8329525 8409600 8587514 8735659 8910419 9088845 9220948 9477109 9720998 9937807 10369485
4679A0369485M72572M56808L38353L41071J72012K17702p2652m5045K3023k6P1636
$$ 10369485 10842057 11298865 11637218 11978289 12150301 12368003 12295351 12250306 12273329 12273303 12344939
4668A2344939J70298J53613L34634K52191K17348M25564M96113M78840M15858
$$ 12344939 12515237 12668850 13003484 13255675 13473023 13898587 14394700 14873540 15289398
4659A5289398N26109O01273P24938O18581L49674j81620l94069m03046m48447
$$ 15289398 15815507 16416780 17141718 17760299 18109973 17928353 17534284 17131238 16682791
4650A6682791m25004j28746j37018K1838J00849N8405J38768K05481M44423J91510
$$ 16682791 16257787 16129041 15992023 16013861 16114710 16173115 16311883 16517364 16961787 17153297
4640A7153297M15639M25433N11830O65029M38471Q278j98779l77472k86621k30137
$$ 17153297 17568936 17994369 18506199 19171228 19609699 19617977 19419198 19041726 18755105 18524968
4630A8524968l85159q7708k6263K893M2850J22222J23104Q1428K88672K93400
$$ 18524968 18139809 18052101 18025838 18028731 18071581 18193803 18316907 18398335 18687007 18980407
4620A8980407J14708L53091L35899M15618K18196L46222L46056J74369L50994
$$ 18980407 19095115 19448206 19784105 20199723 20417919 20764141 21110197 21284566 21635560
4611B1635560K36016M53682K83982M59344M38485N66578M23428M29114P96221
$$ 21635560 21871576 22325258 22609240 23068584 23507069 24073647 24497075 24926189 25722410
4602B5722410O16187N48764O59642P01494P86913P52450N95489Q27654R72946
$$ 25722410 26338597 26887361 27547003 28248497 29035410 29787860 30383349 31211003 32183949
4593C2183949J156932J105448J355464J358728J513625J800611J787895J937340
$$ 32183949 33340881 34446329 35801793 37160521 38674146 40474757 42262652 44199992
4585D4199992K044631K335892K650815L086807L269803L828549M652006N303476
$$ 44199992 46244623 48580515 51231330 54318137 57587940 61416489 66068495 71371971
4577G1371971O031667O657309O448996N186522K369057q67584k603472k755223
$$ 71371971 77403638 84060947 90509943 95696465 98065522 97197938 94594466 91839243
4569I1839243j773845p50543L92623J527405K356173L535947M419919N312432
$$ 91839243 90065398 89314855 89707478 91234883 93591056 97127003 101546922 106859354
4561A06859354O722824Q242767J0107716J2436211J4921994J6818478J6891823
$$ 106859354 113582178 121824945 131932661 144368872 159290866 176109344 193001167
4554A93001167J2419382K218298q272794j3454419j3942238j2612658j0197038
$$ 193001167 205420549 207638847 199366053 185911634 171969396 159356738 149159700
4547A49159700p607815n164568l067039j217730Q4279J650075L260324N295538
$$ 149159700 141551885 136387317 133320278 132102548 132186827 133836902 137097226 142392764
4539A42392764P387106R767215J2343141J4184071J3891240Q739051r04600r935681
$$ 142392764 149779870 159547085 171890226 186074297 199965537 208704588 207799988 197864307
4531A97864307j5292692j7052683j6030087j3778838j1339470r060818o788774
$$ 197864307 182571615 165518932 149488845 135710007 124370537 115309719 108520945
4524A08520945n261999l861802l029847k298701j196558k65972M95508J445194
$$ 108520945 103258946 99397144 96367297 94068596 92872038 92606066 93101574 94546768
4516I4546768J692577J418235j55703k556939n042174o558359o972083o634077
$$ 94546768 96239345 97657580 97501877 94944938 89902764 83344405 76372322 69738245
4508F9738245n802545m934565m255726l734800l117911k782925k471538k035042
$$ 69738245 63935700 59001135 54745409 51010609 47892698 45109773 42638235 40603193
4500D0603193j850536j700351j733602j568507j525409j596335j448861j346978
$$ 40603193 38752657 37052306 35318704 33750197 32224788 30628453 29179592 27832614
4492B7832614j119633j165073j070822r08258r19075o28043o13454o44212n76532
$$ 27832614 26712981 25547908 24477086 23568828 22649753 22021710 21408256 20764044 20187512
4483B0187512o88987l13996m60674o62554l29778p34970n00978m03023n53325
$$ 20187512 19498525 19184529 18723855 18061301 17731523 16996553 16495575 16092552 15539227
4474A5539227m42718m97146m46589k19467m52234l13692k73888l91089l89740
$$ 15539227 15096509 14599363 14152774 13933307 13481073 13167381 12893493 12502404 12112664
4465A2112664k47245k93078j32366j77563k10275m6804k30078j56452j27255p8200
$$ 12112664 11865419 11572341 11439975 11262412 11052137 11005333 10775255 10618803 10491548 10413348
4455A0413348n7549j91076j53815j6193j45348j45425N7039k24623p3915L802
$$ 10413348 10355799 10164723 10010908 9994715 9849367 9703942 9760981 9536358 9462443 9466245
4445I466245j71084j37914j84996o5378l09727l12204j46521O4771j11485j53343
$$ 9466245 9295161 9157247 8972251 8906873 8597146 8284942 8138421 8203192 8091707 7938364
4435G938364j83717j31266k97945J19709l7815j06064n3534k07482j96615R547
$$ 7938364 7754647 7623381 7325436 7445145 7407330 7301266 7247732 7040250 6843635 6853182
4425F853182j66099j81775n7962O1157o8525j35734j76165Q337j93196j10087
$$ 6853182 6687083 6505308 6447346 6508503 6439978 6304244 6128079 6136416 5943220 5833133
4415E833133J18838J446m7519p0984n4641j77073Q7820j7490k72099l8560k44219
$$ 5833133 5951971 5953417 5905898 5834914 5780273 5603200 5691020 5673530 5401431 5362871 5118652
4404E118652q7066K5019k32422M6264j06857P2434j2002N0237j90214n850r9937
$$ 5118652 5031586 5056605 4824183 4870447 4763590 4836024 4824022 4874259 4684045 4678195 4578258
4393D578258j10661r8539j9549l3995j89531j2873o2188l4857j339N1632j46762
$$ 4578258 4467597 4369058 4349509 4315514 4125983 4113110 4050922 4016065 4014726 4066358 3919596
4382C919596j25636j60913N4683P3318J45492q3970n9668o1893l3492M2953j62777
$$ 3919596 3793960 3633047 3687730 3761048 3906540 3822570 3762902 3701009 3667517 3710470 3547693
4371C547693j13364R0618l7718r9284n4513j25305K29245o9134l9803m2099L6349
$$ 3547693 3434329 3524947 3487229 3387945 3333432 3208127 3437372 3368238 3328435 3286336 3322685
4360C322685R049J4217K4579l3491J01556o9175j79398j9367M370n9629K2940
$$ 3322685 3331734 3345951 3370530 3337039 3438595 3369420 3190022 3170655 3175025 3115396 3138336
4349C138336q5950O2366P6547j56582q8136M1966J37966k43168n312P2661J84902
$$ 3138336 3052386 3114752 3191299 3034717 2946581 2988547 3126513 2883345 2878033 2950694 3135596
4338C135596j16021k90520J03864J44820J59927q1648K0616J29156K5516k74413
$$ 3135596 3019575 2729055 2832919 2977739 3137666 3056018 3076634 3205790 3231306 2956893
4328B956893m9419J09876o4704j11856J68334J9202j5226J41530r451L681K06464
$$ 2956893 2907474 3017350 2952646 2840790 3009124 3028326 3013100 3154630 3145179 3148860 3355324
4317C355324j27211L7650n8156J74333R6842l5931J6985o8621l2711j13657M9423
$$ 3355324 3228113 3265763 3207607 3381940 3478782 3442851 3459836 3391215 3358504 3244847 3294270
4306C294270K520r239J6791n3017k0199o8160j86358K79673M6225m9635O1160
$$ 3294270 3296790 3287551 3304342 3251325 3231126 3162966 2976608 3256281 3302506 3252871 3314031
4295C314031m963M4247N4369J52931K6100k3209j08696j13354j0219j24375m7265
$$ 3314031 3309068 3353315 3407684 3560615 3586715 3563506 3454810 3341456 3331237 3206862 3159597
4284C159597O3874p9173n2834j47313J2776R1041j00148J44253r2060J36448j62850
$$ 3159597 3223471 3144298 3091464 2944151 2956927 3047968 2947820 3092073 3000013 3136461 2973611
4273B973611L4067q5240O4136N7851P8533j40487L1643j45803p5010Q7059m1347
$$ 2973611 3007678 2922438 2986574 3044425 3122958 2982471 3014114 2868311 2793301 2880360 2839013
4262B839013j657o1664K1268n0240Q548P799o2960J52859n4606p072l5585j36589
$$ 2839013 2837356 2775692 2796960 2746720 2755268 2763067 2700107 2852966 2798360 2791288 2755703 2619114
4250B619114J05472R7976Q8202r8079L8957q7035J12580n2599k4154N9204j50359
$$ 2619114 2724586 2822562 2910764 2812685 2851642 2764607 2877187 2824588 2800434 2859638 2709279
4239B709279R6447j6973M451J19281l022J17739K4340J00480p7621l6070r2174
$$ 2709279 2805726 2788753 2793204 2912485 2909463 3027202 3051542 3152022 3074401 3038331 2946157
4228B946157K7740J84327j7257K9245J26319n293J87336R7996j4869K762J76463
$$ 2946157 2973897 3158224 3140967 3170212 3296531 3291238 3478574 3576570 3561701 3564463 3740926
4217C740926J03774J34401N4210L23126J67174j33529k89660J40004K9157n2151
$$ 3740926 3844700 3979101 4033311 4356437 4523611 4390082 4100422 4240426 4269583 4217432
4207D217432Q5830J9807o0478J09904K9231k1762j40196R3446Q6178K7646K2915
$$ 4217432 4303262 4323069 4262591 4372495 4401726 4379964 4239768 4333214 4419392 4447038 4469953
4196D469953k8965J15510O7230m7816J44621J5022n6918J23122J72433Q986k7502
$$ 4469953 4440988 4556498 4623728 4575912 4720533 4735555 4678637 4801759 4974192 4983178 4955676
4185D955676J17561K11941l8782L4938J03422n209J3479K0489j21483k3393K01094
$$ 4955676 5073237 5285178 5246396 5281334 5384756 5379547 5393026 5413515 5292032 5268639 5469733
4174E469733j29517J3105J41002J71082q8381J0632J04791J68498n9692j6642
$$ 5469733 5340216 5353321 5494323 5665405 5577024 5587656 5692447 5860945 5801253 5784611
4164E784611J52701J76697L941L1314J58684J00208m782m6410J24181Q5026l8239
$$ 5784611 5937312 6114009 6117950 6149264 6307948 6408156 6403374 6356964 6481145 6566171 6527932
4153F527932R6842j7838q4719J0279O9259j32679K14202J57272m65o3024Q2280
$$ 6527932 6624774 6606936 6522217 6532496 6601755 6469076 6683278 6840550 6840085 6777061 6859341
4142F859341Q5774K30971Q4033K42121p730R2470Q9160n6811J93810j1739K5015
$$ 6859341 6945115 7176086 7260119 7502240 7494510 7586980 7676140 7619329 7813139 7801400 7826415
4131G826415J32945R1548Q6386K7088J12079K59578R2210r8107j18520j14229
$$ 7826415 7959360 8050908 8137294 8164382 8276461 8536039 8628249 8530142 8411622 8297393
4121H297393N2841J1283j39914O812J95270n9144J14027j5996n8417L6842j15421
$$ 8297393 8350234 8361517 8221603 8228415 8423685 8364541 8478568 8462572 8404155 8440997 8325576
4110H325576M95k1749K54085N7931N5310m9847o6728Q691K8313J3980J63129P0340
$$ 8325576 8326071 8304322 8558407 8616338 8671648 8621801 8555073 8563764 8592077 8606057 8769186 8839526
4098H839526J69312J10657m5306K13811N9091Q7476J145L5252M3273R1393J54238
$$ 8839526 9008838 9119495 9074189 9288000 9347091 9434567 9435712 9470964 9514237 9605630 9759868
4087I759868j35889L7020J73158q87Q1845J38737J02715J97444J52876L3276N1525
$$ 9759868 9623979 9660999 9834157 9833270 9915115 10053852 10156567 10354011 10506887 10540163 10591688
4076A0591688J77087Q3180J65785J09534L84415J62837o102J22427K87313K47671
$$ 10591688 10768775 10851955 11017740 11127274 11511689 11674526 11668424 11790851 12078164 12325835
4066A2325835R8885J36848K88517J73327Q8755K27620K51204K88711K74089K44700
$$ 12325835 12424720 12561568 12850085 13023412 13112167 13339787 13590991 13879702 14153791 14398491
4056A4398491K09748L79263K34111L33557M28488L84591M22400N27289L23108
$$ 14398491 14608239 14987502 15221613 15555170 15983658 16368249 16790649 17317938 17641046
4047A7641046J59842J99736K69735L84040L18243L63572M93320M22841N77393
$$ 17641046 17800888 18000624 18270359 18654399 18972642 19336214 19829534 20252375 20829768
4038B0829768M38132O98164N34539M20931P76267O72906O17558P19650P54321
$$ 20829768 21267900 21966064 22500603 22921534 23697801 24370707 24988265 25707915 26462236
4029B6462236Q88110R03698Q33205Q85029J081340J243267J279217J256986J596986
$$ 26462236 27350346 28254044 29087249 29972278 31053618 32296885 33576102 34833088 36430074
4020C6430074J642426J767046K103090J941454K354848K510640K391972K507208
$$ 36430074 38072500 39839546 41942636 43884090 46238938 48749578 51141550 53648758
4012E3648758K558977K611969K536822K326809K411435J966681J835770J636530
$$ 53648758 56207735 58819704 61356526 63683335 66094770 68061451 69897221 71533751
4004G1533751J385454J082176J291564J325406J555794K098236K347173K678772
$$ 71533751 72919205 74001381 75292945 76618351 78174145 80272381 82619554 85298326
3996H5298326L055986L694345L916674L997980L956884L869673L516648L049169
$$ 85298326 88354312 92048657 95965331 99963311 103920195 107789868 111306516 114355685
3988A14355685K629655J907751R82254R9973l77084o40746q05997n09275l22044
$$ 114355685 116985340 118893091 119875345 119975318 119598234 118957488 118151491 117642216 117320172
3979A17320172j90821J32514O88331R20813J381574J810096J982514K320820K249051
$$ 117320172 117129351 117261865 117950196 118871009 120252583 122062679 124045193 126366013 128615064
3970A28615064K021134J847866J841230J303401O52894M37843P6255l41552m64130
$$ 128615064 130636198 132484064 134325294 135628695 136281589 136719432 136795687 136454135 135990005
3961A35990005o29976p92531q40179l29175J88907O27984J226319J959064K445088
$$ 135990005 135360029 134567498 133727319 133398144 133587051 134215035 135441354 137400418 139845506
3952A39845506L190979L898475M275745M586506M616620M503406M194007L666182
$$ 139845506 143036485 146934960 151210705 155797211 160413831 164917237 169111244 172777426
3944A72777426K897315J811707P86167j15409n83987n61158n57518j12723M25545
$$ 172777426 175674741 177486448 178272615 178157206 177573219 177012061 176454543 176341820 176767365
3935A76767365R71811J683673K304347K967266L526505L717766L417065L506452
$$ 176767365 177739176 179422849 181727196 184694462 188220967 191938733 195355798 198862250
3927A98862250K821179K305930J521646O03141m46180r65526j388797j570183
$$ 198862250 201683429 203989359 205511005 206114146 205667966 204702440 203313643 201743460
3919B01743460j274522p57961l40041M97971J098692J608985K479992K817933
$$ 201743460 200468938 199710977 199370936 199868907 200967599 202576584 205056576 207874509
3911B07874509L254097L227476K857026J845070Q27475o13032j943575l499650
$$ 207874509 211128606 214356082 217213108 219058178 219885653 219272621 217329046 213829396
3903B13829396m745783n719777o517377o573824o119277n779006n018037m196494
$$ 213829396 209083613 203363836 196846459 190272635 184153358 178374352 173356315 169159821
3895A69159821l407454k608760k000244j665080j562418j791716k021233k538075
$$ 169159821 165752367 163143607 161143363 159478283 157915865 156124149 154102916 151564841
3887A51564841l220215l965369m329921m946495n260551n626356n752421n627636
$$ 151564841 148344626 144379257 140049336 135102841 129842290 124215934 118463513 112835877
3879A12835877n447722n364733m944602m577304m331584l932320l508673l429126
$$ 112835877 107388155 102023422 97078820 92501516 88169932 84237612 80728939 77299813
3871G7299813l190054l158633k951969k815161k608963k458887k278314k325183
$$ 77299813 74109759 70951126 67999157 65183996 62575033 60116146 57837832 55512649
3863E5512649j984155j835181j952719j640980j349857j516527j454840j360474
$$ 55512649 53528494 51693313 49740594 48099614 46749757 45233230 43778390 42417916
3855D2417916j284096j058914j193767j110241r67762q15044q39451r09789r23800
$$ 42417916 41133820 40074906 38881139 37770898 36803136 35988092 35148641 34238852 33315052
3846C3315052p09198p31388o75795o51933o45678p47704p25625n85544o24527
$$ 33315052 32605854 31874466 31198671 30546738 29901060 29153356 28427731 27842187 27217660
3837B7217660o82188p82035n09064r07043o63476m55016n66192n85958o67189
$$ 27217660 26535472 25753437 25244373 24337330 23673854 23218838 22652646 22066688 21399499
3828B1399499l61361m94535m13137n24709l39766m10841n64619n88377l16922
$$ 21399499 21038138 20543603 20130466 19605757 19265991 18855150 18290531 17702154 17385232
3819A7385232l95373k91920m41452m09653m22555m43594l37221k95282k93402
$$ 17385232 16989859 16697939 16256487 15846834 15424279 14980685 14643464 14348182 14054780
3810A4054780k52409n04957k30709k51204j57199k98653l44754k71837k20667
$$ 14054780 13802371 13297414 13066705 12815501 12658302 12359649 12014895 11743058 11522391
3801A1522391k57168k11273j44615j04442l52891k09364O5107j67559j69065j23702
$$ 11522391 11265223 11053950 10909335 10804893 10452002 10242638 10307745 10140186 9971121 9847419
3791I847419o416K0947k91874k73247k18434n6174m0925k03401k4409l5713j50543
$$ 9847419 9841003 9861950 9570076 9296829 9078395 9022221 8981296 8777895 8753486 8717773 8567230
3780H567230j64557l1835j36121j64703j00966n7756J10457J3682j64399p5132
$$ 8567230 8402673 8370838 8234717 8070014 7969048 7911292 8021749 8035431 7871032 7795900
3770G795900j30344p8683j87059p6123L1229J30347j27699j34216p1205J11216
$$ 7795900 7665556 7586873 7399814 7323691 7354920 7485267 7357568 7223352 7152147 7263363
3760G263363j21649O676o1693j90000P0952L6817j21299k661j1276j46195J09020
$$ 7263363 7141714 7148390 7086697 6896697 6967649 7004466 6883167 6880506 6869230 6723035 6832055
3749F832055m1095n1339k14172l3608L008N7979j5970o3195n4973L8886O1212
$$ 6832055 6790960 6739621 6525449 6491841 6494849 6552828 6536858 6473663 6418690 6457576 6518788
3738F518788K9351R0250o6614j14276M4618J22259j28798p1486J43073Q40M7292
$$ 6518788 6548139 6638389 6571775 6457499 6502117 6624376 6495578 6424092 6567165 6568005 6615297
3727F615297o2522Q5205j32179O2936K5392O8288p4753R4838J21179q2705N5353
$$ 6615297 6552775 6637980 6505801 6568737 6594129 6662417 6587664 6682502 6803681 6720976 6776329
3716F776329j0446J70L6770J80712j49603J04694L5394p8355j29333J54753Q6516
$$ 6776329 6765883 6766053 6802823 6983535 6833932 6938626 6974020 6895665 6766332 6921085 7007601
3705G007601M6746J78852J4596k31958o508J41493K17536l4195J36925J32736
$$ 7007601 7054347 7233199 7247795 7015837 7009329 7150822 7368358 7334163 7471088 7603824
3695G603824N4489K19275K01940K24139R8102M26330K99567M1655J64156j82349
$$ 7603824 7658313 7877588 8079528 8303667 8401769 8828099 9127666 9169321 9333477 9151128
3685I151128k56002k57513k4756l5586j43315j86526J08115m9386M5820l5375
$$ 9151128 8895126 8637613 8612857 8577271 8433956 8247430 8355545 8306159 8351979 8316604
3675H316604M1468N8929Q3835J47222K5484J04452J46297p6893n8833J38808J44781
$$ 8316604 8358072 8417001 8500836 8648058 8673542 8777994 8924291 8847398 8788565 8927373 9072154
3664I072154K25059K34079n1568J5785K47796Q7111R5080K69619J28507R6018
$$ 9072154 9297213 9531292 9479724 9495509 9743305 9830416 9925496 10195115 10323622 10419640
3654A0419640M64288M29195M14751L96476L70050J52197j72774m09836l83553
$$ 10419640 10883928 11313123 11727874 12124350 12494400 12646597 12473823 12063987 11680434
3645A1680434k37519j12930j64475j22266J0502j2970n2862j1532M4426P5152
$$ 11680434 11442915 11329985 11165510 11043244 11053746 11040776 10987914 10976382 11020808 11095960
3635A1095960j14215j16958m1053N904l2967O8851j28481J70217m7424k28243
$$ 11095960 10981745 10864787 10823734 10829638 10796671 10865522 10737041 10907258 10859834 10631591
3625A0631591N1067J73471k973L0511n0352Q4007K732J58432J16662q2880L9973
$$ 10631591 10682658 10856129 10853156 10883667 10833315 10917322 10920054 11078486 11195148 11112268 11152241
3614A1152241l11R4759Q101j59892k972j02138K77234M5042j65140L0330Q898
$$ 11152241 11151930 11246689 11254790 11094898 11091926 10989788 11267022 11312064 11146924 11177254 11186152
3603A1186152R5114N8725K40379K1546P6672N7990M0445n2894M236n0249J55557
$$ 11186152 11281266 11339991 11580370 11601916 11678588 11736578 11777023 11724129 11728365 11678116 11833673
3592A1833673l017P8029r9032J29354Q2909k8281Q4677O8992J07022Q4370J32166
$$ 11833673 11830656 11908685 11809653 11939007 12021916 11993635 12078312 12147304 12254326 12338696 12470862
3581A2470862J68810J90094L8368R8184K7708J9498j08493n0046o3224J94639
$$ 12470862 12639672 12829766 12868134 12966318 12994026 13013524 12905031 12854985 12791761 12986400
3571A2986400n384j55369M1647O0892j6561J68034o092J30188L5073J45829J84989
$$ 12986400 12981016 12825647 12867294 12928186 12911625 13079659 13073567 13203755 13238828 13384657 13569646
3560A3569646J02931N6878L01103K58592N2745M3230L217J80042j428J8697J98582
$$ 13569646 13672577 13729455 14030558 14289150 14341895 14385125 14388342 14568384 14566956 14585653 14784235
3549A4784235J38898j7415J1996n445J26004Q553J1736j3448R0544Q8742K07817
$$ 14784235 14923133 14905718 14917714 14912269 15038273 15046826 15058562 15045114 15135658 15224400 15432217
3538A5432217J60939O8565K26928J70586q603L52226K65945J56383J23382L31635
$$ 15432217 15593156 15661721 15888649 16059235 16050632 16402858 16668803 16825186 16948568 17280203
3528A7280203J46531O3528K94809K89260J81146K78852K95596J48381K97335K48431
$$ 17280203 17426734 17490262 17785071 18074331 18255477 18534329 18829925 18978306 19275641 19524072
3518A9524072K76072L60378L85850M92334M22920K89477L64433K05216L09022
$$ 19524072 19800144 20160522 20546372 21038706 21461626 21751103 22115536 22320752 22629774
3509B2629774L66415L47453L06610M17695L99792J86519L18818L31834R0796L41004
$$ 22629774 22996189 23343642 23650252 24067947 24467739 24654258 24973076 25304910 25395706 25736710
3499B5736710L47633K40075M10731L43491O64450N10007N76322Q08119P40347
$$ 25736710 26084343 26324418 26735149 27078640 27743090 28253097 28829419 29637538 30377885
3490C0377885N94092P79319R39953R01484J040637R07328J069156J056775J105684
$$ 30377885 30971977 31751296 32691249 33592733 34633370 35540698 36609854 37666629 38772313
3481C8772313J323048J338629J406788J291930J623513J860936J803422J928186
$$ 38772313 40095361 41433990 42840778 44132708 45756221 47617157 49420579 51348765
3473E1348765J866267J961603K044356K163327K147129K135624K148820J996716
$$ 51348765 53215032 55176635 57220991 59384318 61531447 63667071 65815891 67812607
3465F7812607K008502K264663K227842K332764K453455K427580K325397K402121
$$ 67812607 69821109 72085772 74313614 76646378 79099833 81527413 83852810 86254931
3457H6254931K372969K310008K382033K587840K390737K705303L042509K924691
$$ 86254931 88627900 90937908 93319941 95907781 98298518 101003821 104046330 106971021
3449A06971021K965668L154375L190141L175130L497633L529115M056402L933560
$$ 106971021 109936689 113091064 116281205 119456335 122953968 126483083 130539485 134473045
3441A34473045M094223M290804M127618L727552L735928L446761L283230L280673
$$ 134473045 138567268 142858072 146985690 150713242 154449170 157895931 161179161 164459834
3433A64459834L022596L261233L497814L667914L451667L979472M274086M570443
$$ 164459834 167482430 170743663 174241477 177909391 181361058 185340530 189614616 194185059
3425A94185059N160813N933311O429761P211740P822177Q132155Q360619Q454167
$$ 194185059 199345872 205279183 211708944 218920684 226742861 234875016 243235635 251689802
3417B51689802P582640O627755N813117M637210L596014K691085K033061J572934
$$ 251689802 259272442 265900197 271713314 276350524 279946538 282637623 284670684 286243618
3409B86243618J108387M40854K60340j32017k1476J21139K99844O12532M67993
$$ 286243618 287352005 287792859 288053199 287921182 287899706 288020845 288320689 288933221 289401214
3400B89401214K26770N70064K65707k28089q62038k121701l376997m696606n550818
$$ 289401214 289627984 290198048 290463755 290235666 289373628 287251927 283874930 279178324 273627506
3391B73627506o249517o643856o931063p379654p187012p066513o834322o586347
$$ 273627506 267377989 260734133 253803070 246423416 239236404 232169891 225335569 218749222
3383B18749222o047579n628879n213457m586281m421356m177014l863667l777478
$$ 218749222 212701643 207072764 201859307 197273026 192851670 188674656 184810989 181033511
3375A81033511l395698l409364l784621m047385m123336m191012m200803m319939
$$ 181033511 177637813 174228449 170443828 166396443 162273107 158082095 153881292 149561353
3367A49561353m226385m440573m432703m277821m383476l894448l899249l684348
$$ 149561353 145334968 140894395 136461692 132183871 127800395 123905947 120006698 116322350
3359A16322350l476096l255827l179206l197951k901600k615667k748593k870063
$$ 116322350 112846254 109590427 106411221 103213270 100311670 97696003 94947410 92077347
3351I2077347k616728k724823k667012k230425k477469k595925k559390k403718
$$ 92077347 89460619 86735796 84068784 81838359 79360890 76764965 74205575 71801857
3343G1801857k304246k282931k307546j984093j971896k017692k110511j672037
$$ 71801857 69497611 67214680 64907134 62923041 60951145 58933453 56822942 55150905
3335E5150905j756997j813546j759695j629607j674822j545618j485494j452289
$$ 55150905 53393908 51580362 49820667 48191060 46516238 44970620 43485126 42032837
3327D2032837j123071j177562j004864j105062r49791p22595q94337p84298n79537
$$ 42032837 40909766 39732204 38727340 37622278 36672487 35949892 35055555 34271257 33691720
3318C3691720p07892m51812o65732n72527n79545p85385n85507n09243o16876
$$ 33691720 32983828 32532016 31866284 31293757 30714212 29928827 29343320 28834077 28217201
3309B8217201n45175p06820m50332o38982o57105n61908o56764l01525m19640
$$ 28217201 27672026 26965206 26514874 25875892 25218787 24656879 24000115 23698590 23278950
3300B3278950l46381l17255k73821l88512m09933l89197m36959j08397k88830
$$ 23278950 22932569 22615314 22341493 21952981 21543048 21153851 20716892 20608495 20319665
3291B0319665k63269j95936l38491k75961p020j49360k41050n2140k61983j2053
$$ 20319665 20056396 19860460 19521969 19246008 19238988 19089628 18848578 18796438 18534455 18522402
3281A8522402l7849l48539j39509k66733m53770j11619j72034l15844j91590l97478
$$ 18522402 18484553 18136014 17996505 17729772 17276002 17164383 16992349 16676505 16484915 16087437
3271A6087437l10423k80229j27782l36189J6165k1283p4354j28784j58117j31615
$$ 16087437 15777014 15496785 15369003 15032814 15048979 15027696 14953342 14824558 14666441 14534826
3261A4534826j43819o6432m41037j92743j67588j60253j46856m4610J4694j94852
$$ 14534826 14391007 14324575 13883538 13690795 13523207 13362954 13216098 13171488 13186182 12991330
3251A2991330m15441j49286o8049m6815k29992j98776j12387r7832p0207K1411
$$ 12991330 12575889 12426603 12358554 12311739 12081747 11882971 11770584 11672752 11602545 11623956
3241A1623956j74450k83493J06281p6743k10657k01087j34254j67095j3115j22500
$$ 11623956 11449506 11166013 11272294 11195551 10984894 10783807 10649553 10482458 10469343 10346843
3231A0346843o4356n8847J33257k1355k48654J4060j65080L5908j17988o1958
$$ 10346843 10282487 10223640 10356897 10335542 10086888 10100948 9935868 9971776 9853788 9791830
3221I791830M5619O867o9470m0654J9064m5395q6958J3556q6162k37822m0268
$$ 9791830 9837449 9844316 9774846 9734192 9753256 9707861 9620903 9634459 9548297 9310475 9270207
3210I270207O1461P2166O3155k06188j00385j227k7052L3643Q2517j3420K0141
$$ 9270207 9331668 9403834 9466989 9260801 9160416 9159189 9132137 9165780 9248297 9234877 9255018
3199I255018j91292o2210J06214k21870j0205K305q6552N6779O3029o6497q3943
$$ 9255018 9063726 9001516 9107730 8885860 8875655 8877960 8791408 8848187 8911216 8844719 8760776
3188H760776k20518j52617K16303K897j8572j13601n472o483m9380P092R1216
$$ 8760776 8540258 8387641 8603944 8606841 8588269 8474668 8469196 8462713 8413333 8420425 8511641
3177H511641j11467j30652P0413r7955P2097m2116L3493R1433j25833j31752N7951
$$ 8511641 8400174 8269522 8339935 8241980 8314077 8271961 8305454 8396887 8271054 8139302 8197253
3166H197253L7899p1592m3915n7792j25056l7094R484J10902k21767j46543O9239
$$ 8197253 8235152 8163560 8119645 8061853 7936797 7899703 7909187 8020089 7798322 7651779 7721018
3155G721018r1237J65584Q397J05167n3883n9052n9046J9159J34086r1072j17179
$$ 7721018 7629781 7795365 7803762 7908929 7855046 7795994 7736948 7756107 7890193 7799121 7681942
3144G681942J8131J70324k61172n461o5267L5352k3329J77769J72534j308j32412
$$ 7681942 7700073 7870397 7609225 7603764 7538497 7573849 7550520 7728289 7900823 7899515 7767103
3133G767103j00530k8491J63281O9183k1571J02049J16380l291M6628Q7349R0621
$$ 7767103 7666573 7638082 7801363 7870546 7848975 7951024 8067404 8064113 8110741 8198090 8288711
3122H288711L4946L8074R8096q4162O7539J51114J05775J72463K1035k4982K6454
$$ 8288711 8323657 8361731 8459827 8375665 8443204 8594318 8700093 8872556 8893591 8868609 8895063
3111H895063J16314O7445R7535K38773J83918J36196J40503K5088n176L15233
$$ 8895063 9011377 9078822 9176357 9415130 9599048 9735244 9875747 9900835 9895659 10210892
3101A0210892J61081O2117J64786K31878L23142K37279R2584J29425L07081K02650
$$ 10210892 10371973 10434090 10598876 10830754 11153896 11391175 11483759 11613184 11920265 12122915
3091A2122915K13542J97355K26862J74848L48284L05398L65666K80910K31950
$$ 12122915 12336457 12533812 12760674 12935522 13283806 13589204 13954870 14235780 14467730
3082A4467730M57512L36613M60735L92816L06138L62340M77227L46040L64171
$$ 14467730 14925242 15261855 15722590 16115406 16421544 16783884 17261111 17607151 17971322
3073A7971322L36417L89040L36220M74812M05842L21411M00051N66963L70880
$$ 17971322 18307739 18696779 19032999 19507811 19913653 20235064 20635115 21202078 21572958
3064B1572958M43948O92516P71362O03933O46014O56293Q44130P61941Q62884
$$ 21572958 22016906 22709422 23480784 24084717 24730731 25387024 26231154 26993095 27855979
3055B7855979P01254P66025P20536P28891P35504O63517Q63459P95292N52655
$$ 27855979 28557233 29323258 30043794 30772685 31508189 32171706 33035165 33830457 34383112
3046C4383112Q41526Q90067J010948J091050J119721J166241J299536J585417
$$ 34383112 35224638 36114705 37125653 38216703 39336424 40502665 41802201 43387618
3038D3387618J647871J677669J573284J871646J951150K085361K310941K488670
$$ 43387618 45035489 46713158 48286442 50158088 52109238 54194599 56505540 58994210
3030E8994210K798978L366605L749818M088972M321978M436119M433090M254520
$$ 58994210 61793188 65159793 68909611 72998583 77320561 81756680 86189770 90444290
3022I0444290L867799L108961K569208J498718M58794m25585j565166k488266
$$ 90444290 94312089 97421050 99990258 101488976 101947770 101522185 99957019 97468753
3014I7468753l106020l736118m030485m123651m002535l716208l329185l354870
$$ 97468753 94362733 90626615 86596130 82472479 78469944 74753736 71424551 68069681
3006F8069681l153707k657636k727606k416749k349017k202996j966544k042601
$$ 68069681 64915974 62258338 59530732 57113983 54764966 52561970 50595426 48552825
2998D8552825j900547j712341j528067j423130j402214j329822j396365j289100
$$ 48552825 46652278 44939937 43411870 41988740 40586526 39256704 37860339 36571239
2990C6571239j082487j044664j091790j156954j122354r06491j046751q85652
$$ 36571239 35488752 34444088 33352298 32195344 31072990 30166499 29119748 28234096
2982B8234096r94568r59329q30689p22417o62290n89923o95601o66209m83844
$$ 28234096 27239528 26280199 25449510 24727093 24064803 23474880 22779279 22113070 21629226
2973B1629226n65347o55299k89237o10527m94757m04001m31387l26413l43032
$$ 21629226 21063879 20408580 20119343 19508816 19014059 18610058 18178671 17852258 17509226
2964A7509226l07463k44197l18683m02921m44039l41468k87826l17878j98379
$$ 17509226 17201763 16957566 16638883 16235962 15791923 15450455 15162629 14844751 14646372
2955A4646372k52415n27445l36889l973n8561k56754j31032k56430l49956k31607
$$ 14646372 14393957 13866512 13529623 13525650 13467089 13210335 13079303 12822873 12472917 12241310
2945A2241310j11574q1887r0126j80819j64625j80581o438m7629j90109k24491
$$ 12241310 12129736 12047849 11957723 11776904 11612279 11431698 11425260 11377631 11187522 10963031
2935A0963031k75235k97762J9638o2560j51776k63116k12440r2955j59611o3080
$$ 10963031 10687796 10390034 10409672 10347112 10195336 9932220 9719780 9626825 9467214 9404134
2925I404134K491r8435J01855k16109j86149J9145k02931p6591j81363n0112J5215
$$ 9404134 9406625 9308190 9410045 9193936 9007787 9026932 8824001 8747410 8566047 8515935 8531150
2914H531150j09968j06471M0665p3419k0503j18123k49464q4219j1674j41140
$$ 8531150 8421182 8314711 8355376 8281957 8261454 8143331 7893867 7809648 7797974 7656834
2904G656834Q4518j62403j11693J3038K1489o5223L1667j80456L8342j10963j21329
$$ 7656834 7741352 7578949 7467256 7480294 7501783 7436560 7468227 7287771 7326113 7215150 7093821
2893G093821k1934N0058r1739l8011k1654K3104o3901K3367q1277j75128J0840
$$ 7093821 7071887 7121945 7030206 6992195 6970541 6993645 6929744 6953111 6871834 6696706 6707546
2882F707546r4672l6312J3653r9627j1595p7754p2251p160M4518m3746q7647l731
$$ 6707546 6612874 6576562 6590215 6490588 6478993 6401239 6328988 6321828 6366346 6322600 6234953 6231222
2870F231222k2443j70775L7217N6293J8425j45665l4372p8158l4216K33141j09738
$$ 6231222 6208779 6038004 6075221 6131514 6149939 6004274 5969902 5891744 5857528 6090669 5980931
2859E980931j60706l2199Q6103K6796R975m7931J8726j4515k1995L1399j01426
$$ 5980931 5820225 5788026 5874129 5900925 5910900 5862969 5881695 5867180 5845185 5876584 5775158
2848E775158Q8165j8494J94698J48801l3763P0938R6441q5020J715Q2256J32061
$$ 5775158 5863323 5844829 6039527 6188328 6154565 6225503 6321944 6236924 6238639 6320895 6452956
2837F452956j977J85558l870J80620J73307k7768K52300J19584N8448J71061L5121
$$ 6452956 6450979 6636537 6632667 6813287 6986594 6958826 7211126 7330710 7389158 7560219 7595340
2826G595340q8971L06302J70580J94985K44202J88421Q7751K49373K43240K53794
$$ 7595340 7506369 7812671 7983251 8178236 8422438 8610859 8698610 8947983 9191223 9445017
2816I445017k4641K18965O0389K72211K47620J70197K06817M14747Q1403L40355
$$ 9445017 9420376 9639341 9699730 9971941 10219561 10389758 10596575 11011322 11092725 11433080
2806A1433080M01177K62741L89264K85487M07649L56966M09179O02620N41821
$$ 11433080 11834257 12096998 12486262 12771749 13179398 13536364 13945543 14548163 15089984
2797A5089984P48566O55935P24246P25219O72352R22341J149507J086418J103601
$$ 15089984 15838550 16494485 17218731 17943950 18616302 19538643 20688150 21774568 22878169
2788B2878169J217154J521768J297582J357912J479069J002511J018001P65889
$$ 22878169 24095323 25617091 26914673 28272585 29751654 30754165 31772166 32538055
2780C2538055M49682M60966N28274N80441L84278M08005O16051O65500O95699
$$ 32538055 32987737 33448703 33976977 34557418 34941696 35349701 35965752 36631252 37326951
2771C7326951P78856J092864J164012J321906J556650K181287K166265K554893
$$ 37326951 38105807 39198671 40362683 41684589 43241239 45422526 47588791 50143684
2763E0143684K975169K706399J673935M32826j272455l034646l502073l060141
$$ 50143684 53118853 55825252 57499187 57932013 56659558 53624912 50122839 47062698
2755D7062698k471956j929404j538054r31957o69265m25699l32188j99165j13347
$$ 47062698 44590742 42661338 41123284 40191327 39522062 39096363 38764175 38565010 38451663
2746C8451663J95840K69117J74988J68057K33611K67686j9666j70061n61940q36697
$$ 38451663 38647503 38916620 39091608 39259665 39493276 39760962 39741296 39571235 39009295 38172598
2736C8172598j468381j755884j701938j685040j454705j195014j053072r87411
$$ 38172598 36704217 34948333 33246395 31561355 30106650 28911636 27858564 26871153
2728B6871153q07764p47970p08585o81215o91364p52487p29250o15719q99389
$$ 26871153 26063389 25315419 24606834 23925619 23234255 22481768 21752518 21136799 20237410
2719B0237410p73352q21120r45878q49352p45627o51247o17661o91539n44684
$$ 20237410 19464058 18642938 17697060 16847708 16102081 15450834 14833173 14141634 13596950
2710A3596950l99792n09694m90234m73759l46770l05458l42115m42518l48500
$$ 13596950 13197158 12687464 12197230 11723471 11376701 11071243 10729128 10286610 9938110
2701I938110k88031k76856k65504m63239k57579k19774l42451k96932k33294j60844
$$ 9938110 9650079 9373223 9107719 8644480 8386901 8167127 7824676 7527744 7294450 7133606
2691G133606j29979k09472j74656k63694j44101j02173k26923k76428p4211J3192
$$ 7133606 7003627 6794155 6619499 6355805 6211704 6109531 5882608 5606180 5531969 5545161
2681E545161k57911j73930M7255j73236j53430J1903l9792j27244r6168j77180
$$ 5545161 5287250 5113320 5160575 4987339 4833909 4845812 4806020 4678776 4582608 4405428
2671D405428j83322J2076j3463j29041k86489J636J5446m7371j52895L8172j66216
$$ 4405428 4222106 4234182 4220719 4091678 3805189 3806825 3822271 3774900 3622005 3660177 3493961
2660C493961j67741n1111n893m9096q5041m9465j43752n6001q6886L2544J9632
$$ 3493961 3326220 3275109 3269216 3220120 3135079 3085614 2941862 2885861 2798975 2831519 2851151
2649B851151k33807L796j5344N9386m7643j03106M8734p4668q9213k1418K2214
$$ 2851151 2617344 2621140 2605796 2665182 2617539 2514433 2563167 2488499 2399286 2377868 2400082
2638B400082p6312k1970p1605k0870j28855p9859J9593j113r0082J17026L6537
$$ 2400082 2323770 2301800 2230195 2209325 2080470 2000611 2020204 2019091 1929009 2046035 2082572
2627B082572k60749k29511J99899Q5045k28583r8362k6111l0956m8482J39478
$$ 2082572 1821823 1592312 1792211 1877256 1648673 1550311 1524200 1493244 1444762 1584240
2617A584240j50160j06154J70009Q097j63063k0075q9593R9069j40302p8787J47694
$$ 1584240 1434080 1327926 1497935 1506032 1342969 1322894 1233301 1332370 1192068 1113281 1260975
2606A260975R6408J79Q3635k08991r0368R5722q4291j2273l6470M6345J3785J02212
$$ 1260975 1357383 1357562 1441197 1232206 1141838 1237560 1153269 1140996 1104526 1150871 1164656 1266868
2594A266868l5751m2511n3073j4493N2421J0433j45089r9238q952P6066M6602
$$ 1266868 1231117 1188606 1135533 1121040 1173461 1183894 1038805 939567 930615 1006681 1053283
2583A053283p9469J0396M2825M6757m3530j16526P5697L4933l1878n1592p6371
$$ 1053283 973814 984210 1027035 1073792 1030262 913736 989433 1024366 992488 940896 864525
2572H64525m455J25817k812N1168J14660j50139l2583N1104o9225j26657n3486
$$ 864525 860070 985887 983075 1034243 1148903 998764 966181 1017285 948060 821403 767917
2561G67917J4183q4367J34415L3044m9482p5105P7743o9568q4347J63461L6832
$$ 767917 782100 697733 832148 865192 815710 740605 818348 748780 664433 827894 864726
2550H64726j86169J92997N2819j26842K8403J38802J4729k17589O9114J6654l9529
$$ 864726 678557 871554 924373 797531 825934 964736 979465 761876 830990 847644 808115
2539H08115o5011l5748L3829k7027j58397N2805O2411k3603l1925P0947N1510
$$ 808115 743104 707356 741185 714158 555761 608566 670977 647374 615449 686396 737906
2528G37906j06585J67347q9321J4065Q9399o8112p0766J23612m8917o3268J17050
$$ 737906 631321 798668 709347 723412 812811 744699 673933 797545 748628 685360 802410
2517H02410j24940k8902R5625J2299l3260p9570j694k3054q1298J47230k2603
$$ 802410 677470 648568 744193 756492 723232 643662 641968 618914 537616 684846 662243
2506F62243L3485j56834m3092j55466k5293J52599O4479j9027k9702M5998l5338
$$ 662243 695728 538894 495802 340336 315043 467642 532121 513094 483392 529390 494052
2495D94052o426j45054J04913L5912K7282N1837l2632q7068j3841j01054N3981
$$ 494052 487626 342572 447485 483397 510679 562516 529884 442816 428975 327921 381902
2484C81902M9469j45661J77642m3389n6683J4838k4127M3427m6573N3204m83M4471
$$ 381902 431371 285710 463352 419963 363280 378118 353991 397418 350845 404049 403566 448037
2472D48037M657K3001o8376r4684l0198J27894n1533l1601J45365p5073J7532
$$ 448037 452694 475695 407319 312635 282437 410331 358798 327197 472562 397489 415021
2461D15021j02118L7263j6935m5709p8660J43375j21227L8788J50328j5661r46
$$ 415021 312903 350166 333231 287522 208862 352237 231010 269798 420126 404465 403519
2450D03519j52853K2457k7903Q0399K8797m9165l9275n7802Q1424J0317K6830
$$ 403519 250666 273123 245220 325619 354416 305251 265976 208174 289598 299915 326745
2439C26745q5296M2297J7948j3352l0195K4017J16497N3385q5216M7219l7945
$$ 326745 241449 283746 301694 288342 258147 282164 398661 452046 366830 414049 376104
2428C76104j60572l3711J661J78996o3012N7890L2055k3548j24610K585n2093
$$ 376104 215532 181821 183482 362478 299466 357356 389411 365863 241253 243838 191745
2417A91745K2086P0425k1836K5035o358j16380l5454R9699j93761J00504r0238
$$ 191745 213831 284256 262420 287455 281097 164717 129263 228962 35201 135705 45467
2406D5467J28749K46511m5195j8305j78305q81m2377J59658j69555n8058K7028
$$ 45467 174216 420727 375532 357227 178922 178041 135664 295322 125767 67709 94737
2395I4737o3543L2157K41004j2051q8219Q6163j29706R5619K393k1622O2594K1356
$$ 94737 31194 63351 304355 292304 204085 290248 160542 256161 258554 236932 299526 320882
2383C20882j96441J1984O4670m4019J7856R5122R827j67490P2032M4080k793R6128
$$ 320882 124441 136425 201095 157076 174932 270054 279881 112391 184423 228503 225710 321838
2371C21838j33700j58967m6005K14770Q6846k1362r9955R6771R228Q1980J9559
$$ 321838 188138 29171 -16834 197936 284782 263420 163465 260236 269464 351444 371003
2360C71003k10472k9548q4672N4011n3016K1319Q2997l9168L8659n354K9300n3744
$$ 371003 160531 130983 46311 100322 47306 68625 151622 112454 151113 145759 175059 121315
2348A21315J26731n070k19317j0865R6704k4611K8058P7525k4095P0209n3078
$$ 121315 248046 242976 23659 12794 109498 84887 112945 190470 166375 236584 183506
2337A83506j29617N9838M7533R4728M1579k56567l4893O9082M1385J295P657j325
$$ 183506 53889 113727 161260 255988 297567 41000 6107 75189 116574 117869 125526 124201
2325A24201j7283N7199K6549k2118j01327O4784J8346m1413L6159j17921k44071
$$ 124201 106918 164117 190666 168548 67221 132005 150351 108938 145097 27176 -216895
2314b16895Q7428K15893n3866R2440q6099K8695j34183J59846q429k0781r9320
$$ -216895 -129467 86426 32560 125000 38901 67596 -66587 93259 84830 64049 -35271
2303c5271O0410J37287R981j45837m9173Q0545n2715K14774J7114q0250j9144
$$ -35271 25139 162426 172407 26570 -22603 57942 5227 220001 237115 156865 137721
2292A37721j57465j15738L5546J57062Q8472L1055l4537j13356p471L1084K23432
$$ 137721 -19744 -135482 -99936 57126 145598 176653 142116 28760 21289 52373 275805
2281B75805j54233J112L7119j17634r8572Q2167N671N6850O5346M1419q3972P601
$$ 275805 121572 122684 159803 42169 -56403 25764 31435 88285 153631 195050 111078 118679
2269A18679O2921J9938r5939j1853J10604q8639j68100j3492J73482O3133l428
$$ 118679 181600 201538 105599 93746 204350 115711 -52389 -65881 107601 170734 167306
2258A67306j18775p483R1198J87440j07570J42K2705J00555r9627p9565J39920
$$ 167306 48531 41048 132246 319686 212116 212258 234963 335518 235891 156326 296246
2247B96246j74153o2151J18882J03491M0427m8542O2716J15866p3020j86287j26083
$$ 296246 122093 59942 178824 282315 322742 274200 336916 452782 379762 193475 67392
2236F7392J38847r5674O1234J41161r1674J1733N4545R9907M0112j29062j5202
$$ 67392 206239 110565 171799 312960 221286 233019 287564 387471 427583 298521 283319
2225B83319P9092O2139j8007R5831O5903l2826O0821J7385J6558k6907J20722
$$ 283319 362411 424550 406543 502374 568277 535451 596272 613657 630215 603308 724030
2214G24030R7493o7660J26509Q43j13510J09044n892r7716Q1774r7061J06696
$$ 724030 821523 753863 880372 881215 767705 876749 870857 773141 854915 757854 864550
2203H64550M5848Q0462J5154n2852m1471R5110M9639M9538J19139m8176J39117
$$ 864550 910398 990860 1006014 953162 911691 1006801 1056440 1105978 1225117 1176941 1316058
2192A316058J48022l9265j4953J5560Q2428P5564M0363N4675O4798J08407K00844
$$ 1316058 1464080 1424815 1409862 1425422 1507850 1583414 1623777 1678452 1743250 1851657 2052501
2181B052501J63094P3557L10835K17515L09283M21883L59069L61717N37328M50970
$$ 2052501 2215595 2289152 2599987 2817502 3126785 3548668 3907737 4269454 4806782 5257752
2171E257752M51829M92644P81789R31553J393375J624613K028807K476085K092924
$$ 5257752 5709581 6202225 6984014 7915567 9308942 10933555 12962362 15438447 17531371
2162A7531371J052062L29199j340647l261435k633202k032492j449692j029846
$$ 17531371 18583433 18912632 17571985 14310550 11677348 9644856 8195164 7165318
2154G165318o82333n65279m80619l00615l81418j26833k21796l69344k27476k65396
$$ 7165318 6482985 5917706 5437087 5136472 4755054 4628221 4406425 4037081 3809605 3544209
2144C544209k86022l30651j79689o4957j5254l29908k73631L5383j14312p6601
$$ 3544209 3258187 2927536 2747847 2682890 2667636 2337728 2064097 2099480 1985168 1908567
2134A908567l1675m4797k48291q3813m1374M3067j34983r8953L2762p4776J4977
$$ 1908567 1876892 1832095 1583804 1499991 1458617 1501684 1366701 1267748 1300510 1225734 1240711
2123A240711l2500k22686q6202r2919J10368j23198M7252P031j63145M095k667
$$ 1240711 1208211 985525 899323 806404 916772 793574 840826 847857 684712 688807 686140
2112F86140l1633K5106J5913o7296l8146l643n6970Q5816o5625k3907J07041j49255
$$ 686140 654507 679613 695526 628230 590084 586441 529471 615287 549662 525755 632796 483541
2100D83541N507J15418p1574j62855j6330n4810J09752m7325m5399J37427r9868
$$ 483541 489048 604466 532892 370037 353707 298897 408649 361324 315925 453352 353484
2089C53484q4635J01069J36066q9262q5468R7745M2496N0928j92849J80700j8683
$$ 353484 268849 369918 505984 416722 331254 428999 471495 522423 329574 510274 491591
2078D91591j83182r7982j09428J21894Q2843m317Q4118j04236m4473Q534J2451
$$ 491591 308409 210427 100999 222893 305736 301419 385537 281301 236828 245362 257813
2067B57813M143m9728O6968L0461k87887Q3521J95792n5387R3726j76481j01950
$$ 257813 261956 212228 279196 309657 21770 105291 301083 245696 339422 162941 60991
2056F0991q107P6033J39403m5208r8223m3726n4417Q6355r3466n5709J05099j9670
$$ 60991 52884 128917 268320 223112 124889 81163 26746 113101 19635 -36074 69025 49355
2044D9355J97957k3038j60770J732P4787O0107O6201r6896j19512R2065p145L4785
$$ 49355 247312 224274 63504 65236 140023 200130 266331 169435 49923 141988 134843 169628
2032A69628l3831j87782m6J45473m6430r6225J95893l0786j2605k6642p9469J27468
$$ 169628 135797 -51985 -52031 93442 47012 -49213 146680 115894 103289 76647 -2822 124646
2020A24646J11509J05161k05092j21260k5693j10455J42193J8513j27974J31134
$$ 124646 236155 341316 136224 14964 -10729 -121184 21009 39522 -88452 42682
2010D2682J74967L8778m9184N2938j72929j6078m3401j7708j0875n585Q4478j7385
$$ 42682 217649 256427 207243 260181 87252 71174 27773 10065 -810 -6395 78083 60698
1998F0698j3715m7775J31597l4807l5814o0935O6376P8364j07764j20852O3149
$$ 60698 46983 -792 130805 95998 60184 -751 65625 143989 36225 -84627 -21478
1987b1478l1887P2339L497J30956k31204j10663J18259M9319J2023r5682J35905
$$ -21478 -53365 18974 22471 153427 -77777 -188440 -70181 -20862 -8839 -104521 31384
1976C1384J43493K1872p7746R0703j01959J16108m6918j60162q3620M9130j8537
$$ 31384 174877 196749 119003 209706 107747 223855 176937 16775 -66845 -17715 -36252
1965c6252J57235J00270p8801O4590j18066Q158l9053q9309N0425O0461M4464
$$ -36252 120983 221253 142452 207042 88976 97134 58081 -31228 19197 79658 124122
1954A24122k16282j08142K67985m3677J48081n115j54066p3702N1269K8903J7457
$$ 124122 -92160 -200302 67683 24006 172087 166972 12906 -60796 -9527 19376 36833
1943C6833M9132P9449N5179j59642J44539r4355p8268J30510P2162j79297J8449
$$ 36833 85965 165414 220593 60951 205490 111135 32867 163377 235539 56242 74691
1932G4691j23939N9328Q8674r5632j4200j4562K3306n157Q4347J69015k04075
$$ 74691 -49248 10080 98754 3122 -11078 -25640 -2334 -7491 76856 245871 41796
1921D1796j11797J22008K4802o3184k1164m3047K9924j25810J33492j15208M1854
$$ 41796 -70001 52007 76809 13625 -7539 -50586 -20662 -146472 -12980 -128188 -86334
1910h6334n584Q828J46828r336j89232k490K04344j20400m8305n8523R0982p641
$$ -86334 -91918 -83090 63738 54402 -134830 -137320 67024 -53376 -101681 -160204 -69222 -76863
1898g6863O505K0002N953m9151j5152N9972O4726o4001M4301r4544J19121o4635
$$ -76863 -70358 -50356 -44403 -93554 -108706 -48734 15992 -48009 -3708 -98252 20869 -43766
1886d3766Q5090p9492p8596k0893J7295J35914o6767J55259J721j70197m723L1143
$$ -43766 41324 -38168 -116764 -137657 -120362 15552 -51215 104044 105765 -64432 -69155 -38012
1874c8012P7916m1900J30401r4947j60909J53393R8026p8620m8979j00022J253
$$ -38012 39904 -1996 128405 33458 -127451 25942 123968 45348 -3631 -103653 -102400
1863a02400J2944K9368J69015q1157L8385K1259j38293N5738k6593j1330j2298
$$ -102400 -89456 -60088 108927 27770 66155 87414 -50879 4859 -21734 -33064 -45362
1852d5362q1114O1786M6958n4880P364L631j03382N1003J78696n3912P4697J5039
$$ -45362 -126476 -64690 -17732 -72612 -65248 -61617 -164999 -113996 64700 10788 85485 100524
1840A00524j6826l5056q6352K8404L6034j60497K5098q5r9733N6024j5252L3395
$$ 100524 83698 48642 -37710 -9306 26728 -133769 -108671 -108756 -208489 -152465 -167717 -134322
1828a34322N9688R4293p8246J34661j34094Q6678L1791k9036R1775m9425n2763
$$ -134322 -74634 19659 -58587 76074 -58020 28658 60449 31413 123188 73763 21000
1817B1000L669k1706J06883k8997n1974k966j0998J06203k01365O0427L1983r0240
$$ 21000 24669 2963 109846 80849 28875 25909 14911 121114 -80251 -19824 12159 -78081
1805g8081J46139q7112n5585m957L7982L0070O8562L5296j8555m0642M3252m5010
$$ -78081 68058 -19054 -74639 -79596 -41614 -11544 57018 92314 73759 33117 76369 31359
1793C1359o661l0723r9457J10294Q3166Q75M1861j00075j3645L8978p8819M1958
$$ 31359 24698 -6025 -105482 4812 87978 88853 130714 30639 16994 55972 -22847 19111
1781A9111J7656P5587L162j19223L0220j5964j8104M964L4979m3585L8819K12576
$$ 19111 36767 112354 115516 -3707 26513 10549 -7555 -2591 32388 -11197 27622 240198
1769B40198k73028r890J39520j15656J9190m6160K8339J8408O9784N9405m5890
$$ 240198 -32830 -42720 96800 -18856 334 -45826 -17487 921 70705 130110 84220
1758H4220L1699k98738K43572M3006p4606J8375j35789J16481r2400P4961K0140
$$ 84220 115919 -182819 60753 103759 29153 47528 -88261 28220 -64180 10781 30921
1747C0921r504L2860j64001r011J32646M2366k2135r6908j29205Q6337J527M0829
$$ 30921 21417 54277 -109724 -118735 13911 56277 34142 -62766 -191971 -105634 -104107 -63278
1735f3278M6127n5866R964l432m3399P0231p0104J44788j5198q3975k1181R8270
$$ -63278 -17151 -73017 -63053 -66485 -109884 -39653 -109757 35031 19833 -64142 -85323 12947
1723A2947J4461Q233Q7181o6458j69297K06748p1538o291L8767q2330Q5771j18429
$$ 12947 27408 35641 122822 56364 -112933 93815 22277 15986 54753 -27577 58194 -60235
1711f0235o239m7601N1012p2713J63041P0696O379l8693r439r7269J3838M3411
$$ -60235 -66474 -114075 -63063 -135776 27265 97961 104340 65647 56208 -41061 -27223 16188
1699A6188M803j17710K17192o4365o0249r9223m9766R3618L338l4665O337J04240
$$ 16188 20991 -96719 120473 56108 -4141 -103364 -153130 -59512 -56174 -90839 -84502 19738
1687A9738q6643o1365k4439J20734M6794R0012p8504o9955J9818O7394j19133
$$ 19738 -66905 -128270 -152709 -31975 14819 104831 26327 -43628 -23810 43584 -75549
1676g5549l71M2387k0722J91355O8404o5220j32194k73j13107n9858J64683j21538
$$ -75549 -75920 -33533 -54255 137100 205504 140284 8090 7817 -105290 -165148 -465 -122003
1664a22003r9878K31571o4838N4144p6569Q138J28684R3043j00450j76171Q341
$$ -122003 -221881 9690 -55148 -1004 -77573 -69435 59249 152292 51842 -124329 -115988
1653a15988J34572o1662m6746R7709j08426J01148J2196j84797J01469l6893P0768
$$ -115988 18584 -43078 -89824 7885 -100541 607 12803 -171994 -70525 -107418 -36650
1642c6650J16211q6699K6233j9168p8379P8262J6446K1492O2914l1718O6883j82200
$$ -36650 79561 -7138 19095 -73 -78452 -190 16256 37748 100662 68944 135827 -46373
1630d6373k6767l9093K9016K8342J04699p9604k1334R9165M4630o2526R5736O7123
$$ -46373 -73140 -112233 -83217 -54875 49824 -29780 -51114 48051 92681 30155 125891 193014
1618A93014j02168o6269n5925m3830J2230M9255j14527j4514J62040l8355n5308
$$ 193014 90846 24577 -31348 -75178 -62948 -13693 -128220 -142734 19306 -19049 -74357
1607g4357Q9353j74366Q0745l4002O0911Q1996r5694L4519m3422J30319n9203
$$ -74357 14996 -159370 -78625 -112627 -51716 30280 -65414 -30895 -74317 56002 -3201
1596c201m7610L384J10107J2600M6845p7124n5014l0104n6903j0262P7669O4569
$$ -3201 -50811 -47427 62680 75280 122125 45001 -10013 -40117 -97020 -107282 -29613 34956
1584C4956r0992m2138L7322K5461M7904J7970J11443k02604j36972O6030P2870
$$ 34956 -56036 -98174 -60852 -35391 12513 30483 141926 -60678 -197650 -131620 -58750
1573e8750m717j7996K3295p1503J03563k3608J01770j03378K4814k25561l6352
$$ -58750 -63467 -81463 -58168 -129671 -26108 -49716 52054 -51324 -26510 -252071 -288423
1562b88423N5311P2884P3267N7617K8096k2410J02163k18373J18401j803J4737
$$ -288423 -233112 -160228 -86961 -29344 -1248 -23658 78505 -139868 -21467 -23270 -8533
1551h533J0663M2642P7376l2682K7341r2958k04110M9616O1708R7314Q2452j49187
$$ -8533 2130 44772 122148 89466 116807 23849 -180261 -130645 -68937 28377 110829 -38358
1539c8358L5067J0581m4663q1905J28571r9796q7009R5513J03195J24747p4624
$$ -38358 -3291 7290 -37373 -119278 9293 -90503 -177512 -81999 21196 145943 71319
1528G1319k430q520q301l6670Q479J8058r9869j31862J76623l6680j8922J75378
$$ 71319 68889 60369 52068 15398 23877 41935 -57934 -189796 -13173 -49853 -68775 106603
1516A06603j11827R9642n1151O4390j23811r4339J9756N8233o3283J22709M2311
$$ 106603 -5224 94418 43267 107657 -16154 -110493 -90737 -32504 -95787 26922 69233
1505F9233q5164j04458k153l8925k7586Q1616K3977J2326N60k861j1132j16o9381
$$ 69233 -15931 -120389 -122542 -161467 -189053 -107437 -83460 -71134 -70574 -73435 -84567 -84683 -154064
1492a54064K7168J24862J12910m6762R7280l4650j19387P994m4055k17K2907o8120
$$ -154064 -126896 -2034 110876 64114 161394 126744 7357 15351 -28704 -28921 -6014 -74134
1480g4134m9836L6658m1008M7385n0832L0248J35058o561K2028M0827k2847n6461
$$ -74134 -123970 -87312 -128320 -80935 -131767 -101519 33539 26978 49006 89833 66986 10525
1468A0525j5565r3330Q8782l4141l9772j11203J33104m6824L711o4386J07726
$$ 10525 -5040 -98370 -9588 -43729 -83501 -194704 -61600 -108424 -104713 -169099 -61373
1457f1373M8256j13726J01196K8148j9175L2123j47883L0085L9985o987M4463
$$ -61373 -13117 -126843 -25647 2501 -16674 15449 -132434 -102349 -62364 -69351 -24888
1446b4888J07487R742j23608o1214J04081N0063L2099o110J0219j10658j18454
$$ -24888 82599 92341 -31267 -92481 11600 61663 93762 87652 97871 -12787 -131241
1435a31241N7153k4302O5629j02354j3678J62812j20723O6711N3678j56487J82016
$$ -131241 -74088 -98390 -32761 -135115 -148793 14019 -106704 -39993 13685 -142802 39214
1424C9214j13870P8101j13355r5726J53514k9843L2414J60815n8195N4989l0904
$$ 39214 -74656 3445 -109910 -205636 -52122 -81965 -49551 111264 53069 108058 77154
1413G7154K2790o5093j39238M0466J8006j5013k218J4590J9298P8542n9798k1076
$$ 77154 99944 34851 -104387 -63921 -45915 -60928 -63146 -48556 -29258 49284 -10514 -31590
1401c1590n2750K153Q2310k59564J24786J10508M8260R976r7678L3897R3373O6990
$$ -31590 -84340 -82187 123 -259441 -134655 -24147 24113 34089 -63589 -29692 63681 130671
1389A30671j64736J3400m4632n451J18086P0605L3715m8083L6644l1160n8695
$$ 130671 -34065 -20665 -65297 -70748 47338 117943 151658 103575 140219 109059 50364
1378E0364J3744k6874j17585k7328k0409M6357K059n4525M0215m5425J7015j40505
$$ 50364 64108 37234 -80351 -107679 -128088 -81731 -79672 -134197 -93982 -139407 -122392 -262897
1366b62897L01288p4455N6196O7812r6026K0427P3879p4269j56190P2353N4875
$$ -262897 38391 -36064 20132 87944 -8082 12345 86224 11955 -144235 -71882 -17007
1355a7007O3240j21781P92p9131J43693k8163L4604j960r5745J7706j24813J38231
$$ -17007 46233 -75548 -74756 -153887 -10194 -38357 -3753 -5713 -101458 -83752 -208565 -70334
1343g0334K22948j40038r6068L6050j46345M3154k7258Q7559J41112j16266J53812
$$ -70334 152614 12576 -83492 -47442 -193787 -150633 -177891 -90332 50780 -65486 88326
1332H8326j84867k6244M0129M3629j15186l4934J7526J82557J00547q4967q7903
$$ 88326 -96541 -122785 -82656 -39027 -154213 -189147 -171621 10936 111483 26516 -61387
1321f1387k2435J15028j7390K4806j03674M6777K5052l492J26049N3051k59554
$$ -61387 -83822 31206 13816 38622 -65052 -18275 6777 3285 129334 182385 -77169
1310g7169N5475P5606j96421J599J29285j21653Q3066K34650j03039p9549R4767
$$ -77169 -21694 53912 -142509 -140910 -11625 -133278 -50212 184438 81399 1850 96617
1299I6617O9431j38335j60313K3062L1114M9084n898J95352j27450j42623J6738
$$ 96617 166048 27713 -132600 -109538 -78424 -29340 -35238 160114 32664 -109959 -93221
1288i3221j4909L4653J400O6821j00472q4161J64157L6259j85731J48252L6576
$$ -93221 -108130 -73477 -72077 -5256 -105728 -189889 -25732 10527 -175204 -26952 9624
1277I624n2834Q6680j08201O3530j0664j13651K24697q2563j7388J2333m8181
$$ 9624 -43210 43470 -64731 -1201 -11865 -125516 99181 16618 -770 11563 -36618
1266c6618K8233k43P9838j73552J4320R0967j12241j7674j0087M3698P2139L7001
$$ -36618 -8385 -8628 71210 -102342 -88022 2945 -109296 -126970 -137057 -93359 -21220 15781
1254A5781j4351p3102J7979j1989O9805K9191m5459O1937O1241j78627O7751o5526
$$ 15781 1430 -71672 -53693 -65682 4123 33314 -12145 49792 111033 -67594 157 -65369
1242f5369R8783m2009o8895J76893j21460j6481m6285Q1256J51687j17964k977
$$ -65369 33414 -8595 -77490 99403 -22057 -38538 -84823 -3567 148120 30156 27179
1231B7179j29933k5483J95716j23605M1193L6440n1310J7395l5793M6071L5111
$$ 27179 -102754 -128237 67479 -56126 -14933 21507 -29803 -12408 -48201 -2130 32981
1220C2981j9799J1084L4290j34045j14443Q7555J36549j602J1387n2447j61104
$$ 32981 13182 24266 58556 -75489 -189932 -102377 34172 32570 43957 -8490 -169594
1209a69594O009R8244K9734O2683q9266N9455r6008Q5213J6762O016M844J16660
$$ -169594 -163585 -65341 -35607 27076 -62190 -2735 -98743 -13530 3232 9248 14092 130752
1197A30752j71722j26008J72710j10157P8884k3814m2157R5707n4911n8516N7195
$$ 130752 -40970 -166978 5732 -104425 -25541 -49355 -91512 4195 -50716 -109232 -52037
1186e2037j7711K47839k3986p3980P3757o8720j23322m005K2715K07769j10639
$$ -52037 -69748 178091 154105 80125 153882 85162 -38160 -42165 -19450 188319 77680
1175G7680J02850n0580r8342K4656j60062n792J16018l7667O2927n091j76407
$$ 77680 180530 129950 31608 56264 -103798 -109590 6428 -31239 31688 26597 -149810
1164a49810Q3571P6192j42329K13808o4489j16956K28037j11036K8756N1217j32545
$$ -149810 -66239 9953 -132376 81432 16943 -100013 128024 16988 45744 96961 -35584
1153c5584j12220L6929J02877O4680J38048l2597p2989o8089k7070j50663K4017
$$ -35584 -147804 -110875 -7998 56682 194730 162133 89144 21055 -6015 -156678 -132661
1142a32661N3179R4908M8761k2976m4635m5966P2655l5033j03900L4182P0006
$$ -132661 -79482 15426 64187 41211 -3424 -49390 23265 -11768 -115668 -81486 -11480
1131a1480q2458J56700O5087j27346M154j29213n2839k7838J42571O5488J5107
$$ -11480 -93938 62762 127849 503 4657 -124556 -177395 -205233 -62662 2826 17933
1120A7933j25615J19912J38493q9142q1788N77m3515O7164J1902J10360j25441
$$ 17933 -107682 12230 150723 61581 -20207 -19630 -63145 4019 15921 126281 840
1109H40m6048L8703q8062L8497p0469K13663N4095k40305R3889p3879k3018N8253
$$ 840 -45208 -6505 -94567 -56070 -126539 87124 141219 -99086 -5197 -79076 -102094 -43841
1097d3841O0831J16534j25623j7398l0908k1857j07841J00674L8544k2986p6046
$$ -43841 16990 133524 7901 -9497 -40405 -62262 -170103 -69429 -30885 -53871 -129917
1086a29917K20940n1691j2114k0288o272n1525j5855l3224Q7876j36841R7638
$$ -129917 91023 39332 27218 6930 658 -50867 -66722 -99946 -12070 -148911 -51273
1075e1273j8334J14000m1917Q3763K0664K0198j32243J9961m0799O4606q6372
$$ -51273 -69607 44393 2476 86239 106903 127101 -5142 14819 -25980 38626 -47746
1064d7746M113n7506Q3772k0827k23390K26280k1127l5028p5164J16115Q46O6714
$$ -47746 -43633 -101139 -17367 -38194 -261584 -35304 -56431 -91459 -166623 -50508 -49662 17052
1052A7052m2649r2707N3489M9929n5705M662R397K00712K1918j58039n3149Q0492
$$ 17052 -25597 -118304 -64815 -14886 -70591 -65929 -56532 144180 166098 8059 -45090 35402
1040C5402M8438q1342q9769K09057n7634l9656K1672N2414j07944K2908M5416
$$ 35402 83840 2498 -87271 121786 64152 24496 46168 98582 -9362 13546 58962
1029E8962N479m4180j46729K5090l5811M7165P3699M3514r01L7720K9644m5681
$$ 58962 64441 20261 -126468 -101378 -137189 -90024 -16325 27189 26288 64008 93652 47971
1017D7971n9946L759r4133J45996K9087j51678o0665m1787J55274m1953K9139
$$ 47971 -11975 -8216 -102349 43647 72734 -78944 -139609 -181396 -26122 -68075 -38936
1006c8936J4260l5634O3756N0922J1996K8693l3324n6175r280j17375P0173R6313
$$ -38936 -24676 -60310 3446 54368 66364 95057 61733 5558 -3722 -121097 -50924 45389
994D5389k21538K10896O9397p8515m1444l8040N723L4085M9727k3727P0635O313
$$ 45389 -176149 34747 104144 25629 -15815 -53855 -48132 -14047 35680 11953 82588 88901
982H8901m4857J4377k5610m2053P3805j09139L5970q2926J1750N7659o4238n6440
$$ 88901 44044 58421 32811 -9242 64563 -44576 -8606 -91532 -79782 -22123 -86361 -142801
970a42801J46194J34527m0133j01645J6534j59104P6659J91523L2415o6745q5118
$$ -142801 3393 137920 97787 -3858 12676 -146428 -69769 121754 154169 87424 2306
959B306j09350P3747O1936j23592J56507q9927K41059l4990j16481q6002J50373
$$ 2306 -107044 -33297 28639 -94953 61554 -28373 212686 177696 61215 -24787 125586
948A25586p0060P2350N0190j8775k28637K7899M6361k2468j18026J28444L9820
$$ 125586 55526 127876 178066 159291 -69346 -41447 4914 -17554 -135580 -7136 32684
937C2684k5672j8582o1573O4988k9815j3184J26741k061k34715J68148J63131
$$ 32684 7012 -11570 -73143 -8155 -37970 -51154 75587 73526 -161189 6959 170090
926A70090r2537r3576l4144K0890q7835j9619L4221J49266L1540m0064L4606j78691
$$ 170090 77553 -16023 -50167 -29277 -117112 -136731 -102510 46756 78296 38232 72838 -105853
914a05853K72591j8594r1743q7519q8872M4834Q3755n8069O7373k5465q031K5112
$$ -105853 166738 148144 56401 -31118 -119990 -75156 8599 -49470 17903 -7562 -15593 9519
902I519M8017j2581L4449r1765M7713R0926O1421k3491L3931K2413j88528N8247
$$ 9519 57536 44955 79404 -12361 35352 126278 187699 164208 198139 220552 32024 90271
890I0271o3155j41108j5010J7241O6601q7193R8038j7706O6963j1733M8018n8244
$$ 90271 27116 -113992 -129002 -111761 -45160 -132353 -34315 -52021 14942 3209 51227 -7017
878g017J0883M797L9955K2344p4473K1242k8670o999P3360p0699J4633O2513j5255
$$ -7017 3866 8663 48618 70962 -3511 17731 -10939 -17938 55422 -15277 -644 61869 46614
865D6614K6669j18572K9977l7215N9372n1840L5002J98290j25829j17316o1961
$$ 46614 73283 -45289 -15312 -52527 6845 -44995 -9993 188297 62468 -54848 -116809
854a16809J65484r3345J15403J12183j51418j8520J20449p0853j23395R2384P4345
$$ -116809 48675 -44670 70733 182916 31498 12978 133427 62574 -60821 31563 105908
843A05908l3598q2352M0776R9956j983j84041L7415L5893J51308j72105j4648
$$ 105908 72310 -10042 30734 130690 128707 -55334 -17919 17974 169282 -2823 -17471
832a7471r025M4668l981o2280P061K958J48783j7377K8949m6189n2049q5423J15447
$$ -17471 -26496 18172 14191 -48089 -41028 -38070 110713 93336 122285 76096 24047 -61376 54071
819E4071m4278j3663J40608N1659p2499j11068P9965k02552M9272J49862l4021
$$ 54071 9793 -3870 136738 188397 115898 4830 84795 -117757 -68485 81377 47356
808D7356j2185j92158N4716J29895k0901O0428j4547Q7089r3530N5392j30409
$$ 47356 35171 -156987 -102271 27624 6723 67151 52604 139693 46163 101555 -28854
797b8854p4545M3961K7640N0456l6827J51437o5419m4730l4001N9387R3429k43936
$$ -28854 -103399 -59438 -31798 18658 -18169 133268 67849 23119 -10882 48505 141934 -102002
785a02002J27464J11345l6112j91728Q4352k13O9298K2085j5954N8334l1246K5899
$$ -102002 25462 136807 100695 -91033 -6681 -6894 62404 84489 68535 126869 95623 121522
773A21522K0488j32432L0753o6605p8850P6763J65202m2982j18548M1727o0592
$$ 121522 142010 9578 40331 -26274 -105124 -28361 136841 93859 -24689 17038 -43554
762d3554J10967j3046m0641r2434R9899j5174o9800p2201l6625P6680L06197j46386
$$ -43554 67413 54367 13726 -78708 21191 6017 -63783 -135984 -172609 -95929 210268 63882
750F3882r7891j07618r633P9162R6790N7205j33487m7645N1191N8787j30o1258
$$ 63882 -34009 -141627 -151260 -72098 24692 81897 -51590 -99235 -48044 10743 10613 -50645
738e0645j4270K49498j77672M1869j03652P5195J2955j65998q791M4263J96733
$$ -50645 -64915 184583 6911 48780 -54872 20323 33278 -132720 -141511 -97248 99485
727I9485n5082o4245J4896K0230N0952m1776q8672k2802j29122J46224O7588l1835
$$ 99485 44403 -19842 -4946 15284 66236 24460 -64212 -87014 -216136 -69912 -2324 -34159
715c4159J74174r3534K7892R921M1396j49461r819P3924k3148J02114k7820K974
$$ -34159 140015 46481 74373 84294 125690 -23771 -33590 40334 17186 119300 91480 94454
703I4454o2113l1433j40658J5046J30928L3348n2511N1238M4845O2777j0876q3510
$$ 94454 32341 908 -139750 -124704 6224 39572 -12939 38299 83144 145921 135045 51535
691E1535j11802p9436N2614J83368k4472j00199j9519Q0476l7082n6175R4935
$$ 51535 -60267 -139703 -87089 96279 71807 -28392 -47911 32565 -4517 -60692 34243
680C4243J27947j26229n0628R665L2814q184O549n5770p5564P4722L3679M401
$$ 34243 162190 35961 -14667 -5002 27812 19628 26177 -29593 -105157 -30435 3244 7645
668G645j7807m3067N9201L4967k4941J17145j3203j53147J28981R9571O1949K6637
$$ 7645 -10162 -53229 5972 40939 15998 133143 119940 -33207 95774 195345 257294 283931
656B83931j71553k8282j54650n9068O3662R4703Q5380j20797J9353P898K1846
$$ 283931 112378 84096 -70554 -129622 -65960 28743 114123 -6674 12679 20577 42423
645D2423j30938o431J28200K9753o5436J61628j094k5342m0223O492l5743p0855
$$ 42423 -88515 -94946 33254 63007 -2429 159199 158105 132763 92540 99032 63289 -7566
633g566j1218R1157j24180O9887Q2838L8434N1420k28700O432O0026k5797l0072
$$ -7566 -18784 72373 -51807 18080 100918 139352 190772 -37928 -31496 28530 2733 -27339
621b7339l0917o887J25381o107m5845p7884P6369O9389j5467l3665R3197k30541
$$ -27339 -58256 -65143 60238 54131 8286 -69598 6771 76160 60693 27028 120225 -110316
609a10316p8904J64535j8091j3535J2341K6952N8254j30032J00304K3659K1321
$$ -110316 -189220 -24685 -42776 -56311 -43970 -17018 41236 -88796 11508 35167 56488
598E6488j55894J11193p4572J33703M5527j4048Q252J9480j62933L7787K8789
$$ 56488 -99406 11787 -62785 70918 116445 102397 110649 130129 -32804 4983 33772
587C3772m5105N5100J10545j8660j07085O6415n0160L2336o0204P7360j65745
$$ 33772 -11333 43767 154312 135652 28567 94982 44822 77158 16954 94314 -71431
576g1431J07290P0689j44733L8124N3924j519q6202J43829j08144o3349K07489
$$ -71431 35859 106548 -38185 -61 53863 52344 -33858 109971 1827 -61522 145967
565A45967j18419j39214m3555K08553o8791L0450J8333m6838j6754Q3296J74664
$$ 145967 27548 -111666 -155221 53332 -15459 14991 33324 -13514 -30268 53028 227692
554B27692j70258o2320k4034l0084o3930L8542K05412l8548o0637l829M6312m3655
$$ 227692 57434 -4886 -28920 -59004 -122934 -84392 121020 82472 21835 18006 64318 20663
542B0663J386j70063O9597J77298J29449k71941Q5177M2280k10938Q912O3045
$$ 20663 22049 -148014 -78417 98881 228330 -43611 41566 83846 -127092 -118180 -55135
531e5135J51591m853J48428j44907j97894p4097m1656O2426j2829K8851N0806
$$ -55135 96456 91603 240031 95124 -102770 -176867 -218523 -156097 -168926 -140075 -89269
520h9269P6621l7057R9628j26977O8892J81048p8106k2120l5513q3944k0512J85326
$$ -89269 -12648 -49705 49923 -77054 -8162 172886 94780 72660 37147 -46797 -67309 118017
508A18017P4204K6712k06482q103q78r1903R0856J74783p8977k9469o1322J20559
$$ 118017 192221 218933 12451 4348 3470 -88433 2423 177206 98229 68760 7438 127997
496A27997j20891M3174M8367O1809M7439k03523k3546N2020k3141Q2560j02103
$$ 127997 7106 50280 98647 160456 207895 4372 -19174 32846 9705 92265 -9838
485i838M130m1633r748p6461J09318O4832q8058j30300J48141O6438J8904j55900
$$ -9838 -5708 -47341 -57089 -133550 -24232 40600 -47458 -177758 -29617 36821 55725 -100175
473a00175l594n3923J02187K71680j9266j82485o4722O1013Q6020Q91n1706n7278
$$ -100175 -103769 -157692 -55505 216175 196909 14424 -50298 10715 96735 97626 45920 -11358
461a1358o390J39867j1515p7499r791J89855j13712n2260p6461O5365j37061J47477
$$ -11358 -17748 122119 110604 33105 23314 213169 99457 47197 -29264 36101 -100960 46517
449D6517j0000p5947J9776P7571q0533J04724j37580N6203n924j8521m4726R5581
$$ 46517 36517 -39430 -19654 57917 -22616 82108 -55472 731 -5193 -23714 -68440 27141
437B7141K3243O4349o1477p1434J9668j0239Q3925k0176l9410J78443j40759L7740
$$ 27141 50384 114733 53256 -18178 1490 -8749 75176 55000 15590 194033 53274 91014
425I1014q1050K3320J38391n9766m8357M3159j22015j5522l7537O8239k7020j575
$$ 91014 9964 33284 171675 111909 63552 106711 -15304 -30826 -68363 -124 -27144 -28719
413b8719r431m08J5260J175p1106J32031l6269R4622j15343N4098J61269j77887
$$ -28719 -38150 -38558 -23298 -22123 -93229 38802 2533 97155 -18188 35910 197179 19292
401A9292m0187O655M31J0270k0126J9346N3434l7009R184k00182j2723O2952M4120
$$ 19292 -20895 -14240 -13809 -3539 -23665 -4319 49115 12106 21290 -178892 -191615 -128663 -84543
388h4543j3511M8027k5014J22769n1831L2169m3281M2515j10247K237m5332R2266
$$ -84543 -98054 -50027 -75041 47728 -4103 28066 -15215 27300 -82947 -80710 -126042 -33776
376c3776J17943m5646j7415J43187J08507l0252j11285r1348j06809O8394J66535
$$ -33776 84167 38521 21106 164293 272800 242548 131263 39915 -66894 1500 168035
365A68035p2354j55754L9241j57726J99756n2888M5256j25168j7999J57464J39527
$$ 168035 95681 -60073 -20832 -178558 21198 -31690 13566 -111602 -129601 27863 167390
354A67390j88697J44192o8905L3383j3502j10017O2811J95919q2248j17373j32509
$$ 167390 -21307 122885 53980 87363 73861 -36156 26655 222574 140326 22953 -109556
343a09556n1692J56019O3614j27539P3919J53034r6478k4852J32470p7256j05646
$$ -109556 -161248 -5229 58385 -69154 4765 157799 61321 36469 168939 91683 -13963
332a3963o4330Q8474j14017j16159N0918O7592J96913j28499l7050n4140J50083
$$ -13963 -78293 10181 -103836 -219995 -169077 -101485 95428 -33071 -70121 -124261 25822
321B5822j25165l8439p60J58296q1427o2168J09577p7604M240P657P3626P8448
$$ 25822 -99343 -137782 -138542 19754 -61673 -123841 -14264 -91868 -87628 -79971 -6345 72103
309G2103J18748j61014K7828q4670q0111J46180q2155M8297N1622J11398q3453
$$ 72103 190851 29837 57665 -27005 -107116 39064 -43091 5206 56828 168226 84773
298H4773r2978M0851M732p8143k2194P8853n7632l5634M8079j2448L9741L8920
$$ 84773 -8205 32646 37378 -40765 -62959 15894 -41738 -77372 -29293 -41741 -2000 36920
286C6920q6066l3479J64687n2078M0410K7954M9952j02488J2972L835q2633m8844
$$ 36920 -49146 -82625 82062 29984 70394 98348 148300 45812 58784 62619 -20014 -68858
274f8858O6446O4403J1208N2283l645j36060J03098N190j39797Q159o5955m5828
$$ -68858 -2412 61991 73199 125482 121837 -14223 88875 94065 -45732 -37573 -103528 -149356
262a49356M4408N9191Q8409l3705N1563O0737j13622o3992R4608l3148L2324p1052
$$ -149356 -104948 -45757 42652 8947 60510 121247 7625 -56367 38241 5093 37417 -33635
250c3635o0688p8011P2959L8386l2416j11939J10388J26484J20337j42483O353
$$ -33635 -94323 -172334 -99375 -60989 -93405 -205344 -94956 31528 151865 9382 15735
$$ [...]
##END NTUPLES=NMR SPECTRUM
##END=
