##TITLE=1H_CG-1201-4
 CDCl3
 8 sc, 
 8.4.2024
##JCAMPDX= 6.0         $$ Bruker NMR JCAMP-DX V2.0
##DATA TYPE= NMR SPECTRUM
##DATA CLASS= NTUPLES
##ORIGIN= UXNMR, Bruker Analytische Messtechnik GmbH
##OWNER= root
$$ XWIN-NMR		Version 3.5
$$ Mon Apr  8 13:54:36 2024 Russian Standard Time (UT+4h)  she@DPX200
##.OBSERVE FREQUENCY= 200.1309
##.OBSERVE NUCLEUS= ^1H
##.ACQUISITION MODE= SIMULTANEOUS
##.ACQUISITION SCHEME= undefined
##.AVERAGES= 8
##.DIGITISER RES= 18
##SPECTROMETER/DATA SYSTEM= spect
##.PULSE SEQUENCE= zg30
##.SOLVENT NAME= CDCl3
##.SHIFT REFERENCE= (INTERNAL, CDCl3, 0, 15.6158)
##AUDIT TRAIL= $$ (NUMBER, WHEN, WHO, WHERE, WHAT)
$$ ##TITLE= Audit trail, XWIN-NMR		Version 3.5
$$ ##JCAMPDX= 5.01
$$ ##ORIGIN= Bruker BioSpin GmbH
$$ ##OWNER= she
$$ F:/spectra/data/she/nmr/H-F/1/pdata/1/auditp.txt
$$ ##AUDIT TRAIL=  $$ (NUMBER, WHEN, WHO, WHERE, WHAT)
(   1,<2024-04-08 13:53:01.84 +0400>,<she>,<DPX200>,
      <created by zg, POWCHK disabled, PULCHK disabled
       configuration hash MD5:
       00 E9 B6 7A A2 85 ED C7 34 08 36 98 17 FE 4E 26
       data hash MD5: 16K
       F6 53 10 11 ED 1A 51 48 8A 72 FA 27 16 B5 14 C2>)
(   2,<2024-04-08 13:53:27.75 +0400>,<she>,<DPX200>,
      <Start of raw data processing
       efp BC_mod = 2 LB = 0.24 FT_mod = 6 PKNL = 1 PHC0 = -25297.81 PHC1 = 9.387311 SI = 16K 
       data hash MD5: 16K
       1D 28 21 EF 6D 4D 91 2F 0E 6F CA 94 F1 09 85 6B>)
(   3,<2024-04-08 13:53:46.45 +0400>,<she>,<DPX200>,
      <pk PHC0 = -4.271925 PHC1 = 8.2 
       data hash MD5: 16K
       E1 22 EB E2 74 61 92 4A 2B 42 BF 23 F4 FB 89 4E>)
(   4,<2024-04-08 13:53:51.03 +0400>,<she>,<DPX200>,
      <abs ABSG = 5 
       data hash MD5: 16K
       E0 2D 5B F9 51 A2 BB BB FA F8 9A 7E EA 44 AA 23>)
$$ ##END=
$$ 
$$ hash MD5
$$ 68 53 22 BD 88 2B 30 4E 39 C4 A4 95 B0 2B E0 81
##$RELAX= 
##$RELAX= 
##$RELAX= 
##$RELAX= 
##$RELAX= 
##$RELAX= 
$$ Bruker specific parameters
$$ --------------------------
##$DU= <F:/spectra>
##$EXPNO= 1
##$NAME= <H-F>
##$PROCNO= 1
##$TYPE= <nmr>
##$USER= <she>
##$AMP= (0..31)
100 100 100 100 100 100 100 100 100 100 100 100 100 100 100 100 100 100 
100 100 100 100 100 100 100 100 100 100 100 100 100 100 
##$AQSEQ= 0
##$AQ_mod= 1
##$AUNM= <au_zg>
##$AUTOPOS= <>
##$BF1= 200.13
##$BF2= 200.13
##$BF3= 200.13
##$BF4= 200.13
##$BF5= 200.13
##$BF6= 200.13
##$BF7= 200.13
##$BF8= 200.13
##$BYTORDA= 1
##$CFDGTYP= 0
##$CFRGTYP= 5
##$CHEMSTR= <none>
##$CNST= (0..31)
1 1 145 1 1 1 1 1 1 1 1 1 1 1 1 1 1 1 1 1 1 1 1 1 1 1 1 1 1 1 1 1 
##$CPDPRG= <>
##$CPDPRG1= <>
##$CPDPRG2= <>
##$CPDPRG3= <>
##$CPDPRG4= <mlev>
##$CPDPRG5= <mlev>
##$CPDPRG6= <mlev>
##$CPDPRG7= <mlev>
##$CPDPRG8= <mlev>
##$CPDPRGB= <>
##$CPDPRGT= <>
##$D= (0..31)
0 1.2 0 0 0 0 0 0 0 0.06 0 0.03 0 0 0 0 0.0002 0 0 0 0 0 0 0 0 0 0 0 0 
0 0 0 
##$DATE= 1712569981
##$DBL= (0..7)
120 120 120 120 120 120 120 120 
##$DBP= (0..7)
150 150 150 150 150 150 150 150 
##$DBP07= 0
##$DBPNAM0= <>
##$DBPNAM1= <>
##$DBPNAM2= <>
##$DBPNAM3= <>
##$DBPNAM4= <>
$$ [...]
##$SUBNAM3= <"">
##$SUBNAM4= <"">
##$SUBNAM5= <"">
##$SUBNAM6= <"">
##$SUBNAM7= <"">
##$SUBNAM8= <"">
##$SUBNAM9= <"">
##$SW= 18.0517689322627
##$SWIBOX= (0..15)
0 0 2 0 0 0 0 0 0 0 0 0 0 0 0 0 
##$SW_h= 3612.71676300578
##$TD= 16384
##$TD0= 1
##$TE= 0
##$TE2= 300
##$TE3= 300
##$TEG= 300
##$TL= (0..7)
0 120 120 120 120 120 120 120 
##$TP= (0..7)
150 150 150 150 150 150 150 150 
##$TP07= 0
##$TPNAME0= <>
##$TPNAME1= <>
##$TPNAME2= <>
##$TPNAME3= <>
##$TPNAME4= <>
##$TPNAME5= <>
##$TPNAME6= <>
##$TPNAME7= <>
##$TPOAL= (0..7)
0.5 0.5 0.5 0.5 0.5 0.5 0.5 0.5 
##$TPOFFS= (0..7)
0 0 0 0 0 0 0 0 
##$TUNHIN= 0
##$TUNHOUT= 0
##$TUNXOUT= 0
##$USERA1= <user>
##$USERA2= <user>
##$USERA3= <user>
##$USERA4= <user>
##$USERA5= <user>
##$V9= 5
##$VALIST= <valist>
##$VCLIST= <CCCCCCCCCCCCCCC>
##$VD= 0
##$VDLIST= <DDDDDDDDDDDDDDD>
##$VPLIST= <PPPPPPPPPPPPPPP>
##$VTLIST= <TTTTTTTTTTTTTTT>
##$WBST= 1024
##$WBSW= 4
##$XGAIN= (0..3)
0 0 0 0 
##$XL= 0
##$YL= 0
##$YMAX_a= 81694
##$YMIN_a= -123393
##$ZGOPTNS= <>
##$ZL1= 120
##$ZL2= 120
##$ZL3= 120
##$ZL4= 120
##$ABSF1= 15.64886
##$ABSF2= -2.403029
##$ABSG= 5
##$ABSL= 3
##$ALPHA= 0
##$AQORDER= 0
##$ASSFAC= 0
##$ASSFACI= 0
##$ASSFACX= 0
##$ASSWID= 0
##$AUNMP= <proc_1d>
##$AZFE= 0.1
##$AZFW= 0.1
##$BCFW= 0
##$BC_mod= 2
##$BYTORDP= 0
##$COROFFS= 0
##$CY= -3
##$DATMOD= 1
##$DC= 0
##$DFILT= <>
##$DTYPP= 0
##$F1P= 0
##$F2P= 0
##$FCOR= 1
##$FTSIZE= 16384
##$FT_mod= 6
##$GAMMA= 0
##$GB= 0
##$INTBC= 1
##$INTSCL= 3.70164e-10
##$ISEN= 128
##$LB= 0.24
##$LEV0= 0
##$LPBIN= 0
##$MAXI= 10000
##$MC2= 0
##$MEAN= 0
##$ME_mod= 0
##$MI= 1.114404
##$NCOEF= 0
##$NC_proc= -9
##$NLEV= 6
##$NOISF1= 3.799351
##$NOISF2= 2.8
##$NSP= 0
##$NTH_PI= 0
##$NZP= 0
##$OFFSET= 15.61581
##$PC= 1
##$PHC0= -25302.08
##$PHC1= 17.58731
##$PH_mod= 1
##$PKNL= yes
##$PPARMOD= 0
##$PSCAL= 0
##$PSIGN= 0
##$REVERSE= no
##$SF= 200.129581172874
##$SI= 16384
##$SIGF1= 3
##$SIGF2= 2
##$SINO= 5.538805
##$SIOLD= 16384
##$SREGLST= <1H.CDCl3>
##$SSB= 0
##$STSI= 16384
##$STSR= 0
##$SW_p= 3612.71676300577
##$SYMM= 0
##$S_DEV= 0
##$TDeff= 16384
##$TDoff= 0
##$TI= <>
##$TILT= no
##$TM1= 0
##$TM2= 0
##$TOPLEV= 0
##$USERP1= <user>
##$USERP2= <user>
##$USERP3= <user>
##$USERP4= <user>
##$USERP5= <user>
##$WDW= 1
##$XDIM= 16384
##$YMAX_p= 366391652
##$YMIN_p= -3296507
$$ End of Bruker specific parameters
$$ ---------------------------------
##NTUPLES= NMR SPECTRUM
##VAR_NAME=  FREQUENCY,     SPECTRUM/REAL,   SPECTRUM/IMAG
##SYMBOL=    X,             R,               I
##VAR_TYPE=  INDEPENDENT,   DEPENDENT,       DEPENDENT
##VAR_FORM=  AFFN,          ASDF,            ASDF
##VAR_DIM=   16384,         16384,           16384
##UNITS=     HZ,            ARBITRARY UNITS, ARBITRARY UNITS
##FACTOR=    0.220516191357247, 1,           1
##FIRST=     3125.18559388369, 0,            0
##LAST=      -487.531169122079, 0,           0
##MIN=       -487.531169122079, -3296507,    0
##MAX=       3125.18559388369, 366391652,    0
$$ Real data points
##PAGE= N=1
##DATA TABLE= (X++(R..R)), XYDATA
$$ [...]
8048B709069j06805M00511L68196k67935N07523p14791J73837j558495L82377
$$ 2709069 2602264 3002775 3370971 3103036 3610559 2895768 3069605 1511110 1893487
8039A893487Q45704o63495l36087r42977q80561O91690k58780m0408J27133r91946
$$ 1893487 2739191 2075696 1739609 796632 -83929 607761 348981 308573 435706 -556240
8029e56240O69180L82488M33879o71930o6952M66759J193260L26540r12798O08675
$$ -556240 112940 495428 929307 257377 190425 657184 1850444 2176984 1264186 1872861
8019A872861j007081P55315k95975R52052l78128j515091O81179L20435o16229
$$ 1872861 865780 1621095 1325120 2277172 1899044 383953 1065132 1385567 769338
8010G69338N08622J320659J9522l40479j41449m00703m80998J025996P15911r5865
$$ 769338 1277960 2598619 2618141 2277662 2136213 1735510 1254512 2280508 2996419 2900554
8000B900554j025256P026M91885j16314k99854n12845j237633L42153q9630j81561
$$ 2900554 1875298 1882324 2374209 2257895 1958041 1445196 207563 549716 460086 278525
7990B78525p58435J360528L23659J568935p36362m61522l95158n79452R89966
$$ 278525 -479910 880618 1204277 2773212 2036850 1575328 1180170 600718 1590684
7981A590684r33324j314431M05456L91131j45155l56387J625766n78873n02562
$$ 1590684 657360 -657071 -251615 139516 -5639 -362026 1263740 684867 182305
7972A82305J084527J90520j007249o60809N14165l37119P86269K9650M85058R02847
$$ 182305 1266832 1457352 450103 -210706 303459 -33660 752609 782259 1267317 2170164
7962B170164L70314k060856n97440L20262J56328q40057J388814O04453j084821
$$ 2170164 2540478 479622 -117818 202444 358772 -481285 907529 1511982 427161
7953D27161J121078j55389J65835p26476r85375J30042J527548J20706q39600
$$ 427161 1548239 1392850 1558685 832209 -153166 -23124 1504424 1625130 785530
7944G85530l97237j84045Q94122J92934j670028l6971M89878q595j29577q86491
$$ 785530 388293 204248 1098370 1291304 -378724 -415695 74183 65588 -63989 -950480
7934i50480J049444q50272J014403J18901P9302J491883o47983K36159j55560
$$ -950480 98964 -751308 263095 381996 461298 1953181 1305198 1541357 1385797
7925A385797j005791K8519K12571j047251L03110p8021J057061N31352n4740r51239
$$ 1385797 380006 408525 621096 -426155 -123045 -201066 855995 1387347 1332607 381368
7915C81368m9543N32088K40113o83656p84062K27112p62188m5367N06174J575005
$$ 381368 331825 863913 1104026 420370 -363692 -136580 -898768 -944135 -437961 1137044
7905A137044K1378j036982k09112L89165M90159P90205j363751L54388p58681
$$ 1137044 1158422 121440 -87672 301493 791652 1581857 218106 572494 -186187
7896a86187n56662l71523L59997J371880L2087O44140l48265q30838n1074J239801
$$ -186187 -742849 -1114372 -754375 617505 649592 1293732 945467 114629 63555 1303356
7886A303356k29280o09946l16826P9799M86084M37116m43652L87208o54741l12981
$$ 1303356 1074076 464130 147304 227103 713187 1150303 706651 1093859 439118 126137
7876A26137j49600j36325J95632j408847q97727O27404N24569R66642j080020
$$ 126137 -23463 -159788 35844 -1373003 -2270730 -1643326 -1118757 -152115 -1232135
7867a232135J377483l1508L5638J249885l62752m91223k30344L35762l84719o47810
$$ -1232135 145348 113840 149478 1399363 1036611 545388 315044 650806 266087 -381723
7857c81723J247283N17902j139960J667483k30556j16400p52733j336194R69260
$$ -381723 865560 1383462 243502 1910985 1680429 1564029 811296 -524898 444362
7848D44362k30627L84526J09889l77653R02768r61892N26741M5571l29759q44281
$$ 444362 213735 598261 708150 330497 1233265 271373 798114 843685 513926 -330355
7838c30355J578683R6838P75837j004856l36752N8248j45424R20877p79443M84248
$$ -330355 1248328 1345166 2121003 1116147 779395 837643 692219 1613096 833653 1317901
7828A317901J81765j24316P00118j614088m49901L3518j84346K84826J241613
$$ 1317901 1499666 1375350 2075468 461380 11479 44997 -139349 145477 1387090
7819A387090o40860J13138j08547m85225k28107L84170P13199R93800m1305q30520
$$ 1387090 746230 859368 750821 265596 37489 421659 1134858 2128658 2087353 1256833
7809A256833l35653N31394j232400K77913O82628k992580j48347J630702K375001
$$ 1256833 921180 1452574 220174 498087 1180715 -1811865 -1960212 -329510 2045491
7800B045491k46528q25097m17820R61209n31275K66138p22945o67247P84142J022426
$$ 2045491 1798963 973866 556046 1517255 985980 1252118 529173 -138074 646068 1668494
7790A668494j446457m12891P54101O57302p04923P24292q91440j158547J058978
$$ 1668494 222037 -190854 563247 1220549 515626 1239918 348478 -810069 248909
7781B48909q48548J292332M51373k05989j159631m27248N41790J92946K05690
$$ 248909 -599639 692693 1144066 938077 -221554 -648802 -107012 85934 291624
7772B91624r66018P63598P72693j384322R29602m3887L37744K093543j416212
$$ 291624 -674394 89204 861897 -522425 407177 363290 701034 2794577 1378365
7763A378365k37402l99228L83656l30555J48275L9960J281219K25649o27695M90299
$$ 1378365 1140963 741735 1125391 794836 943111 983071 2264290 2489939 1862244 2352543
7753B352543q9582j913216m21876J464218r21087q47699m82840J622795R41420
$$ 2352543 2262961 349745 -72131 1392087 471000 -376699 -859539 763256 1704676
7744A704676j539544N41236M92043q13911k06996L50790j347912J69291O81887
$$ 1704676 165132 706368 1198411 384500 177504 528294 -819618 -650327 31560
7735C1560l42585q27484J253168L58295j34069R8356l49703M70777p25278J070332
$$ 31560 -311025 -1138509 114659 472954 338885 437241 87538 558315 -166963 903369
7725I03369o45731q98543k72984Q66405n26007j315788J338468K11082p2792L86003
$$ 903369 257638 -640905 -913889 -47484 -573491 -1889279 -550811 -339729 -412521 -26518
7715b6518k03288Q54254J7546j06632n5149o65786q85523N02378M21379l58352
$$ -26518 -229806 624448 641994 535362 480213 -185573 -1071096 -568718 -147339 -505691
7705e05691m34835J267350Q77016j068962N41128M78043j051262j37624m3944
$$ -505691 -940526 326824 1203840 134878 676006 1154049 102787 -34837 -78781
7696g8781o11512J926J079420Q14308j114069q23350J516519j43854j59918J077791
$$ -78781 -690293 -688367 391053 1205361 91292 -732058 784461 640607 480689 1558480
7686A558480k984306K94530J460455n30696M25705J19279J36528p04428O33685
$$ 1558480 -1425826 -1131296 329159 -201537 224168 343447 479975 -224453 409232
7677D09232K09696r6072Q88661m63302j83041p19204j44263m5804N27602l11412
$$ 409232 618928 522856 1411517 948215 765174 45970 -98293 -144097 383505 72093
7667G2093J75917M16408o36721K92416L36534o79720n97904P08637M82733l19866
$$ 72093 248010 664418 27697 320113 656647 -23073 -620977 87660 570393 250527
7657B50527n54885N15152j520960K463918O47013j412079J064248j298092j409201
$$ 250527 -304358 210794 -1310166 1153752 1800765 388686 1452934 154842 -1254359
7648a254359Q00966j43982Q5413L88873M15615m33162n47591l72330N66215N70634
$$ -1254359 -453393 -597375 -511962 -123089 292526 -140636 -688227 -1060557 -494342 76292
7638G6292K30235p87078J484822N51665j969322l91019J434741q89057N58905
$$ 76292 306527 -480551 1004271 1555936 -413386 -804405 630336 -258721 300184
7629C00184j14403J44379r31669R31825L40784j71935o38056j28398J257410n9463
$$ 300184 185781 330160 -601509 330316 671100 499165 -138891 -267289 990121 930658
7619I30658j385798q64255K144510o6059P55621j107749j05976j285119j214147
$$ 930658 -455140 -1319395 825115 759056 1514677 406928 300952 -984167 -2198314
7610b198314J966693J711685k147506L43906J040810P24405j248627m26140k38001
$$ -2198314 -231621 1480064 -667442 -323536 717274 1441679 193052 -233088 -471089
7601d71089M4177k60367l45216p74702L20675J439711Q33359j029636K11861P39849
$$ -471089 -426912 -687279 -1032495 -1807197 -1486522 -46811 786548 -243088 -31227 708622
7591G08622j265298l13318J508875k42395j306922P75685j050082J61482Q94310
$$ 708622 -556676 -869994 638881 396486 -910436 -134751 -1184833 -1023351 -129041
7582a29041m03944O2491k22051L8086m61661R9820O93568N65852P0779l81756
$$ -129041 -532985 -470494 -692545 -654459 -1116120 -1016300 -322732 243120 313899 -67857
7572f7857j179733J65914O25915L37474l00600J696669J346486j302326o24325
$$ -67857 -1247590 -1081676 -455761 -118287 -418887 1277782 2624268 1321942 697617
7563F97617o9964N96134m03426r12430p14418r82730L29725Q47718q16153j51888
$$ 697617 627653 1223787 820361 -92069 -806487 -1789217 -1459492 -611774 -1427927 -1579815
7553a579815J480277P64458p99124o54814K1012J733000m59075j703253J581468
$$ -1579815 -99538 664920 -134204 -789018 -768006 964994 505919 -1197334 384134
7544C84134J022885n11200j81435m47301j041289q57148O23291q3420p88875J866212
$$ 384134 1407019 895819 714384 267083 -774206 -1631354 -1008063 -1091483 -1880358 -14146
7534a4146R05941j688540n76219Q07994K27934Q83769K21233r79100n52609J62284
$$ -14146 891795 -796745 -1372964 -564970 -337036 546733 767966 -211134 -763743 -601459
7524f01459Q91695k70173N8113r16159P37895o85291l9255M85036J020398l33225
$$ -601459 290236 20063 78176 -837983 -100088 -785379 -824634 -339598 680800 347575
7514C47575n64752K85209j132450n158N97701n48250M10457m45548O37807R48052
$$ 347575 -217177 68032 -1064418 -1069576 -471875 -1020125 -609668 -1055216 -417409 530643
7504E30643j7381k51785q99660R43831j40959p36161j01077J570032L83916j353927
$$ 530643 513262 261477 -638183 305648 164689 -571472 -672549 897483 1281399 -72528
7494g2528O59206o18944l73923q9461M40250M15916j80897J18395J038099j436369
$$ -72528 586678 -32266 -406189 -495650 -55400 360516 179619 298014 1336113 -100256
7484a00256j60918n21012j370803K55108O10005R51850M10433J269614j508970
$$ -100256 -261174 -782186 -2152989 -1897881 -1287876 -336026 74407 1344021 -164949
7475a64949J224865N4413k234780o42434J331514K54108k69737N61250Q18589
$$ -164949 1059916 1114329 -1120451 -1762885 -431371 -177263 -447000 114250 932839
7466I32839p05007l09853J52213l17715J268451j51608q62253j376825P74645
$$ 932839 227832 -82021 70192 -247523 1020928 869320 7067 -1369758 -595113
7457e95113m52163P20420O856M1862P99229j348428n21935N01082N52416m56403
$$ -595113 -1047276 -326856 -320000 -278138 521091 -827337 -1349272 -848190 -295774 -752177
7447g52177K85555p43643l9499J299907M18140l51719J579467o19962j741485
$$ -752177 -466622 -1210265 -1249764 50143 468283 116564 1696031 1076069 -665416
7438f65416q84674Q09356J346483j27315p18537m57146l76691K67997j226585
$$ -665416 -1550090 -740734 605749 478434 -240103 -697249 -1073940 -805943 -2032528
7429b032528J125560K76661L33680M28660j08772j425158o1950P18510K35044
$$ -2032528 -906968 -630307 -296627 132033 23261 -1401897 -1463847 -745337 -510293
7420e10293l90868R25616O37870p21517P55713M9335j606807K1345o15628N61400
$$ -510293 -901161 24455 662325 -59192 696521 745856 -860951 -839606 -1455234 -893834
7410h93834j136190K33438J321046j134175R33020o43673Q63035Q37937L15617
$$ -893834 -2030024 -1796586 -475540 -1609715 -676695 -1320368 -457333 380604 696221
7401F96221p53861j574668J00832J90038L90117K133974j467839j148580M46959
$$ 696221 -57640 -1632308 -1531476 -1341438 -951321 1182653 -285186 -1433766 -986807
7392i86807J270556N02094J49269J023795n66902l72385j8253j495179M0254l00901
$$ -986807 283749 785843 935112 1958907 1392005 1019620 1001367 -493812 -453558 -754459
7382g54459P59258N06927o50915l36252l57805J163811P6024K77432K92926q76372
$$ -754459 4799 511726 -139189 -475441 -833246 330565 406589 684021 976947 100575
7372A00575K81055N41308l65212j056392m82016N98503j88687K36514J073669
$$ 100575 381630 922938 557726 -498666 -980682 -382179 -570866 -334352 739317
7363G39317l3732N23786m34472r08784j457076M38528K1352Q32367L21519J78362
$$ 739317 705585 1229371 794899 -113885 -1570961 -1132433 -1111081 -278714 42805 221167
7353B21167o19424Q66574N3522n0640l9505j9115J316797j078526j151760N22647
$$ 221167 -398257 468317 521839 471199 431694 412579 1729376 650850 -500910 21737
7343B1737P94518O63896l55726j862914J081867J570160q8746l15610j037361
$$ 21737 816255 1480151 1124425 -738489 343378 1913538 1824792 1509182 471821
7334D71821k91547o24883J23288O23427j36366O00327L01542P12977j059905q75706
$$ 471821 180274 -444609 -321321 302106 165740 766067 1067609 1780586 720681 -155025
7324a55025J579053j26859p69887l23880O73781N3389m31773j11988l80560J172305
$$ -155025 1424028 1297169 527282 203402 877183 930572 498799 386811 6251 1178556
7314A178556p29962m80981m96028M09871L40678O7998M68136l5490p32279n60656
$$ 1178556 448594 -32387 -528415 -118544 222134 290132 758268 722778 -9501 -570157
7304e70157J267863M21386K58693l30953P76903j019616p63263m734o48088K033831
$$ -570157 697706 1119092 1377785 1046832 1823735 804119 40856 36122 -611966 1421865
7294A421865J323742r21538p20131k7120j85921K03443n58336K07856N90831j370065
$$ 1421865 2745607 1824069 1103938 1076818 890897 1094340 536004 743860 1334691 -35374
7284c5374l70820J000162R41548k2819n37224J497886q03734j378288Q35033j177455
$$ -35374 -406194 593968 1535516 1512697 975473 2473359 1669625 291337 1126370 -51085
7274e1085q48302O56984N6284Q89045M19653m19412k49442J002117j382398q11467
$$ -51085 -899387 -242403 -186119 702926 1122579 703167 453725 1455842 73444 -738023
7264g38023q84195j84452J002613K50208N50841M57668P23761o88873m46738L67577
$$ -738023 -1622218 -1806670 -804057 -553849 -3008 454660 1178421 489548 42810 410387
7254D10387r53454j11088Q4247q5734Q63749O5721r04620r58405l21192J926653
$$ 410387 -543067 -654155 -569908 -655642 208107 273828 -630792 -1589197 -1910389 16264
7244A6264q8801m58918j93476J899836n80065q08704n63100p37705P05650j30554
$$ 16264 -72537 -531455 -724931 1174905 594840 -213864 -776964 -1514669 -809019 -939573
7234i39573N76385l61313N84347J202908j329272J121702l52807j977596N44067
$$ -939573 -363188 -724501 -140154 1062754 -266518 855184 502377 -1475219 -931152
7225i31152R99483j608627J627365n98019p51820N55536M49951N6353j184481
$$ -931152 68331 -1540296 87069 -510950 -1262770 -707234 -257283 -200930 -1385411
7216a385411J102794n11281m30051L43359O17885j263299L31240R90568o47055
$$ -1385411 -282617 -793898 -1223949 -880590 -262705 -1526004 -1194764 -204196 -851251
7207h51251O7075q57109m33982J772584N33698j154982J06473N58373l35554J13544
$$ -851251 -784176 -1641285 -2075267 -302683 231015 -923967 -817494 -259121 -594675 -481131
7197d81131n78246N31111L92168k39175o41098J125404j169895J014815M69548
$$ -481131 -1059377 -528266 -136098 -375273 -1016371 109033 -1060862 -46047 423501
7188D23501r46725m84418Q97119k97843Q5039M57920j143046O66710p164n43571
$$ 423501 -523224 -1007642 -110523 -408366 -323327 134593 -1008453 -341743 -348907 -892478
7178h92478L48573q46548L18261K43602l7521n39217O24651K19836K5805P77958
$$ -892478 -543905 -1390453 -1072192 -828590 -866111 -1405328 -780677 -560841 -535036 242922
7168B42922M324j828267R22473Q44713O43416q31908k0962R5663q93514j79580
$$ 242922 247246 -1581021 -658548 186165 829581 -2327 -23289 72374 -821140 -1000720
7158a000720q9306J229057k40345r95215O44966J126977m67762j165387n0014
$$ -1000720 -1090026 139031 -101314 -1096529 -451563 675414 207652 -957735 -1007749
7149a007749O83685r364M38966L77431p45675K47946J037057j018432j51331l27721
$$ -1007749 -324064 -333428 105538 482969 -262706 -14760 1022297 3865 -147466 -475187
7139d75187M50584N91844n40415l71937r51719K4546O29769O58658M02987k95007
$$ -475187 -24603 567241 26826 -345111 -1296830 -1272284 -642515 16143 419130 124123
7129A24123l81769j051965k0272J394974N90735p43773p99270N38599k32103j032117
$$ 124123 -257646 -1309611 -1329883 65091 655826 -87947 -887217 -348618 -580721 -1612838
7119a612838Q23387J82526n72790L33345l61922J259467J11720j762819m09235
$$ -1612838 -789451 -606925 -1179715 -846370 -1208292 51175 162895 -1599924 -2009159
7110b009159J082535J021825J41646r16149q30518K86693Q54710J030894j305081
$$ -2009159 -926624 95201 236847 -679302 -1509820 -1223127 -368417 662477 -642604
7101f42604M98258J10643o87323r74821Q26826j083997J24754L5520J010953R6312
$$ -642604 -144346 -33703 -721026 -1695847 -869021 -1953018 -1828264 -1792744 -781791 -685479
7091f85479m38314R42993q39942j44846Q22716n72904N11575p0310k60030q1071
$$ -685479 -1123793 -180800 -1020742 -1165588 -342872 -915776 -404201 -474511 -734541 -815612
7081h15612M69551M31009o6667k86256j49221l0742O7567r50214n99917l02001
$$ -815612 -346061 84948 18281 -267975 -417196 -447938 -380371 -1330585 -1930502 -2232503
7071b232503J574739J698472j376169J029046m67483o35343J32922l38030L7935
$$ -2232503 -657764 1040708 -335461 693585 226102 -409241 -276319 -614349 -576414
7062e76414j034758O72381R8301p63630q1875J21721J029309J574658m66770j298523
$$ -576414 -1611172 -938791 -840490 -1604120 -1685995 -1564274 -534965 1039693 572923 -725600
7052g25600Q99915M58128j132763j613904K154214l20382k77762M8033K76813
$$ -725600 174315 632443 -500320 -2114224 39990 -280392 -558154 -510121 -233308
7043b33308J377571L53983N7134j217309o05953P72396q61470m09054M49605N06840
$$ -233308 1144263 1498246 1555380 338071 -267882 504514 -356956 -766010 -316405 190435
7033A90435n03083P6792p8853j432628J07288N70823N66822k09015L8725Q44183
$$ 190435 -312648 -235856 -314709 -1747337 -1640049 -1069226 -502404 -711419 -672694 171489
7023A71489k05705j014260j40797p90278J01607J094599N18382j706821o27288
$$ 171489 -34216 -1048476 -1189273 -1979551 -1877944 -783345 -264963 -1971784 -2599072
7014b599072n85955J183844O85583J093771L84781n14633n81667q19845J070877
$$ -2599072 -3185027 -2001183 -1315600 -221829 162952 -351681 -933348 -1753193 -682316
7005f82316N02404K29028n57176p58245K02723J789542J6443K33220o36962j207589
$$ -682316 -179912 49116 -508060 -1266305 -1063582 725960 742403 975623 338661 -868928
6995h68928n60658J109503j160178J94447Q3914l61789J113385l95775O17361
$$ -868928 -1429586 -320083 -1480261 -1285814 -1201900 -1563689 -450304 -846079 -228718
6986b28718J680072r11988j358541k08782j2079M59819n61822l95674O51479J061958
$$ -228718 1451354 539366 -819175 -1027957 -1040036 -580217 -1142039 -1537713 -886234 175724
6976A75724m95451p92029M90106Q09308l06406r13431N09357j314968O43255l25825
$$ 175724 -319727 -1111756 -621650 187658 -118748 -1032179 -522822 -1837790 -1194535 -1520360
6966a520360Q36221l07722n01500L44080q19826J045963K4499j08098J89681J396904
$$ -1520360 -684139 -991861 -1493361 -1149281 -1969107 -923144 -898645 -1006743 -817062 579842
6956E79842k15411j138671O84344K78664k14785J103637o35750p95960j654319
$$ 579842 364431 -774240 -89896 188768 -26017 1077620 441870 -354090 -2008409
6947b008409J212077L31942K95621J23891l40246o66763J456269k57231o83728
$$ -2008409 -796332 -464390 -168769 -44878 -385124 -1051887 404382 147151 -536577
6938e36577L08742j281011N53627K12412j001246J115235k92733P51571L2858
$$ -536577 -227835 -1508846 -955219 -742807 -1744053 -628818 -921551 -169980 -137122
6929a37122j28150p55986N9400M14496l48286R5603l87107M38480j752388J034901
$$ -137122 -265272 -1021258 -961858 -547362 -895648 -800045 -1187152 -748672 -2501060 -1466159
6919a466159n31274R30619R41775j96602n53536N69640J020583j245859j894829
$$ -1466159 -1997433 -1066814 -125039 -321641 -875177 -305537 715046 -530813 -2425642
6910b425642K691012J603566m9850m34309j98125o82078p48059J111970N48728
$$ -2425642 265370 1868936 1819086 1384777 1186652 504574 -243485 868485 1417213
6901A417213j110301j030801R77471P63033P70127O32713J513574j74748j215775
$$ 1417213 306912 -723889 253582 1016615 1786742 2419455 3933029 3758281 2542506
6892B542506q53712n90071K72810r97501L58034j64160O5222l3017Q4085M49868
$$ 2542506 1688794 1098723 1371533 374032 732066 567906 633128 600111 684196 1134064
6882A134064p41020r06258r09691P66593J282609R2059N2181K45067j051711j551992
$$ 1134064 393044 -513214 -1422905 -656312 626297 718356 770537 1015604 -36107 -1588099
6872a588099J605841R69194m93666o29953l15739J12471M23452J54121K27719
$$ -1588099 17742 986936 493270 -136683 -452422 -339951 83501 237622 465341
6863D65341m36731Q76690Q738j031667l79281k66649N76103K4901J444788M62742
$$ 465341 28610 905300 914038 -117629 -496910 -763559 -187456 -162555 1282233 1744975
6853A744975j366313p17893r81393J40150M87708J968237N15142k255074K02291
$$ 1744975 378662 -339231 -1320624 -1180474 -692766 1275471 1790613 -464461 -262170
6844b62170o02485J128804O26017Q5567r57366Q68052J82091q05016r19497O43838
$$ -262170 -864655 264149 890166 975733 18367 886419 1068510 263494 -656003 -12165
6834a2165n27744J81849Q09956J16030J45851r93861J186672k41094J35158N41316
$$ -12165 -539909 -358060 451896 567926 713777 -280084 906588 665494 800652 1341968
6824A341968k94290n95457m80874m89609P86092M36281j321234Q15866J592839
$$ 1341968 1047678 452221 -28653 -518262 267830 704111 -617123 198743 1791582
6815A791582J72064j884258J376635m02697J125118k34221j319652J19807o96163
$$ 1791582 1963646 79388 1456023 1053326 2178444 1944223 624571 744378 48215
6806D8215J465766J93887n99832j411007R99075N80713q41576l84557R15140J429029
$$ 48215 1513981 1707868 1108036 -302971 696104 1276817 435241 50684 965824 2394853
6796B394853k817890J021016J80990n15690N9861q24862l73246K1024J333965
$$ 2394853 -423037 597979 778969 263279 323140 -501722 -874968 -853944 480021
6787D80021j444442M70577R59387k47059k3226J01816k49977j326097L45320R64481
$$ 480021 -964421 -493844 465543 218484 195258 297074 47097 -1279000 -933680 30801
6777C0801P3643k89161j010771J114272K41398Q53177r5048m07490p75950k80589
$$ 30801 104444 -184717 -1195488 -81216 160182 1013359 918311 510821 -265129 -545718
6767e45718J27409P62967K27899k91943M98319j571454r62520L62503M21625m20577
$$ -545718 -418309 344658 572557 280614 778933 -792521 -1755041 -1392538 -970913 -1391490
6757a391490m76358n56659J516030r01388J16269J971489M24697l42398k1121
$$ -1391490 -1867848 -2424507 -908477 -1809865 -1693596 277893 702590 360192 339071
6748C39071k40622O7574n81299N47614l04347k13960J642881P54636k40095j188711
$$ 339071 98449 166023 -415276 132338 -172009 -385969 1256912 2011548 1771453 582742
6738E82742N54401L91769M1459j599904K22057l66326l6944k43353j35397K13403
$$ 582742 1137143 1528912 1570371 -29533 192524 -173802 -210746 -454099 -589496 -376093
6728c76093J940645j641002k85149N24945m22560K66220m26576j004853P90268
$$ -376093 1564552 -76450 -361599 163346 -259214 7006 -419570 -1424423 -634155
6719f34155J720487r39614M61320j230733N68636O04835k56604K14091j186829
$$ -634155 1086332 146718 608038 -622695 -54059 550776 294172 508263 -678566
6710f78566J194158j56874K107k79426L1820M98998l95214j83803O38163l05693
$$ -678566 515592 358718 360825 81399 113219 612217 217003 33200 671363 365670
6700C65670k81167j242417J056713J319095j144910J66785o8948M21202M74875
$$ 365670 84503 -1157914 -101201 1217894 72984 239769 170821 592023 1066898
6691A066898q59824K97487R81861P14890o07810j085763O79690K75506j278999
$$ 1066898 207074 504561 1486422 2201312 1593502 507739 1187429 1462935 183936
6682A83936l39442R23330Q86281J136246p09502j098786n97888P11085L89408
$$ 183936 -155506 767824 1654105 2790351 2080849 982063 384175 1095260 1484668
6673A484668N02364m37278K5477Q59326M79757o36983j055554J270191k90113
$$ 1484668 1987032 1549754 1575231 2434557 2914314 2277331 1221777 2491968 2201855
6664B201855o96819J434392q21376m5362j43322J59219Q13896L31395J294878
$$ 2201855 1505036 2939428 2118052 2072690 1929368 2088587 2902483 3233878 4528756
6655D528756k99971j051481Q54424K96486m18352J261998J429498L7088j141732
$$ 4528756 4228785 3177304 4031728 4328214 3909862 5171860 6601358 6638446 5496714
6646E496714L46068J583268j269704J95122j14087K10086r05077o34522J126119
$$ 5496714 5842782 7426050 6156346 6351468 6237381 6447467 5542390 4907868 6033987
6637F033987J506960M22516p39172K20030Q59118k97681q99330M3626j855343
$$ 6033987 7540947 7963463 7224291 7444321 8303439 8005758 7106428 7150054 5294711
6628E294711J24349L47162o74957N6052R39021N35848L52660j02168j179135M2368
$$ 5294711 5419060 5766222 5091265 5147317 6086338 6622186 6974846 6872678 5693543 5735911
6618E735911k06514k70287j410736j50753O61011K190768L68628p35932n60370
$$ 5735911 5529397 5259110 3848374 3697621 4358632 6549400 6918028 6182096 5621726
6609E621726O0227O91841j004594m71898Q5389N0329Q80498P53122K41963r92044
$$ 5621726 5681953 6373794 5369200 4897302 4982691 5033020 5913518 6666640 6908603 5916559
6599E916559l58521Q92393Q6623p49311m22523N36387J96392o53228M25056O43109
$$ 5916559 5558038 6450431 6537054 5787743 5365220 5901607 6097999 5444771 5869827 6512936
6589F512936j64885n44392l15768K55576j112014J99947q10753R57933M50100
$$ 6512936 6348051 5803659 5487891 5743467 4631453 4831400 4020647 4978580 5428680
6580E428680M86782q68762o06931Q96716j108986k94303J074450j486040L26934
$$ 5428680 5915462 5046700 4439769 5336485 4227499 3933196 5007646 3521606 3848540
6571C848540P69644n19337j438832j057817J224031J719801j365758j858396M91831
$$ 3848540 4618184 4098847 2660015 1602198 2826229 4546030 3180272 1321876 1813707
6562A813707M64522J230859k029733l90080J77811J312539n87630k79345L1482
$$ 1813707 2278229 3509088 1479355 1089275 1267086 2579625 1991995 1712650 1744132
6553A744132j39962k95801p77527J380364J292098k59810r09594P13702j021934
$$ 1744132 1604170 1308369 530842 1911206 3203304 2943494 2033900 2747602 1725668
6544A725668l44377J415571j49812j76653l40584l41028o75242k66640P57080
$$ 1725668 1381291 2796862 2647050 2470397 2129813 1788785 1113543 846903 1603983
6535A603983l18901M35784R94374l13606j224119k06031P92232j83887J44910
$$ 1603983 1285082 1720866 2715240 2401634 1177515 971484 1763716 1579829 1724739
6526A724739L27964K227272q84090q71421K91617k69327r77917O76750P57149
$$ 1724739 2052703 4279975 3395885 2524464 2816081 2546754 1568837 2245587 3002736
6517C002736j225098N19849l73092k99063j280913O37604P58868m94845P3375
$$ 3002736 1777638 2297487 1924395 1625332 344419 982023 1740891 1246046 1319421
6508A319421J074625j55313R7096o52005K10096K59209n3114m51729j221927p25403
$$ 1319421 2394046 2238733 2335829 1683824 1893920 2153129 2100015 1648286 426359 -299044
6498b99044l65688Q40922J656751m88547j318259k26364J510301o38116l31157
$$ -299044 -664732 176190 1832941 1344394 26135 -200229 1310072 671956 340799
6489C40799O08642l5739M70188K24223J91975k36801l95860N40739l33552L42595
$$ 340799 949441 913702 1383890 1608113 1800088 1563287 1167427 1708166 1374614 1717209
6479A717209K80423N187q89824j59356m92768P32163J238831N78049m54901q11287
$$ 1717209 1997632 2002819 1112995 953639 460871 1193034 2431865 3009914 2555013 1743726
6469A743726j793087K83281J36572R1381O21673k40304M80635n35919M12133J73156
$$ 1743726 -49361 233920 370492 461873 1083546 843242 1323877 787958 1200091 1373247
6459A373247q21403k07858P78660r28731M06985M56639O95982n17100q25975J94886
$$ 1373247 551844 343986 1122646 193915 600900 1057539 1753521 1236421 410446 605332
6449F05332O29858j154346M41456O88387j31251n67898j034822J384301O75597
$$ 605332 1235190 80844 522300 1210687 1079436 511538 -523284 861017 1536614
6440A536614k84798J06238Q4099Q48629j333826L44782J088056q52424j221276
$$ 1536614 1251816 1358054 1442153 2290782 956956 1301738 2389794 1537370 316094
6431C16094M57925P77729p04370j79065J78745O49396M07887p21276m52600O21806
$$ 316094 774019 1551748 847378 668313 847058 1496454 1904341 1183065 730465 1352271
6421A352271p12180j29156N00806p28804J047385J1212n80372p7475J46178N15442
$$ 1352271 640091 510935 1011741 282937 1330322 1341534 761162 683687 829865 1345307
6411A345307L36531J149402p72913j497190P82625o84652q13333J189021J005409
$$ 1345307 1681838 2831240 2058327 561137 1343762 659110 -154223 1034798 2040207
6402B040207o26490p80892j072712J019171r35565J40300J027852J137184k20877
$$ 2040207 1413717 632825 -439887 579284 -356281 -215981 811871 1949055 1728178
6393A728178j74423K63708j578246J06600J293096M70832r18178p27168J015260
$$ 1728178 1553755 1817463 239217 345817 1638913 2109745 1191567 464399 1479659
6384A479659j20120J87969j219807K47073N46482r58810J435293n59342R24253
$$ 1479659 1359539 1547508 327701 574774 1121256 162446 1597739 1038397 1962650
6375A962650k99789J25863l5087j73224P12575k44329n45601n73740M22978Q05000
$$ 1962650 1662861 1788724 1753637 1580413 2292988 2048659 1503058 929318 1352296 2157296
6365B157296m9244o8460j08810n51149j114321j06829J301969P74473K4047J85573
$$ 2157296 2108052 2039592 1930782 1379633 265312 158483 1460452 2234925 2258972 2444545
6355B444545j254286j36651J000602o46681M20411J029895j218147q48695K35283
$$ 2444545 1190259 1053608 2054210 1407529 1827940 2857835 1639688 790993 1026276
6346A026276O75952l96333J24232n67431J382678j99299j32694m52931q60626
$$ 1026276 1702228 1305895 1430127 862696 2245374 2046075 1913381 1460450 599824
6337E99824J248638L52446R56170k15410n36598j580856O77723J212079J44893
$$ 599824 1848462 2200908 3157078 2941668 2405070 824214 1501937 2714016 2858909
6328B858909j647084L16615P96672r61253k99149j110445P21487O35708J61068
$$ 2858909 1211825 1528440 2325112 1363859 1064710 -45735 675752 1311460 1472528
6319A472528N13398O81720r59895n78982L29814J088382o43441O42L3406J24313
$$ 1472528 1985926 2667646 1707751 1128769 1458583 2546965 1903524 1904166 1937572 2061885
6309B061885L61958l4710J62825j63054O23126m5848Q94565j920824m32756J362342
$$ 2061885 2423843 2389133 2551958 2388904 3012030 2966182 3860747 1939923 1507167 2869509
6299B869509n1270k7469K51234J8526L50614n31270l63091M39195j10671R34712
$$ 2869509 2818239 2790770 3042004 3060530 3411144 2879874 2516783 2955978 2845307 3780019
6289C780019r31998M1145L46487L77038j55032m17636O32022N03375J171854k396362
$$ 3780019 2848021 2889166 3235653 3612691 3457659 3040023 3672045 4175420 5347274 2950912
6279B950912K28700J624873j659262p50505O72195m93667p90499K60639m75057
$$ 2950912 3179612 4804485 3145223 2394718 3066913 2573246 1782747 2043386 1568329
6270A568329O04496J57960R12863N04309n53109l08707q39080J029963O41863
$$ 1568329 2172825 2330785 3243648 3747957 3194848 2886141 2047061 3077024 3718887
6261C718887p13023Q43568Q25534j175303J389549M28980j221215p15900J499429
$$ 3718887 3005864 3849432 4674966 3499663 4889212 5318192 4096977 3381077 4880506
6252D880506l22054j070776J185845J055002p67473J16307K71198m07343q23451
$$ 4880506 4558452 3487676 4673521 5728523 4961050 5077357 5348555 4941212 4117761
6243D117761L48952K96161k618657K37967K42895J129279m40351J074185r73162
$$ 4117761 4466713 4762874 2144217 2382184 2625079 3754358 3314007 4388192 3415030
6234C415030k99145L21564N28678K56118K32117k69500p65485J583428k9838p5695
$$ 3415030 3115885 3437449 3966127 4222245 4454362 4184862 3419377 5002805 4972967 4897272
6224D897272J063134N0849p65061K22738j076621N62510N88302l93502n21571
$$ 4897272 5960406 6011255 5246194 5468932 4392311 4954821 5543123 5149621 4628050
6215D628050R4387K60995m48094N3914L93932O17257j138636n22621K209146p10854
$$ 4628050 4722437 4983432 4535338 4589252 4983184 5600441 4461805 3939184 6148330 5437476
6205E437476n36066M32153l02006J48718p24239J085948J244328R7561j263729
$$ 5437476 4901410 5333563 5031557 5180275 4456036 5541984 6786312 6883873 5620144
6196E620144Q90033J33909o84172O13014m91037j357962p61517k69982R80563
$$ 5620144 6510177 6644086 5959914 6572928 6081891 4723929 3962412 3692430 4672993
6187D672993O42946K73566J51285k2923n94396Q1083R49872q92165J425575q14254
$$ 4672993 5315939 5589505 5740790 5717867 5123471 5204554 6154426 5262261 6687836 5873582
6177E873582j389725j879176N77087K756552Q4867m71617L64216k00974m5617
$$ 5873582 4483857 2604681 3181768 5938320 6023187 5551570 5915786 5714812 5669195
6168E669195n48763L60700J660031m50276j145968l31036l29477K310847K30194
$$ 5669195 5120432 5481132 7141163 6690887 5544919 5213883 4884406 7195253 7425447
6159G425447m93210r31487j351750K85616O79316N70055J721716m92049m32991
$$ 7425447 6932237 6000750 4649000 4934616 5613932 6183987 7905703 7413654 6980663
6150F980663K10515j22036L26018N3468l93201j440991N67898O46048L21984P58108
$$ 6980663 7191178 7069142 7395160 7448628 7055427 5614436 6182334 6828382 7150366 7908474
6140G908474n57718j62239P99386J865099k83913o03319j32924m5996R19589R91798
$$ 7908474 7350756 7188517 7987903 9853002 9569089 8965770 8832846 8786850 9706439 10698237
6130A0698237k69595r31000L63178R17622J58338R03058Q94590p28647Q15608
$$ 10698237 10428642 9497642 9860820 10778442 10936780 11839838 12734428 12005781 12821389
6121A2821389J65357P37691M14317K76863j492905M63900J165768K60491p34086
$$ 12821389 12986746 13724437 14138754 14415617 12922712 13386612 14552380 14812871 14078785
6112A4078785J038233j388062j15738Q76861j24370L00507K152203L86798j145334
$$ 14078785 15117018 13728956 13613218 14490079 14365709 14666216 16818419 17205217 16059883
6103A6059883J163553Q59758N17339j487972P8242j8966K84904J118639k90380
$$ 16059883 17223436 18083194 18600533 17112561 17190803 17171837 17456741 18575380 18285000
6094A8285000o1441N40494J28667O25367J138865J013048K31131p96957L03005
$$ 18285000 18223559 18764053 18892720 19518087 20656952 21670000 21901131 21104174 21407179
6085B1407179K1682L60590L32735O92313K62945l47898J57305l11958J389645
$$ 21407179 21428861 21789451 22122186 22814499 23077444 22729546 22886851 22574893 23964538
6076B3964538R52498j027999j257469Q47108L75374L21226j36627k08725J183605
$$ 23964538 24917036 23889037 22631568 23478676 23854050 24175276 24038649 23829924 25013529
6067B5013529P90683k82368o32273J267896R22187K88098p7194K84800M9883P57299
$$ 25013529 25804212 25521844 24889571 26157467 27079654 27367752 27290558 27575358 27625241 28382540
6057B8382540j003763j099369R99411Q61586N38290j48096m0509l42712R96478
$$ 28382540 27378777 26279408 27278819 28140405 28678695 28530599 28490090 28147378 29143856
6048B9143856J21428L29022L87216J069117Q74051N69356Q05008K29810j92023
$$ 29143856 29265284 29594306 29981522 31050639 31924690 32494046 33299054 33528864 33336841
6039C3336841Q65576L42308l80968P1744J747096R25452L63965j89750K8415M47953
$$ 33336841 34202417 34544725 34163757 34235501 35982597 36908049 37272014 37082264 37110679 37558632
6029C7558632N77418o98668L10712M11365J736702Q9587J934206J731758Q28606
$$ 37558632 38136050 37437382 37748094 38159459 39896161 39985748 41919954 43651712 44480318
6020D4480318J682240Q67699J449948P76216K066382J486403K937165K843408
$$ 44480318 46162558 47030257 48480205 49256421 51322803 52809206 55746371 58589779
6012E8589779K189288L104071N059000L630149N978469L735690L245153Q40418
$$ 58589779 60779067 63883138 68942138 72572287 78550756 82286446 85531599 86372017
6004H6372017J773898o78801k953247k885825j420129l431675k729185r88895
$$ 86372017 88145915 87467114 84513867 81628042 80207913 76776238 74047053 73058158
5996G3058158o56965n1260L24582k75462O14783O18565N15938K959454J494409
$$ 73058158 72401193 72349933 72674515 72399053 73013836 73632401 74148339 77107793 78602202
5987G8602202L109093M582449N057655M615548N713889P412554J0056607Q649485
$$ 78602202 81711295 86293744 91351399 95966947 101680836 109093390 119149997 127799482
5979A27799482Q273109N701387J541306j486784o492437q065469r633457r281273
$$ 127799482 136072591 141773978 143315284 141828500 135336063 127270594 117637137 108355864
5971A08355864p006453o266589m588331m664997l408189k450863k258494p0158
$$ 108355864 101349411 95082822 90494491 85829494 82421305 79970442 77711948 77641790
5963G7641790j314554r76111J119560J371444J901690O65235n07138J695897L212053
$$ 77641790 76327236 75351125 76470685 77842129 79743819 80409054 79901916 81597813 84809866
5954H4809866K432222L682627K695042J781535N34978O04342m288232l671002
$$ 84809866 87242088 90924715 93619757 95401292 95936270 96540612 92252380 88581378
5946H8581378m688404l792384n219207n224855l517540k134272j753808k604032
$$ 88581378 83892974 80100590 74881383 69656528 66138988 64004716 62250908 59646876
5938E9646876q38291j118417n56440j062138j495296q51306K59679n2554j675715
$$ 59646876 58808585 57690168 57133728 56071590 54576294 53724988 53984667 53932113 52256398
5929E2256398j977608n37431n83425j144277j744171k259736o94705O88426j443593
$$ 52256398 50278790 49741359 49157934 48013657 46269486 44009750 43315045 44003471 42559878
5920D2559878j199734P9113j099877r57539K89748l11927j702911J525051j69145
$$ 42559878 41360144 41439257 40339380 39381841 39671589 39359662 37656751 39181802 39012657
5911C9012657n29762m76098q66494J36689j25039l0949j102150n6432O55900q03415
$$ 39012657 38482895 38006797 37140303 37276992 37151953 37121004 36018854 35962422 36618322 35814907
5901C5814907n26640J384523J355652P54143l9898l68412o33630p81757j601070
$$ 35814907 35288267 36672790 38028442 38782585 38742687 38374275 37740645 36958888 35357818
5892C5357818j457915q56203m68094j02785o57719j566788q68589m66263N07736
$$ 35357818 33899903 33043700 32575606 32472821 31815102 30248314 29379725 28913462 29421198
5883B9421198r89685j206680l91699P70994n78674m15427n68721m20397L29304
$$ 29421198 28431513 27224833 26833134 27604128 27025454 26610027 26041306 25620909 25950213
5874B5950213Q42286l71474l09520K74933J396228m2094J39045J047223j280786
$$ 25950213 26792499 26421025 26111505 26386438 27782666 27740572 27879617 28926840 27646054
5865B7646054r45077j38764n71432P87022N54823o07443j994130m92568o55920
$$ 27646054 26700977 26562213 25990781 26777803 27332626 26725183 24731053 24238485 23582565
5856B3582565q5123q57947o06522K85172k82710J36050o61043j363872j672116
$$ 23582565 23497442 22639495 22032973 22318145 22035435 22171485 21510442 20146570 18474454
5847A8474454j484561J453003P97972j061051k71076Q94504j266612n24356J401996
$$ 18474454 16989893 18442896 19240868 18179817 17908741 18803245 17536633 17012277 18414273
5838A8414273k34969L68919l97447j058509r0046l34417M39723M3609r2826N53442
$$ 18414273 18179304 18548223 18150776 17092267 17002221 16667804 17107527 17151136 17058310 17611752
5828A7611752j171649j379407P0995p71158L75091M417j311047n7945l2702J068886
$$ 17611752 16440103 15060696 15131691 14360533 14735624 14740041 13428994 13371049 13338347 14407233
5818A4407233K56228J62670j767244J053668L44582j64428M94986j582718p20389
$$ 14407233 14663461 14826131 13058887 14112555 14457137 14292709 14787695 13204977 12484588
5809A2484588M3408O06515n8423j264847J784306j201669L25155M69939P2527
$$ 12484588 12527996 13134511 13076088 11811241 13595547 12393878 12719033 13188972 13261499
5800A3261499N31277l35769k041185M4919J568013m65281l68849J171696o10599
$$ 13261499 13792776 13457007 11415822 11460741 13028754 12563473 12194624 13366320 12755721
5791A2755721n38083r83914L10130J70028O14385L31227j09329q46225O48822
$$ 12755721 12217638 11233724 11543854 11713882 12328267 12659494 12550165 11703940 12352762
5782A2352762o8233k229954j37049P59608L76736q70267Q19630R0824p39507p16119
$$ 12352762 12284529 10054575 9917526 10677134 11053870 10183603 11003233 11094057 10354550 9638431
5772I638431J415857L94741j089943J092695j29903j521553Q13935L36639j89105
$$ 9638431 11054288 11449029 10359086 11451781 11321878 9800325 10614260 10950899 10761794
5763A0761794p9058j5540m52876P80864j254032O15530M57186j92175J82462J99931
$$ 10761794 10682736 10667196 10214320 10995184 9741152 10356682 10813868 10621693 10804155 11004086
5753A1004086o36296o93056M82786M66133L47350Q02676N27253o91044J59465
$$ 11004086 10367790 9674734 10157520 10623653 10971003 11773679 12300932 11609888 11769353
5744A1769353K000060n50133k44842M71906q14103o88915J096828J106428q36591
$$ 11769353 13769413 13219280 12974438 13446344 12632241 11943326 13040154 14146582 13309991
5735A3309991q97677o01973J268470n07192l18641P76045m0015J540811J51718
$$ 13309991 12412314 11810341 13078811 12571619 12252978 13029023 12989008 14529819 14681537
5726A4681537P58921l94909k08720j611231J69723L5029N50839Q69051k19919
$$ 14681537 15440458 15045549 14836829 13225598 13395321 13430350 13981189 14850240 14630321
5717A4630321J77290n96999Q06934n99156r3371k32140Q06185O57159Q22012o71685
$$ 14630321 14807611 14210612 15017546 14418390 14325019 14092879 14899064 15556223 16378235 15706550
5707A5706550m87855O09148R86308R11976J33434k16969K00656K87857O96269
$$ 15706550 15218695 15827843 16814151 17726127 17859561 17642592 17843248 18131105 18827374
5698A8827374J238598m28122J005357Q87430k29774l70583N34503O54424n55902
$$ 18827374 20065972 19637850 20643207 21530637 21300863 20930280 21464783 22119207 21563305
5689B1563305m17615n28256r36069l28126Q46409q19278q74620J293511m56024
$$ 21563305 21145690 20617434 19681365 19353239 20199648 19380370 18505750 19799261 19343237
5680A9343237R58395L20263j85051L17145J044476J566672j07798o67729j08514
$$ 19343237 20301632 20621895 20436844 20753989 21798465 23365137 23257339 22589610 22481096
5671B2481096J121309P40044J169821m16787q53010j300645K14850P77790K35509
$$ 22481096 23602405 24342449 25512270 25095483 24242473 22941828 23156678 23934468 24169977
5662B4169977p9742Q59254n63353k36596Q2025J045816j654558K47247R86484
$$ 24169977 24090235 24949489 24386136 24149540 24231565 25277381 23622823 23870070 24856554
5653B4856554M20876P80918m15771l92443M6741J33526Q20207j70999M45696J522507
$$ 24856554 25277430 26058348 25642577 25250134 25296875 25430401 26250608 26079609 26525305 28047812
5643B8047812o2660k65306L59012R29511Q77545m31855m84285J35698K39613P94186
$$ 28047812 27985152 27719846 28078858 29008369 29885914 29454059 28969774 29105472 29345085 30139271
5633C0139271j583350J49328K38920Q58552M21607K76777q5950r61849j81355
$$ 30139271 28555921 28705249 28944169 29802721 30224328 30501105 30415155 29453306 29271951
5624B9271951N76457L51665O56723J622852j34256j338329P12532J637444O82111
$$ 29271951 29848408 30200073 30856796 32479648 32345392 31007063 31719595 33357039 34039150
5615C4039150j1545l43197Q79648K390422o8883j27921K136254J425910J163989
$$ 34039150 34027605 33684408 34564056 36954478 36885595 36757674 38893928 40319838 41483827
5606D1483827J010023o6835q92509n03145O00467Q92330N30153k36721N35429
$$ 41483827 42493850 42427015 41534506 41031361 41631828 42524158 43054311 42817590 43353019
5597D3353019J137889M43136J93967N17797J40539n18533l38220K95113m54392
$$ 43353019 44490908 44934044 45128011 45645808 45786347 45267814 44929594 45224707 44770315
5588D4770315J049354K190691L76320j67096J211159J284214J693259p91863j8951
$$ 44770315 45819669 48010360 48386680 48219584 49430743 50714957 52408216 51616353 51597402
5579E1597402K615132K719419K427497J287678J608947R47542O47678J983813
$$ 51597402 54212534 56931953 59359450 60647128 62256075 63203617 63851295 65835108
5571F5835108J508056N05706J808520P94971J626264O18694J427491K916584J222343
$$ 65835108 67343164 67848870 69657390 70452361 72078625 72697319 74124810 77041394 78263737
5562G8263737K861780N571466N144788N417197M441116M359651N658606J681350
$$ 78263737 81125517 86696983 91841771 97258968 101700084 106059735 111718341 113399691
5554A13399691j313206l016633m725063m114855l781252j989454k385897j505552
$$ 113399691 112086485 109069852 104344789 100229934 96448682 94459228 92073331 90567779
5546I0567779j201197j050464m65542m40847P79997P12014J563856J556082L827480
$$ 90567779 89366582 88316118 87850576 87409729 88189726 88901740 90465596 92021678 95849158
5537I5849158L692784M355360N246218N813734N395353Q972168J0423769J0966510
$$ 95849158 99541942 103897302 109143520 114957254 120352607 129324775 139748544 150715054
5529A50715054O344646J849841k922933q408697r730795j0532449q749946q855155
$$ 150715054 157059700 158909541 155986608 147577911 137847116 127314667 118564721 109709566
5521A09709566o521672n083141n112618l579512k898367l167414j417345j481700
$$ 109709566 103187894 98104753 92992135 89412623 86514256 83346842 81929497 80447797
5513H0447797J19480q71189Q324J139693J309376K387592J892120J737502K494532
$$ 80447797 80567277 79696088 79704412 80844105 82153481 84541073 86433193 88170695 90665227
5504I0665227M826324L819225R37155J229584J460288k236872m194174m562919
$$ 90665227 95491551 99310776 100247931 101477515 102937803 100700931 96506757 91943838
5496I1943838k714555m113200k693102l078831l463148j471175j862065k021895
$$ 91943838 89229283 85116083 82422981 79344150 75881002 74409827 72547762 70525867
5488G0525867q25392K9251j045062o97968k001400n78532l5711j43096j64339
$$ 70525867 69700475 69729726 68684664 67986696 65985296 65406764 65371053 65227957 65063618
5479F5063618q5121N30538L96937j71838L37777q70558J355172J828754O30441
$$ 65063618 64978497 65509035 65905972 65734134 66071911 65201353 66556525 68385279 69015720
5470F9015720J116849N81960j48116O19963k67069M01173n66990j259158l61138
$$ 69015720 70132569 70714529 70566413 71186376 70919307 71320480 70753490 69494332 69133194
5461F9133194l8167r38548j785618j039747n49563K028993q37025r05706j271307
$$ 69133194 69095027 68156479 66370861 65331114 64781551 66810544 65973519 65067813 63796506
5452F3796506m24258K12503K53328M30498n31829J886797L81053j541884n73220
$$ 63796506 63372248 63584751 63838079 64268577 63736748 65623545 66004598 64462714 63889494
5443F3889494n61001O70513L15030p66065j020282m96810K03085p87223k58661
$$ 63889494 63328493 63999006 64314036 63547971 62527689 62030879 62233964 61446741 61188080
5434F1188080R00891j220220k066137p99290j138711O62705K04916m06196k137366
$$ 61188080 62088971 60868751 58802614 58003324 56864613 57527318 57732234 57326038 55188672
5425E5188672O46251K00994J336098J430363j301722O31962r71198M4255o05037
$$ 55188672 55834923 56035917 57372015 58802378 57500656 58132618 57161420 57205675 56600638
5416E6600638M82017l10214j067124N71950J97628Q15833j218857p95519L0232
$$ 56600638 57082655 56772441 55705317 56277267 56474895 57290728 56071871 55276352 55306584
5407E5306584J000143n42866M9928M8907O10278n36939j481680K21909N43351
$$ 55306584 56306727 55763861 55813789 55862696 56472974 55936035 54454355 54676264 55219615
5398E5219615J89467l91548K08210m99670Q79721M10285j19460O38095M96236
$$ 55219615 55409082 55017534 55225744 54726074 55605795 56016080 55896620 56534715 57030951
5389E7030951k64739J387866N99481Q14927o53770J091285J792866Q7621J594038
$$ 57030951 56766212 58154078 58753559 59568486 58914716 60006001 61798867 61886488 63480526
5380F3480526J030009J825265J34751J42249J49239N71264L23489j257890o60295
$$ 63480526 64510535 66335800 66470551 66612800 66762039 67333303 67656792 66398902 65738607
5371F5738607J20009J885051J029743P42386P44712R15745J161447K76773K121121
$$ 65738607 65858616 67743667 68773410 69515796 70260508 71176253 72337700 72614473 74735594
5362G4735594K307202J299825Q07137K370831K356678K541141J760415Q06579
$$ 74735594 77042796 78342621 79149758 81520589 83877267 86418408 88178823 88985402
5354H8985402K737016K195455L126199L059453M163938M519966N184969N461690
$$ 88985402 91722418 93917873 97044072 100103525 104267463 108787429 113972398 119434088
5346A19434088M521206N046639O228674N460757O293535N561266Q511295J2093185
$$ 119434088 123955294 129001933 135230607 140691364 146984899 152546165 161057460 173150645
5338A73150645J2196415J6855901J9204393K1682570K4268591K5395241K6176870
$$ 173150645 185347060 202202961 221407354 243089924 267358515 292753756 318930626
5331C18930626K4399308J7274887N786831l769266j5811248k4786977k9627714
$$ 318930626 343329934 360604821 366391652 362622386 346811138 322024161 292396447
5324B92396447l0656432k9427658k5656124k3694674j9656982j6421933j4100924
$$ 292396447 261740015 232312357 206656233 182961559 163304577 146882644 132781720
5317A32781720j1215301q155129o301908n014487l495125m573439m143298l619826
$$ 132781720 121566419 113411290 107109382 102094895 98599770 94026331 89883033 86263207
5309H6263207l546840l490255k722417l265488k982400j932872k330228j092273
$$ 86263207 82716367 79226112 76503695 73238207 70255807 68322935 65992707 64900434
5301F4900434r92751j947970j943961l062708k807296j035623M27592j785465
$$ 64900434 63907683 61959713 60015752 56953044 54145748 53110125 53537717 51752252
5293E1752252j573688j556934k8729K97963r83134m09023j204694r05599N9069
$$ 51752252 50178564 48621630 48592901 48890864 47907730 47498707 46294013 45388414 45447483
5284D5447483j150119o03945k027117k93244j065844j313209J63625j082876J54835
$$ 45447483 44297364 43693419 41666302 41373058 40307214 38994005 39157630 38074754 38229589
5275C8229589j410201q44114M52551j016847q97303j59251M64547Q56976j125322
$$ 38229589 36819388 35975274 36427825 35410978 34513675 34354424 34818971 35675947 34550625
5266C4550625q0692J445140K11332R41366j553751j950853j069673j810511n67850
$$ 34550625 34469933 35915073 36126405 37067771 35514020 33563167 32493494 30682983 30115133
5257C0115133j091575j554899m8729j350116n63826J32238P86692j026988j199111
$$ 30115133 29023558 27468659 27419930 26069814 25505988 25638226 26424918 25397930 24198819
5248B4198819q12965j009000O77337j126937L34822R96472L8006m27840j736320
$$ 24198819 23385854 22376854 23054191 21927254 22262076 23258548 23296554 22868714 21132394
5239B1132394O41787J393597n79925r33796J88572M05697j333831J06304M06165
$$ 21132394 21774181 23167778 22587853 21654057 21842629 22248326 20914495 21020799 21426964
5230B1426964n69917j736800j375586M72223J505430L1459n72985q71118Q41245
$$ 21426964 20857047 19120247 17744661 18216884 19722314 19753773 19180788 18309670 19150915
5221A9150915j653862p54289R71915Q69941K03843Q0807m54407J91292R34723
$$ 19150915 17497053 16742764 17714679 18584620 18788463 18869270 18414863 18606155 19540878
5212A9540878o5070N51684Q91379K01140L75535R2284K81766L98749J89678Q51877
$$ 19540878 19475808 20027492 20918871 21120011 21495546 21587830 21869596 22268345 22458023 23309900
5202B3309900l22166p32971j395834j121449j504416M60428j44278r66033j767179
$$ 23309900 22987734 22254763 20858929 19737480 18233064 18693492 18549214 17583181 15816002
5193A5816002P73209N50556J022916j560161q25888M06432L12488Q73616N0897
$$ 15816002 16589211 17139767 18162683 16602522 15776634 16183066 16495554 17369170 17420067
5184A7420067k89349j350385m93240Q77812L86565O41867q64978O51116K813357
$$ 17420067 17130718 15780333 15287093 16164905 16551470 17193337 16328359 16979475 19792832
5175A9792832N18129p72929M30690Q66265l38985j56334J000554n16148p70907
$$ 19792832 20310961 19538032 19968722 20834987 20496002 20339668 21340222 20824074 20053167
5166B0053167l36294j687737q03453r39183K81179j864619o42816R2367j308344
$$ 20053167 19716873 18029136 17225683 16286500 16567679 14703060 14060244 14152611 12844267
5157A2844267N85725K47461o97594J173117j635349l76305j94115l78557K64184
$$ 12844267 13429992 13677453 12979859 14152976 12517627 12141322 11947207 11568650 11832834
5148A1832834N34576L54982j249359L03936k87095J119431J857137q63813J46067
$$ 11832834 12367410 12722392 11473033 11776969 11489874 12609305 14466442 13602629 13748696
5139A3748696m62359K79221J027000j935961R5099O28916j27237q02013k18678
$$ 13748696 13286337 13565558 14592558 12656597 12751696 13380612 13253375 12451362 12232684
5130A2232684J2875n37306m25952k92801M03394L26094p43161k1577q48831R67136
$$ 12232684 12245559 11708253 11282301 10989500 11392894 11718988 10975827 10954250 10105419 11072555
5120A1072555L12685k67109j110732J53018k30506P34744n77346r51355N95857
$$ 11072555 11385240 11118131 10007399 10160417 9929911 10664655 10087309 9135954 9731811
5111I731811K13755Q75513l06742q1576j597524P06629K42229l68552N09667J401592
$$ 9731811 9945566 10821079 10514337 10432761 8835237 9541866 9784095 9415543 9925210 11326802
5101A1326802K29414P1291j117952J594590K12702J58765O29894M85896K38863
$$ 11326802 11556216 11627507 10509555 12104145 12316847 12475612 13105506 13591402 13830265
5092A3830265J97669q55315j99660M89558l47871P50253p19287q17622n20556
$$ 13830265 14027934 13172619 12972959 13462517 13114646 13864899 13145612 12327990 11807434
5083A1807434n29569n71067j063853O43250n30876O28168k61662P98948J35167
$$ 11807434 11277865 10706798 9642945 10286195 9755319 10383487 10121825 10920773 11055940
5074A1055940j502245j973195o22183O05542N03428J844601J46173k38095N05257
$$ 11055940 9553695 7580500 6958317 7563859 8067287 9911888 10058061 9819966 10325223
5065A0325223K45599O48986o44332j859912M84846K43607M35984n40387K38148
$$ 10325223 10570822 11219808 10575476 8715564 9200410 9444017 9880001 9339614 9577762
5056I577762J623319m18590j403961n30643P92471k10341P65261J360962j376459
$$ 9577762 11201081 10782491 9378530 8847887 9640358 9430017 10195278 11556240 10179781
5047A0179781m42660P39799j30635q50786O8252m37599j111116M40607n98171
$$ 10179781 9737121 10476920 10346285 9495499 9563751 9126152 8015036 8455643 7857472
5038G857472J078810J78465J67864N06520p27389m2065j58874j117117l73708
$$ 7857472 8936282 9114747 9282611 9789131 9061742 9019677 8860803 7743686 7369978
5029G369978J287242j28602n09878p74988K28130J151294J139523l97950J4635
$$ 7369978 8657220 8528618 8018740 7243752 7471882 8623176 9762699 9364749 9379384
5020I379384J12335k43183m96923k13801j252001J487190r9391L43131j87663
$$ 9379384 9491719 9248536 8751613 8537812 7285811 8773001 8673610 9016741 8829078
5011H829078n85366M40097O47521j014251m01938J92102m01842P83811J515395
$$ 8829078 8243712 8683809 9331330 8317079 7915141 8107243 7705401 8489212 10004607
5002A0004607q06461j204158k128001K58936J091118R1726J242820P35595o40071
$$ 10004607 9198146 7993988 5865987 6124923 7216041 7307767 8550587 9286182 8646111
4993H646111k011942K11794J736189n30707K550J167359l8269q35616J255016
$$ 8646111 6634169 6845963 8582152 8051445 8053995 9221354 9183085 8347469 9602485
4984I602485M15409K43492q65859Q52096P18855K151331K99084j507947l05251
$$ 9602485 10017894 10261386 9395527 10247623 10966478 13117809 13416893 11908946 11603695
4975A1603695m43068N3694j218681J5599K12870M50519k63261L07238o80244j830141
$$ 11603695 11160627 11214321 9995640 10011239 10224109 10674628 10411367 10718605 10038361 8208220
4965H208220m09359K081655Q96454n71827L07397R1623m25104M04618o54327J137294
$$ 8208220 7798861 9880516 10776970 10205143 10512540 10604163 10179059 10583677 9929350 11066644
4955A1066644O16524j519377J03555q75358k08424J631125j077494J57726J999373
$$ 11066644 11683168 10163791 10267346 9391988 9183564 10814689 9737195 9894921 11894294
4946A1894294q30912n03507j145755j221197J043481l430O78092m222R21990r08837
$$ 11894294 11063382 10559875 9414120 8192923 9236404 9232974 9911066 9906844 10828834 9919997
4936I919997p92292p02471Q78396P47336l79476j105963M98623j194142M6225
$$ 9919997 9127705 8425234 9303630 10050966 9671490 8565527 9064150 7870008 7916233
4927G916233J056319r76598K347301N97040j362020P72485O84816j063044j65050
$$ 7916233 8972552 7995954 10343255 10940295 9578275 10350760 11035576 9972532 9807482
4918I807482l9489p2585N92914q71722m8039M58032O5905K19600j90688N51037
$$ 9807482 9767993 9695408 10288322 9416600 9368561 9826593 9892498 10112098 9921410 10472447
4908A0472447R72384J68590q46563R36184R90398r33340n43598j60041M40763
$$ 10472447 11444831 11613421 10766858 11703042 12693440 11760100 11216502 11056461 11497224
4899A1497224R2803L26074R9863J090932r72927k13956q62245O22683O40632K87412
$$ 11497224 11590027 11916101 12015964 13106896 12133969 11920013 11057768 11680451 12321083 12608495
4889A2608495L10678O93045l08906j15185q02382o15304j43524O76266K02587
$$ 12608495 12919173 13612218 13303312 13188127 12385745 11770441 11626917 12303183 12505770
4880A2505770l19144o1983J056334L34857r00365J487276J35538J81616K97619
$$ 12505770 12186626 12124643 13180977 13515834 12615469 14102745 14238283 14419899 14717518
4871A4717518j082547n42649M73171J079767m89797j97906p91973Q71660P42481
$$ 14717518 13634971 13092322 13565493 14645260 14155463 13957557 13165584 14037244 14779725
4862A4779725m74720L80194n63762J00987q26582N44211M95153K63230M57036
$$ 14779725 14305005 14685199 14121437 14222424 13395842 13940053 14435206 14698436 15155472
4853A5155472O51604m57808J249990L76859o99978J05119K61535j576263P1077
$$ 15155472 15807076 15349268 16599258 16976117 16276139 16381258 16642793 15066530 15137607
4844A5137607O00270J50056Q01846l28482l19137j378460k92812J974551j442828
$$ 15137607 15737877 15887933 16689779 16361297 16042160 14663700 14370888 16345439 14902611
4835A4902611m81809m54300P98240J118030J680748j50566j16801K35521k46893
$$ 14902611 14420802 13966502 14764742 15882772 17563520 17412954 17296153 17531674 17284781
4826A7284781k58290k92061L74684j60672l37914J040527J138751O28355j04618
$$ 17284781 17026491 16734430 17109114 16948442 16610528 17651055 18789806 19418161 19313543
4817A9313543J48941j257750P09717O21466l40299M2979J256993N37417m43403
$$ 19313543 19462484 18204734 18914451 19535917 19195618 19238597 20495590 21033007 20589604
4808B0589604N46342P73432L74041N23061J54545J41359K020936N51081j51489
$$ 20589604 21135946 21909378 22283419 22806480 22961025 23102384 25123320 25674401 25522912
4799B5522912J234841k9059J124714L67989p52577j71289R15533J198233P64591
$$ 25522912 26757753 26728694 27853408 28221397 27468820 27297531 28213064 29411297 30175888
4790C0175888P76021J025154J199572N91457O49316L38620J301677J480901L064240
$$ 30175888 30951909 31977063 33176635 33768092 34417408 34756028 36057705 37538606 40602846
4781D0602846K637437L182013L774486K998141Q36670j03906j071446k584389
$$ 40602846 43240283 46422296 50196782 53194923 54031593 53927687 52856241 50271852
4773E0271852k307559m079788k878820k068201k216375j640247j207173N83407
$$ 50271852 47964293 43884505 41005685 38937484 36721109 35080862 33873689 34457096
4765C4457096M19866O30817k14641k64364J200760O61815m3373M2387j8760j553864
$$ 34457096 34876962 35507779 35293138 35028774 36229534 36891349 36847976 36890363 36871603 35317739
4755C5317739j816142j613055j1748l8334K17521J16373n53574M2958r6941M05387
$$ 35317739 33501597 31888542 31876794 31838460 32055981 32172354 31618780 31661738 31564797 31970184
4745C1970184J301666J883869m62738K58802j235033J195136J122121P064J689625
$$ 31970184 33271850 35155719 34692981 34951783 33716750 34911886 36034007 36041071 37730696
4736C7730696N38590j409719K091981J52062J417044J696266O12785L18721n9731
$$ 37730696 38269286 36859567 38951548 39103610 40520654 42216920 42829705 43148426 43088695
4727D3088695M75144P58996J171233L77719l77374j49440J302928J803683r6672
$$ 43088695 43563839 44322835 45494068 45871787 45494413 45344973 46647901 48451584 48354912
4718D8354912M06660N75858P13091J875636J462263O69000k10905N23860O83823
$$ 48354912 48761572 49337430 50050521 51926157 53388420 54057420 53846515 54370375 55054198
4709E5054198J377596K903092M96734L66535J403610J400815L007255K229775
$$ 55054198 56431794 59334886 59831620 60198155 61601765 63002580 66009835 68239610
4701F8239610L46744J072779K703582K504884K381893K908930J996412K457286
$$ 68239610 68586354 69659133 72362715 74867599 77249492 80158422 82154834 84612120
4693H4612120J199034K626223N326222K391884K815509J599797K035935J926861
$$ 84612120 85811154 88437377 93763599 96155483 98970992 100570789 102606724 104533585
4685A04533585J172709P82659J102977L550635k50919K222218N43614l03478L70808
$$ 104533585 105706294 106488953 107591930 111142565 110891646 113113864 113657478 113354000 113724808
4676A13724808J085216J760230O82518K255662Q21718L277846K338581L057688
$$ 113724808 114810024 116570254 117252772 119508434 120330152 123607998 125946579 129004267
4668A29004267L278767L379694L660444L946383M623366L963266K409249L197119
$$ 129004267 132283034 135662728 139323172 143269555 147892921 151856187 154265436 157462555
4660A57462555J496913m65716J503755p33306k176126k92131j669304j920778
$$ 157462555 158959468 158493752 159997507 159264201 157088075 156795944 155126640 153205862
4652A53205862k792971j096420j063258q52797j508356J23236R90354J858761
$$ 153205862 150412891 149316471 148253213 147400416 145892060 146015296 147005650 148864411
4644A48864411J119753J710645K471075J344847J785957M618399M278187L453750
$$ 148864411 149984164 151694809 154165884 155510731 157296688 161915087 166193274 169647024
4636A69647024L099841R85034J654915J526463R80783q58053j538574l801121
$$ 169647024 172746865 173731899 175386814 176913277 177894060 177036007 175497433 171696312
4628A71696312k310507k240546j975260q76059P04614K50931q54497j066841P25189
$$ 171696312 169385805 167145259 165169999 164293940 164998554 165249485 164394988 163328147 164053336
4619A64053336N07082J719673L497166K638918K346494K74465J773769K493372
$$ 164053336 164560418 166280091 169777257 172416175 174762669 175037134 176810903 179304275
4611A79304275J709875P07061Q97132R77528l31732j795592l110654k715053k209577
$$ 179304275 181014150 181721211 182618343 183595871 183264139 181468547 178357893 175642840 173433263
4602A73433263m492738l876893l096016l284779l366585m059218j575877k004489
$$ 173433263 168940525 165063632 161967616 158682837 155316252 151257034 149681157 147676668
4594A47676668l555664j398239k038861j990270m48196r01954j114038r41719
$$ 147676668 144121004 142722765 140683904 138693634 138245438 137343484 136229446 135287727
4586A35287727j017593k880327j647893p42723j661085k051731l326700j576466
$$ 135287727 134270134 131389807 129741914 128999191 127338106 125286375 121959675 120383209
4578A20383209k483811l100731m279478m028227l919910k632448j631335m652331
$$ 120383209 117899398 114798667 110519189 106490962 102571052 99938604 98307269 93654938
4570I3654938l529308j712322l049092j371181j544427j888519j337639j893686
$$ 93654938 90125630 88413308 85364216 83993035 82448608 80560089 79222450 77328764
4562G7328764j955334k719001l196757j648459m33009j093301j78022q46270l57588
$$ 77328764 75373430 72654429 69457672 67809213 67376204 66282903 66104881 65258611 64901023
4553F4901023j351952k121183q64794q88810o15754n37394K10322j053410p54207
$$ 64901023 63549071 61427888 60563094 59674284 59058530 58521136 58731458 57678048 56923841
4544E6923841K97960k98730m08759j63848j058932j714271l12481n25435o53052
$$ 56923841 57221801 56923071 56514312 56350464 55291532 53577261 53264780 52739345 52086293
4535E2086293j259019o28459K51489K29467J40222j970070m40519J6933j349787
$$ 52086293 50827274 50198815 50450304 50679771 50819993 48849923 48409404 48426337 47076550
4526D7076550P91869k2358q67941r04928M18915K39294R19403J017926j367027
$$ 47076550 47868419 47846061 46978120 46073192 46492107 46731401 47650804 48668730 47301703
4517D7301703j749394j372194j571765J121968l22915Q67275p72261J019144o49293
$$ 47301703 45552309 44180115 42608350 43730318 43407403 44274678 43502417 44521561 43872268
4508D3872268q23963K68239J13866r92526j197008O54185j163208p03396o20367
$$ 43872268 43048305 43316544 43430410 42437884 41240876 41895061 40731853 40028457 39408090
4499C9408090O71888m58794n76401q23188Q82937o97091j241874n31885l08470
$$ 39408090 40079978 39621184 39044783 38221595 39104532 38407441 37165567 36633682 36325212
4490C6325212J733343R6370j391476r68931r87148m78409N95253K0312j342961
$$ 36325212 38058555 38154925 36763449 35794518 34807370 34328961 34924214 34944526 33601565
4481C3601565j020701j073789M10387j081090k93184m73594l63569j266424q18014
$$ 33601565 32580864 31507075 31917462 30836372 30543188 30069594 29706025 28439601 27621587
4472B7621587j70860l7230M9652j34703J10226k88384j042035k95090P63711n25473
$$ 27621587 27450727 27413497 27463149 27328446 27438672 27150288 26108253 25813163 26576874 26051401
4462B6051401R25461L24337j218681j386740N90869q48947j42807m79790J56496
$$ 26051401 26976862 27301199 26082518 24695778 25286647 24437700 24294893 23815103 23971599
4453B3971599O38560k93860p69632m33789k01020p76298q42055j104627J147815
$$ 23971599 24610159 24316299 23546667 23112878 22911858 22135560 21293505 20188878 21336693
4444B1336693P82904j280965n70023N32676l30964j311165l62564M7569O6583
$$ 21336693 22119597 20838632 20268609 20801285 20470321 19159156 18796592 18844161 18910744
4435A8910744n37280K20807M41198j073979j104264M42060J174492j120959j200426
$$ 18910744 18373464 18594271 19035469 17961490 16857226 17299286 18473778 17352819 16152393
4426A6152393K89884j84811M88221k08958j003630J23469n4194M21988J190539
$$ 16152393 16442277 16257466 16745687 16536729 15533099 15656568 15602374 16024362 17214901
4417A7214901j279672o49056M97427n95647n65686p2816Q79585N51819j18575
$$ 17214901 15935229 15286173 15783600 15187953 14622267 14549451 15429036 15980855 15862280
4408A5862280q819j95000k184765J043400J318074j636584K14416R30281J49871
$$ 15862280 15853461 15658461 13473696 14517096 15835170 14198586 14413002 15343283 15493154
4399A5493154M25910p95020j98814J58689N64345K51177K07198j183672m52383
$$ 15493154 15919064 15124044 14925230 15083919 15648264 15899441 16106639 14922967 14470584
4390A4470584k20886n43409R13639n3913j517672k79683J218285r5950j659890
$$ 14470584 14249698 13706289 14619928 14566015 13048343 12768660 13986945 13890995 12231105
4381A2231105N79885M40377j7249o21944l97978Q12093Q77448Q49498M70358j664781
$$ 12231105 12810990 13251367 13234118 12612174 12214196 13026289 13903737 14753235 15223593 13558812
4371A3558812j089100R27811J140121J64343p00507p14401L58923R57380o6776
$$ 13558812 12469712 13397523 14537644 14701987 14001480 13287079 13646002 14603382 14536606
4362A4536606p53564k82542J220533N72995j149417o05216N86213j543746J043195
$$ 14536606 13783042 13500500 14721033 15294028 14144611 13539395 14125608 12581862 13625057
4353A3625057K23775k11619J476974K77921n56716k77254m50231k49826M37965
$$ 13625057 13848832 13637213 15114187 15392108 14835392 14558138 14107907 13858081 14296046
4344A4296046m9739o30100q99490O97492p2786N95862O46263k98227p69568L33021
$$ 14296046 14246307 13616207 12716717 13414209 13341423 13937285 14583548 14285321 13515753 13848774
4334A3848774j166656p20483P74910r7739J001213p2886K15688J7983k45008p90963
$$ 13848774 12682118 11961635 12736545 12638806 13640019 13567133 13782821 13800804 13555796 12764833
4324A2764833K11115p07243k204L45767r5130O46370k60679k34881Q69837O46434
$$ 12764833 12975948 12268705 12266501 12612268 12517138 13163508 12902829 12667948 13537785 14184219
4314A4184219k4706P59163m09961r65308J909305K2260M1194Q0916m05469m24236
$$ 14184219 14159513 14918676 14508715 13543407 15452712 15474972 15516166 15597082 15191613 14767377
4304A4767377n26086N32181p78967N65368k23506j268747J555810J546094m12104
$$ 14767377 14241291 14773472 13994505 14559873 14336367 13067620 14623430 16169524 15757420
4295A5757420p56636l38622L98855K62796M35547j54898l70473R4781p2929J168617
$$ 15757420 15000784 14662162 15061017 15323813 15759360 15604462 15233989 15328770 15255841 16424458
4285A6424458j163836n98719N54839j67522J182976Q75064q23582k37547o87659
$$ 16424458 15260622 14661903 15216742 15049220 16232196 17107260 16283678 16046131 15358472
4276A5358472P33283J379153M63212j237101n22880n2631k23134P16615K348798
$$ 15358472 16091755 17470908 17934120 16697019 16174139 16121508 15898374 16614989 18963787
4267A8963787N00449j765278j119709P27545J015012J71599J92862l32736l98744
$$ 18963787 19464236 17698958 16579249 17306794 18321806 18493405 18686267 18353531 17954787
4258A7954787q14282N88575P32470R4398r14310K41975M18457J321122q81392
$$ 17954787 17140505 17729080 18461550 18555948 17641638 17883613 18302070 19623192 18741800
4249A8741800j175538J068119J326363j152223k78242J139239J360399j592380
$$ 18741800 17566262 18634381 19960744 18808521 18530279 19669518 21029917 19437537
4241A9437537p65469J079583O07783j009015n98690j87123R83212J520330j003071
$$ 19437537 18672068 19751651 20359434 19350419 18751729 18564606 19547818 21068148 20065077
4232B0065077j231618J394815J838732j916305n54685k06183N00334J049226j02478
$$ 20065077 18833459 20228274 22067006 20150701 19596016 19389833 19890167 20939393 20836915
4223B0836915q8212j93798L46277J7103J420715J14716l25026l02493J295287
$$ 20836915 20748703 20554905 20901182 20918285 22339000 22453716 22128690 21826197 23121484
4214B3121484J088382m90859m12119k45108R73275l87725n28087J472571M27645
$$ 23121484 24209866 23719007 23306888 23061780 24035055 23647330 23119243 24591814 25019459
4205B5019459J82547Q59208p92353L58588J50460r20692n14116O6706P32810N20981
$$ 25019459 25202006 26061214 25268861 25627449 25777909 24857217 24343101 24409807 25142617 25663598
4195B5663598O89077M77194m27308k36617j02724J551672k99271K41753L87624
$$ 25663598 26352675 26829869 26402561 26165944 26063220 27614892 27315621 27557374 27944998
4186B7944998R19320Q6154o77900O78157J643391l87614n92953k25578j456188
$$ 27944998 28864318 28950472 28272572 28950729 30594120 30206506 29613553 29387975 27931787
4177B7931787j171940J500618J42033o78509R38401O45133p20034j877075J60226
$$ 27931787 26759847 28260465 28402498 27723989 28662390 29307523 28587489 26710414 26870640
4168B6870640J242861j11469o21792n28981J285124P69151J71018o2848j236685
$$ 26870640 28113501 28002032 27380240 26851259 28136383 28905534 29076552 29013704 27777019
4159B7777019m08576M40613J595648R15526M5875K13663O09500j449327O08840
$$ 27777019 27368443 27809056 29404704 30320230 30366105 30579768 31189268 29739941 30348781
4150C0348781O5913q56800M86521Q21819J09368J46526q96059K11309J244542
$$ 30348781 30414694 29557894 30044415 30866234 30975602 31122128 30226069 30437378 31681920
4141C1681920M7657j13027p41475J162490O37426j465115k51923J191754J455532
$$ 31681920 31729577 31616550 30875075 32037565 32674991 31209876 30957953 32149707 33605239
4132C3605239m19747m45301K10979j7552J46771J273712j122486q40615P29134
$$ 33605239 33185492 32740191 32951170 32933618 33080389 34354101 33231615 32391000 33120134
4123C3120134j406462J933583L13686l14946j709745r05186J808836R19410o6733
$$ 33120134 31713672 33647255 33960941 33645995 31936250 31031064 32839900 33759310 33692577
4114C3692577L09782O92569j022078L42210l88375o6785l11857M95950Q0681L18084
$$ 33692577 34002359 34694928 33672850 34015060 33626685 33559900 33248043 33743993 33824674 34142758
4104C4142758o87404K21580K43047k96926J419772j024203n0408j227967K84696
$$ 34142758 33455354 33676934 33919981 33623055 35042827 34018624 33968216 32740249 33024945
4095C3024945J382094L70905o50640q5076J099351p80353j37852K99761M6681
$$ 33024945 34407039 34777944 34127304 34042228 35141579 34361226 34223374 34523135 34569816
4086C4569816J036951N77862q97711l7363J005798n65944J52789P06973J23192
$$ 34569816 35606767 36184629 35286918 35249555 36255353 35689409 35842198 36549171 36672363
4077C6672363r39663l235Q64264n97880K93409r60268M33983j77431K71973M44321
$$ 36672363 35732700 35729465 36593729 35995849 36289258 35328990 35762973 35585542 35857515 36301836
4067C6301836N44226j95751q72188J59505Q30023N09637K12949l40648j85584
$$ 36301836 36846062 36650311 35778123 35937628 36767651 37277288 37490237 37149589 36964005
4058C6964005K038015N21711j024698O09684o10564J72815N757J529996M29174
$$ 36964005 39002020 39523731 38499033 39108717 38498153 38670968 38676725 40206721 40635895
4049D0635895o01715J248114O51664q87391l83032L28885P98280K74791J076078
$$ 40635895 40034180 41282294 41933958 41046567 40663535 40992420 41790700 42065491 43141569
4040D3141569J430010j6351L75364r06883J125671q0927k30681m33705J304674
$$ 43141569 44571579 44555228 44930592 44023709 45149380 45068453 44837772 44404067 45708741
4031D5708741J26208j473104L17879Q78376m63097Q34939M9247K99811K156016
$$ 45708741 45834949 44361845 44679724 45558100 45095003 45929942 45979189 46279000 48435016
4022D8435016K51820L19314k5023m92829R95865J27807N09982m51961N17482N13875
$$ 48435016 48686836 49006150 48981127 48488298 49484163 49611970 50121952 49669991 50187473 50701348
4012E0701348Q80003J670380K250952O38543j398068J456184J291554J894619
$$ 50701348 51581351 53251731 55502683 56141226 54743158 56199342 57490896 59385515
4004E9385515J767192N23089L39396J024387J229831J592043J474588j41557J195100
$$ 59385515 61152707 61675796 62015192 63039579 64269410 65861453 67336041 67194484 68389584
3995F8389584Q98343J318129J905773P35048O43561J379036N6321J445368K603607
$$ 68389584 69287927 70606056 72511829 73246877 73890438 75269474 75325795 76771163 79374770
3986G9374770J045271Q50517K371585J442186R42850K148767J984568Q95487J385403
$$ 79374770 80420041 81270558 83642143 85084329 86027179 88175946 90160514 91056001 92441404
3977I2441404K510218J318630N5596N18657K034817J809127J529158K204200R74228
$$ 92441404 94951622 96270252 96325848 96844505 98879322 100688449 102217607 104421807 105396035
3968A05396035J388733J949874J197764J119891J850092J18011K154490K675168
$$ 105396035 106784768 108734642 109932406 111052297 112902389 113020400 115174890 117850058
3960A17850058J062801K848733J303423L398216J734500J085607J627378K604223
$$ 117850058 118912859 121761592 123065015 126463231 128197731 129283338 130910716 133514939
3952A33514939k00877Q70967J125237k08063J549280J094300J206282O93171P14120
$$ 133514939 133314062 134185029 135310266 135102203 136651483 137745783 138952065 139645236 140359356
3943A40359356J539281J207770M75538Q77427K722375J214917M20929K094948
$$ 140359356 141898637 143106407 143581945 144459372 147181747 148396664 148817593 150912541
3935A50912541J090723N16434Q45325K755495J256290L291322J866100J135734
$$ 150912541 152003264 152519698 153365023 156120518 157376808 160668130 162534230 163669964
3927A63669964M644086K644656K941214K365174J706312J94121K217715K769681
$$ 163669964 168314050 170958706 173899920 176265094 177971406 178165527 180383242 183152923
3919A83152923J196754J787546O26324J745076J053922K465724J057700r4247
$$ 183152923 184349677 186137223 186763547 188508623 189562545 192028269 193085969 192991722
3911A92991722J212136o71228J559464J132538Q05575N02770J441195J336447
$$ 192991722 194203858 193532630 195092094 196224632 197030207 197532977 198974172 200310619
3903B00310619O77478n92213P6809l20720n16171K196900L28283j470893J066441
$$ 200310619 200988097 200395884 200472693 200151973 199635802 201832702 202160985 200690092 201756533
3894B01756533N41081N81551J504930N8341q43707q3413J81030k47917j245678
$$ 201756533 202297614 202879165 204384095 204442436 203598729 203515316 203696346 203448429 202202751
3885B02202751j971895p77848j579091p51179k152511k269056k030034j743703
$$ 202202751 200230856 199453008 197873917 197122738 194970227 192701171 190671137 188927434
3877A88927434k868133j443414k207935k230383l382459k169040k31572j475384
$$ 188927434 186059301 184615887 182407952 180177569 176795110 174626070 174394498 172919114
3869A72919114j165727j675206R9379j316001j168463j124611j063446j895922
$$ 172919114 171753387 170078181 170177560 168861559 167693096 166568485 165505039 163609117
3861A63609117p72958j818000k547584j793823j884437p77281r91816p47056p94232
$$ 163609117 162836159 161018159 158470575 156676752 154792315 154015034 153023218 152276162 151481930
3852A51481930o89702p72061k479938j656945k693408l212740k097391j978147
$$ 151481930 150792228 150020167 147540229 145883284 143189876 139977136 137879745 135901598
3844A35901598l782840k619514r75055j658488j645480j353524k324103j946617
$$ 135901598 132118758 129499244 128524189 126865701 125220221 123866697 121542594 119595977
3836A19595977j779254j470258j809060n81823j953456j376076j434457j430192
$$ 119595977 117816723 116346465 114537405 113955582 112002126 110626050 109191593 107761401
3828A07761401k164602j938089q34213k325586l1487j508567j955900k264103
$$ 107761401 105596799 103658710 102824497 100498911 100467424 98958857 97002957 94738854
3820I4738854o22730k156628k552319k637984q98496j392756k659677j053824
$$ 94738854 94116124 91959496 89407177 86769193 85870697 84477941 81818264 80764440
3812H0764440m76669j932365j488417k828161n73713k224358n04249K30124r91535
$$ 80764440 80287771 78355406 76866989 74038828 73465115 71240757 70736508 70966632 69975097
3803F9975097n57500j681476q96026j482183j352869j070887k893758k85276k74738
$$ 69975097 69417597 67736121 66840095 65357912 64005043 62934156 60040398 59755122 59480384
3794E9480384n85218M76453j88798k575754p15333j101757j492257p99022j035266
$$ 59480384 58895166 59371619 59182821 56607067 55891734 54789977 53297720 52498698 51463432
3785E1463432r16477j00460j295192o24078j416464m41134k32415M60807p32971
$$ 51463432 50546955 50446495 49151303 48527225 47110761 46669627 46437212 46898019 46165048
3776D6165048j929950n30179q51322j03133o33713J247263n85857j173394Q85785
$$ 46165048 44235098 43704919 42853597 42750464 42116751 43364014 42778157 41604763 42490548
3767D2490548M24952j171145n95056j204141k69152j105492O14290m64116m37410
$$ 42490548 42915500 41744355 41149299 39945158 39676006 38570514 39184804 38720688 38283278
3758C8283278j020403r7554q1633J29364j21085l80169j141558l77487m50350
$$ 38283278 37262875 37165321 37083688 37213052 37091967 36711798 35570240 35192753 34742403
3749C4742403l69815r32017M01913K61264K71962L79722k49969p68675l46514
$$ 34742403 34372588 33440571 33842484 34103748 34375710 34755432 34505463 33736788 33390274
3740C3390274J9890R72056M66220j008972j96049M53724o76008k0290K47351O27200
$$ 33390274 33410164 34382220 34848440 33839468 33643419 34097143 33421135 33400845 33648196 34275396
3730C4275396j306100p69878J972887J946065j077941j688904q30303q60010Q19514
$$ 34275396 32969296 32199418 34172305 36118370 35040429 33351525 32521222 31661212 32480726
3721C2480726J426175l14170l95979q21511N71515J1660O25047M2579O42222j52931
$$ 32480726 33906901 33592731 33196752 32375241 32946756 32958416 33583463 33626042 34268264 34115333
3711C4115333j072537J06661l25349M37167L42070L74117j498778P90954r5284
$$ 34115333 33042796 33149457 32824108 33261275 33603345 33977462 32478684 33269638 33174354
3702C3174354l55465J328277O26088m37806J114198L54075p70470N26848O79564
$$ 33174354 32818889 34147166 34773254 34335448 35449646 35803721 35033251 35560099 36239663
3693C6239663r16034J091945L65664L41744j3664O62496J164764n04786R0256
$$ 36239663 35323629 36415574 36781238 37122982 37109318 37771814 38936578 38431792 38522048
3684C8522048K329127R92696l06721K789442P30825l13588Q22939J266740K948028
$$ 38522048 40851175 41843871 41537150 44326592 45057417 44743829 45566768 46833508 49781536
3675D9781536L58935J349513L127549L685461K051996K002458K699403L575636
$$ 49781536 50140471 51489984 54617533 58302994 60354990 62357448 65056851 68632487
3667F8632487L477392M577102N318503M769888N758045N894780P959204Q509734
$$ 68632487 72109879 76686981 82005484 86775372 92533417 98428197 106387401 114897135
3659A14897135R210354J0419307R820390R292115P542736N693651J114639k866970
$$ 114897135 124107489 134526796 144347186 153639301 161182037 166875688 167990327 165123357
3651A65123357r037879j1316760j2209363j1984494j0071371j0785030q849588
$$ 165123357 156085478 144768718 132559355 120574861 110503490 99718460 90868872
3644I0868872q224165o269229o293726n164212l317946m052500l675638l269023
$$ 90868872 82644707 76375478 70081752 64917540 61599594 57547094 53871456 50602433
3636E0602433k130301k580437k138809j768016j243396r24827k951291j524220
$$ 50602433 48472132 45891695 43752886 41984870 40741474 39816647 36865356 35341136
3628C5341136q05607q37243j384903j069595r4855L53680R9249j440195j43299
$$ 35341136 34535529 33698286 32313383 31243788 31148933 31502613 31601862 30161667 30018368
3619C0018368J182073j475214j492043j095651q87916L02555R58009o96330M36731
$$ 30018368 31200441 29725227 28233184 27137533 26249617 26552172 27510181 26813851 27250582
3610B7250582m54148k299056r61256O13394J26353n07382L0080l94434m62497
$$ 27250582 26796434 24497378 23536122 24149516 24275869 23768487 23798567 23404133 22941636
3601B2941636L7j334055J074456L09738k190596L34158j007773M94581p96208
$$ 22941636 22941673 21607618 22682074 22991812 20801216 21135374 20127601 20622182 19825974
3592A9825974l95866P29689o74417N74658M51733j215731J4059L57895o52315
$$ 19825974 19430108 20159797 19485380 20060038 20511771 19296040 19310099 19667994 19015679
3583A9015679P5793L09433m13571n17030K43198m00735m82827J236413m19158
$$ 19015679 19091472 19400905 18987334 18470304 18713502 18312767 17829940 19066353 18647195
3574A8647195n86369J20485j111555o15959J27688q82095O94209J379322j018920
$$ 18647195 18060826 18181311 17069756 16453797 16581485 15699390 16393599 17772921 16754001
3565A6754001J55015r87795P70483L17149k53937q86948q31734O20616N88853
$$ 16754001 16909016 15921221 16691704 17008853 16754916 15867968 15036234 15656850 16245703
3556A6245703q16305j150407L12604N5225L47162R44363r79756p65554N40655
$$ 16245703 15429398 14278991 14591595 14646820 14993982 15938345 14958589 14193035 14733690
3547A4733690p51806J8815O86852K00984J83117j81480q3434L51742K38736O43971
$$ 14733690 13981884 14000699 14687551 14888535 15071652 14890172 14806738 15158480 15397216 16041187
3537A6041187q38049J41877j45356N91199n83008j58627J13559o9791M8852J053402
$$ 16041187 15203138 15345015 15199659 15790858 15207850 15049223 15162782 15092991 15141843 16195245
3527A6195245j17849j010649J42770q56024M12505l82021j474498m50289K3712
$$ 16195245 16077396 15066747 15209517 14353493 14765998 14383977 12909479 12459190 12482902
3518A2482902J180308K68635l02559L94224L35044P14894k21684m73922j387188
$$ 12482902 13663210 13931845 13629286 14023510 14358554 15073448 14851764 14377842 12990654
3509A2990654K32161j07863K96246k6697L21495k18705j501165J90786J065936
$$ 12990654 13222815 13114952 13411198 13384501 13705996 13487291 11986126 12176912 13242848
3500A3242848M35195n63546O5046O63037M65142q59952J49278N83933k68726j0821
$$ 13242848 13678043 13114497 13179543 13842580 14307722 13447770 13597048 14180981 13912255 13901434
3490A3901434r44615N93485j228329q87587L86778J552275J422222n69905J054821
$$ 13901434 12956819 13550304 12321975 11434388 11821166 13373441 14795663 14225758 15280579
3481A5280579o61329j076866j238526p46910L70565l08421M35659J87199L65581
$$ 15280579 14619250 13542384 12303858 11556948 11927513 11619092 12054751 12241950 12607531
3472A2607531J91772K88066n56637q0952l18365R89079j66055n21445R29596M80328
$$ 12607531 12799303 13087369 12530732 12449780 12131415 13120494 12954439 12432994 13362590 13842918
3462A3842918l5625m9714q31929l26541L88283L14528O1088K08354l66266n02634
$$ 13842918 13807293 13757579 12925650 12599109 12987392 13301920 13363008 13571362 13205096 12702462
3452A2702462Q13695J094595j8450j822323K93279M70665k78415O2806J115223
$$ 12702462 13516157 14610752 14592302 12769979 13063258 13533923 13255508 13318314 14433537
3443A4433537n54118j8702L14886n20980o00119j17251J94897L3590m44343O76703
$$ 14433537 13879419 13860717 14175603 13654623 13054504 12937253 13132150 13165740 12721397 13398100
3433A3398100q92127l60186L18092L61845q5302j27016J177964L23901K1642o76960
$$ 13398100 12505973 12145787 12463879 12825724 12740422 12613406 13791370 14115271 14136913 13459953
3423A3459953J21970J182872K3531n56573O29029P85976j006903L04343o24113
$$ 13459953 13581923 14764795 14788326 14231753 14860782 15646758 14639855 14944198 14320085
3414A4320085n95651o8369R98620J176967l56982J14191J554401m33617R2512
$$ 14320085 13724434 13656065 14654685 15831652 15474670 15588861 17143262 16709645 16802157
3405A6802157p72630R54056p15954l4864K160578o35944j139077o372O25684P31172
$$ 16802157 16029527 16983583 16267629 16232765 18393343 17757399 16618322 16611950 17237634 17968806
3395A7968806N44963p22570M87418j342J238907l32948N73065o62707k00478O79104
$$ 17968806 18513769 17791199 18278617 18277275 19516182 19183234 19756299 19093592 18893114 19572218
3385A9572218K62629Q58265k54584M5787J443803j243254l10905J87743N12368
$$ 19572218 19834847 20693112 20438528 20484315 21928118 20684864 20373959 20561702 21074070
3376B1074070l50125Q31202K401373J865027J020654m87774m67400J909722k12269
$$ 21074070 20723945 21555147 23956520 25821547 26842201 26354427 25887027 27796749 27584480
3367B7584480r80153k25817O1510R93670O70228O77044N56203P02868P49643J349450
$$ 27584480 26604327 26378510 26440020 27433690 28103918 28780962 29337165 30040033 30789676 32139126
3357C2139126N45442J88701N86244J107406J581609J901918J403600l62140p75396
$$ 32139126 32684568 32873269 33459513 34566919 36148528 38050446 39454046 39091906 38316510
3348C8316510O59954N43570J141792m88369q66617J46133K028529Q87482k40264
$$ 38316510 38976464 39520034 40661826 40173457 39306840 39452973 41481502 42368984 42128720
3339D2128720N49067j123544l390814m261704j887547k071009j656187n95895
$$ 42128720 42677787 41554243 38163429 33901725 32014178 29943169 28286982 27691087
3331B7691087l93189n13660j442341j540596k83541J264503P50977q53568O31666
$$ 27691087 27297898 26784238 25341897 23801301 23517760 24782263 25533240 24679672 25311338
3322B5311338R3490j43054j045500J530523K653665O36781J161236J527598J796041
$$ 25311338 25404828 25261774 24216274 25746797 28400462 29037243 30198479 31726077 33522118
3313C3522118J038306N64046M78983O16924O97531M63384k124993k646131l632506
$$ 33522118 34560424 35124470 35603453 36220377 36917908 37381292 35256299 32610168 28977662
3304B8977662j378280k912926k000429j301832k25809j101576m99783j002216
$$ 28977662 27599382 24686456 22686027 21384195 21158386 20056810 19557027 18554811
3296A8554811j485536j81304q0719J60473m49819j218679r99371R64600L85312
$$ 18554811 17069275 16887971 16807252 16967725 16517906 15299227 14299856 15264456 15649768
3287A5649768m143M50072N56551Q20621L21807L76906J217948l43938J32808j10153
$$ 15649768 15645625 16095697 16652248 17472869 17794676 18171582 19389530 19045592 19178400 19068247
3277A9068247m89992K05885j328564k622624o37247M84739l65144m11034j333029
$$ 19068247 18578255 18784140 17455576 14832952 14195705 14680444 14315300 13904266 12571237
3268A2571237j174443R74545q15740j638723n06693O51457M47709q31123l86301
$$ 12571237 11396794 12371339 11555599 9916876 9410183 10061640 10509349 9678226 9291925
3259I291925n63498k90085n17946J127508K22289r11862L64033l37292j57559
$$ 9291925 8728427 8438342 7920396 9047904 9270193 8358331 8722364 8385072 8227513
3250H227513K92850n0232K66444j111178p46756N6164q51317L40566m42748L31853
$$ 8227513 8520363 8470131 8736575 7625397 6878641 6934805 6083488 6424054 5981306 6313159
3240F313159J536310J974991J61621j898922q95471J340090q95438o34243L88176
$$ 6313159 7849469 9824460 9986081 8087159 7191688 8531778 7636340 7002097 7390273
3231G390273l25020Q31334m56737J204344j366184r77438j5818M53310P3317q89734
$$ 7390273 7065253 7896587 7439850 8644194 7278010 6300572 6284754 6738064 6811381 5921647
3221E921647K30202j51160O90999k676924n8900J34180n26674J031327K96511
$$ 5921647 6151849 6000689 6691688 4014764 3955864 4090044 3563370 4594697 4891208
3212D891208O76212M03095n15724Q13560l38511N20447k01538O9748j003740O80214
$$ 4891208 5567420 5970515 5454791 6268351 5929840 6450287 6248749 6318497 5314757 5994971
3202E994971K85115Q77652j313796Q92707j51838K72524J032421n74483J14587
$$ 5994971 6280086 7157738 5843942 6736649 6584811 6857335 7889756 7315273 7429860
3193G429860r48180j429260l64917J369572j005612j904413O27156K045465j91928
$$ 7429860 6481680 5052420 4687503 6057075 5051463 3147050 3774206 5819671 5627743
3184E627743k96830m9226m11583q35704K316582j305555J15354j175380J182134
$$ 5627743 5330913 5281687 4870104 4034400 6350982 5045427 5160781 3985401 5167535
3175E167535N37354n74568j32565M77113P19957n47418O50997K67200j422785
$$ 5167535 5704889 5130321 4997756 5474869 6194826 5647408 6298405 6565605 5142820
3166E142820o12188K18551R86956j00272k134771P61164O25616K51737P98816
$$ 5142820 4530632 4749183 5736139 5635867 3501096 4262260 4887876 5139613 5938429
3157E938429j080505m05024N9573J20941m15243K06957J79433k78794j03737O50790
$$ 5938429 4857924 4452900 4512473 4633414 4218171 4425128 4604561 4325767 4222030 4872820
3147D872820k38745P85041k36043o60277n162j03876j093912m2281J916446N54968
$$ 4872820 4634075 5419116 5183073 4522796 4517634 4413758 3319846 3277565 5194011 5748979
3137E748979j110534L59638J248266o13847n47378p47475J43200M26123J39045
$$ 5748979 4638445 4998083 6246349 5632502 5085124 4337649 4480849 4906972 5046017
3128E046017r29296k56927Q56859j26040O12871O33618L77676j223940m5154P0523
$$ 5046017 4116721 3859794 4716653 4590613 5203484 5837102 6214778 4990838 4945684 5016207
3118E016207M73682r48746j92815J998992j19646k51309l52667J396537p40547
$$ 5016207 5489889 4541143 4348328 6347320 6227674 5976365 5623698 7020235 6279688
3109F279688k92434M18189N38773k77195o89482K48527J498311Q36502O82945
$$ 6279688 5987254 6405443 6944216 6667021 5977539 6226066 7724377 8560879 9243824
3100I243824L80596P33243O45281O32319l56914K12389l3001j708886k68147O10200
$$ 9243824 9624420 10357663 11002944 11635263 11278349 11490738 11457737 9748851 9480704 10090904
3090A0090904n21606j326514K90234P30077J954970J014208j451438j068956k15658
$$ 10090904 9569298 8242784 8533018 9263095 11218065 12232273 10780835 9711879 9496221
3081I496221q16247p87840L91631p43644Q3888R64062R12034J46911k0043k001913
$$ 9496221 8679974 7892134 8283765 7540121 7624009 8588071 9500105 9647016 9626973 7625060
3071G625060J306205J227069J071455J076595k16610J846497J557122l42529K20106
$$ 7625060 8931265 10158334 11229789 12306384 12089774 13936271 15493393 15150864 15370970
3062A5370970j336260k47035J058172L06218N76149l96344K43776q04736j593660
$$ 15370970 14034710 13787675 14845847 15152065 15728214 15331870 15575646 14770910 13177250
3053A3177250M57284p26029q54149j94012J045938j147430j746675J932468J41884
$$ 13177250 13634534 12908505 12054356 11860344 12906282 11758852 10012177 11944645 12086529
3044A2086529J6326L26348n64729o00216L64499j27436M4993Q87116J63245j60947
$$ 12086529 12102855 12429203 11864474 11264258 11628757 11501321 11546314 12433430 12596675 12435728
3034A2435728O06517L91941N95935L26619J388188L34358j19317k222697j724178
$$ 12435728 13042245 13434186 14030121 14356740 15744928 16079286 15959969 13737272 12013094
3025A2013094R80284L1676J12985J4981o70405k07596o12676j009879j089649
$$ 12013094 12993378 13025054 13138039 13153020 12482615 12275019 11662343 10652464 9562815
3016I562815j94272k13657K625460m39351o47777K77689n23822J43533M63064
$$ 9562815 9368543 9154886 11780346 11340995 10693218 10970907 10447085 10590618 11053682
3007A1053682j248101j158958N11640l59652j117031l25324m63837J62260n29760
$$ 11053682 9805581 8646623 9158263 8798611 7681580 7356256 6892419 7054679 6524919
2998F524919J571922l44241p47153R55625p33267K389966j203208k3919m87284
$$ 6524919 8096841 7752600 7005447 7961072 7227805 9617771 8414563 8390644 7903360
2989G903360j654478J221951J274102j297374P569K53785k41088m4752L9546O52559
$$ 7903360 6248882 7470833 8744935 7447561 7455130 7708915 7467827 7423075 7462621 8115180
2979H115180j306023o17638M88538R70598j090818p01470J365133K20132j648351
$$ 8115180 6809157 6191519 6680057 7650655 6559837 5858367 7223500 7443632 5795281
2970E795281P7570J595787j389539K48595j166111j212972J816322M80628K03899
$$ 5795281 5872851 7468638 6079099 6327694 5161583 3948611 5764933 6245561 6449460
2961F449460j344722M45888M82484p96285J270004q51327j659288J57096n66685
$$ 6449460 5104738 5550626 6033110 5236825 6506829 5655502 3996214 4153310 3586625
2952C586625K95447K8859K0696m96284j20866R752j321399N67191o3526q5337
$$ 3586625 3882072 3910931 3931627 3435343 3314477 3324229 2002830 2570021 2506495 2421158
2942B421158P71811L21457q03022l35684J39063P78114J247435k15736j847423
$$ 2421158 3192969 3514426 2711404 2375720 2514783 3292897 4540332 4324596 2477173
2933B477173l29840Q52187J114135j356985K59678O03169n81407r86348M51129
$$ 2477173 2147333 2999520 4113655 2756670 3016348 3619517 3038110 2051762 2502891
2924B502891k12255L50744K72723j80420o4249j019589R07438J867917r54735
$$ 2502891 2290636 2641380 2914103 2733683 2669434 1649845 2557283 4425200 3470465
2915C470465j387724O56896m79946O09738r48542j620314O30045J837539j206798
$$ 3470465 2082741 2739637 2259691 2869429 1920887 300573 930618 2768157 1561359
2906A561359R8955r18796Q93133J052621M37979j45428j611805q74499Q6065l3664
$$ 1561359 1660314 741518 1634651 2687272 3125251 2979823 1368018 493519 579584 545920
2896E45920P86007o38195j37483O53633l65417L43696O39228P42654j105154j440607
$$ 545920 1331927 693732 556249 1209882 844465 1188161 1827389 2570043 1464889 24282
2886B4282Q14275N58714K63295R72694O88637m92317l63046L78540j557132o01927
$$ 24282 838557 1397271 1660566 2633260 3321897 2829580 2466534 2845074 1287942 686015
2876F86015N12162N9504J20445N51921O54023p87097j195891J03224O64017N79104
$$ 686015 1198177 1257681 1378126 1930047 2584070 1796973 601082 704306 1368323 1947427
2866A947427p44107p83739O56263J70923j201201J9678O02897q880j786016O12576
$$ 1947427 1203320 419581 1075844 1246767 45566 65244 668141 659261 -1126755 -514179
2856e14179M96544R72492Q78542P5963p73172J332778m45039p47508R63594n7937
$$ -514179 -17635 954857 1833399 1909362 1136190 2468968 2023929 1276421 2240015 2182078
2846B182078p25944k193966m59274N36036O69529N72230N01856J682282k88953
$$ 2182078 1456134 -737832 -1197106 -661070 8459 580689 1082545 2764827 2475874
2837B475874m58635j155520O07162r85296k15063Q46827r34468j64417N18165
$$ 2475874 2017239 861719 1468881 483585 268522 1115349 180881 16464 534629
2828E34629J471670m28767j63713o79684n25681O54132R47147j901o10297l57505
$$ 534629 2006299 1577532 1413819 734135 208454 862586 1809733 1807832 1197535 840030
2818H40030m3214N38224l96797J90410J238023m98755j222187m90020N48200r31460
$$ 840030 796816 1335040 938243 1128653 2366676 1867921 645734 155714 703914 -227546
2808b27546j89187M59042N79532p62349J023866N92138l37801N27521p95678l0268
$$ -227546 -416733 42309 621841 -140508 883358 1475496 1137695 1665216 869538 839270
2798H39270M3449M61445m27564m88135J346416L8098j016303r5435J65792j236517
$$ 839270 882719 1344164 916600 428465 1774881 1812979 796676 701241 867033 -369484
2788c69484K47194J116623M49520l37502m32566O1610J548006q3594k309629j255882
$$ -369484 -122290 994333 1443853 1106351 673785 735395 2283401 2199807 -109822 -1365704
2778a365704J857130K9943Q7935N2767J111510N26911j379628J93099O16305j851214
$$ -1365704 491426 521369 609304 662071 1773581 2300492 920864 1113963 1730268 -120946
2768a20946m76870K05165p09049L69402J712870o69962N78436j20932j061226
$$ -120946 -597816 -392651 -1101700 -732298 980572 310610 889046 768114 -293112
2759b93112K674110K09987o59218j02342j092626o54322N44493R95441J33391
$$ -293112 2380998 2590985 1931767 1829425 736799 82477 626970 1622411 1755802
2750A755802P033q04741l03967J022137p66409j2378J64453K92113K40511l65091
$$ 1755802 1762835 958094 654127 1676264 909855 897477 1061930 1354043 1594554 1229463
2740A229463j660327L10386L47550l53644K53355N46740N32089l84802L05165
$$ 1229463 -430864 -120478 227072 -126572 126783 673523 1205612 820810 1125975
2731A125975N22294j296534K62981J691558j807068k87322J667278k121287J34027
$$ 1125975 1648269 351735 614716 2306274 499206 211884 1879162 -242125 -108098
2722a08098m11279m57653K20295J088869L67136p72308P44457J344648r18733
$$ -108098 -519377 -977030 -756735 332134 699270 -73038 671419 2016067 1097334
2713A097334q27289M17950k29717O44342N86854j674292k017649m50537J195724
$$ 1097334 270045 687995 458278 1102620 1689474 15182 -2002467 -2453004 -1257280
2704a257280M33336k52652J070840J708310n714j445103n49862k19641n84534
$$ -1257280 -823944 -1076596 -5756 1702554 1696840 251737 -298125 -517766 -1102300
2695a102300K554961j10453j128194R02523o47436l07231K33187j586961O19665
$$ -1102300 1452661 1342208 214014 1116537 469101 161870 395057 -1191904 -572239
$$ [...]
##END NTUPLES=NMR SPECTRUM
##END=
