##TITLE=1H_CG-1201-3
 CDCl3
 8 sc, 
 8.4.2024
##JCAMPDX= 6.0         $$ Bruker NMR JCAMP-DX V2.0
##DATA TYPE= NMR SPECTRUM
##DATA CLASS= NTUPLES
##ORIGIN= UXNMR, Bruker Analytische Messtechnik GmbH
##OWNER= root
$$ XWIN-NMR		Version 3.5
$$ Mon Apr  8 14:04:53 2024 Russian Standard Time (UT+4h)  she@DPX200
##.OBSERVE FREQUENCY= 200.1309
##.OBSERVE NUCLEUS= ^1H
##.ACQUISITION MODE= SIMULTANEOUS
##.ACQUISITION SCHEME= undefined
##.AVERAGES= 8
##.DIGITISER RES= 18
##SPECTROMETER/DATA SYSTEM= spect
##.PULSE SEQUENCE= zg30
##.SOLVENT NAME= CDCl3
##.SHIFT REFERENCE= (INTERNAL, CDCl3, 0, 15.683)
##AUDIT TRAIL= $$ (NUMBER, WHEN, WHO, WHERE, WHAT)
$$ ##TITLE= Audit trail, XWIN-NMR		Version 3.5
$$ ##JCAMPDX= 5.01
$$ ##ORIGIN= Bruker BioSpin GmbH
$$ ##OWNER= she
$$ F:/spectra/data/she/nmr/H-F/1/pdata/1/auditp.txt
$$ ##AUDIT TRAIL=  $$ (NUMBER, WHEN, WHO, WHERE, WHAT)
(   1,<2024-04-08 14:03:20.12 +0400>,<she>,<DPX200>,
      <created by zg, POWCHK disabled, PULCHK disabled
       configuration hash MD5:
       00 E9 B6 7A A2 85 ED C7 34 08 36 98 17 FE 4E 26
       data hash MD5: 16K
       BA BB 04 EA 41 F1 42 89 2C 2F 11 31 16 68 CF B9>)
(   2,<2024-04-08 14:03:23.32 +0400>,<she>,<DPX200>,
      <Start of raw data processing
       efp BC_mod = 2 LB = 0.24 FT_mod = 6 PKNL = 1 PHC0 = -25300.57 PHC1 = 11.38731 SI = 16K 
       data hash MD5: 16K
       C8 24 B4 16 B0 BB 25 EC F6 C7 C7 5D 01 4C 55 C0>)
(   3,<2024-04-08 14:03:42.28 +0400>,<she>,<DPX200>,
      <pk PHC0 = 1.933455 PHC1 = -1.6 
       data hash MD5: 16K
       D5 5E D5 0F 24 9C 59 46 FE 1E 3E 02 65 5F 4D D0>)
(   4,<2024-04-08 14:03:46.01 +0400>,<she>,<DPX200>,
      <abs ABSG = 5 
       data hash MD5: 16K
       D8 C1 ED 2F 99 48 2C 99 92 07 4B 20 B0 F5 39 78>)
(   5,<2024-04-08 14:04:01.00 +0400>,<she>,<DPX200>,
      <pk PHC0 = 1.318659 PHC1 = -2 
       data hash MD5: 16K
       0B C1 E6 43 E5 07 49 68 B8 F9 53 BD A4 B4 ED EC>)
(   6,<2024-04-08 14:04:04.43 +0400>,<she>,<DPX200>,
      <abs ABSG = 5 
       data hash MD5: 16K
       DA DD E3 19 CA 2A FC 77 C7 19 50 83 FB B5 7A 96>)
$$ ##END=
$$ 
$$ hash MD5
$$ 85 53 12 F9 C9 23 5D 08 12 3D D9 EC 68 F7 EA 88
##$RELAX= 
##$RELAX= 
##$RELAX= 
##$RELAX= 
##$RELAX= 
##$RELAX= 
$$ Bruker specific parameters
$$ --------------------------
##$DU= <F:/spectra>
##$EXPNO= 1
##$NAME= <H-F>
##$PROCNO= 1
##$TYPE= <nmr>
##$USER= <she>
##$AMP= (0..31)
100 100 100 100 100 100 100 100 100 100 100 100 100 100 100 100 100 100 
100 100 100 100 100 100 100 100 100 100 100 100 100 100 
##$AQSEQ= 0
##$AQ_mod= 1
##$AUNM= <au_zg>
##$AUTOPOS= <>
##$BF1= 200.13
##$BF2= 200.13
##$BF3= 200.13
##$BF4= 200.13
##$BF5= 200.13
##$BF6= 200.13
##$BF7= 200.13
##$BF8= 200.13
##$BYTORDA= 1
##$CFDGTYP= 0
##$CFRGTYP= 5
##$CHEMSTR= <none>
##$CNST= (0..31)
1 1 145 1 1 1 1 1 1 1 1 1 1 1 1 1 1 1 1 1 1 1 1 1 1 1 1 1 1 1 1 1 
##$CPDPRG= <>
##$CPDPRG1= <>
##$CPDPRG2= <>
##$CPDPRG3= <>
##$CPDPRG4= <mlev>
##$CPDPRG5= <mlev>
##$CPDPRG6= <mlev>
##$CPDPRG7= <mlev>
##$CPDPRG8= <mlev>
$$ [...]
##$SUBNAM3= <"">
##$SUBNAM4= <"">
##$SUBNAM5= <"">
##$SUBNAM6= <"">
##$SUBNAM7= <"">
##$SUBNAM8= <"">
##$SUBNAM9= <"">
##$SW= 18.0517689322627
##$SWIBOX= (0..15)
0 0 2 0 0 0 0 0 0 0 0 0 0 0 0 0 
##$SW_h= 3612.71676300578
##$TD= 16384
##$TD0= 1
##$TE= 0
##$TE2= 300
##$TE3= 300
##$TEG= 300
##$TL= (0..7)
0 120 120 120 120 120 120 120 
##$TP= (0..7)
150 150 150 150 150 150 150 150 
##$TP07= 0
##$TPNAME0= <>
##$TPNAME1= <>
##$TPNAME2= <>
##$TPNAME3= <>
##$TPNAME4= <>
##$TPNAME5= <>
##$TPNAME6= <>
##$TPNAME7= <>
##$TPOAL= (0..7)
0.5 0.5 0.5 0.5 0.5 0.5 0.5 0.5 
##$TPOFFS= (0..7)
0 0 0 0 0 0 0 0 
##$TUNHIN= 0
##$TUNHOUT= 0
##$TUNXOUT= 0
##$USERA1= <user>
##$USERA2= <user>
##$USERA3= <user>
##$USERA4= <user>
##$USERA5= <user>
##$V9= 5
##$VALIST= <valist>
##$VCLIST= <CCCCCCCCCCCCCCC>
##$VD= 0
##$VDLIST= <DDDDDDDDDDDDDDD>
##$VPLIST= <PPPPPPPPPPPPPPP>
##$VTLIST= <TTTTTTTTTTTTTTT>
##$WBST= 1024
##$WBSW= 4
##$XGAIN= (0..3)
0 0 0 0 
##$XL= 0
##$YL= 0
##$YMAX_a= 567537
##$YMIN_a= -723905
##$ZGOPTNS= <>
##$ZL1= 120
##$ZL2= 120
##$ZL3= 120
##$ZL4= 120
##$ABSF1= 15.68522
##$ABSF2= -2.36667
##$ABSG= 5
##$ABSL= 3
##$ALPHA= 0
##$AQORDER= 0
##$ASSFAC= 0
##$ASSFACI= 0
##$ASSFACX= 0
##$ASSWID= 0
##$AUNMP= <proc_1d>
##$AZFE= 0.1
##$AZFW= 0.1
##$BCFW= 0
##$BC_mod= 2
##$BYTORDP= 0
##$COROFFS= 0
##$CY= -3
##$DATMOD= 1
##$DC= 0
##$DFILT= <>
##$DTYPP= 0
##$F1P= 0
##$F2P= 0
##$FCOR= 1
##$FTSIZE= 16384
##$FT_mod= 6
##$GAMMA= 0
##$GB= 0
##$INTBC= 1
##$INTSCL= 3.70164e-10
##$ISEN= 128
##$LB= 0.24
##$LEV0= 0
##$LPBIN= 0
##$MAXI= 10000
##$MC2= 0
##$MEAN= 0
##$ME_mod= 0
##$MI= 1.114404
##$NCOEF= 0
##$NC_proc= -7
##$NLEV= 6
##$NOISF1= 3.799351
##$NOISF2= 2.8
##$NSP= 0
##$NTH_PI= 0
##$NZP= 0
##$OFFSET= 15.68302
##$PC= 1
##$PHC0= -25297.32
##$PHC1= 7.78731
##$PH_mod= 1
##$PKNL= yes
##$PPARMOD= 0
##$PSCAL= 0
##$PSIGN= 0
##$REVERSE= no
##$SF= 200.129567721928
##$SI= 16384
##$SIGF1= 3
##$SIGF2= 2
##$SINO= 5.538805
##$SIOLD= 16384
##$SREGLST= <1H.CDCl3>
##$SSB= 0
##$STSI= 16384
##$STSR= 0
##$SW_p= 3612.71676300577
##$SYMM= 0
##$S_DEV= 0
##$TDeff= 16384
##$TDoff= 0
##$TI= <>
##$TILT= no
##$TM1= 0
##$TM2= 0
##$TOPLEV= 0
##$USERP1= <user>
##$USERP2= <user>
##$USERP3= <user>
##$USERP4= <user>
##$USERP5= <user>
##$WDW= 1
##$XDIM= 16384
##$YMAX_p= 463577514
##$YMIN_p= -938938
$$ End of Bruker specific parameters
$$ ---------------------------------
##NTUPLES= NMR SPECTRUM
##VAR_NAME=  FREQUENCY,     SPECTRUM/REAL,   SPECTRUM/IMAG
##SYMBOL=    X,             R,               I
##VAR_TYPE=  INDEPENDENT,   DEPENDENT,       DEPENDENT
##VAR_FORM=  AFFN,          ASDF,            ASDF
##VAR_DIM=   16384,         16384,           16384
##UNITS=     HZ,            ARBITRARY UNITS, ARBITRARY UNITS
##FACTOR=    0.220516191357247, 1,           1
##FIRST=     3138.63594073976, 0,            0
##LAST=      -474.08082226601, 0,            0
##MIN=       -474.08082226601, -938938,      0
##MAX=       3138.63594073976, 463577514,    0
$$ Real data points
##PAGE= N=1
##DATA TABLE= (X++(R..R)), XYDATA
$$ [...]
8687 39590008 40429531 41540138 42495782 43475258 45003720 46687501 48254121 50037456 51861051
8678 51861051 54307030 57340453 60178538 63175685 65843755 67617209 69005007 70468545
8670 70468545 71296966 71543282 72044749 73389050 75826356 78705122 82398762 86627354 89166480
8661 89166480 88663535 86694027 84766231 83518540 82970236 83063449 83919244 85472684 87756279
8652 87756279 90526376 94689137 99545728 105523762 112741749 122265294 133914004 147176005
8644 147176005 160778958 170834495 175865236 178925587 182234477 188427722 192550987 192665467
8636 192665467 196547715 197674577 192840850 188616828 187677002 190074947 192395922 192547967
8628 192547967 192055041 191098044 186565781 177452065 166860570 157823606 151593467 148138420
8620 148138420 146165576 144253199 141171292 136124740 131277162 127510992 125091648 123996896
8612 123996896 123722078 123790255 123802492 123888983 124446560 126102214 128476668 131588995 135375796
8603 135375796 139663122 145061517 151769642 160430013 170783242 182325685 193479145 201751198
8595 201751198 205473254 207090439 210367707 215875640 222590116 228718917 232226156 229920465
8587 229920465 222482696 213114550 204293264 197753443 194268718 193515718 195908539 200463107
8579 200463107 206403987 213303480 218193491 220637906 220222773 214659316 203925709 193112372
8571 193112372 185026687 179684880 176746346 175995728 177959034 181986216 187355972 190756922
8563 190756922 190285746 187231846 180965329 175093153 171851712 171762404 174407253 179216622
8555 179216622 184990048 190385976 193809268 193959876 192907037 192462039 193810314 196670591
8547 196670591 201330691 206645038 211068761 213295780 212802936 210424499 206999315 202428632
8539 202428632 198839400 199359623 204044962 211603436 219575605 225415435 225533662 217513096
8531 217513096 201936626 183398308 166563993 152145275 140240377 130166762 121945947
8524 121945947 115802508 111304590 108504449 107314235 107406943 109302529 112909149 118132772
8516 118132772 124798558 131627114 137521815 140468764 139767459 135962674 128799855 120287681
8508 120287681 112335411 105142961 99432298 94849088 91598193 89103660 86759501 84884996
8500 84884996 84078381 85091011 87744252 91965960 97444555 102399958 105584174 105786586
8492 105786586 102473485 97158150 90261146 82812949 75347581 68310453 61705073 55879904
8484 55879904 50986928 46888496 43779473 41205418 39017320 37138714 35535445 34096631
8476 34096631 32684748 31556742 30551198 29762732 28729751 27790631 27046224 26474675 25510427
8467 25510427 24805377 24321137 23699402 23329710 22920041 22560061 22078508 21935014 21699454
8458 21699454 21356133 21011426 20946579 20812619 20519849 20364328 20287427 19799315 19336501 19072235
8448 19072235 18700998 18409614 17999749 17785919 17507290 17259879 17223376 17075947 16889077 16714625
8438 16714625 16910345 17141212 17056498 17051953 16924183 16966278 17035563 16919762 17034455 16921609
8428 16921609 16606073 16474174 16642775 16737665 16564621 16561703 16506719 16576665 16742111 16818935
8418 16818935 16916026 16993082 16915325 16994260 17218446 17361312 17607285 17887681 18087536 18057214
8408 18057214 18107258 18350362 18509070 18818781 19175589 19540869 19976198 20120166 20671636 21225545
8398 21225545 21517141 21955153 22242116 22883309 23410683 24012489 24784533 25635831 26563809
8389 26563809 27817856 28925962 30431933 32001062 33644739 35660630 37775007 40103729
8381 40103729 43196107 46932593 51366443 56841296 62174377 66705471 68891986 67324183
8373 67324183 63764814 60378417 58063914 56728029 56627727 57739497 59943316 62682202
8365 62682202 65047691 66582351 65082191 61083440 56451101 52287824 48783170 46118484
8357 46118484 44006753 42407678 41245361 40756120 40198727 39936781 40126664 40565265 41231469
8348 41231469 42176164 43259003 44718978 46414879 48370307 50876491 53737818 57057608
8340 57057608 61170850 66396703 72816743 79773658 87016256 93344737 97163802 97940455
8332 97940455 95504472 90880269 86354916 83411821 82620640 83798771 86787347 90652199
8324 90652199 94309569 95970383 94835246 90559801 83210663 75082492 67170467 60348839
8316 60348839 54990191 50899536 47329544 44456088 42221428 40504251 38901918 37891501
8308 37891501 37264941 37050485 36813340 36743314 37200252 37444465 37987887 38696492 39842764
8299 39842764 41325293 43771232 46872234 50349203 54393516 58671900 61697456 62616957
8291 62616957 61656848 59887956 58407917 57556506 57010320 56355889 56889601 57698258 58486190
8282 58486190 59012967 58164230 56009863 53032025 49677728 46444116 43909040 41712275
8274 41712275 39110142 36399184 33852078 31367200 29315657 27612463 26090503 24711847
8266 24711847 23565098 22638773 22055711 21961090 21557799 21509398 21663813 22020562 22232422 22405386
8256 22405386 22526794 22455211 22339046 22037960 21585004 20458034 19440338 19077919 19021472
8247 19021472 19150468 19428930 19923087 20483265 21300910 22344186 22922498 22901739 22939052 22598986
8237 22598986 21959151 20863415 19874007 18943012 17420774 16420669 15530825 14589281 13598691
8228 13598691 13226085 12912769 12584461 12216729 11877602 11651347 11485013 11199232 10660652
8219 10660652 10629828 10477821 10267370 9962686 9848442 9626987 9696969 9459298 9090365 9082134
8209 9082134 8831491 8913510 8629364 8406938 8325153 8420518 8102160 7743688 7562614 7675982
8199 7675982 7849915 8046003 7955230 7964488 7989129 7919091 7595052 7952042 8869181 8811187 8958568
8188 8958568 8985038 9320925 9338912 9427208 9344881 9447053 9475198 9302822 9544492 9921717
8178 9921717 10447268 10759191 11130052 11749687 12510983 13240099 14200804 15600642 17012721
8169 17012721 18102397 18595796 18620413 17916070 16730345 15325764 13984797 12875352 11946326
8160 11946326 11126627 10689361 10042253 9478710 9173679 8725526 8352518 8023320 7581175
8151 7581175 7317513 7193387 7041605 6891229 6612443 6545804 6434359 5863720 5566545 5539974
8141 5539974 5418232 5492619 5409955 4969129 4576331 4424554 4280822 4347538 4237124 4054666
8131 4054666 4104645 3990463 3976498 4123066 3943045 3955110 4047498 4143641 3863102 3750125
8121 3750125 3856748 3833099 3769458 3779801 3669010 3685012 3658251 3467659 3303226 3452550
8111 3452550 3453495 3169345 3055255 3122598 3020724 3040901 2783477 2659213 2769881 2836452 2727263
8100 2727263 2731971 2635988 2540277 2626605 2635838 2744145 2721080 2737281 2401247 2349638 2397415
8089 2397415 2519163 2585900 2339592 2219861 2091366 2041458 2167809 2221505 2192048 2055494
8079 2055494 2121641 2402766 2317662 2337262 2295749 2356553 2541369 2339426 2117019 2123082 2169978
8068 2169978 2088660 2149627 1972388 2125348 2354267 2167883 2372349 2531611 2549630 2732276
8058 2732276 2966542 3089582 3013023 2941454 3061928 3219297 3362826 3262188 3063487 2788801
8048 2788801 2719897 2585458 2619086 2602851 2576025 2642314 2597277 2447008 2278100 2241977 2371446
8037 2371446 2312210 2300468 2356345 2248996 2149191 1925473 2019995 2021110 1985882 2041605 2209197
8026 2209197 2245796 2324469 2238586 2177321 2019768 2064797 2261583 2453437 2465057 2289653 2541488
8015 2541488 2523304 2364843 2575982 2453958 2401783 2443153 2363065 2337727 2420403 2259039 2221904
8004 2221904 1978402 2053508 2010384 1965285 1982393 1765885 1717159 2067524 2152592 1986102 1891525
7993 1891525 1832496 1781784 1776200 1908892 1912071 1907967 1777314 1760742 1774491 1685244 1654877 1624847
7981 1624847 1562689 1616644 1723085 1632851 1551576 1625138 1608962 1674028 1649947 1751844 1863339
7970 1863339 1551680 1637729 1881760 1861019 1875755 1781455 1504297 1412180 1547337 1541440 1547509
7959 1547509 1654938 1658561 1767947 1893594 1857385 1787810 2098887 1962051 1820001 2012006
7949 2012006 1898327 1930050 2025544 2063838 1966399 1961435 1975858 2034557 2018077 2009805 1914095 1919650
7937 1919650 1888785 1793777 1652960 1784178 1812763 1805926 1615924 1725205 2033792 1905283
7927 1905283 1749896 1741413 1930770 2023165 1876760 1735182 1491180 1431791 1424769 1345878 1298538
7916 1298538 1368381 1389876 1538296 1668354 1626780 1617738 1604550 1667457 1754755 1613875 1353614
7905 1353614 1279425 1275339 1326952 1258822 1132375 1165701 1071457 1128435 1102251 1039407 1055854
7894 1055854 1114572 906958 745073 817986 768804 806372 671224 731178 828785 726991 781223
7883 781223 660700 577603 479763 591599 602356 578389 611213 694136 558263 677550 569615
7872 569615 408557 261974 148798 461583 219862 238166 258208 298814 423021 406528
7862 406528 403395 311389 299983 389655 319245 260103 288273 56963 -33838 102958 298420
7851 298420 222971 176133 42112 34649 176348 -69894 36958 133468 110335 5245 23227
7840 23227 -199366 -102110 40720 107148 -15563 -5039 -192807 -45251 64530 -249605
7830 -249605 -464270 -307748 -237228 -125538 64005 27402 132955 199169 96791 -24721
7820 -24721 -180985 -321157 -344662 -399208 -301050 -235514 -156888 -136236 -173659 -371526 -237625
7809 -237625 -99823 -92459 177042 380955 -172062 -297204 -110995 -253080 -287850 -165044
7799 -165044 -207629 -54274 -106938 -230737 -6428 -76428 -299142 -515812 -478372 -119640
7789 -119640 87366 -164792 -232948 -370542 -85559 -96930 -76208 -70728 -136840 -180494 -37839
7778 -37839 128862 32378 -41408 16601 54472 10442 70325 28849 -151633 -292474 -292966 -237548
7766 -237548 -23239 -196077 -181502 -226849 -348196 -410499 -239417 -258995 -88682 2967 85460
7755 85460 42103 -117330 -9120 91166 263875 139400 -45352 95669 117311 216340
7745 216340 248988 56601 -7057 53256 252895 242332 144137 170732 84152 -187972 -196183
7734 -196183 -127908 27274 -191457 -35648 -266280 -341574 -267722 -509551 -476116 -199886
7724 -199886 -272814 -389909 -313965 -332663 -55643 -108284 -278354 -200484 -6462 -32705 -135392
7713 -135392 -175076 -321013 -363747 -238259 -177620 -85528 -178714 -385008 -180592 -68713 -72243
7702 -72243 -86432 -116914 -93884 -228902 14270 -72669 -57409 -229607 -210067 -33154 -6691
7691 -6691 -108272 -15339 -14168 -6254 -4283 72943 95237 160657 99236 80033 112891 -114054
7679 -114054 -68315 14681 113286 237118 200374 -3350 8087 -27816 4225 217082 114815
7668 114815 -249700 -31161 8188 -96357 -162786 -237172 -229849 13900 -33780 -210112 -131189
7657 -131189 -100254 -38716 -75294 83258 -125463 -81440 92694 60983 122369 -59314 99726
7646 99726 84082 -20993 -39420 -110908 242409 68211 -240896 -126819 2548 -106819
7636 -106819 -224637 -80489 -112237 107147 245934 279583 44446 -50626 34581 93664 53424
7625 53424 -238004 -171916 -151501 135903 152706 3479 -259190 -381460 -63550 -121641 -214371
7614 -214371 -42552 353 71877 100279 -28270 -57284 9603 -79566 -53817 65650 217733
7603 217733 112216 -104037 130029 82038 -76709 205773 267952 26303 -57965 162328
7593 162328 -154427 -256173 -200803 -219207 -22312 71994 248835 327332 195822 8540
7583 8540 142693 -15992 -4750 -66573 176669 193992 179812 344904 570390 356343 400741
7572 400741 411556 84833 -179675 -22139 229565 188938 164186 228010 465027 539744 439807
7561 439807 284491 230547 390323 447950 506166 334550 380976 457183 620130 720117 669730
7550 669730 708429 597377 560565 374421 404647 306812 272438 294780 291454 351283 280474
7539 280474 448318 399873 190558 439872 593398 656823 544081 508865 492148 437394 398009
7528 398009 455206 377018 43368 -3312 -116380 -163912 164367 224422 256084 296631 243526
7517 243526 364316 397597 322053 259491 227063 303536 220471 144065 140816 261092 297402
7506 297402 146402 -116843 -93736 -32393 -252228 -156960 44254 -242435 -345580 -241463
7496 -241463 -130560 -132863 -141817 -248741 -123960 -394068 -292009 -355532 -264623 -56030 -87024
7485 -87024 -322816 -327570 -120846 -188473 -276172 -167286 -278453 -295159 -308115 -441063 -323429
7474 -323429 -438891 -284522 -387725 -375851 -297932 -334882 -516398 -548492 -623696 -386052 -318678
7463 -318678 -238694 -341290 -242705 -406331 -451840 -425737 -418214 -394983 -448163 -353413 -400609
7452 -400609 -246412 -332784 -297309 -419075 -370751 -338804 -355363 -335269 -296914 -225236 -341373
7441 -341373 -273661 -249568 -282882 -374329 -397104 -596525 -478364 -316245 -379051 -364410 -463371
7430 -463371 -496401 -452835 -390079 -257793 -92731 -329954 -438723 -313533 -169653 -216023
7420 -216023 -405313 -304574 -243633 -257956 -312194 -247595 -378888 -426559 -341560 -271795 -429196
7409 -429196 -586765 -363036 -318677 -388639 -205725 -309757 -350644 -225455 -384408 -433111
7399 -433111 -359055 -228229 -118811 -92870 -86029 -37528 -184493 -219724 -555679 -597877 -438737
7388 -438737 -325840 -149505 -366994 -490202 -267906 -296024 -345897 -401042 -398076 -390918 -547270
7377 -547270 -586178 -194107 -297527 -315533 -340469 -402041 -336951 -424006 -358591 -400647 -371843
7366 -371843 -357437 -184733 -218559 -160093 -283798 -255709 -364872 -481197 -444496 -432778 -445559
7355 -445559 -545713 -446626 -306482 -73687 -47519 -181183 -135150 -300469 -346165 -391621 -333308
7344 -333308 -335624 -340000 -315608 -112786 -334932 -565027 -548060 -582006 -717705 -484281 -433198
7333 -433198 -390830 -602985 -770246 -722893 -604929 -416066 -526805 -410509 -728284 -486637
7323 -486637 -357152 -236239 -198942 -97484 -81949 -259638 -295776 -415437 -325649 -270840 -33934
7312 -33934 -63764 -250628 -208434 -295992 10755 -253233 -363364 -219968 -39663 249379
7302 249379 61892 110400 233897 94126 144902 281819 186227 71794 197267 189647 9301
7291 9301 -12865 109776 153352 162094 232762 239977 161158 193891 330321 232102 348216 282080
7279 282080 86827 122075 228946 431651 501964 457429 598726 551424 455199 100477 114001
7268 114001 505153 247065 278045 316648 397870 461073 536048 473869 253534 378975 443810
7257 443810 444154 395279 363487 375331 330964 430423 471326 389308 330948 214614 391498 488197
7245 488197 360310 217799 428988 448310 433661 531008 523757 503946 427628 405497 328917
7234 328917 421926 549468 589397 285042 418576 563045 455341 385631 487387 435972
7224 435972 283142 423602 335176 99668 79349 128761 138815 235085 101250 183943 353251
7213 353251 148319 96947 -98678 -138100 -61393 109872 186542 155359 -79578 -142646 47761
7202 47761 33046 55667 45971 -61322 -55766 57881 104298 262117 440544 386967 231826
7191 231826 342538 228275 217550 266207 338379 257503 206443 180747 106802 85347 116132
7180 116132 208279 132986 114210 97707 85484 102961 79752 161246 209168 274047 12742
7169 12742 -85847 -66474 131943 -14396 -164751 -92058 13789 58470 5107 -59480 -125294
7158 -125294 -108357 106090 18238 102609 -4191 -114811 61025 143048 345233 411835 339369
7147 339369 144059 186074 300561 28725 30970 -77175 -105036 -2438 -177777 -295943
7137 -295943 -523418 -354684 -176115 -3599 -144450 -122071 -288821 -356769 -379150 -437106
7127 -437106 -563631 -447286 -238440 -173462 -240196 -322785 -374385 -232601 -177671 -391408 -342645
7116 -342645 -390789 -551206 -449115 -416750 -720423 -647958 -320485 -316103 -380636 -606542 -535762
7105 -535762 -390914 -413334 -380828 -370266 -265314 -392546 -439185 -508175 -634498 -683726 -753636
7094 -753636 -801875 -788823 -623003 -577938 -594892 -643227 -477748 -377370 -288499 -316282 -470465
7083 -470465 -620297 -353502 -420900 -586179 -756700 -733137 -640343 -782850 -386826 -507936
7073 -507936 -614705 -530087 -459164 -460977 -427459 -250403 -236707 -539936 -645655 -498403 -577887
7062 -577887 -679533 -648429 -636048 -429466 -527878 -583118 -469717 -504535 -504582 -698658 -629634
7051 -629634 -504355 -570901 -628113 -533197 -455403 -485185 -680703 -626199 -486381 -499792 -457085
7040 -457085 -515570 -615780 -445683 -534317 -595419 -323276 -359863 -555262 -483382 -339902 -489267
7029 -489267 -406346 -433107 -543118 -614276 -802289 -938938 -869517 -829833 -763669 -698842 -639422
7018 -639422 -771834 -660092 -729150 -619313 -517444 -559000 -403361 -375544 -364525 -485255
7008 -485255 -565300 -464776 -572738 -528502 -567752 -518201 -472115 -479225 -545073 -571299 -628418
6997 -628418 -673816 -611562 -572610 -567511 -569140 -688701 -662307 -571455 -763640 -646674 -414260
6986 -414260 -494345 -537794 -382915 -500535 -450042 -544705 -523950 -731638 -499230 -649173 -534224
6975 -534224 -345649 -289605 -304143 -606325 -631448 -545230 -472683 -562908 -601005 -604058 -636802
6964 -636802 -598447 -527951 -645916 -685377 -642893 -395191 -399659 -495614 -526500 -538233 -580803
6953 -580803 -636305 -551190 -540591 -463410 -325975 -329581 -390340 -465604 -568249 -527893 -242150
6942 -242150 -383006 -421120 -543440 -771397 -819472 -704695 -585411 -530214 -446117 -557624
6932 -557624 -587385 -467358 -376145 -432349 -379132 -440986 -479620 -254944 -146625 -351021 -323329
6921 -323329 -230550 -432815 -340631 -350072 -506614 -524378 -682497 -620016 -422384 -571037 -506471
6910 -506471 -435455 -448515 -467305 -573865 -636609 -595304 -598504 -758332 -470273 -444956 -446710
6899 -446710 -373642 -490130 -650438 -695628 -445108 -453492 -650808 -670290 -674045 -519496 -401040
6888 -401040 -641066 -609653 -466998 -429909 -480928 -572623 -719272 -640328 -651626 -488252 -475430
6877 -475430 -624718 -590746 -568810 -449056 -418637 -400869 -383114 -365014 -410627 -248012 -419335
6866 -419335 -467643 -358169 -260738 -279357 -302371 -561446 -390014 -281815 -341734 -351848 -458073
6855 -458073 -489732 -409796 -455695 -559467 -561647 -554516 -546563 -478913 -487446 -613902 -535813 -494750
6843 -494750 -541839 -405511 -401071 -521449 -502732 -374561 -247415 -322049 -356362 -412755 -478027
6832 -478027 -611996 -521433 -554577 -556838 -461376 -139723 -211765 -339945 -382813 -261156 -197313
6821 -197313 -220569 -300239 -307031 -157925 -178681 -536841 -637296 -526010 -568454 -506709 -439142
6810 -439142 -362112 -251053 -190352 -168752 -80412 -242170 -221885 -420531 -515586 -378203 -358479
6799 -358479 -380739 -382973 -412666 -367046 -220826 -395890 -403366 -459299 -634069 -366392 -3162
6788 -3162 -294613 -275238 -137199 -278459 -400566 -313032 -507804 -623045 -556877 -515928 -347001
6777 -347001 -354841 -378415 -332091 -279072 -367782 -380089 -410578 -402459 -381100 -540216 -588478 -470289
6765 -470289 -395528 -301252 -319913 -234556 -255173 -228162 -319256 -325607 -281552 -225244 -58203 -174909
6753 -174909 -238858 -272231 -259682 -223570 -108929 -121774 4378 -102324 -159562 27024 -75585
6742 -75585 -28315 -218664 -187447 -448423 -411857 -258250 -412938 -577829 -652543 -449952 -327617
6731 -327617 -233340 -154446 -258280 -376371 -379551 -422821 -423165 -374216 -387612 -368688 -390161 -493394
6719 -493394 -314132 -341173 -446084 -289009 -356519 -422559 -404215 -486935 -642807 -728341 -563064
6708 -563064 -447843 -491183 -624388 -544336 -676251 -464787 -435991 -534316 -451838 -550446 -404917
6697 -404917 -187931 -249603 -531690 -399034 -577417 -528371 -555557 -390256 -379687 -511187
6687 -511187 -298766 -38003 -39202 -298080 -234671 -304742 -473355 -369853 -408200 -424197 -383895
6676 -383895 -268129 -195220 -135745 -223771 -356848 -376728 -322231 -38807 -248337 -501703 -448400
6665 -448400 -380129 -460995 -342221 -147145 -73664 -102731 -182210 -319997 -210317 -219027 -240148
6654 -240148 -424408 -506170 -409099 -433390 -282513 -151070 -194483 -401542 -531832 -557308 -329059
6643 -329059 -174626 -392477 -277554 -400430 -269611 -167145 -311958 -316444 -90118 -178375
6633 -178375 -240567 -238544 -392816 -129871 -193870 -269560 -555625 -609324 -429225 -243542 -278303
6622 -278303 -373781 -521400 -479739 -614003 -517609 -356937 -380632 -270239 -308525 -240463 -460800
6611 -460800 -526748 -450255 -344876 -416046 -305300 -245131 -324925 -46823 -153378 -274048 -389389
6600 -389389 -420888 -423346 -374427 -109064 -210213 -225470 -235064 -211349 -203690 -145097 -163773 -107163
6588 -107163 -90988 -357048 -172352 -294621 -207624 -289978 -358446 -262256 -251558 -223847 -287477
6577 -287477 -91252 -94475 -265639 -382185 -134192 -21522 -12441 -84888 -66397 -162076 -132236
6566 -132236 -316134 -381086 -311421 -244486 -206654 -196440 -214783 -197348 -183545 -178693 -124286 -114250
6554 -114250 -31274 -94520 -89900 -75519 -60937 64184 -66334 -95689 -82923 -203170 12916
6543 12916 -31586 -30119 144451 82069 -8355 -52076 -38540 87049 -34919 -170727 -34124
6532 -34124 25737 -180511 -187657 -145245 14300 66031 -71639 -196565 -129224 11693 51830
6521 51830 267813 254525 63815 136747 52143 33048 -73049 60861 71889 3166 -135394
6510 -135394 -198652 -27749 -75380 -95653 -76266 140608 199239 253071 234629 148550 117589
6499 117589 64143 80004 339417 197519 69386 57268 160020 292788 64130 177165
6489 177165 250415 186339 255273 466551 305736 171294 452561 367329 288132 210956 462603
6478 462603 583321 485815 336642 527449 641769 582529 638433 646974 457595 290951 734728
6467 734728 733502 602142 761498 804269 828204 764168 609243 550702 622169 592300 641593
6456 641593 601344 706630 883742 655687 634101 656568 821992 906919 938253 774850 866665
6445 866665 868768 867401 979232 1076076 881955 1112408 1224976 1118508 1075499 943065 1023819
6434 1023819 995854 1255659 1547341 1491665 1313987 1472954 1466249 1324258 1458273 1797939
6424 1797939 1917442 1798811 1965806 2000979 1928224 2005982 2051782 2112240 2153007 2187894 2236875
6413 2236875 2209285 2383582 2659059 2865240 2837461 2774779 2993693 2942474 2826586 2822424 2989092
6402 2989092 3181346 3190503 3338687 3556919 3715311 3815479 3853341 4040490 4224330 4474032
6392 4474032 4504036 4680698 4906257 5134735 5348142 5733198 5905576 6003946 6136054 6370213
6382 6370213 6621839 7001469 7139257 7355062 7555122 7808997 8193181 8557952 8896109 9181950
6372 9181950 9380802 9624211 9980950 10339721 10609149 10711815 10803671 10692459 10876985 10987027
6362 10987027 10967111 10757623 10623631 10523472 10236203 9952195 9763516 9557322 9043947 8607443
6352 8607443 8323321 7881104 7540968 7232531 6863256 6677574 6538110 6010917 5793911 5769464
6342 5769464 5321889 5008913 4868164 4770732 4712644 4452152 4104848 3804572 3777223 3827787
6332 3827787 3756721 3631214 3308580 3297342 3270710 3195162 3078119 2810663 2741309 2633074
6322 2633074 2565483 2543202 2530300 2444704 2348268 2248223 2181075 2101924 2146646 2320753 2515199
6311 2515199 2307525 2218541 2135666 1911560 1714674 1714106 1757544 1913808 1751434 1537496 1751200
6300 1751200 1781363 1803636 1685108 1641547 1433450 1612665 1753599 1614137 1767211 1703839
6290 1703839 1594195 1424336 1381243 1353323 1389237 1130589 1123838 1223902 1376969 1522264
6280 1522264 1425366 1248913 1323555 1418200 1344799 1191114 1072762 844646 996073 1270244
6270 1270244 1220137 1235925 1286789 1336801 1181052 1168925 1072674 1189718 1144107 1083835 1033430
6259 1033430 1061461 1045749 1178302 975438 1028476 928368 901445 969940 1004713 1002387 847196
6248 847196 862207 909147 1085825 872113 613091 786432 846324 551585 648258 1034209
6238 1034209 1030475 1062645 889946 679332 709627 766781 795961 745986 731132 842432 770877
6227 770877 939173 831887 788701 855043 683033 662154 807918 867914 704289 747504 785084
6216 785084 741217 606198 668545 524251 554544 441424 615887 621337 635740 748218 684478
6205 684478 692565 623607 723003 812387 760874 530854 518817 508787 508471 571887 562509 606084
6193 606084 613625 599873 386617 586307 646697 430017 368285 671317 644838 754119 616656
6182 616656 816267 805164 554356 716654 812286 619996 511164 547056 499168 815035
6172 815035 715429 643948 810255 933866 838175 798057 927984 752547 622469 570494 696564
6161 696564 787213 831570 890390 850391 848483 999922 998792 853082 1026015 943133 1072150
6150 1072150 1020497 999371 1028276 1065250 1071551 1270352 1279514 1106159 1130686 1050945 1059021 1479265
6138 1479265 1453995 1366409 1374547 1342208 1369224 1535998 1696052 1573569 1539937 1549980 1624425
6127 1624425 1443036 1471743 1619211 1618366 1786605 1784991 1834616 1928952 2022802 1998236 2135562
6116 2135562 2207759 2311446 2347443 2538451 2690108 2657412 2564082 2572320 2717116 2727235 2688683
6105 2688683 2608680 2716408 2502608 2540378 2804635 2840907 2702167 2817848 2867136 2851899
6095 2851899 3107395 3006454 2976797 3069847 3230939 3225586 3459906 3510346 3493176 3630369 3804717
6084 3804717 3913614 4145199 4354134 4553149 4596846 4520382 4539529 4737195 4717987 4508856
6074 4508856 4740761 4549428 4454697 4370186 4397784 4231213 4209182 4195958 4248890 4224137 4186346
6063 4186346 4228931 4412709 4652741 4883157 5019529 5283998 5691538 5900177 6096935 6235457
6053 6235457 6315004 6532711 6575449 6646149 6722473 6649503 6423852 6414660 6459727 6368106 6338420
6042 6338420 6206334 5926717 5890952 6083665 6010818 5857996 5818783 5785837 5849346 6018284
6032 6018284 6201195 6272666 6239619 6335834 6298431 6420520 6357776 6328035 6534370 6920084 7006245
6021 7006245 7157604 7357525 7557581 7626308 7847048 7890750 7760376 7795566 7459201 7233030
6011 7233030 6953846 6921645 6665498 6512058 6210269 6274912 6138796 5921764 6081948 5933236
6001 5933236 6038704 6297714 6088069 6176348 6438601 6360727 6521136 6710194 6859822 7223425
5991 7223425 7283130 7194306 7490082 7258805 7230287 7145139 7126999 6960917 6934648 6889241 6728941
5980 6728941 6669913 6684206 6691561 6808104 6984074 6961064 7025648 6779030 6765764 6771324 6888987
5969 6888987 6845527 6834687 6778706 6671967 6876480 7082649 7202329 7435082 7534940 7630361
5959 7630361 7877083 8222307 8363040 8324366 8478771 8566729 8503528 8511078 8486189 8393908 8428764
5948 8428764 8613238 8559705 8347204 8533264 8614083 8696546 8707912 8757455 8909733 9182900
5938 9182900 9439185 9488830 9606255 9834481 10164210 10266408 10653513 11133937 11518739 11699099
5928 11699099 11790779 12072876 12173300 12069334 12254080 12515842 12497479 12588657 12699754 12937257
5918 12937257 12915086 13019055 13230832 13262725 13570653 13997720 14395057 14683026 14927214 15240177
5908 15240177 15519375 15851319 16440491 16747351 16947780 17417853 17666810 18091178 18484999
5899 18484999 18929911 19117904 19576976 20049435 20273966 20426483 20613677 20948425 21009716 21168377
5889 21168377 21415559 21769117 21925766 22149717 22675309 23150829 23691245 23928056 24156453
5880 24156453 24981875 25625306 26084733 26647626 27277797 28044846 28790542 29458317 30196323
5871 30196323 30858931 31469064 32112149 32496657 33014973 33474862 33711356 34215859 34767558
5862 34767558 35125458 35629637 36013417 36828363 37600384 38228648 39348498 40370012 41350020
5853 41350020 42796209 44125073 45623333 47063287 48649092 50370870 52440973 54433805
5845 54433805 56557920 58777153 61301535 63954419 66904868 70221036 73950083 78223122
5837 78223122 82682026 87883933 93691578 100350104 107163999 113799983 119533552 123763491
5829 123763491 125767612 125246051 123057483 119810991 115896570 112524056 109924249 108080256
5821 108080256 107136626 107141246 107754626 109351179 111918082 115230160 119413105 124335635 129978230
5812 129978230 137056131 145185306 154872243 165837644 178754633 193656796 209937821
5805 209937821 226201184 240585851 250835989 255871201 255617279 250877323 243482299 235825999
5797 235825999 228822769 223362931 219098139 214979198 210386703 205035163 198898568 192123489
5789 192123489 185914214 180470902 175930629 173063572 171651494 172141006 174664122 178849732
5781 178849732 185143140 193196343 202066820 211693895 220957072 228867043 234902865 239939511
5773 239939511 245003341 250462761 256863613 264109243 270602887 274525335 274724264 270012076
5765 270012076 259919871 245230306 227751354 208952242 191107016 174726794 160403593
5758 160403593 148329579 138377284 130388057 124420691 119984255 116791126 114689360 113710837
5750 113710837 113711275 114965873 117245373 120535704 124578206 129855582 135678390 140816576 144629310
5741 144629310 146478842 145757437 141687877 135053655 126740842 117182156 107465691 98013372
5733 98013372 89307181 81621295 75028034 69119409 64018590 59406291 55436811 52148407
5725 52148407 49030962 46187610 43713698 41470663 39457423 37640568 36116992 34461269
5717 34461269 33171857 31895003 30891599 30075581 29292734 28571782 27999727 27383643 26923572
5708 26923572 26375137 25855279 25324903 24644253 23944234 23248671 22709177 22117352 21252222
5699 21252222 20318530 19848254 19139236 18614262 18216846 17788813 17436289 17125982 16706044
5690 16706044 16290123 16141888 15896143 15615392 15203408 14825404 14731062 14716446 14632700 14495476
5680 14495476 14238893 14236221 14260314 14039822 13587153 13027565 12900274 12744838 12702660 12420261
5670 12420261 12198118 11947832 11705367 11503995 11241716 10866515 10766239 10541520 10132001
5661 10132001 10047316 9844667 9731367 10027607 9743763 9476070 9515554 9550764 9528257 9689287
5651 9689287 9719727 9672622 9426679 9510239 9448188 9439149 9312135 9090946 8978580 8822509 8668815
5640 8668815 8395807 8326387 8348726 8235387 7923593 7758130 7622755 7635802 7647777 7733192
5630 7733192 7672959 7554271 7468349 7458150 7527626 7554277 7615743 7664947 7520722 7314103 7292314
5619 7292314 7123453 6982104 6947991 6956719 6882450 6709078 6627517 6543956 6299070 6502452 6611036
5608 6611036 6409830 6258493 6270693 6329403 6303839 6232612 6267183 6355072 6306367 6372999 6492036
5597 6492036 6457787 6301422 6274492 6152592 5977221 5812474 5843782 5846125 5766110 5650246 5672836
5586 5672836 5657421 5708731 5696107 5603507 5369975 5557120 5830563 5864563 5811041 5548922 5759189
5575 5759189 5867825 5899533 5954656 5788403 5853626 6048064 6131290 5936176 5841040 5952521
5565 5952521 6024816 5883654 5870600 5952365 6112609 6112008 6224995 6163452 6180167 6285727 6272076
5554 6272076 6292362 6245453 6588973 6739024 6756091 7153675 7036192 6797017 6755025 6913003
5544 6913003 7000333 6953430 7046788 6983737 7138205 7368131 7440188 7478756 7501311 7520175 7749506
5533 7749506 7756841 7952841 8117334 8220776 8452234 8815553 8862572 9006958 9415790 9355824
5523 9355824 9465410 9681935 9855236 10010991 10002220 10011392 10060944 10090411 10174561 10251695 10443610
5512 10443610 10501342 10697547 10704694 11020898 11302845 11271981 11571903 11856091 12002855 12328448
5502 12328448 12983423 13271081 13636749 14062231 14502063 15084706 15463171 15768180 15930030
5493 15930030 16051589 15950787 15796795 15570989 15596941 15507332 15213694 15004338 14941050 14881783
5483 14881783 15065369 15148836 15375324 15673059 15694837 16098256 16515851 17002108 17417840 17918349
5473 17918349 18410813 18820993 19218232 19633690 20183979 20801555 21196892 21496219 21318818
5464 21318818 21058771 20686361 20394051 19939303 19561655 19169941 18945818 18903148 18568747 18390656
5454 18390656 18555757 18468649 18644414 18747271 18698607 18967513 19334034 19684962 19785944 20052693
5444 20052693 20678604 21467211 21802722 22172815 22621865 22759445 22758940 22809146 22887379 22780881
5434 22780881 22577852 22251049 22282783 22197311 22329373 22635933 22724616 22796467 22807205 22794627
5424 22794627 22881455 23061382 23325699 23627853 23726597 24195460 24785834 25366954 25785655 26278983
5414 26278983 26932493 27578904 28148401 28822281 29589865 30120299 30520131 31310410 31666325
5405 31666325 32304588 33152883 33946442 34547964 35291825 36070212 36699970 37607306 38208901
5396 38208901 38871186 39491561 40100794 40827578 41666699 42453134 43248114 44389503 45454647
5387 45454647 46589633 47926869 49225127 50633704 51959066 53553692 55291054 57003497
5379 57003497 58904931 60694255 62710572 65076194 67585456 70373506 73409185 76569379
5371 76569379 80236816 84005295 87831024 92521667 97601156 103281621 109881455 117477024
5363 117477024 125959315 135148209 144067264 151604793 156821176 158578352 157153158 152938660
5355 152938660 147185902 141733846 136885632 133322882 131244868 129871704 129696095 130903467
5347 130903467 133537704 137242099 142111388 148311944 155588513 164491040 174960215 186931816
5339 186931816 201373985 218764932 239252944 262963056 288337086 312144442 330909600
5332 330909600 340995035 340484557 329353830 310614711 288831772 266875313 246183672
5325 246183672 228045572 212909449 200325795 190883170 184083314 179467349 176852944 176365289
5317 176365289 177744812 180873269 186021527 193319666 202888274 214879969 229999190 248551616
5309 248551616 269665000 291914366 311858228 326350318 332925870 328893575 315245795
5302 315245795 294912813 271095960 246325815 222676391 201158902 182384106 166725621
5295 166725621 154013360 143680558 135326749 128586458 123223264 119168303 115983559 114093506
5287 114093506 113066289 113353439 114800808 117306863 120651597 124885869 129124896 132252223
5279 132252223 133976414 133240067 129844240 123740555 115750494 107065624 98149579 89634172
5271 89634172 82027848 75265108 69033522 63689143 59198823 55451836 52124213 49305693
5263 49305693 46766179 44576130 42571487 40828910 39237994 37667351 36441503 34958841
5255 34958841 33752346 32630032 31371779 30289223 29211138 28339587 27610164 26691916 26093466
5246 26093466 25556687 25008429 24479783 24044267 23587445 23452955 23479143 23077389 22801119 22524593
5236 22524593 22382110 21990085 21566516 21029117 20348942 19671687 18882776 18340712 17561313
5227 17561313 16744253 16183431 15748725 15270799 14884615 14566874 14244248 13908509 13859445 13570348
5217 13570348 13415855 13296789 13058904 12839645 12727023 12530977 12440855 12196003 12056896 12200464
5207 12200464 12055684 12002104 11969173 11812164 11953701 12033261 12122326 12219559 12434156 12537209
5197 12537209 12341324 12185654 12183884 12286616 12235475 12403003 12501497 12932174 13394055 13572497
5187 13572497 13826163 13695074 13337178 12718933 11763411 11152180 10672672 10314002 9919894
5178 9919894 9612478 9757884 9631125 9432281 9377933 9261550 9148650 9097369 8932757 8732808
5168 8732808 8571661 8333965 8194948 7995568 7901752 7996108 8138242 7917687 7740246 7535482
5158 7535482 7381101 7045570 6922056 7177352 6864716 6878142 6758458 6529248 6451953 6590071
5148 6590071 6517122 6463006 6170903 6426603 6479428 6410912 6517547 6424453 6454435 6352076 6288603
5137 6288603 6394239 6454723 6307908 6205588 6017421 5903895 5766281 5671684 5504238 5579956
5127 5579956 5419688 5353523 5194563 5484101 5375008 5241868 5137454 5029204 5085129 5157725
5117 5157725 5028347 5087575 4944596 4779466 4949620 4788348 4730841 4801631 4771029 4961751
5107 4961751 4792512 4761913 4837280 4754564 4886311 5218923 5232951 5173509 5234150 5301835 5262914
5096 5262914 5358247 5400080 5537960 5425117 5029672 4842470 4785377 4673073 4691896 4510188
5086 4510188 4468505 4463339 4494117 4430858 4251213 4382336 4231148 4328624 4211958 4192364 4231647
5075 4231647 4538838 4495249 4304084 4309104 4407277 4556825 4466168 4578403 4756935 4762693 4920039
5064 4920039 4780987 4882369 4835559 4890551 4895561 4771367 4604904 4611491 4299679 4169838 4314627
5053 4314627 4491360 4361251 4288430 4155296 4309173 4227022 3960527 3929116 3914341 4200243
5043 4200243 4206812 4244149 4154283 4185833 4366192 4296617 4641460 4610528 4757761 4739528 4521446
5032 4521446 4700206 4517046 4596859 4632979 4654398 4747847 4859222 4898220 4900607 4893227 4834945
5021 4834945 4790137 4814369 4676422 4628308 4477740 4512683 4365313 4664856 4759649 4911273
5011 4911273 5223788 5188424 4921178 5156757 5191472 4982721 4762245 4768215 4985828 4731747
5001 4731747 4778424 4911361 4746487 4654163 4960561 4834165 4811357 4908154 5223237 5087450
4991 5087450 5091730 5144514 5202139 5357653 5458121 5519753 5326037 5310006 5282720 5366685 5401761
4980 5401761 5287761 5228311 5113580 5087574 5003239 4609547 4598514 4535695 4374345 4394109 4154916
4969 4154916 4403304 4509435 4407442 4398205 4214177 4026774 4110917 4330127 4479957 4648905
4959 4648905 4753942 4637537 4644125 4933181 5046790 4710179 4535293 4389603 4160305 4299172
4949 4299172 4381094 4199173 3968484 3968222 3749669 3794468 3761100 3777559 3564766 3770281 3749334
4938 3749334 3848890 3923754 3854581 3978896 3977830 4041791 3785758 3952516 4025777 3833980 3940327
4927 3940327 4092891 4273937 4034214 3860784 4176634 4069388 4012800 4050053 4062885 4040583
4917 4040583 4112933 4036184 4026815 3984868 4003095 3984332 4008559 4098666 4165866 4178077 4091363 4202508
4905 4202508 4323518 4416337 4469319 4572780 4646091 4487929 4500373 4605761 4703607 4903296
4895 4903296 5122892 5296892 5274907 5269839 5210432 5350356 5719698 6255103 6333038 6444997
4885 6444997 6860992 7448558 7638542 8315978 9049034 9387880 9350646 9252056 8891778 8295284
4875 8295284 7920490 7623368 7099406 6849656 6732752 6533529 6448613 6491255 6454796 6178660
4865 6178660 6305512 6328821 6302202 6159961 5976991 5712288 5836328 5946870 5937446 5999296
4855 5999296 5951212 6031300 6137994 6236175 6109341 6291405 6276476 6364236 6537510 6455910 6646309
4844 6646309 6461386 6646935 6841071 6880240 6950576 6853747 6846781 6986763 7116931 7033928 7031681
4833 7031681 7085378 6969742 7016431 7011150 6999879 6794892 7103374 7261912 7186436 6942755 6911257
4822 6911257 7199015 7257672 7375196 7706985 7759984 7735033 7700808 7864112 7886262 8084119
4812 8084119 8137242 8206601 8421368 8296871 8548205 8655568 8579820 8479520 8518814 8624621
4802 8624621 8519651 8658183 8606204 8771142 8937001 8908439 8876880 8826820 8801258 8839782 8886049
4791 8886049 8939575 8767861 8891775 9102373 9197888 9221676 9357583 9500011 9617527 9743685
4781 9743685 9676983 9801162 9930440 9901327 9982476 10143870 10129085 10245789 10163153 10318707
4771 10318707 10466886 10565253 10585958 10697695 10635764 10962844 10993593 10914686 10978750 11153087
4761 11153087 10953016 11109112 11404230 11272203 11406887 11508773 11500060 11736639 11904386 11775662
4751 11775662 11795683 11864624 11899059 11704610 11827306 12015449 12185626 12259731 12205467 12318437
4741 12318437 12338143 12344634 12370174 12587569 12650136 12474841 12484250 12833577 12974009 12912080 12954647
4730 12954647 13125750 13240025 13307097 13522734 13676920 13726968 13969694 13873066 13946487 14153928
4720 14153928 14335503 14407642 14460540 14448897 14735528 14771942 14629375 14818028 15154527 15262839
4710 15262839 15424960 15530138 15506527 15825593 16054922 16159390 16209421 16455219 16661125 16853225
4700 16853225 17011221 17272801 17584538 17863114 18139298 18398456 18656011 18964485 19236850
4691 19236850 19567902 19706008 19871116 20290598 20562534 20913409 21324154 21469528 21975211
4682 21975211 22161237 22289145 22441312 22795678 23226882 23601651 24026302 24259458 24785446
4673 24785446 25328465 25799714 26140536 26593369 27171119 27748590 28413751 28858648 29403003
4664 29403003 30277768 31143155 31943754 33135549 34298436 35452857 36336906 36808626 37044694
4655 37044694 36722060 36485067 36649459 36860137 37204514 37640880 38287880 38939746 39555258
4646 39555258 40357639 41040062 41870669 42822827 43770879 44594743 45440268 46406764 47383489
4637 47383489 48499776 49776300 50863613 52055853 53556178 54927397 56422701 58164139
4629 58164139 59852439 61668219 63749613 66077504 68773491 71318860 73696043 76338526
4621 76338526 79542215 82568140 86019062 89656546 93171464 96869034 100242851 103491715
4613 103491715 106542186 109811065 113404169 116419823 119516960 121956995 124011401 125689205
4605 125689205 126749508 127712384 128468892 129468620 130614099 132183579 134017307 136323181
4597 136323181 139055753 142138406 145587441 149923766 154572116 159401899 165051230 170635948
4589 170635948 176234608 181521601 186570788 191205562 195531915 199522758 202952496 205297677
4581 205297677 206836514 207371260 206571854 205306178 203932185 202211400 200682034 199531434
4573 199531434 198407860 197281501 196541748 196514692 196829748 197650775 198549917 200178503 202291419
4564 202291419 204681403 207260260 210152198 213114726 216005630 218828749 221679919 224237632
4556 224237632 226366085 228132846 229473784 229971317 230466724 230810806 231053646 231231193 230613483
4547 230613483 229606791 228140047 226619912 225139743 223997427 223180766 222602478 222829266
4539 222829266 223260061 224145847 225481670 227697908 230667109 234673469 239250711 244411413
4531 244411413 250053347 255644173 261304411 266747860 272135859 277170798 281485371 285117384
4523 285117384 287537908 288549840 288127932 286623256 284359779 281235461 278088937 275249113
4515 275249113 272714243 270471133 268647974 267891877 267829868 268609892 270117639 272166455 275099925
4506 275099925 278591616 282769710 287377033 291806150 296052736 300237508 303593215 306556211
4498 306556211 308889630 310173191 310372154 309807317 308220686 305783652 303004656 300068304
4490 300068304 297082596 294423765 292386421 291022415 290377932 290396055 291214662 293004194 295371696
4481 295371696 298539035 302330397 306387469 311040600 316084830 321283732 325830708 329407606
4473 329407606 331787417 332625085 332134310 330332403 327258759 322696580 316447445 308734899
4465 308734899 299883619 290543812 281281973 272258938 263607966 255585011 248486178 242274946
4457 242274946 236708319 232194799 228743720 226006367 224249789 222695505 221448891 220212187
4449 220212187 218623185 216455572 213904430 210623263 206843687 202182015 197109949 191597841
4441 191597841 185663618 179300574 172304367 165345508 157827445 150417881 143464261 136748558
4433 136748558 130081543 124040116 118258372 112675341 107718245 103276310 99020294 95079617
4425 95079617 91385410 87968843 84932652 81814955 78975319 76070104 73163585 70714574
4417 70714574 68567054 66509857 64195519 62056426 60263997 58372757 56786671 55271131
4409 55271131 53744980 52486835 51263217 50107309 49072018 48191539 47278446 46414939 45419628
4400 45419628 44518360 43638388 43005611 42291143 41703877 40856887 40069006 39381690 38813599
4391 38813599 38177629 37614814 37333580 36720306 36108853 35616112 35334787 34571975 34032155
4382 34032155 33266680 32554499 32149744 31561066 30904985 30228040 29652506 29034423 28413008
4373 28413008 27811960 27376307 26826881 26274263 26116472 25576846 24927331 24677482 24129567
4364 24129567 23556090 23054161 22540826 22235787 21830742 21594367 21322837 20809654 20397497
4355 20397497 19956762 19466549 19006005 18781595 18531643 18242849 17753866 17622089 17425221
4346 17425221 16866213 16621961 16564065 16504290 16261159 15922260 15822026 15777142 15664668 15421095
4336 15421095 15233707 15100726 14797379 14834547 14734389 14414393 14422911 14386295 14028989 13800439
4326 13800439 13555164 13629488 13536218 13408330 13230924 13117969 13232335 13188903 13229380 13320215
4316 13320215 13232186 13241176 13013602 12776152 12779251 12607348 12630073 12572155 12543612 12363058 12288471
4305 12288471 12003879 11740123 11792358 11687658 11428030 11378413 11207153 11253833 11136512 10867572
4295 10867572 10878542 11048228 10899073 10831644 10680752 10795763 10822437 10788711 10883280 10581495
4285 10581495 10608836 10601866 10266070 10191880 10105926 10037248 9876934 9764038 9811764 9825694 9695168
4274 9695168 9588671 9700374 9623054 9478419 9063558 9264551 9506831 9376007 9350016 9258040
4264 9258040 9282852 9353008 9224408 9243535 9060165 8913730 9129343 9237551 9342692 9434116
4254 9434116 9410637 9467872 9336771 9439009 9425488 9416352 9587880 9596001 9718321 9857623 9820789
4243 9820789 9789042 10036839 9977442 10042811 10093711 9939451 10052456 10106618 10009457 10196521 10402659
4232 10402659 10392143 10476716 10661159 10667200 10746799 10602657 10690778 10723340 10662914 11001551 10961394
4221 10961394 10916624 11049252 11247072 11205174 11293969 11420049 11583139 11654966 11780686 11865726
4211 11865726 12029064 12114752 12331988 12421415 12578296 12568929 12671564 12702725 12814630 12983069
4201 12983069 13123460 13308580 13567750 13861203 14113939 14314256 14415044 14611072 14940838
4192 14940838 15278931 15757870 16159066 16521530 16983675 17724802 18242219 18740278 19266758
4183 19266758 20152563 20700656 21195037 21025130 20231905 19753147 19135914 18681736 18192781
4174 18192781 18134182 18069531 18048195 18107759 17989707 18006122 18044558 18323992 18623308 18680768 18997555
4163 18997555 19018724 19323862 19526733 19843722 20086395 20516882 20781636 21108803 21452128 21903144
4153 21903144 22382178 22969937 23833790 24633262 25184907 25803071 26937258 28143651 29488782
4144 29488782 31319597 33146862 35190379 37375638 39776611 42948966 46620490 50703048
4136 50703048 55632707 61852551 69258073 77066193 84922228 90330660 90840162 85280020
4128 85280020 76439785 67458331 59576549 52818949 47251042 42770816 39171976 36037464
4120 36037464 33543531 31671282 29802986 28176108 27087412 25973953 25053271 24292588
4112 24292588 23605965 22858021 22257256 21666229 21165539 20819013 20651622 20309764 20177252
4103 20177252 19990388 19629833 19408892 19164124 19226802 19110010 19043548 18826838 18801782 18819643
4093 18819643 18664042 18643095 18622782 18545847 18357624 18259936 18356072 18252809 18296890 18324403 18280517
4082 18280517 18274008 18500483 18578548 18431274 18114183 18320317 18303954 18223176 18238655 18593436
4072 18593436 18678268 18653558 18755431 18927530 18924404 19159342 19316140 19600922 19453119 19506574
4062 19506574 19701395 19533340 19537881 19704624 19933027 20154811 20157238 20437789 20376623 20448947
4052 20448947 20757025 20792615 20841487 20990938 21125115 21054725 21253859 21399670 21781511 21950557
4042 21950557 22092363 22498037 22862920 23145873 23361058 23580663 23886794 24232908 24520881
4033 24520881 25081965 25485600 25666375 25675538 25763688 25778619 25695316 25625558 25587496 25576440 25543114
4022 25543114 25194618 25364676 25568280 25401616 25611916 25739658 26309436 26400976 26586335 26868270
4012 26868270 27175403 27592549 27777505 28271308 28858512 29444041 30155314 30632292 31163231
4003 31163231 31621230 31939395 31830152 31817870 31797089 31873629 31732374 31678850 31601446 31797486
3993 31797486 32042434 32031268 31992823 31949839 31681667 31447128 31412498 31414360 31677873 32038178
3983 32038178 32058477 32052568 32157671 32421998 32669212 33031945 33305000 33464575 34005341 34559856
3973 34559856 35186109 35621438 36195982 36621837 36830730 37130661 37654287 37955426 38501170
3964 38501170 38728800 39081607 39593685 39801582 40199264 40822846 41402012 41860526 42040660
3955 42040660 42258567 42769516 43574912 44014788 44757664 45722885 46319584 46996096 47500038
3946 47500038 47982272 48365827 48955900 49400052 49890311 50167680 50560095 51340537 52045124
3937 52045124 52659001 52847217 52878521 52935895 53012294 52971851 52954784 52918513 52828886 53125564 53298921
3926 53298921 53509636 53717279 54202892 54705996 55471423 56550902 57449800 58273417 59354042
3917 59354042 60457591 61788642 63115752 64332355 65847507 67286846 68696412 70495454
3909 70495454 72076821 73901750 75835936 77642863 79616887 81276296 82990094 84823412
3901 84823412 86780798 88800965 91107617 93446605 95666593 98008470 100096109 102575880
3893 102575880 104968488 107354012 109963978 112502943 115113750 117630423 120034434 122651692
3885 122651692 125508624 128356624 131626724 134820734 137699184 140254245 142781686 145372038
3877 145372038 148137822 151013964 154024842 157251852 160310573 163223255 165963407 168706283
3869 168706283 171262668 174141256 177270997 180527233 184279709 187957074 191787032 195499742
3861 195499742 199154661 202981045 207342284 211845467 216326165 221044140 225748550 230857990
3853 230857990 236164945 241333687 246522099 251185618 255376715 259948459 264560645 268689740
3845 268689740 272528834 276168556 279649381 282881042 286482682 290309164 294075793 298191293
3837 298191293 302445442 306487468 310460380 315035293 319949071 325416903 331646829 338410275
3829 338410275 346242221 354699976 364029483 374136470 384631148 395389184 405905841
3822 405905841 415740280 425074082 433655186 441400017 447839618 453148163 456954958 459604701
3814 459604701 461340963 462556898 463092355 463321577 463577514 463355445 462319156 460869982 459192252
3805 459192252 457601810 456190084 455391941 455267580 455414896 455844670 456156493 456288274 456571349
3796 456571349 456834907 457008915 456626625 455375626 453042566 449071548 443707704 436795188
3788 436795188 428524895 419605000 410522376 401349655 392100369 382640850 372673822 362511250
3780 362511250 352353793 342172157 332648590 323914609 315986033 308358889 301196939 294692332
3772 294692332 288719278 283005473 277607972 272703729 268520207 264739427 261301983 258398270
3764 258398270 255458081 252106303 248508110 244258734 240049438 235448733 231041417 226869620
3756 226869620 222932395 218875038 214585857 209847106 204980617 200032420 195292090 190724520
3748 190724520 186268698 181947362 178008624 174397432 171027325 167561965 164528937 161813621
3740 161813621 159221575 156838326 154608329 152528112 150528551 148684376 146595975 144608881
3732 144608881 142879402 141215991 139359793 137769143 136065566 133991136 131998023 129678502
3724 129678502 127089075 124785454 122422516 120299297 118211501 116098448 113914461 111803004
3716 111803004 109658349 107463530 105052008 103105672 100880593 98702801 96935330 94951848
3708 94951848 93078996 91250327 89302482 87343016 85076614 83082801 81015804 79010254
3700 79010254 77025341 74928890 73114758 71571620 70463350 69312883 68219652 67000228
3692 67000228 66102645 65264697 64555961 63882495 63352793 63051936 62744027 62464657 62117463
3683 62117463 61483712 60620334 59915772 58895123 58162110 57385501 56338098 55662975 55177912
3674 55177912 54616938 53830030 52933261 51876145 50659787 49512531 48650235 47316121 46098364
3665 46098364 45134580 44408232 43746214 42879101 42337330 41929840 41663491 41407705 41228241
3656 41228241 40995034 40748954 40434675 40212586 39744681 39242146 39026458 38600246 38457494
3647 38457494 38425971 38310385 38218599 38223575 38134175 37772750 37703885 37789996 38060403 38236356 38371904
3636 38371904 38541106 38465425 38146420 38050678 37956102 37635285 37191269 36641919 36192993 35451720
3626 35451720 34834816 34229546 33630900 32991145 32321085 31742625 31330001 31312240 31256162 31391940
3616 31391940 31523241 31350741 31419061 31739590 31864933 31787503 31717819 31850731 31835639 31381377
3606 31381377 30937385 30711405 30340794 29953442 29560050 29364903 29271866 29156577 29015480 28881593
3596 28881593 28573575 28365811 28120124 27632125 27401103 27261607 26857300 26868996 26802680 26441194
3586 26441194 26312035 26197048 26170394 25914227 25577634 25533318 25457408 25314216 25253329 25083574
3576 25083574 25108894 25083918 25151629 25180719 25186917 25170428 25423066 25598190 25577200 25750392 25959807
3565 25959807 26120849 26504164 26791772 26613242 27000939 27313632 27718967 27964131 28101128
3556 28101128 28299162 28610359 29051484 29582058 29748233 29665431 29777973 29971004 30232180 30425944
3546 30425944 30711985 30945983 31110544 30954431 30712470 30635070 30526452 30344516 30197346 30087612
3536 30087612 29755336 29547933 29060049 28761799 28594833 28413123 28221652 27891587 27578208
3527 27578208 27247986 26691165 26464790 26398528 26065976 25731121 25478373 25305526 25015256 24885498
3517 24885498 24550789 24327163 24114318 23919683 23632750 23724597 23410674 23030458 23127084 23294718
3507 23294718 23029660 22992285 22977676 23159521 22929532 22707270 22751766 22876630 22882923 22823645
3497 22823645 22676019 22413056 22055609 22253636 22455151 22666478 22735351 22596976 22431534 22214420
3487 22214420 22280652 22197866 22229901 22123923 22067451 22085536 22032803 22120746 22176540 22123026 22071962
3476 22071962 22002134 21970630 22019592 22051423 22107137 21959739 21777014 22082253 22138418 22146877 22083098
3465 22083098 22072985 22233501 22281659 22128312 22080970 22039364 22146514 22142633 22208965 22390558 22536695
3454 22536695 22413481 22313745 22347599 22357073 22416878 22543555 22721417 22684267 22942873 23333959
3444 23333959 23492590 23469994 23564154 23794285 23746059 23890567 24212961 24396465 24520682 24616960
3434 24616960 24873136 25153991 25349015 25438074 25466137 25889555 26035873 26176281 26403527 26378164
3424 26378164 26501905 26495726 26846803 27183602 27303966 27653511 27731986 27909881 28232618 28567002
3414 28567002 28969414 29374905 29590942 29771223 29893448 30186378 30392968 30623571 30943063
3405 30943063 31294760 31588972 32027057 32381897 32699961 33286412 33832052 34342728 34613289
3396 34613289 34904960 35332749 35876389 36298031 36556866 37104230 37482205 38118644 38583671
3387 38583671 38991490 39595640 40228505 40821251 41195954 41594931 42334152 43005074 43855684
3378 43855684 44497233 45131372 46001214 46852913 47740982 48500149 49159723 49942815 50738823
3369 50738823 51493525 52316832 53127239 53907135 54641603 55598175 56439901 57151672 57925460
3360 57925460 58707854 59506837 60721748 61967001 62938268 63951481 65067543 66245492 67452517
3351 67452517 68749743 70199880 71441016 72864879 74263933 75892438 77660502 79176165
3343 79176165 80487762 81871260 83228861 84776268 86436440 88016063 89240261 90554399
3335 90554399 92150281 93651062 95308511 96762891 98422223 100216018 101805388 103420382
3327 103420382 104852074 106367947 108093883 109999948 111905472 113879867 116269282 118932634
3319 118932634 121170512 123899141 126864721 129864091 133303636 136573164 140329792 144278278
3311 144278278 148435565 152995150 157694225 163199560 168980352 175323925 182358755 190247046
3303 190247046 198784041 207797096 217650978 227855511 238433880 249467668 260594220
3296 260594220 271370903 281678112 290917897 298744266 305160233 309365884 310921044 309108452
3288 309108452 304197753 296179370 285679048 273602141 261134596 248928803 237573289
3281 237573289 226734981 216815981 208113858 200415343 193031087 186105924 180045757 174094185
3273 174094185 168610809 163454593 158966074 154917439 150873619 147206600 143618097 140121617
3265 140121617 137152183 134132826 131206894 128167585 125076900 122209775 119397156 116507419
3257 116507419 113814094 110889858 108165651 105600081 102940955 100397683 98242690 95953949
3249 95953949 93808482 91746112 89681622 87477062 85177810 83164901 81132741 79069158
3241 79069158 77368052 75814145 74151928 72532032 71082161 69843990 68600458 67332788
3233 67332788 66012700 65027228 64180640 63176189 62179181 61179455 60241890 59492904 58683404
3224 58683404 57948142 57385925 56703154 56068181 55564958 54874061 54885014 54558500 54203601 53893948
3214 53893948 52814689 51661436 50510563 49705844 49085401 48355580 47559810 46927371 46262021
3205 46262021 45921660 45172495 44699475 44154915 43656401 43334418 42964153 42465076 41961580
3196 41961580 41514532 41279728 40822305 40475887 40245790 39921463 39840399 39410972 39206887 38927880
3186 38927880 38798954 38814205 38582828 38310410 37940895 37593273 37080830 36322724 35726826 35436314
3176 35436314 35075410 34568776 34255456 34063936 33653450 33198470 32760675 32711293 32528615 32235039
3166 32235039 31941590 31702389 31706729 31397626 31259982 31113491 30792614 30458639 30199053 29898865
3156 29898865 29948665 29618409 29517332 29400201 29407129 29140085 28762287 28478248 28420077 28526558
3146 28526558 28297030 28195981 28080866 28040456 27955203 27934374 27772068 27649656 27650694 27527656
3136 27527656 27234716 27056435 26930859 26961469 26795947 26711002 26549062 26403227 26514827 26472294
3126 26472294 26277630 26116927 25840787 25616403 25469329 25340449 25034390 24920669 24991404 24755575
3116 24755575 24474919 24388360 24150959 23872053 23610168 23322840 23372881 23269955 23180775 22999386
3106 22999386 22834056 22815582 22711328 22801559 22474562 22173756 22135776 22147728 22008147 21808431
3096 21808431 21816445 21783109 21544938 21452350 21429926 21287380 21025698 20698360 20713338 20483953
3086 20483953 20499069 20445786 20192387 19879638 19787706 19552309 19421321 19300914 19339111 19376074
3076 19376074 19334743 19168722 19136203 19240350 19106604 18887007 18873314 18879932 19009772 18930386
3066 18930386 19048037 19285286 19002275 19080548 19237268 19160804 19259010 19419848 19424136 19515177
3056 19515177 19562150 19719275 20029712 20073369 20181199 20400208 20389853 20469740 20611166 20774742
3046 20774742 21062039 21400999 21630633 21893850 22058327 22386480 22594376 22658962 22792233 23155192
3036 23155192 23370658 23661402 24089355 24405226 24850408 25266236 25552789 25962884 26389471
3027 26389471 26718821 27216525 27478757 27979621 28631425 28809186 29159289 29366187 29735267
3018 29735267 30024277 30068532 30498129 30777110 31060443 31641486 32321872 32831038 33281818 33862557
3008 33862557 34346143 34917967 35334830 35821007 36410687 37043166 37567392 38144097 39113979
2999 39113979 39937835 41095617 42144209 43292479 44265267 45445509 46826653 48180239
2991 48180239 49496548 50861702 52220042 53495039 54844276 56389900 57856464 59680534
2983 59680534 61381069 63077642 65023813 66854589 68731339 70461744 71853196 72812385
2975 72812385 73836587 74368738 75153683 75831289 76481453 76926836 77553686 78305068 79354671
2966 79354671 80543694 81804488 83351793 84997823 86996577 89048908 91382468 93987257
2958 93987257 96469521 99567520 102758660 105914129 109548241 113296736 117201237 121406520
2950 121406520 125302658 128215771 129795663 129897543 128052989 124669079 120196115 116016594
2942 116016594 112068847 108599744 106243495 104607396 103561128 103007182 102939401 103121332 103513355
2933 103513355 104302558 105269658 106325622 107911846 109563001 111052128 112441272 113626679
2925 113626679 114676637 115747036 116272288 116261632 115588782 114307572 112896292 110906160 108693746
2916 108693746 105931443 102811789 99325342 95649037 92386571 89640603 87381475 85186546
2908 85186546 83458208 82083297 80950067 79998540 79362094 78662860 77990186 77179826 76265779
2899 76265779 75190154 73817399 72268713 70606154 68692365 66419355 63861182 61344454
2891 61344454 58770809 56090698 53419794 50874543 48709040 46669356 44874901 43289803
2883 43289803 41558426 40108122 38787350 37820134 36667294 35437184 34485638 33588896 32844223
2874 32844223 31971356 31057378 30384204 29709782 29098120 28286718 27528648 26871932 26251079
2865 26251079 25304368 24477004 23853770 23203781 22468176 21877067 21400971 20912229 20276974
2856 20276974 19776805 19199854 18734624 18191238 17544668 17473045 17092373 16639536 16195575 15728757
2846 15728757 15504474 15291304 15189901 14938663 14670660 14259029 14225494 14108698 13912711 13581640
2836 13581640 13319993 13270510 12878491 12742946 12603867 12415321 11945266 11887808 11679953 11263178
2826 11263178 11215878 10807196 10562453 10541125 10230986 10064273 9896940 9700055 9521268 9259319
2816 9259319 9073433 8818732 8678727 8584042 8298516 8309484 8221566 8069632 8140637 7930610
2806 7930610 7692224 7721987 7593618 7544064 7353424 7187269 7142324 7114357 6856926 6928534
2796 6928534 6746348 6379489 6238724 6236459 6229834 5942564 5847140 5579369 5542579 5513193 5193925
2785 5193925 5017241 5209968 5165780 4757835 4860174 4990988 4828351 4678693 4698077 4583040
2775 4583040 4278254 4286020 4272727 4153731 4210808 3905652 3821126 3911822 3956756 4005488 3941329
2764 3941329 3840680 3986038 3736555 3718949 3747472 3685546 3722749 3814582 3589022 3473092
2754 3473092 3520462 3093108 3189464 3471177 3337162 3458509 3396502 3303823 3170613 3207384
2744 3207384 3168468 3014507 3090295 2970859 3061748 2941771 2791683 2641751 2619744 2688988
2734 2688988 2816871 2695561 2586623 2589080 2605693 2807401 2796996 2890045 2904888 2667706 2541760
2723 2541760 2463145 2430113 2297832 2348344 2549137 2776243 2839701 2812424 2708526 2368518
2713 2368518 2268516 2405856 2578611 2521789 2308953 2220994 2269780 2153487 2156244 2220622 2060441
2702 2060441 2110596 2196918 2547820 2517911 2525269 2371996 2194857 2295710 2529411 2533662 2340613
2691 2340613 2185523 2151586 2145399 2039501 1905991 2061081 1888300 1861909 2060252 2180430
2681 2180430 2125470 2050757 2084617 1886475 1880098 1920293 1996064 2101792 2040464 2004707 2026201
2670 2026201 1896723 1942242 2043929 2102034 2049891 2076123 2044227 1901670 1841092 1907608 1847542
2659 1847542 1906956 2038016 1837612 1666855 1661980 1766422 1710967 1758829 1705767 1718670 1794483
2648 1794483 1558846 1452578 1467857 1665150 1522371 1627520 1754316 1602836 1630818 1699217
2638 1699217 1621391 1636593 1841673 1698050 1566747 1515348 1576762 1595284 1684300 1604324 1443373
2627 1443373 1471873 1488015 1589469 1540227 1297274 1197460 1170969 1073855 897276 1046125 1183286
2616 1183286 1366390 1437231 1292845 1168729 1147105 1324668 1261735 1040545 983955 1176720
2606 1176720 1259079 1315513 1084248 1011322 945805 1037576 1141492 1029632 1057628 1111155 729975
2595 729975 594862 600563 669361 732415 963357 1021435 809213 657712 590698 650313 638254
2584 638254 611943 603115 776865 740794 746124 726007 802589 711879 805876 953232 882107 756259
2572 756259 641564 699474 562134 544484 714068 915679 861211 688282 503751 546330
2562 546330 615574 584326 730638 606147 589087 755310 525999 645656 876449 685885
2552 685885 466300 406794 440617 562596 692819 662071 603934 511786 405165 434006 416525
2541 416525 409812 449317 576612 833989 652775 610115 667642 790122 883934 639895 580822
2530 580822 627695 649328 645247 390923 399047 311848 288443 132146 14441 318118 496980
2519 496980 450203 222168 262680 278829 363837 583285 558402 450833 303602 388977 430687
2508 430687 384868 398907 355900 375739 445074 333965 301685 229911 282853 437181 255946
2497 255946 212187 125140 -32646 36442 15099 293615 354776 133537 206245 257982 157161
2486 157161 -31361 58714 -148917 -62949 -15988 4656 -125827 -88379 -5621 72702 26273
2475 26273 46782 130274 117086 210870 115796 89094 6965 48514 21019 -6 -14090 197877
2463 197877 261661 215083 208702 9364 67740 -49079 48685 167450 -53578 -136054 16418
2452 16418 97606 50593 132246 27059 9890 186314 229450 64872 44363 -18103 -234675
2441 -234675 -296281 -118345 -13748 -18378 -1159 78917 33092 -27486 -133092 -94121 -60827
2430 -60827 -57093 73554 3683 -50722 53920 -89980 -134227 -122695 -194484 -113001 -56136
2419 -56136 -96939 -148811 -182000 -62161 32520 -11556 -134033 21770 11252 -251233 -233763
2408 -233763 -236125 -171012 -172130 -57194 -95974 -105702 -3306 -196590 -167042 -185454 -442730
2397 -442730 -487505 -124214 -81513 -49412 40563 12751 -274123 -232355 -85152 -271682 -203822
2386 -203822 -57224 -202423 -184664 -188665 -180623 -106829 -117978 -121337 18052 187661 4272
2375 4272 110987 260754 154634 -78360 -184804 -254807 -254233 -309527 -231548 -248172 -345057
2364 -345057 -405646 -208076 -240480 -303215 -191645 -298758 -364378 -117076 -146407 -130161 -30849
2353 -30849 -134137 -1159 -43789 -373843 -408384 -373095 -348428 -211603 -197824 -120349 -211439
2342 -211439 -196689 -81947 -42104 -188075 -380557 -275170 -163370 -278586 -141497 150696
2332 150696 160897 -86984 -322154 -256479 -159994 -138107 -89522 -178146 -250934 -276862 -252537
2321 -252537 -219314 -26472 -18294 -223580 -252550 -317202 -297380 -161022 -129508 -166213 -312678
2310 -312678 -335701 -27574 -52668 -54549 -199281 -63534 95372 -119015 -106764 -129907 -374838
2299 -374838 -108641 -95803 -219922 -77041 10888 -4100 6035 -181915 -243972 -181808 -188503
2288 -188503 -113263 -94153 -125140 -206230 -77624 8404 45595 -60296 -44808 -146250 -264542
2277 -264542 -349629 -319280 -236071 -89713 -141604 -215326 -150223 79017 -2084 -66869 15679
2266 15679 -119855 -77377 -65989 -300903 -389745 -93977 21489 -182897 55112 119576 -20391
2255 -20391 -58887 -45491 -69401 10003 -175047 -82269 -5236 78670 -13492 -154326 -175184
2244 -175184 -16382 212453 164104 327439 351520 353216 24693 170211 263181 395877 316314
2233 316314 338308 489146 443197 204206 89131 201632 324802 347120 451292 712475
2223 712475 782201 692835 704572 524796 578902 451161 339697 385718 523720 390956 370643
2212 370643 620938 751688 748540 607606 590261 597405 698130 642859 690934 731424 939620
2201 939620 839070 919417 1061663 1138834 947873 1055288 1112234 1130839 1256971 1378528
2191 1378528 1411120 1253502 1212073 1418427 1734879 1665468 1356433 1411519 1749933 2107882
2181 2107882 2095445 2000673 1902111 2020595 2152997 2350914 2335166 2511450 2626027 2643651
2171 2643651 2849139 3051632 3465963 3677057 3890033 4110602 4626219 5117907 5335591 5993330
2161 5993330 6720833 7539600 8365842 9253546 10472076 11934358 13832621 16165034 18827859
2152 18827859 21264520 22768199 23102180 22973901 20059772 16060886 12960905 10572572
2144 10572572 9144083 7869980 6732208 5937505 5521583 4828798 4348392 4131935 3767986
2135 3767986 3436012 3173566 2911068 2617649 2358492 2123974 2043585 1892136 1733922 1592084
2125 1592084 1394644 1261745 1252224 986736 962402 1066262 1128759 1133424 976719 980406 978523
2114 978523 1101476 1031878 711160 607001 402665 262676 289186 432756 433609 415343 494168
2103 494168 410664 380267 696748 605121 473720 448885 543706 408543 469238 528063 447204
2092 447204 85286 34640 12560 -63750 182051 100468 119125 181544 -16686 -23242 65835
2081 65835 272800 315265 -69847 14808 51400 188419 -22358 -42566 -47935 -118436 32168
2070 32168 13962 100543 2002 -292445 -218395 -146775 -45149 -34763 -83021 -13035 -96053
2059 -96053 -69660 86604 44945 241008 -56339 -34706 -17688 95195 207298 50678 59151
2048 59151 122166 162189 -12009 -137984 -231142 -120391 126791 -77968 -119954 -218533 -261682
2037 -261682 -268698 -224383 -218470 -155656 -30367 65592 206 -26493 -89167 -124255 -136061 -81485
2025 -81485 -109109 -285510 -294016 -123487 41538 -273606 -146035 -64246 -79658 -207450 -180458
2014 -180458 -193431 -112962 97161 94715 -89280 -125099 -231962 -334981 -249692 -287159 -330756
2003 -330756 -88472 -12044 -140458 -125582 -24402 -217041 -320971 55989 80778 -85068
1993 -85068 28125 -23774 -181319 -348217 -186228 -276549 -164261 -125389 -57200 23494 -122642
1982 -122642 -209568 -162432 -139102 -144619 -62508 -139325 -118985 -116249 -167788 -91292 -118962 -257587
1970 -257587 -312440 -160489 -202924 -316196 -207335 -192173 -309453 -298814 -181016 -128329 -145475
1959 -145475 -178166 -130024 44435 -224098 -357418 -141005 -290772 -275916 -166820 -77362
1949 -77362 -228922 -138662 -9238 -115555 -239797 -285774 -207015 -183002 -410821 -567772 -607300
1938 -607300 -281667 -129347 105680 5537 -15267 -56766 -111276 -20528 -235540 -68789
1928 -68789 95689 138 -84421 -323630 -290160 -247250 -497843 -496579 -286759 -171998 -250925
1917 -250925 -168696 -56047 -79799 -183399 -162999 -130817 -22702 -86041 -99588 -118527 -102486
1906 -102486 -281267 -132975 -86246 -247848 -317387 -374610 -241281 -157657 -212583 -11040 196286
1895 196286 -33859 -178755 -376732 -457231 -417563 -409442 -369780 -250678 -113615 22857 45489
1884 45489 -7890 -6505 -16386 36485 127058 134746 -69588 -248276 -306074 -249806 -38025 -194479
1872 -194479 -321447 -222910 -421009 -301546 -286562 -237120 -26252 -399933 -479204 -384445 -376759
1861 -376759 -430559 -352449 -148200 -218114 -125647 -8599 -190923 -228256 -357375 -252024 -175041
1850 -175041 -311591 -217433 -104682 -206507 -389928 -452360 -342613 -280495 -378346 -431709 -167344
1839 -167344 -383156 -324390 -169124 -221561 -304051 -313890 -373288 -310804 -205665 -277649 -347646
1828 -347646 -367432 -196714 -244443 -313515 -277142 -141585 82937 -94403 -118234 -115153 -253618
1817 -253618 -106420 -43909 -95180 -125365 38647 107017 -10868 -156475 -55581 -86638 -94602
1806 -94602 -66333 84110 -93993 -42511 -141431 -165375 -10228 -189729 -421962 -239657 -137805
1795 -137805 -138393 -212960 -267309 -335531 -135139 5488 -195202 -370506 -433360 -466169 -512495
1784 -512495 -348637 -120473 -19920 51741 -293705 -309760 -105455 -98125 -196393 -269222 -319976
1773 -319976 -277611 -183926 -301484 -398317 -256792 -236916 -461906 -264205 -208977 -110077 66675
1762 66675 -227961 -461932 -414003 -298644 -204344 -295400 -20902 -114632 -261218 -119196 -122525
1751 -122525 3590 -268779 -74884 -76759 -287146 -196219 -380892 -363093 -268428 -291389 -149248
1740 -149248 -54266 -225657 -321182 -470565 -416877 -317390 -235826 -335012 -334639 -470440 -400864
1729 -400864 -316488 -87686 -217290 -105963 -117827 -225269 -84144 -47 -355454 -398706
1719 -398706 -59337 77444 -11920 -130213 -145168 -42067 -4481 -117138 -18280 -186000
1709 -186000 -137906 -86873 16702 -52518 -222669 -408564 -229955 -199759 -222018 -138570 -26280
1698 -26280 -102741 -268269 -364485 -264932 -74588 -165286 -249248 -405498 -424859 -369491 -425363
1687 -425363 -128322 -137880 -394104 -271305 -279491 -336953 -83637 33343 -127074 -204110 -414730
1676 -414730 -286475 -179832 -133983 -234655 -140825 -139854 -280771 -315124 -48361 -54461 -107870
1665 -107870 -90580 -96430 -180746 -229456 -257647 -194831 -80782 5445 -33627 -88940 -133348 -184602
1653 -184602 -32983 -22870 150609 50034 56264 52869 107302 93352 -199928 -160185 -231567
1642 -231567 -205360 105057 222557 131721 -108332 -70961 -27050 -108603 -62796 16960 -36458
1631 -36458 -112662 -157128 -56787 -320514 -187769 -81084 -159276 -15280 -13809 -177261 -166750
1620 -166750 -105527 -174030 -51560 -113660 -186602 -101519 -286943 -158505 -89074 6905 -6801
1609 -6801 -239153 -331940 -264857 -255213 -151686 -204771 -179975 -135489 -197108 -387932 -344795 -276844
1597 -276844 -369255 -129198 -70643 -61375 -236608 -233612 -309875 -385892 -327298 -155207 19211
1586 19211 187758 -9089 -264125 -106060 -61561 -113452 -18775 -45902 -55277 -94194 -88167
1575 -88167 -28708 -248258 -104346 -127409 -122274 -210976 -204591 1537 38581 62005 -36486 -75610
1563 -75610 -120516 -143751 -80689 -167383 229787 -25246 -197610 -111841 -36881 32179 -28031
1552 -28031 -36878 70470 4605 -154547 -190191 -292870 -163304 -129202 88926 -62985 -118756
1541 -118756 -140993 25807 -45710 -234717 -322403 -190966 -289571 -265577 -156123 -15263 129478
1530 129478 48552 -104051 -153114 -207732 -111338 34309 -66100 -40100 -169155 -226889 -224706
1519 -224706 70675 22603 -181596 6387 -157799 -284824 -513260 -295729 -241451 -300958
1509 -300958 -142136 -111910 -153608 -136163 -9106 -114669 -72277 68116 -192088 -81053
1499 -81053 -15698 -248355 -358163 -33053 -10193 -191171 -72931 -35883 -257161 -225663 -165174
1488 -165174 260 107852 -56923 -214744 -119725 -110436 -208395 -352256 -190025 -33187
1478 -33187 259310 103112 -35164 -73785 -113644 96066 -249394 -267791 -59085 91107
1468 91107 -41321 -34757 50991 22744 3229 -137900 -114778 18925 53916 66171 25400
1457 25400 24985 -92376 133462 24029 -181279 -179163 20061 -233877 -138429 -48034 -201473
1446 -201473 -191727 -105318 -4848 -57025 -6012 158690 7329 -144327 -94051 88739 -50090
1435 -50090 -55649 -23298 -100323 -174913 -184730 -38425 -22335 28725 -70879 -196580 85328 -47456
1423 -47456 103834 159964 108738 -17941 -35848 19399 -14809 -30594 -211463 -41919 -18770
1412 -18770 -76470 -155225 -157425 -29352 -89881 -44071 -89825 -123644 117057 209767 125864 190255
1400 190255 127252 252453 10792 -85759 -152530 102972 119611 -58403 84091 -9498 -7401
1389 -7401 40938 120146 -117863 -64195 -75730 -40334 28735 57113 -124233 -103375 110480
1378 110480 94295 29600 110509 38726 -133026 -147878 -102928 -31586 -155455 -287269 -57900
1367 -57900 -131882 27166 -116255 -91780 -211718 -270936 -152532 680 18444 31405 139096
1356 139096 5820 -275598 -316348 -23657 63418 -112640 -77534 -203890 -189679 35735
1346 35735 -124084 -235295 -112733 -52158 33156 -18028 56058 38971 -52387 -139512 -195773
1335 -195773 -423102 -209029 166751 93922 -77811 35597 215318 46632 77462 79854
1325 79854 96059 267961 150465 54077 30501 61181 159107 -20670 -125993 -58512 -9112
1314 -9112 -13079 -52806 -66661 -127478 -132796 130071 139840 253045 103426 -54759 42221 136112
1302 136112 123590 -47352 -123144 -124796 -135249 52480 161586 -74089 -97992 -78769 4419
1291 4419 283919 292392 69960 129787 1726 -45421 55019 -180621 -172891 -138994 -36777
1280 -36777 -49008 39899 -199491 -218487 -152270 -42800 110972 -165117 -53322 -93667 -125090
1269 -125090 -68139 -304205 -2259 29760 -136426 -159301 69263 24367 111439 -42904 41893
1258 41893 129042 -159200 -232990 -313311 -184601 -191225 -257372 -36667 241667 130806 94744
1247 94744 220871 16617 -22134 61438 119722 243634 292097 330884 199963 162838 81522
1236 81522 160887 46420 13805 3945 88663 269512 139993 -58924 -48099 186598 207800
1225 207800 -71373 718 -63887 -252161 -142703 -84007 -45244 -114560 -288055 -167247 -96272
1214 -96272 -201906 -41744 -45484 -35146 -113897 -140834 -367375 -293508 -44795 -103630 -178661
1203 -178661 -309857 -270989 -188923 -10202 247214 -46138 28800 172959 -27385 -25301 -60969
1192 -60969 -46465 -78481 -81418 26572 94396 20637 -41361 -205911 123001 -76390 -16983
1181 -16983 241063 46522 -166811 -282529 -69995 21905 -145746 -136831 -192909 165477 -5008
1170 -5008 -216554 -106119 -140090 -28940 -48113 -55697 -93422 -130632 -73341 -215926 -28450
1159 -28450 -69761 -33733 26460 32185 -247 206793 253226 -87698 48268 -32464 32848
1148 32848 156534 135710 160353 296908 233116 334228 370819 232108 173540 -105657 -149704
1137 -149704 98655 64969 261596 319035 246569 60641 -23845 149413 91332 -130477 57553
1126 57553 47833 178890 23880 55079 155349 102863 -96 -58610 520 197233 46996
1115 46996 -67733 -94200 -143823 -80209 -70414 -53286 78153 117450 173948 140203 80401 192403
1103 192403 144895 107450 -43405 -44078 113625 -63349 -221435 -56402 -64777 17098 262853
1092 262853 193600 103197 33438 -68274 81182 -91816 86561 -46270 -30152 52597 -72254
1081 -72254 -106591 104635 118686 -188309 -110660 141840 174437 155299 126826 66455 30259
1070 30259 -95947 -195255 -13353 -11717 78927 27254 35742 -158235 -168243 -99073 -94129 -39519
1058 -39519 730 58606 1773 -23471 133968 -1806 -189536 -30052 153254 174137 248053
1047 248053 344342 134757 100552 -34419 -114102 26829 147631 166093 236019 43769 59178
1036 59178 227934 359001 404632 130264 -194175 -161291 -50777 145232 -8784 -48277
1026 -48277 -7819 45763 41880 37025 -119252 -265903 79139 163817 249724 375637 272254
1015 272254 138207 78283 106555 -147875 -171014 -113250 -156113 17815 24972 -102284 102132
1004 102132 105996 -6411 -1984 75487 109793 -89169 -95041 69126 43086 -95819 125220
993 125220 222980 289682 34770 -65696 141953 69418 20618 -101155 110122 177859 73127
982 73127 78043 208181 159830 21571 -93665 -63341 138183 40890 68238 -125072 -192041
971 -192041 13107 82247 103895 53218 -15854 174362 91895 87157 50172 -118012 113921
960 113921 196416 253330 142451 118225 246459 175508 69226 -111822 -200104 -284124 -190938
949 -190938 24641 -30636 40348 74924 27523 50521 245250 144955 -4049 15482 -18919
938 -18919 43721 -68870 -51931 -7707 -169469 -11026 50905 69596 -18301 25613 15617 8799
926 8799 24648 -55889 138952 71902 275057 219257 51256 -44921 39809 38327 -32307 -21828
914 -21828 -182101 -36035 6811 -74356 -72932 -170530 -169255 -96033 96085 81885 11749 176346
902 176346 99565 9850 161316 130839 212225 219212 68049 116496 64619 -4617 13893 -97863
890 -97863 -98130 -79081 34770 90321 60919 -3978 -62026 -49664 -11626 -72175 -60185 -52759
878 -52759 -4340 98070 140879 196758 26422 -50120 -10418 -23988 36285 41293 21843 22994
866 22994 279576 214349 95760 66828 102987 -2371 16135 27562 -138512 -40838 -95856
855 -95856 137468 141585 -16380 -188089 -26569 202243 308372 228257 -36241 -97656 12415
844 12415 -35461 64951 -15220 -32052 -167591 -110415 -54033 -47503 -37256 38698 72234 -110633
832 -110633 -184478 -269477 -144921 30321 152641 147553 193266 119576 165279 94763 232095
821 232095 349002 227566 117805 87064 119566 126865 160284 33394 94268 106862 -53337
810 -53337 -74381 -73039 -22955 13649 115868 240937 35185 -54214 -66 1951 87391 85891
798 85891 73377 187110 123661 -22104 226012 241499 274407 247936 199640 66697 -87629
787 -87629 52252 -15613 135030 162808 174002 171114 116081 147684 187561 71872 25490 15332
775 15332 -103960 -132927 -79898 7135 -10630 -53037 -23521 90813 117606 -28614 -209251
764 -209251 -335558 -273557 -36346 215914 21904 -9724 83567 139982 -28725 -128736 -6716
753 -6716 56885 -76844 15760 18181 -19980 -132191 -274350 -4485 25822 -83090 156697
742 156697 347891 77464 122285 -29281 69360 70540 84632 37936 -86541 -47874 -30503
731 -30503 124164 252039 360968 213729 156195 255806 196797 354453 230992 313953 52106
720 52106 -61202 22158 232546 204859 161398 169670 34639 -94993 64496 109920 93595
709 93595 321550 222448 190728 63633 -13941 62943 123515 140066 179931 171821 268804 130229
697 130229 112229 -23419 103928 107212 -118427 -148702 181975 38298 -4278 70190 114609
686 114609 144616 105330 90603 8823 -57246 -116566 -165651 -183540 38667 71038 19551 -65116
674 -65116 -25963 43262 123594 166183 164494 154294 191796 339099 240602 -19782 -133935 88610
662 88610 51251 50684 296664 339302 152648 116371 -136069 -186704 198045 52014 -188826
651 -188826 -206067 -41862 124611 166301 74135 172242 -1596 36574 143259 140290 18683
640 18683 275620 292410 45941 -41219 67858 222702 231115 21823 28140 307701 148667
629 148667 41969 201589 94123 -27926 -28056 -23045 80873 -88951 104955 22223 149581
618 149581 219637 69166 -63190 25095 36929 -64905 59984 -64336 -322813 -65546
608 -65546 197062 109336 167009 90113 192391 155457 -5419 77212 97291 75067 159492
597 159492 171895 -1539 -73383 -106164 -41011 89522 -58073 31334 -119232 -17975 125449
586 125449 252960 396916 -43981 -63291 7689 5711 -165729 -157897 -99172 -114026 3175
575 3175 177207 56195 -34047 50897 41889 77778 163781 242993 256858 67845 88835 246772
563 246772 13384 -122793 -146822 -84437 153845 200289 224469 144724 83126 72073 -85260
552 -85260 102061 129157 85937 290777 104224 -20167 60541 87392 260925 274275 9861
541 9861 -96899 207516 200559 169519 84930 62933 181766 113371 162956 13487 -52864 -37599
529 -37599 -5467 32855 80571 41930 -34962 98822 -141916 196942 326775 300890 136016
518 136016 41163 90423 -70467 54598 -18947 -8310 215893 337407 269830 89055 38080
507 38080 212512 123034 65347 179560 44115 24548 187092 182250 205710 40678 70874
496 70874 38217 15582 29419 215679 30237 109565 131940 107910 127138 9675 171794
485 171794 224984 334468 141536 63241 321083 238515 33242 155217 267605 311213 68403
474 68403 -49430 231117 536931 310899 129499 -95165 -121131 158603 153115 -18127 134752
463 134752 196555 146747 176589 187813 174922 21113 -25875 -22164 1992 25396 -89871 -3811
451 -3811 104421 292159 398792 250534 65063 -12724 5598 -50876 -36182 -52282 13515
440 13515 130080 91847 130059 -112417 -43759 -20800 -84273 58645 73234 -3605 104979
429 104979 -53772 -197298 -53778 -49006 -9746 -242446 -89409 12850 -81788 -270648 -141719
418 -141719 -83177 -39176 -86357 -118645 129668 130801 28902 -16833 -216488 -211064 -93349
407 -93349 83995 179630 33358 207334 100104 122241 130330 156753 -46321 -180401 -82081
396 -82081 -109295 -105732 -219130 -182423 -133185 99682 293929 111815 -52134 114056 96409
385 96409 -57181 63687 66325 175320 279115 108489 36501 -147625 189952 272867 -26104
374 -26104 199437 124255 -144305 -70781 -55441 -2277 -139450 -52276 -131763 -83910 -178251
363 -178251 -118420 -100296 -56085 -116068 -182839 -94896 -298960 -424940 -399476 -259969 -6207
352 -6207 -44166 -8635 211699 210172 160475 -25954 23384 155293 184600 -98033 -237634
341 -237634 -54304 64418 14966 299323 343735 -11741 -52124 -106575 20280 -25675 -60467
330 -60467 -24853 69290 300943 125146 91133 -31257 -136907 -150960 -37231 -38010 78406
319 78406 3062 -1594 107052 139455 263858 164174 121394 130929 91731 206162 -22837 -43136
307 -43136 -85631 -147543 64077 177897 143667 204053 173267 80952 145942 215808 48897
296 48897 92640 65205 236332 442584 279525 133274 53278 -110704 -115805 161838 22346
285 22346 -44249 -134615 -111495 114130 13745 -150478 -31776 68562 25240 86894 86414
274 86414 -99773 -248177 -277244 -199270 -78186 -169017 -234811 51007 11214 51720 173109
263 173109 8177 -110125 42872 34690 10832 94016 58389 222074 -67353 -261608 -347414
252 -347414 -70078 90529 -14219 -139732 -118146 -92191 -34626 -76208 -184161 -69708 57623
241 57623 64581 -80102 -107685 -34531 -8843 -6126 86270 -51832 -4010 73887 -26269 -216907
229 -216907 -136693 -182433 904 63429 -48880 -138037 -161087 -155276 -14646 -95935 -30983
218 -30983 10521 -31458 -31819 43651 145015 17352 -146663 45554 230929 -3597 -175286
207 -175286 -8668 83069 118989 129022 50086 140044 222086 -34881 -65445 -35321 42284
196 42284 38888 -169541 -38318 20776 -63166 -81535 -63850 -18926 51551 -62178 -127976 54394
184 54394 156896 117464 41188 48881 291246 262273 138856 15624 27391 -80405 -85942
173 -85942 12614 100394 188540 177472 -118180 -185773 967 -100582 -89506 50636 150041
162 150041 59288 -63637 -61337 -112099 -65795 97093 150396 82634 15433 101221 -93406
151 -93406 -189967 -131690 -31967 19741 -58992 -73319 -66614 37337 25404 10239 -26568 -10093
139 -10093 -63087 172966 187020 238840 133021 158673 87859 4254 117831 68541 -77075
128 -77075 -100083 -54657 6085 17512 62063 145578 67773 173433 43847 -63002 -134527
117 -134527 -52007 22282 -8365 -142187 -95798 157625 178058 92557 113839 49613 108462
106 108462 26690 131641 143703 36967 10263 33790 55473 75618 22187 -222017 -211054
95 -211054 -163373 -106612 -99992 -24551 -82089 -29511 95232 -106925 -112814 -38219 -43377 -28059
83 -28059 5492 4411 19099 76713 11086 -63206 -190845 25096 35284 -39514 -5791 -41800
71 -41800 -14858 4565 113196 42072 99070 148162 128510 124283 27691 -121134 -71738 -39768
59 -39768 -36465 20831 76684 -27752 -109871 -50181 13635 21878 -15918 -76853 -122502 -46155
47 -46155 -111218 53439 216013 187355 7532 -42155 -29303 -102945 -74492 -106755 -67995 -123595
35 -123595 -108318 -32093 -158361 -204907 -49523 -7253 -132315 -142589 56012 15221 103784
24 103784 63627 6987 -42101 -1491 30654 -34257 95196 224710 163509 -96180 -142963
13 -142963 -40917 84170 -62819 -19898 -73083 -30709 88623 -4805 -21130 136587 64328
2 64328 92938 105243
0 105243
$$ Imaginary data points
##PAGE= N=2
##DATA TABLE= (X++(I..I)), XYDATA
16383 -5052274 -5044117 -4942238 -4950936 -4838582 -4816086 -4664915 -4535628 -4432840 -4392250 -4301817 -4349174
16372 -4349174 -4163435 -4023696 -4011627 -3986445 -3861255 -3706830 -3596803 -3639599 -3578562 -3478453
16362 -3478453 -3471446 -3399285 -3208061 -3090709 -3087195 -2974730 -2882373 -2870626 -2682123 -2737313 -2712632
16351 -2712632 -2463358 -2210523 -2229272 -2159940 -2110717 -2192451 -2097736 -1967954 -1861368 -1924510
16341 -1924510 -1687236 -1528886 -1440832 -1240517 -1183788 -1266355 -1228062 -1174442 -1018611 -958161
16331 -958161 -870538 -686119 -730272 -726796 -651030 -525870 -517094 -505267 -507642 -420694 -403629 -328628
16319 -328628 -168919 -194343 6364 87861 200395 292085 305578 359935 358310 450292 666117
16308 666117 754012 752113 756981 779523 876588 897560 879547 1061837 1094850 1288889 1360881
16297 1360881 1317941 1378471 1418812 1422990 1607332 1630430 1711156 1737311 1909689 2022488 1998418
16286 1998418 2025904 1928017 1909339 2194394 2162254 2133468 2216942 2425617 2638970 2585144 2782513
16275 2782513 2703965 2807049 2814456 2884030 3103459 3174327 2983246 2889179 2936131 2855825 3250651
16264 3250651 3559307 3251042 3271954 3466837 3416860 3597282 3626723 3638681 3548170 3719891
16254 3719891 3916583 3786265 3941151 3892515 4085109 4105323 4018942 4085074 4165597 4203031
16244 4203031 4063403 4185870 4384572 4549961 4603605 4591538 4647153 4589977 4514065 4572330
16234 4572330 4783677 4704522 4653527 4726731 4768277 4764312 4923447 4981008 4943423 5023540 5030427
16223 5030427 5063237 5129688 5165393 5258749 5258247 5285178 5335034 5350554 5342975 5401884 5304054 5215387
16211 5215387 5482585 5619655 5691519 5674383 5534901 5651919 5734126 5547074 5744060 5856517
16201 5856517 5784711 5754214 5978102 6153057 6045895 5985680 5928823 5909002 6074890 6054538
16191 6054538 6164303 6308162 6236238 6106547 6211810 6262196 6254586 6314768 6323917 6470821 6461185
16180 6461185 6434201 6595038 6508247 6347473 6598008 6503425 6354061 6348823 6501702 6423286
16170 6423286 6579525 6577236 6599995 6701561 6648090 6778691 6736221 6682901 6627263 6733090 6555772
16159 6555772 6628132 6897367 7022920 6875570 6770713 6853902 6825338 6729650 6777451 7034108
16149 7034108 6966010 6905906 6950725 6995584 7004412 6827804 6928693 6908984 6945718 7075439 7031906
16138 7031906 6953536 6994671 7152508 7250709 7118611 7100784 7303391 7310888 7303204 7083161 7095058
16127 7095058 7056902 7058193 7067869 7050267 7194223 7315040 7400042 7415660 7205677 7306640 7308909
16116 7308909 7453102 7351455 7239205 7451550 7468170 7395361 7433949 7490033 7405613 7321247
16106 7321247 7207089 7227350 7361980 7293145 7322190 7392768 7364357 7396766 7285624 7297543 7391727
16095 7391727 7445639 7258284 7527783 7540296 7370812 7518437 7515450 7376119 7447308 7542543
16085 7542543 7524761 7572047 7471301 7523591 7669902 7703035 7717005 7393994 7356759 7576349
16075 7576349 7540479 7466464 7668645 7545712 7652196 7767478 7906206 7693567 7396801 7349828
16065 7349828 7345140 7413258 7537757 7639833 7734723 7593322 7507856 7684351 7799237 7719372
16055 7719372 7481829 7648597 7711624 7629150 7713605 7800338 7677642 7688375 7677057 7641308 7665866
16044 7665866 7742500 7821673 7844804 7706349 7633658 7599347 7627054 7764951 7771215 7690548 7749003
16033 7749003 7598486 7469004 7522783 7605480 7642576 7512588 7434402 7557493 7546130 7508889
16023 7508889 7608816 7588792 7716654 7636553 7688268 7609007 7589550 7824941 7822137 7718405 7650236
16012 7650236 7598392 7679574 7806232 7756361 7759635 7810706 7640278 7658212 7769844 7772698 7854132
16001 7854132 7776090 7882961 7868093 7823972 7885977 7632273 7641735 7710023 7747788 7894313 7996980
15990 7996980 7885644 7637851 7504989 7519636 7725597 7730835 7886840 7687898 7652773 7724893
15980 7724893 7719407 7691228 7780909 7829491 7817021 7914962 7822032 7732580 7578099 7595791 7793615
15969 7793615 7800509 7823915 7900337 7984795 7964013 8034754 7908995 7737969 7778592 7863422 7724059
15958 7724059 7778862 7691599 7563106 7442080 7504823 7681758 7792619 7871096 7812166 7590841
15948 7590841 7499808 7612550 7723714 7846429 7824542 7776835 7904494 7804985 7848982 7815316
15938 7815316 7714363 7744749 7795540 7729422 7638622 7636693 7782063 8043330 7866899 7753573
15928 7753573 7606140 7624109 7809473 7795889 7833665 7764373 7836985 8029384 7877914 7875312 7817479
15917 7817479 7754416 7674934 7843603 7956097 7822002 7633924 7717413 7633353 7607711 7683189
15907 7683189 7695727 7642501 7746206 7817626 7920896 7878591 7916364 7905051 7919120 7712725 7652093
15896 7652093 7684776 7673289 7721784 7753218 7971369 7936573 7833188 8042648 7750235 7805092
15886 7805092 7672190 7639356 7732642 8010838 7912192 7732271 7741900 7670300 8039295 7922980
15876 7922980 7831579 7778212 7814692 8064133 8042830 8037589 8070500 7909503 7892248 7770940 7849687
15865 7849687 8045873 7993764 7919483 7904368 8026682 7939689 7887268 7929991 7777247 7848590 7795194
15854 7795194 7818262 7710502 7914282 7836195 7926689 7868744 7838298 7614065 7502701 7667477
15844 7667477 7796166 7741871 7769016 7808340 7761026 7794167 7790508 7834827 7953605 7953454 7806857
15833 7806857 7686707 7665555 7844491 7885958 7836777 7919424 7977565 7851179 7701896 7582238
15823 7582238 7871707 7990572 7929405 7954912 7830594 7788696 7989164 7909198 7979039 7881773
15813 7881773 7987138 8120199 8021387 7981749 8187797 8124438 7904458 7870483 7915142 7959089
15803 7959089 7925452 7836778 7654583 7809383 8011967 8070444 7847755 7840519 7670961 7527021
15793 7527021 7604577 7879495 7997485 7950130 7952192 8078330 8065170 8036843 7913474 8040907
15783 8040907 7967001 7953947 8151342 8124584 8068964 8114903 7979236 7878459 7981431 8103862
15773 8103862 7938683 7983906 8069549 8017889 8077146 8199612 8167443 8105802 8084877 7903942 8057025
15762 8057025 7916672 7802011 7820182 7781032 7889142 7860186 7794852 7915247 8013141 8013005 7899011
15751 7899011 7799388 7911019 7809022 7565676 7745385 7841717 7970699 8034256 7935274 7951266
15741 7951266 7934826 8060548 8084063 7946092 8060121 8079606 8153424 8152372 8102887 8053155 8073667
15730 8073667 7896516 7603851 7588936 7652071 7813172 8000016 8022635 8001325 7996780 7728425
15720 7728425 7794137 8057440 7948285 7893124 7774179 7914061 7919735 8184314 8185049 8150444 8163011
15709 8163011 8045303 8002111 7967285 7806246 7903807 7964203 8027672 7902189 7973625 7700713
15699 7700713 7764081 8110748 7818664 7845668 8059216 7889389 7876499 7933954 7848588 7992727
15689 7992727 7919156 7947758 8036235 8031717 8018587 8047773 7865156 7713687 8024604 8101960 7968005
15678 7968005 8064442 8056637 8221082 8111052 8301971 8139156 7872984 7914428 7939298 8126160
15668 8126160 8206365 8243726 8490558 8443361 8238662 7893176 7967432 8082457 7985020 8055428
15658 8055428 8139803 8217827 8269732 8260008 8102496 8184086 8267153 8045337 8067019 8225347 8065287
15647 8065287 7902700 8001486 8124854 8106827 8127412 8114446 8096950 8260394 8161734 8113901 8217100
15636 8217100 8120493 8048951 7909649 7985969 8256971 8035780 7688202 7730172 8045077 8049964
15626 8049964 7813361 7834808 7976609 7877368 8001511 7905133 7859487 7877187 7966725 8184521
15616 8184521 8199983 8259881 8151659 8013325 7844615 8014162 8094000 7860083 7765169 7953679
15606 7953679 8269199 8356814 8071486 8186571 8346385 8191509 8063614 8323225 8314063 8241483
15596 8241483 8404119 8341573 8084235 8242132 8319372 8172018 8133496 8130368 8068484 8082167 8205674
15585 8205674 8210083 8191378 8250216 8301271 8207425 8210638 8198321 8196701 8346303 8416901 8121268
15574 8121268 8172496 8112691 8127564 8098124 8102057 8139717 8096822 8085045 8129260 8191648 8237354
15563 8237354 8208871 8230589 8201965 8255889 8233685 8199003 8131234 8186589 8096609 8023735 8149284
15552 8149284 8199501 8076893 8246160 8153731 8137187 8187161 8056296 8253723 8264472 7974124
15542 7974124 8031447 8145915 8052336 8103961 8210436 8304178 8205686 8178113 8033609 8256528
15532 8256528 8277304 8139389 8274507 8329414 8200898 8275591 8148192 8073441 8048853 8095409
15522 8095409 8007441 7996916 7955416 8027004 7959014 8265791 8328371 7937442 7913091 8220404 8115456
15511 8115456 7962917 8063588 8021413 7988313 8094332 8059104 8003935 7873591 8130622 8047659
15501 8047659 8052694 8259547 7958587 8164145 8326290 8303800 8278795 8296336 8261542 8157132
15491 8157132 8181547 8179755 8211406 8303700 8331242 8258818 8381391 8392445 8273873 8149915 8046499
15480 8046499 8129804 8277526 8218724 8176150 8238284 8265588 8179873 8243112 8303896 8251572 8144741
15469 8144741 7828498 7985628 8173059 8263101 8184117 8273123 8285701 8339063 8380035 8308152 8039351
15458 8039351 8125408 8293325 8299412 8147382 7997793 8089171 8206028 8109169 8480727 8362750
15448 8362750 8116573 8087038 7961442 8335685 8526688 8374555 8172802 8148587 8100823 8064318
15438 8064318 8149806 8160077 8244992 8216068 8243277 8268586 8298211 8402771 8526401 8483983 8153150
15427 8153150 8117948 8129661 8119689 8198880 8101350 8041426 8175781 8142169 8220186 8220963 8226191 8075650
15415 8075650 8091565 8123926 8341111 8313976 8372876 8337062 8233235 8393100 8308360 8259711 8139042
15404 8139042 8105244 8075672 8106405 8292522 8468887 8273856 8199183 8403589 8380707 8150464
15394 8150464 8327312 8465025 8419936 8167354 8229222 8402133 8533557 8249665 8172955 8306445
15384 8306445 8238753 8384902 8297108 8253096 8108854 8163202 8210278 8079504 8246172 8276809
15374 8276809 8277346 8240800 8314111 8208789 8304002 8419227 8301277 8266726 8310089 8328067 8296257
15363 8296257 8269506 8315635 8296321 8328503 8495764 8460772 8338571 8223571 8274279 8176835 8324676
15352 8324676 8325503 8169037 8305044 8309750 8293344 8442123 8230234 8282712 8213738 8309310 8364773
15341 8364773 8162176 8059027 8173731 8329421 8281341 8301292 8417042 8482362 8564834 8592307
15331 8592307 8354865 8484606 8301114 8186926 8410142 8367823 8287367 8304529 8324296 8155946
15321 8155946 8090132 8251137 8200086 8122886 8157728 8292144 8306469 8337242 8437021 8485020 8659097
15310 8659097 8493526 8326194 8545140 8438227 8323103 8597073 8608156 8610407 8468246 8548254
15300 8548254 8551342 8363356 8645161 8567603 8430716 8415202 8280271 8472409 8439504 8505472
15290 8505472 8416240 8259699 8437323 8580572 8471738 8448205 8385244 8388810 8504965 8531501
15280 8531501 8378971 8267608 8296955 8254896 8368439 8577804 8640329 8594453 8439874 8636299
15270 8636299 8596850 8368033 8239269 8448894 8438000 8339879 8592766 8597290 8511323 8482396 8547572
15259 8547572 8454939 8427832 8492481 8440187 8202758 8190901 8364663 8344638 8532240 8460516 8455723
15248 8455723 8377640 8400624 8498101 8418892 8378716 8434372 8465870 8332966 8398982 8393334 8350945
15237 8350945 8550833 8536860 8373047 8590599 8611929 8721115 8655709 8514667 8407457 8400505
15227 8400505 8380001 8513322 8459630 8536314 8436209 8571529 8661662 8558994 8430727 8678665
15217 8678665 8830435 8734209 8849068 8761094 8570970 8506713 8436002 8496757 8385412 8368585
15207 8368585 8449703 8526468 8473494 8593351 8678305 8426312 8546549 8556469 8588048 8633095 8389437
15196 8389437 8610406 8689156 8648777 8432051 8352919 8644020 8453012 8422982 8465740 8400007
15186 8400007 8548614 8559366 8606480 8516318 8378891 8424869 8399738 8514684 8473203 8480921 8231073
15175 8231073 8460436 8480424 8617982 8730027 8709796 8537322 8426543 8386345 8417368 8607727
15165 8607727 8706882 8654294 8351121 8363253 8521222 8688940 8372939 8318718 8460750 8651533
15155 8651533 8476779 8538510 8453717 8410682 8321269 8324254 8506296 8761569 8772659 8459210 8671069
15144 8671069 8626388 8578976 8567294 8653181 8516489 8366047 8513812 8485608 8497446 8496641 8432390
15133 8432390 8500718 8467635 8542199 8495509 8436950 8463300 8708672 8632801 8365160 8546105 8631305
15122 8631305 8580730 8836679 8645432 8460921 8497945 8572788 8498646 8612807 8639508 8433708
15112 8433708 8435940 8408195 8703767 8759220 8743678 8697595 8558634 8476423 8472954 8392390 8592430
15101 8592430 8510539 8604148 8775267 8710830 8887637 8520371 8349859 8502468 8530241 8567624
15091 8567624 8509204 8603740 8734021 8615906 8612975 8596390 8651647 8571317 8699287 8577027 8874540
15080 8874540 8783332 8600755 8630301 8540588 8627524 8473999 8376971 8372050 8437024 8683354 8764089
15069 8764089 8554961 8558723 8696139 8877687 8509678 8354033 8595687 8652907 8813865 8605580
15059 8605580 8684347 8692759 8561608 8583220 8682109 8680050 8551534 8386401 8400679 8633711 8874764
$$ [...]
##END NTUPLES=NMR SPECTRUM
##END=
