##TITLE=1H_CG-1201-2
 CDCl3
 8 sc, 
 5.4.2024
##JCAMPDX= 6.0         $$ Bruker NMR JCAMP-DX V2.0
##DATA TYPE= NMR SPECTRUM
##DATA CLASS= NTUPLES
##ORIGIN= UXNMR, Bruker Analytische Messtechnik GmbH
##OWNER= root
$$ XWIN-NMR		Version 3.5
$$ Fri Apr  5 14:16:36 2024 Russian Standard Time (UT+4h)  she@DPX200
##.OBSERVE FREQUENCY= 200.1309
##.OBSERVE NUCLEUS= ^1H
##.ACQUISITION MODE= SIMULTANEOUS
##.ACQUISITION SCHEME= undefined
##.AVERAGES= 8
##.DIGITISER RES= 18
##SPECTROMETER/DATA SYSTEM= spect
##.PULSE SEQUENCE= zg30
##.SOLVENT NAME= MeOD
##.SHIFT REFERENCE= (INTERNAL, MeOD, 0, 15.6423)
##AUDIT TRAIL= $$ (NUMBER, WHEN, WHO, WHERE, WHAT)
$$ ##TITLE= Audit trail, XWIN-NMR		Version 3.5
$$ ##JCAMPDX= 5.01
$$ ##ORIGIN= Bruker BioSpin GmbH
$$ ##OWNER= she
$$ F:/spectra/data/she/nmr/H-F/1/pdata/1/auditp.txt
$$ ##AUDIT TRAIL=  $$ (NUMBER, WHEN, WHO, WHERE, WHAT)
(   1,<2024-04-05 14:15:20.29 +0400>,<she>,<DPX200>,
      <created by zg, POWCHK disabled, PULCHK disabled
       configuration hash MD5:
       00 E9 B6 7A A2 85 ED C7 34 08 36 98 17 FE 4E 26
       data hash MD5: 16K
       EE 68 AE 49 09 9B 91 59 FE D8 5C EF 24 6F A1 01>)
(   2,<2024-04-05 14:15:22.98 +0400>,<she>,<DPX200>,
      <Start of raw data processing
       efp BC_mod = 2 LB = 0.24 FT_mod = 6 PKNL = 1 PHC0 = -25453.84 PHC1 = 8.58731 SI = 16K 
       data hash MD5: 16K
       4B 78 7E 77 CE 23 25 2C 07 B8 DC 6B A8 CC D7 BE>)
(   3,<2024-04-05 14:15:43.21 +0400>,<she>,<DPX200>,
      <pk PHC0 = 156.4606 PHC1 = 2.4 
       data hash MD5: 16K
       A8 E0 39 83 29 8E A0 C4 E3 4F 16 0C E6 4B BD 7D>)
(   4,<2024-04-05 14:15:46.31 +0400>,<she>,<DPX200>,
      <abs ABSG = 5 
       data hash MD5: 16K
       A5 33 E8 08 FE 69 35 46 96 2A 7E A0 3D E1 CB 11>)
$$ ##END=
$$ 
$$ hash MD5
$$ B0 5C 59 0C 74 CD B2 36 E2 CF 9C 07 20 2E 6B 83
##$RELAX= 
##$RELAX= 
##$RELAX= 
##$RELAX= 
##$RELAX= 
##$RELAX= 
$$ Bruker specific parameters
$$ --------------------------
##$DU= <F:/spectra>
##$EXPNO= 1
##$NAME= <H-F>
##$PROCNO= 1
##$TYPE= <nmr>
##$USER= <she>
##$AMP= (0..31)
100 100 100 100 100 100 100 100 100 100 100 100 100 100 100 100 100 100 
100 100 100 100 100 100 100 100 100 100 100 100 100 100 
##$AQSEQ= 0
##$AQ_mod= 1
##$AUNM= <au_zg>
##$AUTOPOS= <>
##$BF1= 200.13
##$BF2= 200.13
##$BF3= 200.13
##$BF4= 200.13
##$BF5= 200.13
##$BF6= 200.13
##$BF7= 200.13
##$BF8= 200.13
##$BYTORDA= 1
##$CFDGTYP= 0
##$CFRGTYP= 5
##$CHEMSTR= <none>
##$CNST= (0..31)
1 1 145 1 1 1 1 1 1 1 1 1 1 1 1 1 1 1 1 1 1 1 1 1 1 1 1 1 1 1 1 1 
##$CPDPRG= <>
##$CPDPRG1= <>
##$CPDPRG2= <>
##$CPDPRG3= <>
##$CPDPRG4= <mlev>
##$CPDPRG5= <mlev>
##$CPDPRG6= <mlev>
##$CPDPRG7= <mlev>
##$CPDPRG8= <mlev>
##$CPDPRGB= <>
##$CPDPRGT= <>
##$D= (0..31)
0 1.2 0 0 0 0 0 0 0 0.06 0 0.03 0 0 0 0 0.0002 0 0 0 0 0 0 0 0 0 0 0 0 
0 0 0 
##$DATE= 1712312120
##$DBL= (0..7)
120 120 120 120 120 120 120 120 
##$DBP= (0..7)
150 150 150 150 150 150 150 150 
##$DBP07= 0
##$DBPNAM0= <>
##$DBPNAM1= <>
##$DBPNAM2= <>
##$DBPNAM3= <>
##$DBPNAM4= <>
##$DBPNAM5= <>
$$ [...]
##$SUBNAM3= <"">
##$SUBNAM4= <"">
##$SUBNAM5= <"">
##$SUBNAM6= <"">
##$SUBNAM7= <"">
##$SUBNAM8= <"">
##$SUBNAM9= <"">
##$SW= 18.0517689322627
##$SWIBOX= (0..15)
0 0 2 0 0 0 0 0 0 0 0 0 0 0 0 0 
##$SW_h= 3612.71676300578
##$TD= 16384
##$TD0= 1
##$TE= 0
##$TE2= 300
##$TE3= 300
##$TEG= 300
##$TL= (0..7)
0 120 120 120 120 120 120 120 
##$TP= (0..7)
150 150 150 150 150 150 150 150 
##$TP07= 0
##$TPNAME0= <>
##$TPNAME1= <>
##$TPNAME2= <>
##$TPNAME3= <>
##$TPNAME4= <>
##$TPNAME5= <>
##$TPNAME6= <>
##$TPNAME7= <>
##$TPOAL= (0..7)
0.5 0.5 0.5 0.5 0.5 0.5 0.5 0.5 
##$TPOFFS= (0..7)
0 0 0 0 0 0 0 0 
##$TUNHIN= 0
##$TUNHOUT= 0
##$TUNXOUT= 0
##$USERA1= <user>
##$USERA2= <user>
##$USERA3= <user>
##$USERA4= <user>
##$USERA5= <user>
##$V9= 5
##$VALIST= <valist>
##$VCLIST= <CCCCCCCCCCCCCCC>
##$VD= 0
##$VDLIST= <DDDDDDDDDDDDDDD>
##$VPLIST= <PPPPPPPPPPPPPPP>
##$VTLIST= <TTTTTTTTTTTTTTT>
##$WBST= 1024
##$WBSW= 4
##$XGAIN= (0..3)
0 0 0 0 
##$XL= 0
##$YL= 0
##$YMAX_a= 675230
##$YMIN_a= -798285
##$ZGOPTNS= <>
##$ZL1= 120
##$ZL2= 120
##$ZL3= 120
##$ZL4= 120
##$ABSF1= 15.72819
##$ABSF2= -2.323699
##$ABSG= 5
##$ABSL= 3
##$ALPHA= 0
##$AQORDER= 0
##$ASSFAC= 0
##$ASSFACI= 0
##$ASSFACX= 0
##$ASSWID= 0
##$AUNMP= <proc_1d>
##$AZFE= 0.1
##$AZFW= 0.1
##$BCFW= 0
##$BC_mod= 2
##$BYTORDP= 0
##$COROFFS= 0
##$CY= -3
##$DATMOD= 1
##$DC= 0
##$DFILT= <>
##$DTYPP= 0
##$F1P= 0
##$F2P= 0
##$FCOR= 1
##$FTSIZE= 16384
##$FT_mod= 6
##$GAMMA= 0
##$GB= 0
##$INTBC= 1
##$INTSCL= 3.70164e-10
##$ISEN= 128
##$LB= 0.24
##$LEV0= 0
##$LPBIN= 0
##$MAXI= 10000
##$MC2= 0
##$MEAN= 0
##$ME_mod= 0
##$MI= 1.114404
##$NCOEF= 0
##$NC_proc= -5
##$NLEV= 6
##$NOISF1= 3.799351
##$NOISF2= 2.8
##$NSP= 0
##$NTH_PI= 0
##$NZP= 0
##$OFFSET= 15.64225
##$PC= 1
##$PHC0= -25297.38
##$PHC1= 10.98731
##$PH_mod= 1
##$PKNL= yes
##$PPARMOD= 0
##$PSCAL= 0
##$PSIGN= 0
##$REVERSE= no
##$SF= 200.129575880486
##$SI= 16384
##$SIGF1= 3
##$SIGF2= 2
##$SINO= 5.538805
##$SIOLD= 16384
##$SREGLST= <1H.CDCl3>
##$SSB= 0
##$STSI= 16384
##$STSR= 0
##$SW_p= 3612.71676300577
##$SYMM= 0
##$S_DEV= 0
##$TDeff= 16384
##$TDoff= 0
##$TI= <>
##$TILT= no
##$TM1= 0
##$TM2= 0
##$TOPLEV= 0
##$USERP1= <user>
##$USERP2= <user>
##$USERP3= <user>
##$USERP4= <user>
##$USERP5= <user>
##$WDW= 1
##$XDIM= 16384
##$YMAX_p= 346880678
##$YMIN_p= -303420
$$ End of Bruker specific parameters
$$ ---------------------------------
##NTUPLES= NMR SPECTRUM
##VAR_NAME=  FREQUENCY,     SPECTRUM/REAL,   SPECTRUM/IMAG
##SYMBOL=    X,             R,               I
##VAR_TYPE=  INDEPENDENT,   DEPENDENT,       DEPENDENT
##VAR_FORM=  AFFN,          ASDF,            ASDF
##VAR_DIM=   16384,         16384,           16384
##UNITS=     HZ,            ARBITRARY UNITS, ARBITRARY UNITS
##FACTOR=    0.220516191357247, 1,           1
##FIRST=     3130.47687053147, 0,            0
##LAST=      -482.239892474298, 0,           0
##MIN=       -482.239892474298, -303420,     0
##MAX=       3130.47687053147, 346880678,    0
$$ Real data points
##PAGE= N=1
##DATA TABLE= (X++(R..R)), XYDATA
$$ [...]
7907A9697m5880J8258L5899R2877M959n0566n886k9446O1170O827o1469l047m0848
7894B545o3491p538O8886r57m6143j11440n0514L0570K4492J6799l4235k5093
7882a96119N2200P9558k3849n51Q8245J9909m1653k3763o421K2142k4182J7823
7870c6661K1672k5535r4175m095j9390p3530q664J9678K0175j0455P5278Q85m9241
7857a84058P447M2587N698l4147M3789k9562J4711L5935L2561K6659m787n2124
7845i5291n4248l9004L2148L8541q740l0027L6130J0401M040n6192o2074R829
7833b14487K3408N086K6043o8003Q669L5481K1749J3621M846L6031J8977o7319
7821a55898M4975M3139l0643j508l7312J8259J461n8446L4443M676r7815R7007
$$ plain form
7907 19697 -26183 -7925 27974 120851 125810 75244 69358 39912 101082 107909 46440 43393 2545
7894 2545 -60946 -68484 402 -555 -46698 -158138 -208652 -178082 -153590 -136791 -171026 -196119
7882 -196119 -143919 -64361 -88210 -88761 -516 19393 -22260 -46023 -52444 -30302 -54484 -36661
7870 -36661 -14989 -40524 -134699 -138794 -158184 -231714 -240378 -220700 -200525 -210980 -135702 -134817 -184058
7857 -184058 -176611 -134024 -128326 -162473 -118684 -148246 -133535 -97600 -65039 -38380 -43167 -95291
7845 -95291 -149539 -188543 -156395 -117854 -126594 -156621 -120491 -110090 -106050 -162242 -224316 -214487
7833 -214487 -191079 -185993 -159950 -227953 -219284 -183803 -162054 -148433 -143587 -107556 -88579 -155898
7821 -155898 -110923 -67784 -98427 -99935 -137247 -118988 -117527 -175973 -141530 -136854 -234669 -137662
7809a37662j4308k0170J072k265N7029j13910K6364N3729n2540m520N5602M253
7797a47326l9253n0235J4187P6406N0698m3340j4547M0734K5154P127q8211Q842
7785a59764N484J8093p5287m4195L1160R3911j0558j5040p3108K7694J4698L011
7773a83901K0278m3643N5912N4082L5303r620k4783j6779P783R928j1292j1927
7761a18659o550l2819j0003N3697l5725l1087k228o9021n1025K6672Q9679k8905
7749b15974K2121P1849l726L037k5698P769R507R708O611K3656l055J6493J2756
7736f4946k1102J8304N701l6336j7463J031l5617j5299p2568N9807N9120m4367
7724a63735j6891P484m9154N0763J223L9213K0397K6025L5239o0089O6945k0100
$$ plain form
7809 -137662 -151970 -172140 -171068 -173333 -116304 -230214 -203850 -150121 -202661 -207181 -151579 -147326
7797 -147326 -186579 -236814 -222627 -146221 -95523 -138863 -153410 -112676 -87522 -80395 -168606 -159764
7785 -159764 -154280 -136187 -211474 -255669 -224509 -130598 -141156 -156196 -229304 -201610 -186912 -183901
7773 -183901 -163623 -207266 -151354 -97272 -61969 -71589 -96372 -113151 -105368 -95440 -106732 -118659
7761 -118659 -125209 -158028 -168031 -114334 -150059 -181146 -183374 -252395 -303420 -276748 -187069 -215974
7749 -215974 -193853 -122004 -125730 -122693 -148391 -140622 -131115 -121407 -114796 -91140 -94195 -77702 -64946
7736 -64946 -86048 -67744 -62043 -98379 -115842 -114811 -150428 -165727 -238295 -178488 -119368 -163735
7724 -163735 -180626 -173142 -222296 -171533 -170310 -131097 -110700 -84675 -49436 -109525 -42580 -62680
7712f2680L5233L5988l4469k6003J2522o2114j0702P0677L2160k3486k9747m7698
7700a10319q224m7726K0231L8236k673l976J2268l3023L7082N598j4171M331n2742
7687a55108K687J5121m727O9688P0634J7368m6538l7460n6168l363J5568l9133
7675a51431j9309k2770k6887J8126N3868J1033m248O3154O8819l9136J5659l371
7663c6493J8670j2305J5053L763N0671J9241m7563m4301k9605l5659L1708o460
7651g3280n1943P024M3094r1366n3507k0703J8273K254L185J9408j3813J06846
7639a04528K7044m5998K4601O5516M5493o0454j6342k0195K1362o0053L3361j4404
7627a04597M8712o9299n198l9304l5357o82o206P8751K8263k8170m7288J7123
$$ plain form
7712 -62680 -27447 8541 -25928 -51931 -39409 -101523 -112225 -41548 -9388 -32874 -62621 -110319
7700 -110319 -118543 -166269 -146038 -107802 -110475 -114451 -102183 -135206 -98124 -92526 -106697 -102366 -155108
7687 -155108 -152421 -137300 -142027 -72339 -1705 15663 -30875 -68335 -124503 -127866 -112298 -151431
7675 -151431 -170740 -193510 -220397 -202271 -148403 -137370 -141618 -78464 -9645 -48781 -33122 -36493
7663 -36493 -17823 -30128 -15075 -11312 39359 58600 11037 -33264 -62869 -98528 -66820 -73280
7651 -73280 -125223 -118199 -75105 -166471 -219978 -240681 -222408 -220154 -216969 -197561 -211374 -104528
7639 -104528 -77484 -123482 -98881 -33365 12128 -48326 -64668 -84863 -63501 -123554 -90193 -104597
7627 -104597 -55885 -125184 -130382 -169686 -205043 -205725 -211931 -133180 -104917 -133087 -180375 -163252
7615a63252L3819P0170k8280N1928r925m6379k9664Q6496M9689K0609p8171p5802
7603a18762R9270P421J2116m2375o7507J694k6144J2234l6166J2002k4683k4283
7591a95183K5275R712N0858K0900K7805k47q4439K4436M7076R0985l8286o9346
7579i0454j0315K3051K8505n868L8763K698n4174j0700m9721O1580K4008n2023
7567i4650O0103j2201j2648o6322j3606N2001J5193j3435l0104L1673M0650L0257
7555a3089l9388O44r3873O5555O5531n5057k6942L8556N6163j7676m5412m1527
7543a06515O9036P144q8495m3728N6128n2348m6198L7472l0943M0627l3030K4347
7531a66503n7734R45J30169N0777m2596J2150o542N0850q930J5856j956N363M4752
$$ plain form
7615 -163252 -129433 -59263 -87543 -35615 -45540 -91919 -121583 -35087 14602 35211 -42960 -118762
7603 -118762 -19492 -12071 45 -42330 -109837 -108143 -134287 -122053 -158219 -146217 -170900 -195183
7591 -195183 -169908 -160196 -109338 -88438 -60633 -60880 -145319 -120883 -73807 17178 -21108 -90454
7579 -90454 -100769 -77718 -49213 -55081 -16318 -13620 -67794 -78494 -128215 -66635 -42627 -94650
7567 -94650 -34547 -46748 -59396 -125718 -139324 -87323 -72130 -85565 -115669 -83996 -43346 -13089
7555 -13089 -52477 -51833 -145706 -80151 -14620 -69677 -96619 -58063 -1900 -19576 -64988 -106515
7543 -106515 -37479 -30335 -118830 -162558 -106430 -158778 -204976 -167504 -198447 -157820 -190850 -166503
7531 -166503 -224237 -223292 -93123 -42346 -84942 -72792 -79334 -28484 -37414 -21558 -23514 -18151 26601
7518B6601j9262p4118q1347L6841K109k3990k6292k7070l7233M9287M7575k0627
7506a47526k4347m5101J5744M4121Q3272N1700j01420M4848M1876J5835m1441
7495f2439k9632L6577J8187m2442J7611j0698J4633J5061j0929o2720m247L1685
7483h9353k828q9258J8611N3784n2798J2667N3128j8396n9693O7164M0859J8439
7471d7674L5409K648k0444q1692J9060J3829q911k0402L5358n3154o9975l6687
7459b32635M304M355L9153j4905P787q196j7820K5988K1551M1177p6453n8193
7447b63887J04207P6779O466L7727l056k3646o9667K9189N8823J0074l2320L712
7435f5599P7572l1154p2926k3016r2579L6440J2080o4792m2359K6803L6228P168
$$ plain form
7518 26601 7339 -66779 -148126 -111285 -109176 -133166 -159458 -186528 -223761 -174474 -126899 -147526
7506 -147526 -171873 -216974 -201230 -157109 -73837 -22137 -123557 -78709 -36833 -20998 -62439
7495 -62439 -92071 -55494 -37307 -79749 -62138 -72836 -58203 -43142 -54071 -116791 -121038 -89353
7483 -89353 -92181 -181439 -162828 -109044 -161842 -149175 -96047 -114443 -174136 -106972 -66113 -47674
7471 -47674 -12265 -9617 -30061 -111753 -92693 -78864 -87775 -108177 -72819 -125973 -195948 -232635
7459 -232635 -228331 -223976 -184823 -199728 -191941 -200137 -217957 -191969 -170418 -129241 -205694 -263887
7447 -263887 -159680 -82901 -76435 -38708 -41764 -65410 -135077 -105888 -47065 -36991 -69311 -65599
7435 -65599 11973 -19181 -92107 -115123 -207702 -171262 -159182 -223974 -266333 -239530 -203302 -196134
7423a96134l8179l4894O3988P0500O3501K1371n399J4362n6989j5007M0501k2486
7411i4865Q584N1684m0614j15748l4430K8075r905J3202l1900m1755k333j1834
7399b81839R4101o1489O8889N1877j561m2054r221k447l6011P9968M5336K8243
7387f6208k1150J9829o9563l7105N7201m0702M799J9466r567j7114P044q370M795
7374a56645m6400l0970r171L7314O0837L2414m677p0702J03623N7307r609k4137
7362f0816K0191k3077M4028J3771j4358j9261K0668l2323J2383k6032l1564r69
7350i7359J1776Q919k7274q4244M8126O9783k2113j0602M5964K5174L045J8528
7338a0277j6551p603M5174M9998k6018K7785J8450l3347n8577l2752J3805p6545
$$ plain form
7423 -196134 -234313 -269207 -205219 -134719 -71218 -49847 -55246 -40884 -97873 -112880 -72379 -94865
7411 -94865 -86281 -34597 -75211 -190959 -225389 -197314 -207219 -194017 -225917 -267672 -270005 -281839
7399 -281839 -187738 -249227 -180338 -128461 -130022 -172076 -181297 -183744 -219755 -139787 -94451 -66208
7387 -66208 -87358 -67529 -137092 -174197 -116996 -157698 -152899 -133433 -143000 -160114 -153070 -161440 -156645
7374 -156645 -203045 -234015 -243186 -205872 -145035 -112621 -117298 -188000 -84377 -27070 -36679 -60816
7362 -60816 -40625 -63702 -19674 -5903 -20261 -39522 -18854 -51177 -38794 -64826 -96390 -97359
7350 -97359 -85583 -76664 -103938 -188182 -140056 -70273 -92386 -102988 -57024 -31850 -28805 -10277
7338 -10277 -26828 -34431 10743 60741 34723 62508 80958 47611 -10966 -43718 -29913 -106458
7326a06458P7827k959q0665l2713m5611Q6005l2486J5536L9338m4496L5408J2561
7314g8713J8285R1405o7690K1449Q1815q6467K6827k9823O3278N5302r466j968
7302H4234J021l8164J2409j6429n0301p8671n6381N1866K5214j6113r562O5383
7290b5494P520P258k5105N5796o231k1775M0599L8447l9623L7554J5806j8871
7278F5881m6401o980L7421l3403J0638j1156k3542l8931l45N318l620j7859m2411
7265a05390j9940M431M1533o743O6539K525L4556J5337q108o215P1658p7067o42
7252A2474J0722N4313M859P560m8759P175q0556J1338j9999j5936k9196m6339
7240a32344n194j7215M374L5332P5735m5366N1310p0134J6830l1407L4120L6451
$$ plain form
7326 -106458 -28631 -31590 -112255 -144968 -190579 -104574 -137060 -121524 -82186 -126682 -91274 -78713
7314 -78713 -60428 30977 -36713 -15264 66551 -19916 6911 -22912 40366 95668 86202 84234
7302 84234 85255 47091 59500 43071 -7230 -85901 -142282 -90416 -65202 -81315 -90877 -25494
7290 -25494 -17974 -10716 -35821 19975 13744 -8031 32568 71015 31392 68946 84752 65881
7278 65881 19480 12500 49921 16518 27156 16000 -7542 -46473 -46818 -41500 -45120 -62979 -105390
7265 -105390 -125330 -120899 -79366 -86109 -19570 -17045 17511 32848 24740 18525 90183 13116 12474
7252 12474 23196 77509 82368 89928 41169 48344 -32212 -20874 -40873 -56809 -86005 -132344
7240 -132344 -137538 -154753 -150379 -115047 -39312 -84678 -33368 -103502 -86672 -118079 -83959 -47508
7228d7508L8008K7990m341o986l7258n764J8576m815o1090n2809K5313Q244j2489
7215a14929p2370j0708l211k3337K9835J6617P6205L7591j9730l2027K6835O3643
7203b5586J4926k9764m3621j6488Q032Q1129L8849K3806r0439o1083j4872K4941
7191i0170J6642m7348o2372J2829L0692J4485R701l8933k1621M335J9866L9318
7179a12576r656k8176j6295O8092R3552L2259j0594k6580L8955l5693n1773j9159
7167g7644m4311k8929p9494L8862M6507K2448n3368q9083r320O2126L0475l8114
7155b19845l9004J5002n6421N2308M9938Q2599Q3937l0844n2677K0532Q6411p7294
7143h5358q718K4764K1908n5176o5099K6892J5324m4241j3303l0946m9417M4541
$$ plain form
7228 -47508 -9500 18490 14149 7163 -30095 -35859 -17283 -22098 -83188 -135997 -110684 -102440 -114929
7215 -114929 -187299 -198007 -201218 -224555 -194720 -178103 -101898 -64307 -84037 -116064 -89229 -25586
7203 -25586 -10660 -40424 -84045 -100533 -92501 -11372 27477 51283 -39156 -100239 -115111 -90170
7191 -90170 -73528 -120876 -183248 -170419 -139727 -125242 -115541 -154474 -176095 -171760 -151894 -112576
7179 -112576 -122232 -150408 -166703 -98611 -5059 27200 16606 -9974 28981 -6712 -58485 -77644
7167 -77644 -121955 -150884 -230378 -191516 -145009 -122561 -175929 -265012 -274332 -212206 -181731 -219845
7155 -219845 -258849 -243847 -300268 -247960 -198022 -115423 -31486 -62330 -115007 -94475 -8064 -85358
7143 -85358 -94076 -69312 -47404 -102580 -167679 -140787 -125463 -169704 -183007 -213953 -263370 -218829
7131b18829k2839L9124M038L5422m0218k0700k8855J658P2620N3606j3249p774
7119a45996N11l2339N3948k8165K8290m9528J4344O662r453j7411l6931m4513
7107b60581K5750L17k1156K0831L4851o3075L7218J9120k2326N6810L6935j3520
7095a48826J7270J580O2216k9755J1450L0024o9325r057P301M5141l138L30j6623
7082a01412q5771J4928q128j2583n750N4521Q355o2219M660O0804J885n5775k9443
7069b15928L4376N8194j4853M4637M0284O0689k1009j0908m3890N8001Q711p2020
7057g3716r444k2956p1118J6334J4187M1723n6097M1780k4288j8737j4115j6456
7045a92903Q7883q371Q7574L8743r6842K2051M0566J3761K8512l7995n2391m2063
$$ plain form
7131 -218829 -241668 -202544 -198506 -163084 -203302 -224002 -252857 -251199 -178579 -124973 -138222 -145996
7119 -145996 -145485 -177824 -123876 -152041 -123751 -173279 -158935 -152273 -161726 -179137 -216068 -260581
7107 -260581 -234831 -234514 -255670 -234839 -199988 -263063 -225845 -206725 -229051 -172241 -135306 -148826
7095 -148826 -131556 -129976 -67760 -97515 -86065 -56041 -125366 -134423 -127122 -81981 -85119 -84789 -101412
7082 -101412 -187183 -172255 -180383 -192966 -198716 -144195 -135840 -198059 -193399 -132595 -130710 -186485 -215928
7069 -215928 -181552 -123358 -138211 -93574 -53290 7399 -13610 -24518 -68408 -10407 -1696 -73716
7057 -73716 -83160 -106116 -177234 -160900 -146713 -104990 -161087 -119307 -143595 -162332 -176447 -192903
7045 -192903 -105020 -113391 -25817 12926 -83916 -61865 -21299 -7538 20974 -17021 -69412 -111475
7033a11475Q6219P998k1553N3611n9897p4484O1564n4086P142K4480l4609k0905
7021a35995N2091R4576P8206j2363N2684j5380O5425J22977N8619K1974J14960
7010D97774J1287O2194J3895J300m9204o5824J0449j07381r7890j14185q7322
6999G5093p9625o1377L1502k660l4871o8373j0413O9110j9602J9244l3840j014
6987a16826N68N4338j4511m0136P9071K5254J8677j6215j4357j3673k5096q206
6975g1112o4265O9012p278p1180l9619J8619j3380J6028K1255M6399q3282M7428
6963a31375P5647j0649M557R8271l8588N384l9603l260R352K8712j6818m4203
6951f2573L7072j7850R34o1336r805k7566k0694K3125K0083j0590J0400k8309
$$ plain form
7033 -111475 -25256 -17258 -38811 14800 -45097 -119581 -58017 -112103 -104961 -80481 -115090 -135995
7021 -135995 -83904 10672 88878 76515 129199 113819 179244 302221 360840 382814 497774
7010 497774 509061 571255 585150 586450 537246 471422 481871 374490 276600 162415 75093
6999 75093 -4532 -65909 -34407 -37067 -71938 -140311 -150724 -81614 -101216 -81972 -115812 -116826
6987 -116826 -116258 -61920 -76431 -116567 -37496 -12242 6435 -9780 -24137 -37810 -62906 -71112
6975 -71112 -135377 -66365 -73643 -144823 -184442 -165823 -179203 -163175 -141920 -95521 -178803 -131375
6963 -131375 -55728 -66377 -61820 36451 -2137 3247 -36356 -39616 -30264 -1552 -18370 -62573
6951 -62573 -25501 -43351 -42417 -103753 -113558 -141124 -161818 -138693 -118610 -129200 -118800 -147109
6939a47109J9005L930l1834L5762L3986K04K1017o430K5334K3034j7986M494L8996
6926B403k2487l380N569n4412N272K6589j7210l8515K0502M4490q6671P27l3737
6913a50860l1441Q517M3862N2467N4413K7463Q701q709K8002O1792k3879m7929
6901B2399k2831N7755N5115k719l0868r67m3212n631k2295p1472J2687l3713J1956
6888g3796N3594l2887l2325M4222J6969M393j4073P8953K2545J152L3201J8947
6876A20895L1786P051L5032K3901r978l580n7455M6071j4897p6406q887l0450
6864F3083p067L3758m823J29M1211m4175p815L7067L5098L4901M0798Q029k4691
6851B05503O5279J04760N0530k7104O182K7654j5949N3751m633N1477j8261l625
$$ plain form
6939 -147109 -128104 -124174 -156008 -120246 -86260 -86056 -65039 -71469 -46135 -23101 -41087 -36593 2403
6926 2403 -20084 -23464 -17895 -72307 -67035 -40446 -57656 -96171 -75669 -31179 -117850 -117123 -150860
6913 -150860 -182301 -173784 -129922 -77455 -23042 4421 13122 4413 32415 94207 70328 22399
6901 22399 -432 57323 112438 109719 78851 77884 34672 29041 6746 -64726 -52039 -85752 -73796
6888 -73796 -20202 -53089 -85414 -41192 -24223 -19830 -33903 45050 67595 68747 101948 120895
6876 120895 152681 159732 194764 218665 208687 205107 147652 193723 178826 102420 93533 63083
6864 63083 56016 89774 84951 85080 126291 82116 74301 111368 146466 181367 222165 230194 205503
6851 205503 270782 375542 426072 398968 405150 432804 416855 470606 465973 517450 499189 495564
6839D95564k0065p2176J6758j9977j3824l0797J2599L2327k2148J8582L1265M3028
6827D71136R6324N4993L5143K7641j6672J7608P6595L8808K888j4378j2641K6096
6815H03541M7984j9524r113J705K9638P2147n730M0114J4447P6288m2275n220
6803A004002J9005l197N6001K9150P9045N999k6319o433K8495L0692k4322p1170
6791A120948N6167j6667j01519L2010l2968J9699k5089o0780j9045n1730j09379
6780H11647K644j8009r0877p1128P6158M743l8189P84j1747N3324p1125m5652
6768F02573k650K8360L10o110l5259k0017r5272n8330m5817J4982n981m7501p3842
6755B55446o5758k2582P8239K182L804q8236K2915J0167l2882j2867K203M2897
$$ plain form
6839 495564 475499 403323 420081 400104 386280 355483 368082 400409 378261 396843 428108 471136
6827 471136 567460 622453 657596 685237 668565 686173 762768 801576 804464 790086 777445 803541
6815 803541 851525 832001 822888 824593 854231 926378 920648 960762 975209 1051497 1009222 1004002
6803 1004002 1023007 1019810 1075811 1104961 1184006 1190005 1163686 1157253 1185748 1216440 1192118 1120948
6791 1120948 1177115 1160448 1058929 1090939 1057971 1077670 1052581 991801 972756 921026 811647
6780 811647 814291 796282 705405 634277 710435 715178 676989 677773 666026 719350 648225 602573
6768 602573 599923 628283 628593 622483 587224 567207 471935 413605 367788 382770 376789 329288 255446
6755 255446 189688 167106 245345 247527 251331 163095 186010 196177 163295 150428 152631 195528
6743A95528j9869N784q3411J00229J4645N609k4180j7928J7313m6902K2060r2404
6731G6474o4767j4190m1945P3153K608n8751n1383n6205L9981L2529P9436R4841
6719A11781L732K4407o5801k2702l5151K2549O6266K5047K3756K9020p7806j1327
6707I3771N3663o8647o6400p477J1331L8045N7501o1025q5363j5027j0390j388
6695f1406J2039J2648n0986n379K6618N3040N1635K9885K0051j5777l2713K680
6683D2335K3504k5562J5095k2016K1815n4884k0517j0492r1342J3954O9497k8153
6671f6766j29640M4613O6489l0148M9455J5360K1713N1545n6868q712P0252O3980
6659I1273O857k8614p6842n0333M3772j2347j5362K0775n1480m9711o520j8563
$$ plain form
6743 195528 175659 181443 98032 198261 212906 218515 194335 176407 193720 146818 168878 76474
6731 76474 11707 -2483 -44428 28725 31333 -27418 -78801 -135006 -95025 -62496 16940 111781
6719 111781 115513 139920 74119 51417 16266 38815 105081 130128 153884 182904 105098 93771
6707 93771 147434 78787 12387 4910 16241 54286 111787 50762 -34601 -49628 -60018 -61406
6695 -61406 -49367 -36719 -87705 -93084 -66466 -13426 38209 68094 88145 72368 39655 42335
6683 42335 65839 40277 55372 33356 55171 287 -20230 -30722 -122064 -108110 -38613 -66766
6671 -66766 -196406 -151793 -85304 -115452 -65997 -50637 -28924 22621 -34247 -42959 27293 91273
6659 91273 98130 69516 -7326 -57659 -13887 -26234 -41596 -20821 -72301 -122012 -128532 -147095
6647a47095k2657J8112L1667m5809O302j944q33k0306J2754K6554K0343K6169
6635i6743K9084O9124K7664M0813k7040n9468j7960j582l778m9527R3659N2451
6623E6697k3178o4205n2879k5921K455M7472n7811l9031p610N3057Q536J3026
6611h9392M2069R32K5537N2549k6420m792M2442o8947K3272O7886k2023p2745
6599b9632J9331j6858M742O0769r4911m9576n5181J2833O0291l3587K6529k2994
6587a18244l7540Q9449l787L1527m343K7325J5117R7790K3377m1775K9201n264
6575A02833L4166l8453L4353k6862r1315n8814J0907r5397j6199j5689L0978M6284
6563h3208R62L655j8659m355K6794K4997P2245j6635J0651R756M8782J2386L704
$$ plain form
6647 -147095 -169752 -151640 -119973 -165782 -159480 -161424 -162257 -182563 -169809 -143255 -122912 -96743
6635 -96743 -67659 1465 29129 69942 42902 -16566 -34526 -36108 -39886 -89413 4246 56697
6623 56697 33519 -30686 -83565 -109486 -107031 -59559 -117370 -156401 -164011 -110954 -102418 -89392
6611 -89392 -47323 -46391 -20854 31695 5275 483 42925 -26022 -2750 65136 43113 -29632
6599 -29632 -10301 -27159 -22417 38352 -56559 -106135 -161316 -148483 -88192 -121779 -95250 -118244
6587 -118244 -155784 -66335 -70122 -38595 -42938 -15613 -496 97294 120671 78896 108097 102833
6575 102833 136999 98546 132899 106037 14722 -44092 -33185 -128582 -144781 -160470 -129492 -83208
6563 -83208 -82246 -78591 -97250 -101605 -74811 -49814 22431 5796 16447 26203 74985 87371 91075
6550I1075K6174J4204O0577m9759o0697o8177N6336k6868L5880N8161o3260j09317
6538c5671j1256p433m2n1270L1078P6284L5931k9014J8797N4969k736M5089Q4712
6525B09438j7911q9983J01088j035m2317M051R3425N381p1242J4583K6124j2500
6513B19102J5665l40l3338K5562k6188p540M0042J8552M0312N4345L873R6771
6501D46818N1697o028P2689P3312L298k5060J3080O952m8797l0598n6807k4559
6489D75997q4393r515p871l209m4237O186M763k2751L5872N5690j3610p940M475
6476C89457k6769m7317l7699Q6806Q407m1339J718q4434M9254L617q126O680m3569
6463B56686l5732l3384l9288j01104j4530P7431j4361n8790j9679q237N369l6731
$$ plain form
6550 91075 117249 131453 192030 142271 81574 13397 69733 42865 78745 136906 73646 -35671
6538 -35671 -46927 -54360 -54402 -105672 -74594 1690 37621 8607 27404 82373 79637 124726 209438
6525 209438 191527 101544 202632 201597 159280 163331 256756 262137 190895 205478 231602 219102
6513 219102 234767 234427 201089 226651 200463 192923 232965 251517 291829 346174 350047 446818
6501 446818 498515 492487 565176 638488 641786 616726 629806 636758 587961 557363 500556 475997
6489 475997 391604 382089 374218 371009 326772 332958 337721 314970 350842 406532 392922 384982 389457
6476 389457 362688 315371 277672 364478 372885 331546 333264 248830 298084 301701 293575 300255 256686
6463 256686 220954 187570 148282 47178 32648 110079 95718 36928 17249 9012 14381 -22350
6451b2350L2008L2302l2999J0260J29028m0665j4231J4062J3421l4506K327O1454
6439A50111j774P000J2731p9102L3012k6752k9168m6218k7911k5742K5283o6682
6427g5212O171M5054k7740j6406K1502M2540P7281J6557q113R094M079N6866K1682
6414A73355n3537L2992n2029n0408P1720L9015j09191q0320J6638l6407k7573
6403g5745R510m2203j9717K5404J8549K3308k8886L5569Q8442Q9897m9825M9928
6391A24231K3122l1400L2295N9382m8838p916n3718M9277j6166m6166M59j34536
6379d9974K2693O0199k4650m5746n9862j6214n894L1880K501R6392o515k4887
6367b0077O5720M4694N9356R096n866N9395l9714l8558m9860L3140K8945k2345
$$ plain form
6451 -22350 9658 41960 8961 19221 148249 107584 93353 107415 120836 86330 88657 150111
6439 150111 148337 155337 168068 88966 121978 95226 66058 19840 -8071 -33813 -8530 -75212
6427 -75212 -69041 -23987 -51727 -68133 -46631 -4091 73190 89747 81634 90728 94807 151673 173355
6414 173355 119818 152810 100781 50373 122093 161108 51917 -28403 -11765 -48172 -75745
6403 -75745 -66235 -108438 -128155 -102751 -84202 -60894 -89780 -54211 34231 124128 74303 124231
6391 124231 147353 115953 148248 207630 158792 150876 97158 146435 130269 84103 84562 -49974
6379 -49974 -27281 32918 8268 -37478 -97340 -113554 -119448 -87568 -85067 11325 4810 -20077
6367 -20077 45643 90337 149693 158789 152923 212318 172604 134046 84186 117326 146271 123926
6355A23926l9457p3651Q949j5526l5389j6225r266q62K4200j2178m4884M3581
6343d6782P2437j0801O88O8013O1599L3206Q4307l6030L4344L2563q309L9469
6331C24704K147n1086l8793n2874j1346L5004j8370q5084p1045K5218j8610j3842
6319B6023m1160M2713l0318J0565Q9971M2329j2766j4103N3533M7429m488L0243
6307B39971J9612K7218l0823p8882m3171J0534J17473j7751m5094l5515j5048
6296A48524q4868n4251P5001q197O930K1452k7624P577M1218M3433J7040N5168
6284B41403P473Q0233L5871o171M3591K6024N8176j049p987M2757N5842L2589
6272F08752N563k2949L5874m4008q9765q6739l0982j6163n6444k4806o5697l5070
$$ plain form
6355 123926 84469 10818 19767 4241 -31148 -47373 -56639 -57501 -33301 -45479 -90363 -46782
6343 -46782 25655 14854 15542 83555 145154 178360 262667 226637 260981 293544 285235 324704
6331 324704 326851 275765 236972 184098 172752 207756 189386 104302 33257 58475 39865 26023
6319 26023 -15137 27576 -2742 7823 97794 140123 127357 113254 166787 214216 209728 239971
6307 239971 259583 286801 255978 177096 133925 144459 261932 244181 199087 163572 148524
6296 148524 63656 9405 84406 76209 83139 104591 76967 84544 125762 169195 186235 241403
6284 241403 248876 329109 364980 358809 402400 428424 486600 485551 477564 520321 576163 608752
6272 608752 614315 591366 627240 583232 493467 406728 375746 359583 303139 278333 212636 177566
6260A77566L5261Q8675L6881r499J5187M0511L154k5773L8362P7467r6805k9047
6248C51940k561o9832M5472j339l4983J0379n4476m5368l6074P8197l8869J1490
6236B13976l8039j0286k921J35709Q7878m084R290L9203M0243O6347O7444m5920
6224E58840l7726m7153R522m5965k5357k8801j9923P6814Qr3443M6211J7901k9528
6211C81400j2193l752L092J0670R301N3441J8300L1201L6858O9621k5713K9536
6199F01762j5394l9364m756O9947P2229L213j17299O4207R259l1781k7737o2698
6187E21588K0777L4673K7459k7643K7961k7586P3701L2879j8444R1672M4760l601
6175G98196J2002K3237O813J6629O3785J7738p5211k0459Q8395l555k9298J8681
$$ plain form
6260 177566 212827 301502 338383 328884 344071 384582 387736 361963 400325 477792 380987 351940
6248 351940 349379 279547 325019 323680 288697 299076 244600 199232 163158 241355 202486 213976
6236 213976 175937 165651 162730 298439 386317 382233 391523 430726 470969 537316 604760 558840
6224 558840 521114 473961 483483 437518 412161 383360 363437 440251 440259 346816 393027 410928 381400
6211 381400 369207 365455 368547 379217 388518 441959 460259 491460 528318 597939 572226 601762
6199 601762 586368 547004 542248 612195 684424 687637 570338 634545 643804 612023 584286 521588
6187 521588 542365 577038 604497 576854 604815 577229 650930 683809 665365 757037 801797 798196
6175 798196 810198 833435 840248 856877 920662 938400 863189 842730 931125 927570 898272 916953
6163I16953o8132n7766M5373K5546l9134J6135M6738M4189L9152N4540O2899N7925
6151A144418M4856J0500R3598O6455O9106j695O2289R7504M4454Q3996L9388j1526
6139A743343m1548q0389m2679k7940m9557K2064o90K7750J1003N1536P8699O2249
6127A753841l469R1290M2124j8938J17974J6615l9795M8461O8388n3244q1632
6116A941615M3379j881j4995l1553o8977l1751l0882J7329n7272o5699o6896K3974
6104A656391N8680j0931l9167N9184N7478o958r734l0951p1195o9258l7367n249
6092A550923k3805L4959k092j6187k2725n8534R652Q053k7745q5174l952n4842
6080A308531j62P367m5984l5534o3832j9105j2849M0745Q5876J9658N5673Q9789
$$ plain form
6163 916953 848821 791055 836428 861974 822840 838975 885713 929902 969054 1023594 1086493 1144418
6151 1144418 1189274 1199774 1293372 1359827 1428933 1427238 1489527 1587031 1631485 1715481 1754869 1743343
6139 1743343 1701795 1621406 1578727 1550787 1501230 1523294 1522604 1550354 1561357 1612893 1691592 1753841
6127 1753841 1750372 1841662 1883786 1864848 1982822 1999437 1959642 2008103 2076491 2023247 1941615
6116 1941615 1984994 1983113 1968118 1936565 1867588 1835837 1804955 1822284 1765012 1699313 1632417 1656391
6104 1656391 1715071 1704140 1664973 1724157 1781635 1774677 1764943 1733992 1662797 1593539 1556172 1550923
6092 1550923 1527118 1562077 1559985 1543798 1521073 1462539 1472191 1480244 1452499 1367325 1363373 1308531
6080 1308531 1308369 1315736 1269752 1234218 1170386 1151281 1138432 1179177 1265053 1284711 1340384 1430173
6068A430173O320O2268P4753J7345j5309L165P3726o1954j0873K1535o538n730
6056A588881o7905p644J0185o3364m8688M358m3197N6229J13540M4128K4304P1445
6044A682272J067N044L7091J41277L8587Q0425Q0488J740N2429L6376Q3942n3628
6032B187110n2272k8278O0150j7828M609M6200L7728M090o4771N4031J7053M1224
6020B289046P4838l033P7275J57379K9789R9310P6980J15210J04323O3776P5510
6009C160403Q2969L6025M4350J06778J28446P9366R9729L9732J18532J22697J19027
5998D138054J02306j7650m1303m7150M7369J12811L0834J3330M5293P8957R3439
5987D556290O7939Q3038P0672J41290J64200J75923Q0317J12255J62099J04463
$$ plain form
6068 1430173 1436493 1498761 1573514 1590859 1575550 1578715 1652441 1590487 1579614 1601149 1594611 1588881
6056 1588881 1520976 1513332 1523517 1460153 1411465 1415823 1372626 1428855 1542395 1586523 1610827 1682272
6044 1682272 1683339 1688383 1725474 1866751 1905338 1985763 2066251 2067991 2120420 2156796 2240738 2187110
6032 2187110 2134838 2106560 2166710 2148882 2153491 2199691 2237419 2241509 2176738 2230769 2247822 2289046
6020 2289046 2363884 2360851 2438126 2595505 2625294 2724604 2801584 2916794 3021117 3084893 3160403
6009 3160403 3243372 3279397 3323747 3430525 3558971 3638337 3738066 3777798 3896330 4019027 4138054
5998 4138054 4240360 4222710 4181407 4134257 4181626 4294437 4325271 4338601 4383894 4462851 4556290
5987 4556290 4624229 4707267 4777939 4919229 5083429 5259352 5339669 5451924 5614023 5718486
5977E718486K09480K52743K10378K66315L09658K47968J29613Q0560k084K0119
5967G443236N7958M6856M5746O8630j4407M8378O3008J11578R5398N7520J1475
5956H035376J10810j374N2872J3252P0321J06310Q7858R2109J66926J66416J77777
5945I078653J44306J40964J70383J59670J11710P4209J22635J01716J42165O5622
5935A0312033J36209J97317Q6193L6674r615q4442r4018j16228k59360j54436
5925A0050327n4085j9766J0531Q455O3726N8565K17393K28695K56602K35287K89170
5914A1344900L63482M28081L54126M09179M74069O54684O07039O22403P46607
5905A6004570P66365P53883P06742O91073O37709L53813P5300k48293n12553n82185
$$ plain form
5977 5718486 5927966 6180709 6391087 6657402 6967060 7215028 7344641 7425201 7423117 7443236
5967 7443236 7501194 7548050 7593796 7662426 7648019 7696397 7759405 7870983 7966381 8023901 8035376
5956 8035376 8146186 8144812 8197684 8210936 8281257 8387567 8475425 8567534 8734460 8900876 9078653
5945 9078653 9222959 9363923 9534306 9693976 9805686 9879895 10002530 10104246 10246411 10312033
5935 10312033 10448242 10645559 10731752 10768426 10758811 10674369 10580351 10464123 10204763 10050327
5925 10050327 9996242 9976476 9987007 9995462 10059188 10117753 10335146 10563841 10820443 11055730 11344900
5914 11344900 11708382 12136463 12490589 12899768 13373837 14028521 14635560 15257963 16004570
5905 16004570 16770935 17524818 18231560 18922633 19560342 19914155 19989455 19741162 19228609 18646424
5895A8646424n87853n30033l86984k58444j07593K1553K03639K84969M51536P27918
5885A8465132O95114Q18339J070602J180094J235817J424136J637632J817238
5877B8344104K164120K367161K413716K291586J655784Q63578m7335r29221j376536
5868C7746957j681183j886677j912348j840683j685005j489725j178187q82145
5860B5191004o04478l44243j40764J22209L37645N82932P28298J043500J203011
5851B8119114J456123J671020J936000K149374K115120J868181J683316J253031
5843D2251279O59260j90264j283010k152125k908488l100074k988147k686216
5835B7602215k404000j998976j695101j353147j170018r10694p12289n47873l97188
$$ plain form
5895 18646424 18058571 17528538 17141554 16883110 16775517 16797070 17000709 17285678 17737214 18465132
5885 18465132 19160246 19978585 21049187 22229281 23465098 24889234 26526866 28344104
5877 28344104 30508224 32875385 35289101 37580687 39236471 40100049 40052714 39123493 37746957
5868 37746957 36065774 34179097 32266749 30426066 28741061 27251336 26073149 25191004
5860 25191004 24586526 24242283 24101519 24223728 24561373 25144305 25872603 26916103 28119114
5851 28119114 29575237 31246257 33182257 35331631 37446751 39314932 40998248 42251279
5843 42251279 42910539 42720275 41437265 39285140 36376652 33276578 30288431 27602215
5835 27602215 25198215 23199239 21504138 20150991 18980973 18070279 17357990 16810117 16412929
5826A6412929j56510J8219Q4506K60343M44920N67394O56854Q05462Q40183O25699
5816B0559999L69751j09118o10992j068693j384679j473151j416768j242356j134086
5807A2489907j028606q78624q04801p72755o10574n84336n03120l53586m61632
5798F491873l35536k37808k51981j73394j66053j75428r9890n107r8057j23623
5788D824996o5223m1598l8538j37102o3929k6735j07504l6475r7786j78354j92417
5777C839335r8363j16630o0269j00561j34226m5374r3992n7436q9083m0441q277
5766B994683j6082J0281J2150l1194k0573M6968q6186j3178J3748m7625m0284
5755B822708j3801K0781j21239j29263n6444n3295p8654k5230Q024J7728k3537
$$ plain form
5826 16412929 16256419 16274638 16359144 16619487 17064407 17631801 18288655 19094117 19934300 20559999
5816 20559999 20929750 20820632 20209640 19140947 17756268 16283117 14866349 13623993 12489907
5807 12489907 11461301 10582677 9777876 9005121 8394547 7810211 7307091 6953505 6491873
5798 6491873 6156337 5918529 5666548 5493154 5327101 5151673 5051783 5046676 4948619 4824996
5788 4824996 4759773 4718175 4679637 4542535 4478606 4451871 4344367 4307892 4210106 4031752 3839335
5777 3839335 3740972 3624342 3564073 3463512 3329286 3283912 3189920 3132484 3043401 3002960 2994683
5766 2994683 2978601 2988882 3001032 2969838 2949265 2996233 2910047 2896869 2910617 2862992 2822708
5755 2822708 2808907 2829688 2708449 2579186 2522742 2469447 2390793 2365563 2373587 2391315 2367778
5744B367778k7661k8924J2251p0576Q182O7798M0834j8710Q473n2227l9665P6013
5732B343566p7397j8108n1447k4916L3503j4714m3478j11770l8396l4654K0516
5721A982705M2649K8529R9419o1544N4455M3665j1675L4393Q8612Q297L5281N6755
5709B401541N3581o8480K1172N7299q926J1311n8168l5109q5839m973l0224n3186
5697B199999K2588n5826m1084J0559L9258J8899L8555J4952j2764R8020Q1734
5686B414890P9559k6491M9844L7289Q5220O8736L1000j5542n7500k5463p9989
5675B561553M939o2193j56151o1738k0189j07089r0063k8617l1607M2757J3278
5664B064880j6334N7052R9791j1696Q0665J17533K1914O5262P775P0860L6043
$$ plain form
5744 2367778 2340117 2311193 2323444 2252868 2261050 2328848 2369682 2350972 2359445 2307218 2267553 2343566
5732 2343566 2266169 2248061 2196614 2171698 2205201 2190487 2147009 2035239 1996843 1962189 1982705
5721 1982705 2025354 2053883 2153302 2091758 2146213 2189878 2178203 2212596 2301208 2309505 2344786 2401541
5709 2401541 2455122 2386642 2407814 2465113 2456187 2467498 2409330 2374221 2288382 2283409 2253185 2199999
5697 2199999 2222587 2166761 2125677 2136236 2175494 2194393 2232948 2247900 2235136 2333156 2414890
5686 2414890 2494449 2467958 2517802 2555091 2640311 2709047 2740047 2724505 2667005 2641542 2561553
5675 2561553 2566492 2504299 2348148 2286410 2266221 2159132 2069069 2040452 2008845 2051602 2064880
5664 2064880 2048546 2105598 2205389 2193693 2274358 2391891 2413805 2479067 2486842 2557702 2593745
5653B593745n1830o0273l165m6402l2238j08813r3758o2407m3585l475o3643L0707
5641B054863K3824M66O5099N9872Q8596K4307O0345J02622Q1222P5085K2894J29719
5629B788914R7525R7743L2287Q9750Q6239K4935J8542l8641j5910j8474j04400
5618C058510j43059l2201k1507l04J9336K7037O126P5456M6979R0332M7907R3725
5606C268337J31318J24328J46752J39050J81552J18648P3416J49119J16339J6851
5596D465710j14083j81162r7841m4837r0496n9719n2377m1470M0674k5296m7071
5585C752032l201J20604O8127J82221K26582J99278J62419P8623J51999K19741
5575E158425J21498K45814R1224J20951J78124J16778J10092N1402J074q5044
$$ plain form
5653 2593745 2541915 2481642 2478477 2432075 2399837 2291024 2197266 2134859 2091274 2087799 2024156 2054863
5641 2054863 2078687 2079153 2144252 2204124 2292720 2317027 2377372 2479994 2561216 2636301 2659195 2788914
5629 2788914 2886439 2984182 3016469 3106219 3192458 3217393 3235935 3197294 3181384 3162910 3058510
5618 3058510 2915451 2883250 2861743 2861439 2880775 2907812 2913938 2989394 3036373 3126705 3174612 3268337
5606 3268337 3399655 3523983 3670735 3809785 3991337 4109985 4183401 4332520 4448859 4465710
5596 4465710 4351627 4170465 4072624 4027787 3937291 3877572 3825195 3783725 3824399 3799103 3752032
5585 3752032 3748831 3869435 3937562 4119783 4346365 4545643 4708062 4786685 4938684 5158425
5575 5158425 5279923 5525737 5616961 5737912 5916036 6032814 6142906 6194308 6195382 6110338
5565F110338o3157l3738j14214o5375n5579j11999l4469K3333J18093K0709J67192
5554E961134J33615J30888J66531J94497K37927K01958K09946K13677J72874J54925
5544G777972J89948J45602J69770m0273j81118j81397k82207k11668j25847j30817
5534G129965j11295o3219r6830p8697l066M8988L9036K7292J16321J53799K42425
5523G404719J18678J79298J71260J11630K5867O9274N1876L7225o7749j54464
5513G947614k06771k72638j42616j44920j38615j64208o8872l9179L3990L252
5503F807037M6297Q2387L8690N3808R1666J55825J56590J50277J73170K41561
5493G997308K56288J74548J16819Q8555J24761p9921l6373j41925j78246j08936
$$ plain form
5565 6110338 6047181 6013443 5899229 5833854 5778275 5666276 5631807 5655140 5773233 5793942 5961134
5554 5961134 6094749 6225637 6392168 6586665 6824592 7026550 7236496 7450173 7623047 7777972
5544 7777972 7967920 8113522 8283292 8243019 8061901 7880504 7598297 7386629 7260782 7129965
5534 7129965 7018670 6955451 6858621 6779924 6776858 6825846 6864882 6892174 7008495 7162294 7404719
5523 7404719 7523397 7702695 7873955 7985585 8011452 8080726 8132602 8169827 8102078 7947614
5513 7947614 7740843 7468205 7325589 7180669 7042054 6877846 6808974 6769795 6803785 6807037
5503 6807037 6853334 6935721 6974411 7028219 7119885 7275710 7432300 7582577 7755747 7997308
5493 7997308 8253596 8428144 8544963 8633518 8758279 8678358 8641985 8500060 8321814 8212878
5483H212878q4812j04618o3718j5889K5161Q2594N2300M0420J09980J67531J85566
5472H607393Q0484J94696L02118J92665J84807K95766K82885K43344K12121J71191
5462A0767470P0378Q7972R3949j6253n0645l8223k9865j03710L4730r858L8357
5451A0844302J53127J70541J48358K59236K83558L66537L95831L90828M75509
5442A3487827N01774N81641O13614N64383P12838P01333P83007Q09894Q65225
5433A9621536Q59823R82025J034989R03043Q19732M27469j28606n55813o69830
5424B3294368p34344o33935m73331l03577j40364R0440L28569M46055O34272P74312
5414B3282465R68888J156498J298138J510172J682942J981485K222060K520346
$$ plain form
5483 8212878 8128066 8023448 7959730 7943841 7969002 8051596 8103896 8144316 8254296 8421827 8607393
5472 8607393 8687877 8882573 9184691 9377356 9562163 9857929 10140814 10384158 10596279 10767470
5462 10767470 10837848 10925820 11019769 11003516 10952871 10914648 10884783 10781073 10815803 10805945 10844302
5451 10844302 10997429 11167970 11316328 11575564 11859122 12225659 12621490 13012318 13487827
5442 13487827 13989601 14571242 15184856 15749239 16462077 17163410 17946417 18756311 19621536
5433 19621536 20481359 21463384 22498373 23401416 24221148 24648617 24520011 23964198 23294368
5424 23294368 22560024 21926089 21452758 21149181 21008817 21099257 21427826 21873881 22508153 23282465
5414 23282465 24251353 25407851 26705989 28216161 29899103 31880588 34102648 36622994
5406C6622994K787101K908936K777775K180026J021062n83843k001079k762383
5398D2950589k903199k728347k312281j953581j600051j319476j015910o93742
5390B8424002m10644j64416O6770L64005O05941R49340J190620J435254J871898
5381C4332770K227636K584267K797926K500056J455694O2900j210472k329564
5373D2421213k926481l133577l087647k733366k456750k168432j861431j534626
5365B2518903j194827r89343p94661o54619m86312l14380j77035J0700J19607
5356A8038033K02497L85398N44487O23720N45910M36583L9464m06101q05818j059276
5346A8544897j146377j184324j143323r82182r03750q13238p25904n84793o09801
$$ plain form
5406 36622994 39410095 42319031 45096806 47276832 48297894 47714051 45712972 42950589
5398 42950589 40047390 37319043 35006762 33053181 31453130 30133654 29117744 28424002
5390 28424002 28013358 27848942 27915712 28279717 28885658 29834998 31025618 32460872 34332770
5381 34332770 36560406 39144673 41942599 44442655 45898349 45961249 44750777 42421213
5373 42421213 39494732 36361155 33273508 30540142 28083392 25914960 24053529 22518903
5365 22518903 21324076 20334733 19540072 18885453 18399141 18084761 17907726 17918426 18038033
5356 18038033 18240530 18625928 19170415 19794135 20340045 20776628 20816092 20409991 19604173 18544897
5346 18544897 17398520 16214196 15070873 14088691 13184941 12371703 11645799 11061006 10451205
5337A0451205m67963m68103l41046k99084l04157l15256k48049j59740k00441
5328G647366k3709p1373r7878k243J44556N963n0807j62761j53467j75234j71533
5317F888880j51797l821n2653p4175n1240j6722J14045J14716P6639J40262Q3739
5306G067873M0739O4786Q2945O6562J22143O6379J50269J47904R2964K5377O9752
5295G997693J15432J01005J51632J31527L2068j39394k20760l30689l78264l22882
5285G137368k53970k40489k75801l26665k11536k29182k18296k67869k23446k90471
5275D599643k13901j02869j16006j42788j77566j36842p2191q3400m3519k2171
5265C488390p7655n8923Q6659K5488L9704O0934J8100j604M9792R290Q7613J02490
$$ plain form
5337 10451205 9983242 9515139 9174093 8875009 8570852 8255596 8007547 7847807 7647366
5328 7647366 7623657 7552284 7454406 7452163 7596719 7602682 7551875 7389114 7235647 7060413 6888880
5317 6888880 6737083 6733262 6680609 6606434 6555194 6538472 6652517 6767233 6843872 6984134 7067873
5306 7067873 7108612 7173398 7256343 7322905 7445048 7511427 7661696 7809600 7902564 7927941 7997693
5295 7997693 8113125 8214130 8365762 8497289 8529357 8389963 8169203 7838514 7460250 7137368
5285 7137368 6883398 6642909 6367108 6040443 5828907 5599725 5381429 5113560 4890114 4599643
5275 4599643 4385742 4282873 4166867 4024079 3846513 3709671 3637480 3554080 3510561 3488390
5265 3488390 3410735 3351812 3438471 3463959 3503663 3564597 3582697 3581093 3630885 3640175 3727788 3830278
5253C830278M6544P5369J18739l3840j25567j02170j18037j77115k15001j22463
5243C176737j11801q7845j27048k5094o9179K9277k8357j8769L0521O077m1146
5232B733373L3796L7971R711M7735N5254K8339L7896K6548n7217M1347k3860M2699
5220C013592k9754l8745p5805o8916k5183r4035o0921P2024k8203o8143J9089
5209B615000j33Q2112N5866L7040L9460J11819J02487J20052N9782R2042J25365
5198C440892Q1822L4650Q6323J49018J34281J31180P1774J7802J930j26882j64454
5187C858336j84860j67132j25557j33557n152M8721j2014j06111P4699N5987M0099
5176C343459R4700Q5084J83888P5288P8901J39201J91643J13350J68571J87350
$$ plain form
5253 3830278 3876822 3952191 4070930 4037090 3911523 3809353 3691316 3514201 3299200 3176737
5243 3176737 3064936 2977091 2850043 2824949 2755770 2785047 2756690 2737921 2768442 2774519 2733373
5232 2733373 2767169 2805140 2814851 2862586 2917840 2946179 2984075 3010623 2953406 2994753 2970893 3013592
5220 3013592 2983838 2945093 2869288 2800372 2775189 2681154 2620233 2692257 2664054 2595911 2615000
5209 2615000 2614867 2696979 2752845 2789885 2829345 2941164 3043651 3163703 3223485 3315527 3440892
5198 3440892 3522714 3557364 3643687 3792705 3926986 4058166 4129940 4147742 4149672 4022790 3858336
5187 3858336 3673476 3506344 3380787 3247230 3242078 3290799 3278785 3172674 3247373 3303360 3343459
5176 3343459 3438159 3523243 3707131 3782419 3861320 4000521 4192164 4305514 4474085 4661435
5166D661435J71869J86056J73100L85825M28414M07549M19656K39071k3713k09559
5156F839703k34723k88083l25916j22960j5931k9965J3970L6184K4622j58599
5146E738302j81547j96511k71258k02204o1418k4543j24213L094L7146J7434K4102
5135D758384q18O9055R1244J92999K40666K84807M29232L81116K59205R2427j34939
5124F663378l06412l52362l53582k99538j72493j94592j53193j71262q5676n8248
5114D516020j53464j55053L893p0630o6270n7081j42777n0771m6065J12548J7506
5103C907856N0744L5725J57762K66669K07043K53975M39350M14102L44085K52213
5093F329524O8577j22879k36076l00141k94714j98170k18624j64272j28879j06543
$$ plain form
5166 4661435 4833304 5019360 5192460 5578285 6006699 6414248 6833904 7072975 7049262 6839703
5156 6839703 6604980 6316897 5990981 5868021 5852090 5822125 5836095 5872279 5896901 5738302
5146 5738302 5556755 5360244 5088986 4886782 4825364 4800821 4676608 4679702 4716848 4734282 4758384
5135 4758384 4757566 4826621 4917865 5110864 5351530 5636337 6065569 6446685 6705890 6798317 6663378
5124 6663378 6356966 6004604 5651022 5351484 5178991 4984399 4831206 4659944 4574268 4516020
5114 4516020 4362556 4207503 4211396 4140766 4074496 4017415 3874638 3823867 3777802 3890350 3907856
5103 3907856 3958600 3994325 4152087 4418756 4625799 4879774 5319124 5733226 6077311 6329524
5093 6329524 6398101 6275222 6039146 5739005 5444291 5246121 5027497 4863225 4734346 4627803
5083D627803j23039k63366j77883j57347q8354j12609j11480p2205p2427m5368
5073C403725L3014J0732K4161O3081J31126J21049P9676J28706R6516J64761Q5628
5062D342175P2490l2167Q880P9334k5138J3649K1132j574n5717k8167r5327q4094
5050D215476O4056o4063N5925J6914N0378R7864J25663J04143J96163K00633J36842
5039E199994K04100J70432J00192J64515L3908K2478n793o9914p8474j38337j40990
5028E462111j48447j19990j30150j21649q5768q7451J407L9294k479K8144J30846
5017D965868J23988J80429K40670J46609K37610J40940J31153J32696O8379N7634
5007F425976J54116J13229N6116j634P8974R5576m7314j09002r0725r1763o6994
$$ plain form
5083 4627803 4504764 4241398 4063515 3906168 3817814 3705205 3593725 3521520 3449093 3403725
5073 3403725 3436739 3447471 3471632 3534713 3665839 3786888 3866564 3995270 4091786 4256547 4342175
5062 4342175 4414665 4382498 4391378 4470712 4445574 4459223 4480355 4478781 4423064 4394897 4299570 4215476
5050 4215476 4279532 4215469 4271394 4288308 4338686 4436550 4562213 4666356 4862519 5063152 5199994
5039 5199994 5404094 5574526 5674718 5839233 5873141 5895619 5889826 5819912 5741438 5603101 5462111
5028 5462111 5313664 5193674 5063524 4941875 4856107 4768656 4770063 4809357 4806878 4835022 4965868
5017 4965868 5089856 5270285 5510955 5657564 5895174 6036114 6167267 6299963 6368342 6425976
5007 6425976 6580092 6693321 6749437 6747803 6826777 6922353 6875039 6766037 6675312 6583549 6516555
4996F516555j98032k09678k01465j34558p0824j6438K1985N0456R6750J75507
4986F030258J85542J13134K27593J13610J26042R7897R3769J6795J0463M6651
4976G061754k4393m0376n7736p0291j0645o2617k0523o617P4820O0760q341J11124
4964G006919J44077J80968K42977K23781K48849J56203K50235J66232J74684K00734
4954H995659R6377M2963O4107M3185q4455k2521m4390J5464k2271k5075L237O0690
4942I122970J08595J27048J10716K13367K64189K18634K80719L97896M40966M64429
4932A1749529M06119M13542M43345M37867L74386L29652K48462K73994Q6647K7528
4922A4791071m5918l5282O386j33493k5153p8221q5324O133J00139J21186J83154
$$ plain form
4996 6516555 6318523 6108845 5907380 5772822 5701998 5685560 5707545 5758001 5854751 6030258
4986 6030258 6215800 6328934 6556527 6670137 6796179 6894076 6987845 7004640 7015103 7061754
4976 7061754 7037361 6996985 6939249 6868958 6858313 6795696 6775173 6768556 6843376 6904136 6895795 7006919
4964 7006919 7150996 7331964 7574941 7798722 8047571 8203774 8454009 8620241 8794925 8995659
4954 8995659 9092036 9134999 9199106 9242291 9157836 9135315 9090925 9106389 9084118 9059043 9062280 9122970
4942 9122970 9231565 9358613 9469329 9682696 9946885 10165519 10446238 10844134 11285100 11749529
4932 11749529 12155648 12569190 13012535 13450402 13824788 14154440 14402902 14676896 14763543 14791071
4922 14791071 14745153 14709871 14716257 14582764 14557611 14479390 14394066 14400199 14500338 14621524 14804678
4911A4804678L07588L62143M14198N18045N17531M86206O47969O73614P31244
4902A9463216O93806O63145N94221N53582M53175L07424L14279K36158L5907j5066
4892B3299847J7291J1618O3615J25233J55034K80102M47181M70995O36954Q05439
4882B6313309Q87897J022097J097161J110919J150819J285813J202747J268208
4874C5338970J121380J102010R70628R70480Q83249P31803O71411O20627O55626
4865D3066184O78873P65960Q23721R65133J276342J638938J978269K500230L112946
4856E6806596L621800M340478N134370N996724P106576Q246528R574831J0946050
4848A11773953J2238115J3422902J4952343J7260264K0802155K6134868L3107095
$$ plain form
4911 14804678 15112266 15474409 15888607 16406652 16924183 17410389 18058358 18731972 19463216
4902 19463216 20157022 20820167 21414388 21967970 22421145 22728569 23042848 23279006 23314913 23299847
4892 23299847 23317138 23328756 23392371 23517604 23672638 23952740 24399921 24870916 25507870 26313309
4882 26313309 27201206 28223303 29320464 30431383 31582202 32868015 34070762 35338970
4874 35338970 36460350 37562360 38532988 39503468 40386717 41118520 41789931 42410558 43066184
4865 43066184 43745057 44511017 45334738 46299871 47576213 49215151 51193420 53693650 56806596
4856 56806596 60428396 64768874 69903244 75899968 83006544 91253072 100827903 111773953
4848 111773953 124012068 137434970 152387313 169647577 190449732 216584600 249691695
4841B49691695L8862006L5703098K0990449J633430k1615144l6339843l9781694
4834B49143997l6928403k9995323k4148894j9796112j6251141j3454798j1422456
4827I7146870r389038p838196o367433n259195m310819l474490k877076k282278
4819E5348345j827143j440879r58045o71553k88352k56886k5963J88685J71295
4810E0239504J20329J35872K03379L14703L68642N77125P61012J010038J338680
4801E5069284J781108K251098K784539L442464M229290N155790O329516P495441
4793H8538530Q822511J0069400J1502966J3115002J5270865J8265379K2548804
4786A88133457K8270709L4346923L5234129K2271682O884907m031861k0917188
$$ plain form
4841 249691695 288553701 324256799 345247248 346880678 325265534 288925691 249143997
4834 249143997 212215594 182220271 158071377 138275265 122024124 108569326 97146870
4827 97146870 87757832 79919636 73552203 68293008 63982189 60507699 57630623 55348345
4819 55348345 53521202 52080323 51122278 50450725 50162373 49905487 49879524 50068209 50239504
4810 50239504 50359833 50495705 50699084 51013787 51382429 51959554 52720566 53730604 55069284
4801 55069284 56850392 59101490 61886029 65328493 69557783 74713573 81043089 88538530
4793 88538530 97361041 107430441 118933407 132048409 147319274 165584653 188133457
4786 188133457 216404166 250751089 285985218 308256900 315141807 311109946 290192758
4779B90192758l4412477l7558189l3570069k6919445k1899467j8038891j5017235
4772A02776985j2722175j0888855r076626p679241o519291n488255m618791l882595
4764D1901156l349029k832996k327079j918410j413688j157047q54804n91982
4756B7456121n06878l06131k81928k37345k65220k81192l31678n37650n09247
4747B4198852n37293n32272o13505o89166o19196o83449n65401n18256m80095
4738A8960219k51194j22811J36745L72486O49915R38570J273072J400720O36803
4729B3994525k73843r33587j141383r03927p09751n49732m93877n04810n28242
4720A7955373n30496m90163n04418m72145m75228n08195m69949l87008l12355
$$ plain form
4779 290192758 255780281 218222092 184652023 157732578 135833111 117794220 102776985
4772 102776985 90054810 79165955 70089329 62410088 55890797 50402542 45783751 41901156
4764 41901156 38552127 35719131 33392052 31473642 30059954 28902907 28048103 27456121
4756 27456121 26949243 26643112 26361184 26123839 25858619 25577427 25245749 24708099 24198852
4747 24198852 23661559 23129287 22515782 21826616 21207420 20523971 19958570 19440314 18960219
4738 18960219 18709025 18586214 18722959 19095445 19745360 20683930 21957002 23357722 23994525
4729 23994525 23720682 22787095 21645712 20741785 20032034 19482302 18988425 18483615 17955373
4720 17955373 17424877 16934714 16430296 15958151 15482923 14974728 14504779 14117771 13805416
4711A3805416k77454k09998n1263P2144P4564O4709N6297R9159J75815J41582
4701A3950971J84307J84903K05913K88774J22690K10276J20030K0090N7080o9650
4691A5275384m7591p7889o4826q5228j16626N6599p209J03614J38002J23936K33908
4680A5532074K22553K43901L80254M06301N39926M22666M91139N29393M09639
4671A9177846L70161L48864L78870L52656L32107L18115K77865M08039L74234
4662B2338757M18115M72724M39838L72108M35326M83077M70908O02672N97405
4653B6630930M50023N06209M80128M03656L41951L21459L95084L68203M19150
4644C0316793L76717M18335M22181L68858L67164M51371M61431N07701N78270
$$ plain form
4711 13805416 13527962 13317964 13266701 13338845 13413409 13478118 13534415 13633574 13809389 13950971
4701 13950971 14135278 14320181 14526094 14814868 14937558 15147834 15267864 15287954 15345034 15275384
4691 15275384 15227793 15149904 15085078 14999850 14883224 14939823 14932614 15036228 15174230 15298166 15532074
4680 15532074 15754627 15998528 16378782 16785083 17325009 17747675 18238814 18768207 19177846
4671 19177846 19548007 19896871 20275741 20628397 20960504 21278619 21556484 21964523 22338757
4662 22338757 22756872 23229596 23669434 24041542 24476868 24959945 25430853 26033525 26630930
4653 26630930 27080953 27587162 28067290 28470946 28812897 29134356 29529440 29897643 30316793
4644 30316793 30693510 31111845 31534026 31902884 32270048 32721419 33182850 33690551 34268821
4635C4268821O92387O50684O72517O06867O53206O38898N54190O35337N67656
4626C9940563M88069L15801J61870J54956L2437J16782J03369M0251Q4991J7410
4616D1456499O1257Q6430O2677J58745J00969J83594K39145K64741L34828L98974
4606D3347859L49623M05212M17874M44317M96603M08090L72945M12175L16290
4597D6970988J76098j1151k9345k1794q5881n6361k0263J319J9739J08547J63813
4586D7215709J58613K54685L11270L00000M62141M68503N93130O66523O65588
4577E1096162P45452P96509P57160P62455O47527N83839N10222K78494J54656
4568E6332476Q5758J0812p5543j09055p4661L0589J6357j4832j7947j7293q9400
$$ plain form
4635 34268821 34961208 35611892 36284409 36891276 37544482 38183380 38737570 39372907 39940563
4626 39940563 40428632 40744433 40906303 41061259 41093696 41210478 41313847 41354098 41439089 41456499
4616 41456499 41517756 41604186 41666863 41825608 41926577 42110171 42349316 42614057 42948885 43347859
4606 43347859 43697482 44102694 44520568 44964885 45461488 45869578 46242523 46654698 46970988
4597 46970988 47147086 47135935 47106590 47084796 46998915 46942554 46922291 46923610 46943349 47051896 47215709
4586 47215709 47374322 47629007 47940277 48240277 48702418 49170921 49764051 50430574 51096162
4577 51096162 51841614 52638123 53395283 54157738 54805265 55389104 55899326 56177820 56332476
4568 56332476 56418234 56429046 56353503 56244448 56169787 56200376 56216733 56201901 56183954 56166661 56077261
4557E6077261q9215q9792j81842k42364k88088k63934k50628k74626j88408j56053
4547E4052311k21910j24532j28674j43535o4896j3354J71169J77400J19201J70226
4537E3993406L35538L17558K10541J96192N2483j3725k15950m84986o95547q68652
4527E2826858j072457j232730j368636j496130j590824j650960j658860j505200
4519D1251061j364505j092933q91826o70272n46126m02509l00026k36655k86261
4510C5459948k16300k02136k42945l04602m54756n19148o39765p83786r63103
4501C1133407j062996j090342j059612j122557j125886j080536j025465r65156
4493B2600857r62388q68942p69635p58413o55037p17934n29144m82311n84884
$$ plain form
4557 56077261 55988046 55898254 55716412 55474048 55185960 54922026 54671398 54396772 54208364 54052311
4547 54052311 53830401 53705869 53577195 53433660 53368764 53355410 53526579 53703979 53823180 53993406
4537 53993406 54328944 54646502 54857043 55053235 55105718 55091993 54876043 54391057 53695510 52826858
4527 52826858 51754401 50521671 49153035 47656905 46066081 44415121 42756261 41251061
4519 41251061 39886556 38793623 37901797 37231525 36685399 36282890 35982864 35746209 35459948
4510 35459948 35243648 35041512 34798567 34493965 34039209 33520061 32880296 32096510 31133407
4501 31133407 30070411 28980069 27920457 26797900 25672014 24591478 23566013 22600857
4493 22600857 21638469 20769527 19999892 19241479 18586442 17868508 17339364 16857053 16272169
4484A6272169m26951m05613m10552l98927l67764l61197m37043l26816l11943
4475A2825363l03654l04250k08097k30034j82014j31803r4867K863j46880j35266
4465A1091361j15872k69202j88311k14648j32949r7702q3534n1013m8689n45O1043
4454I949939J66816L9616J42960N9606Q1180k9043j85854k85635l93869l73295
4444I172421l22996l00958k59645j88738k41856k10279j42826j40474j7483j7134
4434G330032n7927n3765l6256r0605j01604K6671q2656p2648o0672j28429q7424
4423F584717j95481o6143q7107j26541j46775j48955j17709r8803r8597j50654
4413E347952j09108j07916j08398n8072J268o558l4223n6516L3488j8190N3426
$$ plain form
4484 16272169 15845218 15439605 15029053 14630126 14262362 13901165 13464122 13137306 12825363
4475 12825363 12521709 12217459 12009362 11779328 11597314 11465511 11370644 11373507 11226627 11091361
4465 11091361 10975489 10706287 10517976 10303328 10170379 10072677 9989143 9938130 9889441 9888896 9949939
4454 9949939 10116755 10156371 10299331 10358937 10440117 10411074 10225220 9939585 9545716 9172421
4444 9172421 8849425 8548467 8288822 8100084 7858228 7647949 7505123 7364649 7347166 7330032
4434 7330032 7272105 7218340 7182084 7091479 6989875 7016546 6933890 6861242 6800570 6672141 6584717
4423 6584717 6389236 6323093 6235986 6109445 5962670 5813715 5696006 5597203 5498606 5347952
4413 5347952 5238844 5130928 5022530 4964458 4965726 4959168 4924945 4868429 4901917 4883727 4937153
4402D937153J8464O200N901o9907m3900l358J180q8475l0441J6578m3189n2877
4390D653329n1323J3197n1543K3045Q0562J36124J33770K12070J79902J42912
4380E472045K42877J98724K98895M60915M28971N12966M20378K34335q5016m78450
4370G706640m61120n48215m35650l42211l41612k94989l08676j95697k30676k03747
4360D344047j10604j97506j75727n393j01648q9866n051k1353j899J1388l2009
4349C614379M0042M6456O1465m6116j038L0026r415m1462j3854l7831j36509m5106
4337C461037j08537K7584o9930j10154k0996j1974r8456K5786q5355N5868K017
4326C066890M8073R2574K6508J10837k4783R0356K3128R1134J9022o7674L8137
$$ plain form
4402 4937153 4955617 4961817 4967718 4897811 4853911 4850553 4851733 4763258 4732817 4749395 4706206 4653329
4390 4653329 4602006 4615203 4563660 4586705 4667267 4803391 4937161 5149231 5329133 5472045
4380 5472045 5714922 5913646 6212541 6673456 7102427 7615393 8035771 8270106 8185090 7706640
4370 7706640 7245520 6697305 6261655 5919444 5577832 5282843 4974167 4778470 4547794 4344047
4360 4344047 4233443 4035937 3860210 3854817 3753169 3663303 3658252 3636899 3635000 3646388 3614379
4349 3614379 3654421 3700877 3762342 3716226 3715188 3745214 3735799 3694337 3680483 3642652 3506143 3461037
4337 3461037 3352500 3380084 3310154 3200000 3179004 3167030 3068574 3094360 3009005 3064873 3066890
4326 3066890 3114963 3207537 3234045 3344882 3320099 3410455 3433583 3524717 3543739 3476065 3514202
4315C514202l2118k0204o6655j10572q690J1750m5696j38134n7518N190j6781
4304C034774P5780r580O9359P4188j7445P0247J67975Q0323j6055K790J21918
4293C654274N5298L9487M0841Q8296L8967L8244L4935m4502k9936P462N2054L3277
4281D008697o6625P0176J05734M3462k9296K7664Q3834L8305N5912N7138R9147
4270D494148o459J32301Q8112Q3512K756N2638J491K3400P4288N0534J4865n6504
4258D955082l5633M8280P866M3149J506P6242O7808O4510J09466P7482J05492
4247E521250J58596J13117J09407J97546K39920J75602J59471K09354K10521J63208
4237G257992J71999K28598J39349J5361Q973j0310r4637j79707k07170j56303
$$ plain form
4315 3514202 3482084 3461880 3395225 3284653 3275963 3287713 3242017 3103883 3046365 3051555 3034774
4304 3034774 3110554 3100974 3170333 3244521 3227076 3297323 3465298 3545621 3529566 3532356 3654274
4293 3654274 3709572 3749059 3789900 3878196 3917163 3955407 3990342 3945840 3915904 3923366 3975420 4008697
4281 4008697 3942072 4012248 4117982 4161444 4132148 4159812 4243646 4281951 4337863 4395001 4494148
4270 4494148 4487689 4619990 4708102 4791614 4794370 4847008 4848499 4871899 4946187 4996721 5011586 4955082
4258 4955082 4919449 4967729 4975595 5018744 5020250 5096492 5164300 5228810 5338276 5415758 5521250
4247 5521250 5679846 5792963 5902370 6099916 6339836 6515438 6674909 6884263 7094784 7257992
4237 7257992 7429991 7658589 7797938 7813299 7822272 7811962 7717325 7537618 7330448 7174145
4227G174145k30037j27070p7129o0341l7333k6663M7682Q2056P6372M2225R1822
4216F955729L8549R6355R3941K9936P6523J12157Q4341j8410N9632J65577K5978
4205G720308Q1311J14602K8859J47520J02669J60401K32025L11388L82321L78518
4195I659922M86571M93023O45133Q21937P03339P87915R61036J002888J243666
4186A6805430J414947J692593J942902K042558J969857J242923j35976j606571
4178B5368663k322402k279879j982701j758762j424151j240727j025695q85073
4170A2449273o93441n92299n35714m65076m26175l43673k13511p8752p6797m3715
4160H980120o2909o9357k9936q2065M1304J9907q0429p5695q993o7261j5818r426
$$ plain form
4227 7174145 6944108 6817038 6739909 6679568 6642235 6615572 6663254 6745310 6821682 6863907 6955729
4216 6955729 6994278 7090633 7184574 7214510 7291033 7403190 7487531 7469121 7528753 7694330 7720308
4205 7720308 7801619 7916221 7945080 8092600 8195269 8355670 8587695 8899083 9281404 9659922
4195 9659922 10146493 10639516 11284649 12106586 12809925 13597840 14558876 15561764 16805430
4186 16805430 18220377 19912970 21855872 23898430 25868287 27111210 26975234 25368663
4178 25368663 23046261 20766382 18783681 17024919 15600768 14360041 13334346 12449273
4170 12449273 11755832 11163533 10627819 10162743 9736568 9392895 9179384 9100632 9023835 8980120
4160 8980120 8917211 8847854 8817918 8735853 8777157 8797064 8716635 8640940 8631947 8564686 8548868 8539442
4148H539442O3639J080p5725N0461K1724M6570M5386N3052j6459o7822j25226
4137H536122o9568l8469o0842O0631Q4387N7142M8648N6102o097P2982N9075N0367
4125H850480J8364L5973L3190j47113o4019j27352n6451o1613j19204p5368r7970
4114H188917q1197r3011r2187j09576m3706l6172o2701O5890m1805j999Q652p9473
4102G621632k061R7047l1285K2707J4963n3207L400l1882l2169k5667L8056n7257
4090G564277L389O098l3745m1148n6723p3293k3450K9525N9765J7567m0592L4285
4078G445955Q1127n5969o2818j6875o4953Q0732L3762l1345J0649j8023p0898
4067G331344k4412r0309m8565M3565K1594j7346n046P6996J3827K572N8698O4101
$$ plain form
4148 8539442 8603081 8604161 8528436 8578897 8600621 8647191 8692577 8745629 8729170 8661348 8536122
4137 8536122 8466554 8428085 8367243 8427874 8512261 8569403 8618051 8674153 8668056 8741038 8800113 8850480
4125 8850480 8868844 8904817 8938007 8790894 8726875 8599523 8543072 8481459 8362255 8286887 8188917
4114 8188917 8107720 8014709 7922522 7812946 7769240 7733068 7670367 7736257 7694452 7692453 7701105 7621632
4102 7621632 7619571 7716618 7685333 7708040 7723003 7669796 7673196 7641314 7609145 7583478 7621534 7564277
4090 7564277 7567666 7573764 7540019 7498871 7442148 7368855 7345405 7374930 7434695 7452262 7411670 7445955
4078 7445955 7527082 7471113 7408295 7391420 7326467 7407199 7440961 7409616 7420265 7402242 7331344
4067 7331344 7306932 7216623 7168058 7211623 7233217 7215871 7210825 7287821 7301648 7304220 7362918 7427019
4055G427019N7606P5861J80529N2706J15821J26799J21394O2777j706o4242q3148
4044H071416j7634N0917j512l4604j36113K2031l7909n6766J3485r2896j6979
4033G763436k9198Q816j1073R8108M292J10574J30550J06600P8677N4227J14860
4022H429869O4803J04095J66791P8241J9858O8586O0468J14636L5788Q2954J0869
4011I236958M3858Q7495K0966L8933J3387R1918P9149J39454J22117J75888K09111
4000A0259234J58036J68901J59481J14633J56355J62882J40032J06617J60111
3991A1586282J03025R7344J17851J05234N7308K7623l4738p6624M2825J3055N9785
3980A2098970Q7527O9891L6050P0584J48089J35409J24019J09656K57638K01708
$$ plain form
4055 7427019 7484625 7560486 7741015 7793721 7909542 8036341 8157735 8220512 8218806 8154564 8071416
4044 8071416 8053782 8104699 8103187 8068583 7932470 7954501 7916592 7859826 7873311 7780415 7763436
4033 7763436 7734238 7743054 7731981 7830089 7834381 7944955 8075505 8182105 8260782 8315009 8429869
4022 8429869 8494672 8598767 8765558 8843799 8863657 8932243 8992711 9107347 9143135 9226089 9236958
4011 9236958 9280816 9368311 9389277 9428210 9441597 9533515 9612664 9752118 9874235 10050123 10259234
4000 10259234 10417270 10586171 10745652 10860285 11016640 11179522 11319554 11426171 11586282
3991 11586282 11689307 11786651 11904502 12009736 12067044 12094667 12059929 11983305 12026130 12039185 12098970
3980 12098970 12186497 12256388 12292438 12363022 12511111 12646520 12770539 12880195 13137833 13339541
3970A3339541K22916J89376K83172L62837K41383J86932J87665K70749L22610
3961A5607181K59649L36779K90710L11008L42062K20078K42274K70526K75040
3952A8155307L40264L22639K80531L67077L62467L71994M64394M55558M70184
3943B1590415M37189M18690M55731M52581L91541M14527M62706L90161L80965
3934B5394506K93342M08086M46304L67746L98293M61319M87364M93299M26551
3925B9176810L65604M70110M91029M07633N11355L97967M13615N60111N58094
3916C3352328N86940O15816O43831N92082O33334N00398N54149N22694N82408
3907C8583980O00516N96597N92341N92226P41915P19438O77581P40157P34894
$$ plain form
3970 13339541 13562457 13751833 14035005 14397842 14639225 14826157 15013822 15284571 15607181
3961 15607181 15866830 16203609 16494319 16805327 17147389 17367467 17609741 17880267 18155307
3952 18155307 18495571 18818210 19098741 19465818 19828285 20200279 20664673 21120231 21590415
3943 21590415 22027604 22446294 22902025 23354606 23746147 24160674 24623380 25013541 25394506
3934 25394506 25687848 26095934 26542238 26909984 27308277 27769596 28256960 28750259 29176810
3925 29176810 29542414 30012524 30503553 30911186 31422541 31820508 32234123 32794234 33352328
3916 33352328 33939268 34555084 35198915 35790997 36424331 36924729 37478878 38001572 38583980
3907 38583980 39184496 39781093 40373434 40965660 41707575 42427013 43104594 43844751 44579645
3898D4579645O43838O05080M82625N08273M73832M56514M51138N42177O01396
3889D9344518N63280M64653N19656M51153M69780N21963O08689O31591P04863
3880E4280146Q06199R04134R15355J079596J195986J356708J456402J427735J453373
3871F4875634J412454J264335J173026R04637P93876P11718N83484M61714K14158
3862G2395036N9279j19503r9077k63056k40593k87507l33689j94088j62924j79579
3852G0574299j88515j87909j11030j68180k24407r7577j38406p160p517j65840
3842F9277758j36050l29638m31677n40073o91256p88677j001311j170580j277379
3833F2911117j452396j474991j500713j500885j430384j431420j330769j184436
$$ plain form
3898 44579645 45223483 45828563 46311188 46819461 47293293 47749807 48200945 48743122 49344518
3889 49344518 49907798 50372451 50892107 51343260 51813040 52335003 52943692 53575283 54280146
3880 54280146 55086345 55990479 56905834 57985430 59181416 60538124 61994526 63422261 64875634
3871 64875634 66288088 67552423 68725449 69630086 70423962 71135680 71719164 72180878 72395036
3862 72395036 72454315 72334812 72235735 71972679 71732086 71444579 71110890 70916802 70753878 70574299
3852 70574299 70385784 70197875 70086845 69918665 69694258 69596681 69458275 69451115 69443598 69277758
3842 69277758 69141708 68812070 68380393 67840320 67149064 66360387 65359076 64188496 62911117
3833 62911117 61458721 59983730 58483017 56982132 55551748 54120328 52789559 51605123
3825E1605123j121734r71230r92779q68256p41005p87880p89453o34088n93872
3816D4104826n29445m78015m95965m36047l76816l46471m34626m66787m44267
3807D0096387n22974n30196n93439o28569o12151n67338n66577o40295n61802
3798C4873046o53307o26481o01089n34332m60715m40927l94626l89215m04099
3789C0368255l10156k44377k49255j92495r4789J8880l4942j10569j14782j72867
3779B8862903k28887l57820l59012l26844l78528l00699l01287l03743l35856
3770B5970227l35924k93985k22263k98563l57944k82215l49192l31599k97535
3761B3201007l39700k74167l06557l22111l45423l76693l54122k82313l28861
$$ plain form
3825 51605123 50483389 49512159 48519380 47651124 46910119 46122239 45332786 44698698 44104826
3816 44104826 43575381 43097366 42601401 42165354 41788538 41442067 41007441 40540654 40096387
3807 40096387 39573413 39043217 38449778 37821209 37209058 36641720 36075143 35434848 34873046
3798 34873046 34219739 33593258 32992169 32457837 31997122 31556195 31161569 30772354 30368255
3789 30368255 30058099 29813722 29564467 29371972 29277183 29296063 29261121 29150552 29035770 28862903
3779 28862903 28634016 28276196 27917184 27590340 27211812 26911113 26609826 26306083 25970227
3770 25970227 25634303 25340318 25118055 24819492 24461548 24179333 23830141 23498542 23201007
3761 23201007 22861307 22587140 22280583 21958472 21613049 21236356 20882234 20599921 20271060
3752B0271060m51585l98055m76015m72926m39587m49688n19617m08057m38161
3743A6217369m09721m06150l89832l96076l10877l36883k99863k22311j70674
3734A3274982k26753k34702j77012j51288j99930k80581j59627j60602j16011
3725A1568476j46000j11099j62776n0370o7024n3365j29710j54625j19981n5861
3715A0517665j12339l2621j23896j07760r7582m9707p7854l3186o4147j17495
3705I701078j59576r4561p6189j69224j04896j23207j14368p7818k4399p8395
3695H678445m4838q1491j8351j35628L0181J6020q2036J008j15731q1401j15630
3684H050548r5640j15927j63769r2197p1810j19536r2743m4141m64j2802o9676
$$ plain form
3752 20271060 19819475 19421420 18945405 18472479 18032892 17583204 17063587 16655530 16217369
3743 16217369 15807648 15401498 15011666 14615590 14304713 13967830 13667967 13445656 13274982
3734 13274982 13048229 12813527 12636515 12485227 12285297 12004716 11845089 11684487 11568476
3725 11568476 11422476 11311377 11148601 11098231 11031207 10977842 10848132 10693507 10573526 10517665
3715 10517665 10405326 10372705 10248809 10141049 10043467 9993760 9915906 9882720 9818573 9701078
3705 9701078 9541502 9446941 9370752 9201528 9096632 8973425 8859057 8781239 8756840 8678445
3695 8678445 8633607 8552116 8533765 8398137 8428318 8444338 8362302 8363310 8247579 8166178 8050548
3684 8050548 7954908 7838981 7675212 7583015 7511205 7391669 7298926 7254785 7254321 7241519 7171843
3673G171843j8535K3777q7012l2584q0974j07080J0129j30018m3084j11914o1824
3662F532724o3862r5281q7866o5916j01524k8781q1645r9115o7597m9255n6090
3651E735792j2198q991N4701J9182J2576q735N0856J15001k0099l2796l5071P363
3639E877581J2945k1139p636n212O95j5145j8236m5526p6635n097j7830m2086
3627E636679k4453n488Q502J3394N5427J8861P28j745M5084M0339K0064N4693
3615E862085L813P0154j4714j5539M638N4779m370K4227R088q3601o8236l827
3603E838497M376r779K7339J03883o6572l4902O8347L052l752j742K4707M1644
3591E995098j3200M3457P2671L272K6620k2318K453n9632K6018j9243n7370R435
$$ plain form
3673 7171843 7153308 7177085 7090073 7057489 6976515 6869435 6879564 6749546 6706462 6594548 6532724
3662 6532724 6468862 6373581 6285715 6219799 6118275 6089494 6007849 5908734 5841137 5791882 5735792
3651 5735792 5723594 5714603 5769304 5788486 5801062 5792327 5843183 5958184 5938085 5905289 5870218 5877581
3639 5877581 5890526 5869387 5861751 5856539 5857234 5842089 5823853 5778327 5701692 5696595 5678765 5636679
3627 5636679 5612226 5606738 5615240 5628634 5684061 5702922 5703650 5701905 5746989 5787328 5807392 5862085
3615 5862085 5865898 5936052 5921338 5905799 5910437 5965216 5960846 5985073 5994161 5910560 5842324 5838497
3603 5838497 5842873 5833094 5860433 5964316 5897744 5862842 5931189 5934241 5930489 5928747 5953454 5995098
3591 5995098 5981898 6025355 6098026 6101298 6127918 6105600 6108053 6048421 6074439 6055196 5997826 6007261
3579F007261k9562L2017k0824l9639k0778L765M8977l422P591j2909j1818K8853
3567E989512R11P3882M2036K4685q531L5973j0378J6679M6812o4596J0212l3054
3555F124143n1832K177j406k0590m9257n3954K5643l7972R190O879N2492m9689
3543E955824n3704P9198o407N8172K6285L9982K3613m2046J25534R8844K0168
3532F325463n1086J5796P0075j6894k2010p4858L9611n7718q064n4538j4344J4178
3520F165611m7507J4324M2982j8579J00152N0343J0525l1977N4319M5316M3235
3509F428744J9183j7181J02460P0906Q8020j5359k4940L9610J5944n3553K6390
3498F680224j1039o8593M2864M3346j1605J49k6423O4710J0946J0085J1680J34389
$$ plain form
3579 6007261 5977699 6009716 5988892 5949253 5928475 5932240 5981217 5977795 5985386 5972477 5960659 5989512
3567 5989512 5990423 6064305 6106341 6131026 6122495 6158468 6148090 6164769 6211581 6146985 6157197 6124143
3555 6124143 6072311 6074488 6073082 6052492 6003235 5949281 5974924 5936952 5946142 5953021 6005513 5955824
3543 5955824 5902120 5981318 5974911 6033083 6059368 6099350 6122963 6080917 6206451 6305295 6325463
3532 6325463 6274377 6290173 6360248 6343354 6321344 6246486 6286097 6228379 6220315 6165777 6151433 6165611
3520 6165611 6118104 6132428 6175410 6156831 6256983 6307326 6317851 6285874 6340193 6385509 6428744
3509 6428744 6447927 6430746 6533206 6604112 6692132 6676773 6651833 6691443 6707387 6653834 6680224
3498 6680224 6669185 6600592 6643456 6686802 6675197 6675346 6648923 6713633 6724579 6734664 6746344 6880733
3486F880733R6060L9733N2805M6599O1877R3150O6745J23682K6017O1034P9351
3475G627786J02913N2006k0737R8431L2322n4770j1555J03200P612M463Q6282
3464H027953M8078N4502R3366Q6595J05578J02827K4493O6510Q1701J47431J56055
3453H995089J49922J77571K3269O0800Q1555J03948R6986Q3750J16624Q1407L1003
3442A0001924P4215Q4138O8632P4573J45970P5771N3842Q7154J54657J41990J64736
3431A1127602J43985J92817K11866J52310J89865J11243J63656J65309J51803
3422A2610456J28666K12629J89748K04585J50196J04133J53805J27156J89691
3413A4071065J46674J00368J98263J27593J77040J93748J06421J40756K19521
$$ plain form
3486 6880733 6976793 7016526 7069331 7115930 7177807 7270957 7337702 7461384 7487401 7548435 7627786
3475 7627786 7730699 7782705 7761968 7860399 7892721 7837951 7826396 7929596 7937208 7941671 8027953
3464 8027953 8076031 8130533 8223899 8310494 8416072 8518899 8543392 8609902 8691603 8839034 8995089
3453 8995089 9145011 9322582 9345851 9406651 9488206 9592154 9689140 9772890 9889514 9970921 10001924
3442 10001924 10076139 10160277 10228909 10303482 10449452 10525223 10579065 10666219 10820876 10962866 11127602
3431 11127602 11271587 11464404 11676270 11828580 12018445 12129688 12293344 12458653 12610456
3422 12610456 12739122 12951751 13141499 13346084 13496280 13600413 13754218 13881374 14071065
3413 14071065 14217739 14318107 14516370 14643963 14821003 15014751 15121172 15261928 15481449
3404A5481449K10015K62352K76432K51795L02113K55080K90326K51348K70205
3395A7851115K73075L43458L33863K96715K77149L09856L15661K80822L17212
3386B0598926K36793K46978K80324K57961L20801K77677K98703L84689L85270
3377B3288122L76448L50480M01674M60087M32839M41975N14450M81968M74089
3368B7222132N30824M63720N56063O02082N58990O06300N75295N41177N08681
3359C2165264N83784O15166O33624O98558P16711O53520P00984Q57149Q39379
3350C8464139R56837J186864J223024J401316J574204J684753J831615K045828
3342E0368580K213284K410831K590300K771495K866183K926149L110479L180193
$$ plain form
3404 15481449 15691464 15953816 16230248 16482043 16784156 17039236 17329562 17580910 17851115
3395 17851115 18124190 18467648 18801511 19098226 19375375 19685231 20000892 20281714 20598926
3386 20598926 20835719 21082697 21363021 21620982 21941783 22219460 22518163 22902852 23288122
3377 23288122 23664570 24015050 24416724 24876811 25309650 25751625 26266075 26748043 27222132
3368 27222132 27752956 28216676 28772739 29374821 29933811 30540111 31115406 31656583 32165264
3359 32165264 32749048 33364214 33997838 34696396 35413107 36066627 36767611 37624760 38464139
3350 38464139 39420976 40607840 41830864 43232180 44806384 46491137 48322752 50368580
3342 50368580 52581864 54992695 57582995 60354490 63220673 66146822 69257301 72437494
3334G2437494L207714L070510K913673K448656J817166R38857M6149q96428j910629
3325H4073162k757290l302912l470812l442546l183925l090529k766206k385442
3317E9673500k173449j974960j841595j582048j516125j402467j079281r43923
3309D7159652q50346n78897m12336n04636p06745q67434r61426j037032q95356
3300D0345444p83443q51538r26479p77344p88470p42949p55888q74759p87425
3291C3057149p70191p49448p44821p02064o39551n82051n07662m39172l54527
3282B7567662k90836k50419j68231q2913O8185K70508M21138N87035L46463j89585
3272B8279007o29861j032830j069430j082166j038668r10851p55357p29415o16353
$$ plain form
3334 72437494 75645208 78715718 81629391 84078047 85895213 86834070 86880219 85983791 84073162
3325 84073162 81315872 78012960 74542148 71099602 67915677 64825148 62058942 59673500
3317 59673500 57500051 55525091 53683496 52101448 50585323 49182856 48103575 47159652
3309 47159652 46309306 45730409 45318073 44813437 44106692 43239258 42277832 41240800 40345444
3300 40345444 39562001 38710463 37783984 37006640 36218170 35475221 34719333 33844574 33057149
3291 33057149 32286958 31537510 30792689 30090625 29451074 28869023 28361361 27922189 27567662
3282 27567662 27276826 27026407 26858176 26775263 26843448 27113956 27535094 28122129 28468592 28279007
3272 28279007 27649146 26616316 25546886 24464720 23426052 22515201 21759844 21030429 20414076
3263B0414076n11236m99856m84355m40127l52128l85710l19829l36517k78431
3254A6805887j31838j80329j23801j14671j01060o76R6511k2966R9211J39638
3244A6465906K34872L73169J95732P0950k28809m32228m93434m89771n28493m45641
3234A4722253m41409m19777l44613l05253k25541k92129l03162j65999j79253
3225A2045117j85350k71883j16114o0346p5753q0840j29405n6204j48447o5557
3215A0855218j3512r3025j35502o7362j10149m2895m1847j57977r7221j44853
3205I950875n2391j29409n3975q5895j01156j04809n7392m0241j14611j8290o5305
3194I127401p7484n1944r764M4636m2253l5633L8367j2901L365J5598n087m6703
$$ plain form
3263 20414076 19902840 19402984 18918629 18478502 18126374 17740664 17420835 17084318 16805887
3254 16805887 16674049 16493720 16369919 16255248 16154188 16153512 16250023 16227057 16326268 16465906
3244 16465906 16700778 17073947 17269679 17340629 17111820 16679592 16186158 15696387 15167894 14722253
3234 14722253 14280844 13861067 13516454 13211201 12985660 12693531 12390369 12224370 12045117
3225 12045117 11859767 11587884 11471770 11411424 11335671 11254831 11125426 11069222 10920775 10855218
3215 10855218 10841706 10748681 10613179 10545817 10435668 10392773 10350926 10192949 10095728 9950875
3205 9950875 9898484 9769075 9715100 9629205 9528049 9423240 9365848 9325607 9210996 9192706 9127401
3194 9127401 9049917 8997973 8988209 9032845 8990592 8954959 8993326 8980425 8983790 8999388 8994301 8947598
3182H947598j05609j2018q2324K443q3361q9882m0711m5531p3035p2164q2103
3171H263303l7786k6268p545j5341p7638L7599j8674N5110L6623K9637p673J9037
3159H250384o0415Q390m6809p3574j13246q5444q3858m9367j11526n2531j22512
3148G459492o8935j04645o0404o3754n5953p0756k4177m5632l1256J5228p086
3137F942122l6011R608j8141L5177M3811K3576p8360r6177J2992n0610o4019k9697
3125F694271k2719m7894n3696n3532l8884j31193k4940j08072p8455p3195J2607
3114F074298j8299K8738r6596P6516L0538o191O247M8533J768K7621J15887J5700
3102F304760p164K7982n1107P0184k386j6342r260J9831K1180j727j8659j3963
$$ plain form
3182 8947598 8841989 8829971 8747647 8750090 8666729 8576847 8536136 8490605 8417570 8345406 8263303
3171 8263303 8225517 8199249 8191704 8176363 8098725 8136324 8117650 8172760 8209383 8239020 8231347 8250384
3159 8250384 8189969 8198359 8151550 8077976 7964730 7879286 7795428 7746061 7634535 7582004 7459492
3148 7459492 7390557 7285912 7225508 7161754 7105801 7035045 7010868 6965236 6933980 6949208 6942122
3137 6942122 6906111 6915719 6897578 6932755 6976566 7000142 6921782 6825605 6838597 6787987 6723968 6694271
3125 6694271 6671552 6623658 6569962 6516430 6477546 6346353 6321413 6213341 6134886 6061691 6074298
3114 6074298 6055999 6084737 5988141 6064657 6095195 6089004 6095251 6143784 6145552 6173173 6289060 6304760
3102 6304760 6297596 6325578 6274471 6344655 6342269 6325927 6316667 6336498 6357678 6355951 6337292 6323329
3090F323329k2800Q7494N7489m2133O586R9784Q1787O2830M7688R7836J36050
3079F935940O8261J57212P5161Q1634P0431O2272Q0564P7330J07252O5892M0196
3068G822145J25408Q7898J00974j1773L5585J13119L4521L7762R3067K10900R7549
3057H747155K4873R5888J35529J59038L7263J8122J33287J80944R2441J06300
3047I730840J05574J53658J01704M2258P6181K01851J68881K26000J22586K23511
3037A1153044K14309K13335K00425K73204J74029J51243K46914L21750L12687
3028A3260940L03306K95945M08213M36459M18468L74940L47688K88906L00538
3019A6435403L07820L34669L49454K88263K20320K41440J58773J13114J43110
$$ plain form
3090 6323329 6300529 6388023 6445512 6403379 6409965 6509749 6591536 6654366 6702054 6799890 6935940
3079 6935940 7004201 7161413 7236574 7318208 7388639 7450911 7531475 7608805 7716057 7781949 7822145
3068 7822145 7947553 8035451 8136425 8124652 8160237 8273356 8307877 8345639 8438706 8649606 8747155
3057 8747155 8772028 8867916 9003445 9162483 9199746 9217868 9351155 9532099 9624540 9730840
3047 9730840 9836414 9990072 10091776 10134034 10210215 10412066 10580947 10806947 10929533 11153044
3037 11153044 11367353 11580688 11781113 12054317 12228346 12379589 12626503 12948253 13260940
3028 13260940 13564246 13860191 14268404 14704863 15123331 15498271 15845959 16134865 16435403
3019 16435403 16743223 17077892 17427346 17715609 17935929 18177369 18336142 18449256 18592366
3010A8592366J17993K11538J07891J90065L24648L27676L18538L73370L31267
3001B0895352M53616N19321O36873O29828O91016Q01885P43425Q51902Q27536
2992B7050754P96835R45260Q61576P65211P09171O35338K66785j86731m47399
2983C1396800p04273q62465q92044q01401n95814m89523k87170k05968J5316N3826
2973B6627284K48865L72420L21391L71200M20974N33717N93038N38133M21057
2964C0448079M19332L88242K92531K03516L2574j52222l63193n11451o13360n81413
2954B9562635p30568r77752j002481r47705q53739p13988o04030n34339m33205
2945B2764828l42367k19076j62260o3532j3982j68546p9519j65278j90163k64708
$$ plain form
3010 18592366 18710359 18921897 19029788 19219853 19544501 19872177 20190715 20564085 20895352
3001 20895352 21348968 21868289 22505162 23134990 23826006 24627891 25371316 26223218 27050754
2992 27050754 27847589 28792849 29654425 30419636 31128807 31764145 32030930 31844199 31396800
2983 31396800 30692527 29830062 28938018 28136617 27540803 27051280 26764110 26558142 26573458 26627284
2973 26627284 26876149 27248569 27569960 27941160 28362134 28895851 29488889 30027022 30448079
2964 30448079 30867411 31255653 31548184 31751700 31784274 31632052 31268859 30757408 30144048 29562635
2954 29562635 28832067 27854315 26851834 25904129 25050390 24336402 23732372 23198033 22764828
2945 22764828 22422461 22203385 22041125 21977593 21963611 21795065 21715546 21550268 21360105 21095397
2935B1095397l64086l78163n07000o18858o88037p67909p67969p04954p57126
2926A5541295p34228p19139n72876n14753n48640n08024m62638m37338m23494
2917A0620165l08356k50621k56548k20719k83518k01983j89074j98170j58700
2908H552476k36666j49255j45786k47980k50439j90016k60084j90238j92731j98146
2898F491135k28089k03391p6184j74418j58027j49808j31712j06842j38629j17854
2888E006181m6263j30990j37217j64968r7473o9637n5358p2622O7701o1481q1180
2877D156693r7820r3856m2509q0809l3159n4826m8111k1540j13317j08661p0715
2866C391370m2476m0395n9254p3811k6452o6653j8287j43496q4798o114p9252
$$ plain form
2935 21095397 20731311 20353148 19846148 19227290 18539253 17771344 17003375 16298421 15541295
2926 15541295 14807067 14087928 13515052 13000299 12451659 11943635 11480997 11043659 10620165
2917 10620165 10311809 10061188 9804640 9583921 9300403 9098420 8909346 8711176 8552476
2908 8552476 8315810 8166555 8020769 7772789 7522350 7332334 7072250 6882012 6689281 6491135
2898 6491135 6263046 6059655 5983471 5809053 5651026 5501218 5369506 5262664 5124035 5006181
2888 5006181 4959918 4828928 4691711 4526743 4429270 4359633 4304275 4231653 4299354 4237873 4156693
2877 4156693 4058873 3965017 3922508 3841699 3808540 3753714 3705603 3684063 3570746 3462085 3391370
2866 3391370 3348894 3308499 3249245 3175434 3148982 3082329 3064042 2920546 2835748 2829634 2750382
2855B750382p985j08129n0169p9842o500k3639M662m7750j4437J0823o2410p2322
2843B292684j02090m1425o306p572j7525o5056P265j2358k8829n4369p9517j8457
2831A866445q493p6807n688J9149n1769j06136j09094k4382m3106j6953L1296
2820A474462n4630l4028J8905m4228r824J0912l5583k2445J9488m7935j248l0088
2808A243758r2177J6507N4794k7113K9254l3146J4682J7584n3412m3919j3630
2797A113182O3303P745o3992l4987l0438p8275J4236n5596m8474n2654J9036O0997
2785I14083j8270O0187o1089K0953q4343k0352L1475K2116J7259Q081K0474l971
2773I06603O7533m6253m5814K5712o2964l3142o280j6965j1787k4331K2522k3085
$$ plain form
2855 2750382 2742397 2634268 2584099 2504257 2497757 2474118 2478780 2431030 2416593 2427416 2365006 2292684
2843 2292684 2190594 2149169 2142863 2135291 2117766 2052710 2059975 2047617 2018788 1964419 1884902 1866445
2831 1866445 1857952 1781145 1775457 1794606 1742837 1636701 1527607 1503225 1460119 1443166 1474462
2820 1474462 1419832 1385804 1404709 1360481 1350657 1361569 1325986 1303541 1323029 1275094 1273846 1243758
2808 1243758 1151581 1168088 1222882 1195769 1225023 1191877 1206559 1224143 1170731 1126812 1113182
2797 1113182 1176485 1184230 1120238 1085251 1054813 976538 990774 935178 886704 834050 853086 914083
2785 914083 895813 956000 894911 915864 831521 811169 842644 864760 882019 890100 910574 906603
2773 906603 974136 927883 882069 907781 844817 811675 805395 788430 776643 752312 774834 751749
2761G51749L6276K593j3818q8035k9737L3907O9526K7209K4405p8563n583j6851
2749G13078R193K3007r823l5353j0559P9451o0293p5717M1386n0789l2513P022
2737E98090J1899k7963J6127K6217m5545l9112L6320M239o7016K0293J10012N8704
2725G02265l2434K4147k5007j4753M8657N94o6848l1509K011M241k8258K2465
2713F05571K8987N895n8113m8388r505R782o8880q794R8386N1741o6845m0700
2701D99137K7058J5701L450l8525q648K561J4612M3543m8001o0070N6287K7703
2689E34808J3411m0247j6431n4152k365L0787K3574J9082l2883q4581N5836M845
2677D51684M138N9305l4807k4411k2705M0455J8371K4500N023k6621k3441j8508
$$ plain form
2761 751749 788025 790618 776800 688765 659028 692935 762461 789670 814075 735512 729929 713078
2749 713078 722271 745278 735455 700102 689543 768994 708701 632984 674370 623581 591068 598090
2737 598090 609989 582026 598153 624370 578825 539713 576033 580272 513256 533549 643561 702265
2725 702265 669831 693978 668971 654218 702875 703469 636621 605112 607123 611364 583106 605571
2713 605571 634558 640453 582340 533952 524447 534229 465349 456555 554941 606682 539837 499137
2701 499137 526195 541896 545346 506821 498173 500734 515346 558889 510888 450818 507105 534808
2689 534808 548219 507972 491541 437389 435024 465811 489385 508467 475584 391003 446839 451684
2677 451684 455822 515127 480320 455909 433204 473659 492030 516530 521553 494932 471491 452983
2665D52983l0887k836L4079N639k8537N2673o8304n3300N89L1588o4008j2298
2653C17381L3103J2250j3834n477m8596K0911n7K8161P3062k8113k6566p124M1413
2640C96514p7080O6616K7368n2171n1769p960O4261qq3971l4882n9788J3559j27
2627B00562j0997r457K0432J2183Q658J4778r059M1716L2892N753q101P8401j7125
2614C60636o0562K446O6901p9721L0905K92o2863O6979m0023m5019P026p897K0952
2601B60052o6991q555l2601k085J7452N726l4984M5423M9285o5065n0077N9046
2589A76626O5215P532n6486n7860L9792N0900j0391L2L9809j9168l4727M151K2517
2576B27942n276q4486k2343k7429n192L2823L1802k3273L320M8903K1244K5188
$$ plain form
2665 452983 422096 419260 453339 458978 430441 483114 414810 361510 362099 393687 329679 317381
2653 317381 350484 362734 348900 343423 294827 315738 315681 343842 416904 388791 362225 355101 396514
2640 396514 319434 386050 413418 361247 309478 301518 365779 365771 281800 246918 187130 200689 200562
2627 200562 189565 180108 200540 212723 221381 236159 227100 268816 301708 307461 299360 377761 360636
2614 360636 300074 302520 369421 289700 320605 320897 258034 325013 284990 239971 246997 239100 260052
2601 260052 193061 184506 151905 149820 167272 172998 138014 183437 232722 167657 117580 176626
2589 176626 241841 249373 192887 135027 174819 225719 215328 215360 255169 236001 201274 205425 227942
2576 227942 222666 138180 115837 88408 83216 116039 147841 124568 127888 176791 198035 223223
2564B23223j2929l9633o0891P4072o069k2494j0189L8223K5134m7835l3501M6124
2552A73235k090l1910J4369K4875j5022n4269k4732Q8691p3734m4626K2634j5784
2540F1637K5420N6365q707Q950j7759J0752R2136K5447p949l7522o1611K6789
2528A73948k8087J6136m3602k1007j8394j15O356p3338l1386P7171k836l7388
2516A7458M3727p8430J3238L4110N5644k5106m8759L0930K00O9783J6078m505
2504A24368j9953k7906L4038k5757L8134J7727K702l1478p066j4413p5300m462
2492A0634o0188k9303M5444L2974K0289N0821m383Q7950l0562r3699l4142j1722
2480a5887Q4740N1532l4052K6128L5613j05040m7556P178J7867j3235J4788k9151
$$ plain form
2564 223223 210294 170661 109770 183842 177773 155279 145090 183313 208447 160612 127111 173235
2552 173235 171145 139235 153604 178479 163457 109188 84456 173147 99413 54787 77421 61637
2540 61637 87057 143422 134715 143665 125906 136658 228794 254241 246292 208770 147159 173948
2528 173948 145861 161997 118395 97388 78994 78879 85235 11897 -19489 57682 54846 17458
2516 17458 61185 -17245 -4007 30103 85747 60641 11882 42812 43012 112795 128873 124368
2504 124368 104415 76509 110547 84790 122924 140651 143353 111875 104809 90396 15096 10634
2492 10634 -49554 -78857 -33413 -439 19850 70671 66288 154238 123676 29977 -4165 -15887
2480 -15887 68853 120385 86333 112461 148074 43034 -4522 2656 20523 7288 22076 -7075
2468g075L5892n2021J8532j1601l3927k7930j7401N0412j5271P452O676J541L9815
2455d906j7137L6216K6984p7593K6003J18757L2776j16972o1748m5540K4969q679
2443f6870k0331N6447k0253l482L8227m8620l6241N7536O7600m4212p731K5067
2431b863K8372j6273n5465O8053M9017K3728m9490l6673l6420M5735J7837l8838
2419c280q157k6368K6767j282q970p3m4019p0275J2476N4493Q789J025n4931N8397
2405e5408l9627j3998N0762K2550J767j0140j855L0088m797M893l0870n4341N96
2392a00380M3801k6791K9478O4230o745o1325m1638j5788L2338L2726M622J914
2380d3558o6050K495J5822L2107l8260N2310m6151R991j9O6801N8819m4961J1852
$$ plain form
2468 -7075 28817 -23204 -4672 -16273 -50200 -78130 -95531 -45119 -60390 -52938 -46262 -44721 -4906
2455 -4906 -22043 14173 41157 -36436 -10433 108324 141100 24128 -37620 -83160 -58191 -66870
2443 -66870 -87201 -30754 -51007 -54489 -16262 -64882 -101123 -43587 24013 -20199 -27930 -2863
2431 -2863 25509 9236 -46229 21824 70841 94569 45079 8406 -28014 17721 35558 -3280
2419 -3280 -11437 -37805 -11038 -12320 -21290 -21363 -65382 -135657 -123181 -68688 -59899 -58874 -113805 -55408
2405 -55408 -95035 -109033 -58271 -35721 -33954 -44094 -45949 -15861 -20658 -15765 -46635 -100976 -100380
2392 -100380 -56579 -83370 -53892 10338 3593 -57732 -99370 -115158 -82820 -50094 -45472 -43558
2380 -43558 -109608 -107113 -91291 -59184 -97444 -45134 -91285 -81294 -81313 -14512 44307 -654 11198
2367A1198j0405N051j9774N5958o301j06465N141Q1012n7084n7296M8520n6717
2355a07162j14935K4275K4136O6879M0275K192Q5737L7873n6853j0306J90r0190
2343i7889J39031j92o1432j8892N547O200l7587K2679o553N6237m2972l2411k205
2330g0439P879Q165k3736N6129o383n6827L6652M8590J0420m5852J341O200k3280
2317e1141J3632P452N584Q063r351L7519K9979m328j6260n4930L8919M7217l5948
2304A6407n2623j4805L6402O2168q9329o9294L666O9747K1538M06L4437O626M2487
2291F7833L1845j1477K2930o0368N3541R9441J4068p7486k8260M2254K1667k1447
2279A54541j6732P88J2957l3830j1548L628P649m4428p3348J00970K8172j445
$$ plain form
2367 11198 793 5844 -13930 42028 35727 -70738 -65597 15415 -41669 -98965 -50445 -107162
2355 -107162 -222097 -197822 -173686 -106807 -66532 -64340 21397 59270 2417 -7889 -7699 -97889
2343 -97889 41142 40950 -20482 -39374 -33827 -27627 -65214 -42535 -49088 7149 -35823 -68234 -70439
2330 -70439 -62560 -54395 -78131 -22002 -28385 -85212 -48560 30 10450 -35402 -34061 -27861 -51141
2317 -51141 -37509 -30057 -24473 -16410 -25761 11758 41737 37409 21149 -33781 5138 52355 16407
2304 16407 -36216 -51021 -14619 47549 -41780 -111074 -107408 -37661 -16123 -15717 18720 25346 67833
2291 67833 99678 88201 111131 50763 104304 203745 217813 140327 112067 154321 175988 154541
2279 154541 137809 138597 151554 117724 106176 109804 117453 73025 -323 100647 128819 127374
2267A27374N8494m888o4197K8975J07137l4919J9293J192l9935K3162K9982o889
2255B44781j0323l018q919L6917L246j8474J9655O8363j5042k4690l7036j080
2243B54380O804K3158j2649M4646J7319O3485J788K9242k039l3430m2215O758
2231C57247Q6152j4154K7223L2147K0680M1285M2360L9055l7812j9061K1952L8553
2219F35627N8146l1953J1002O7422J1167K2266R6807K6005N6066J12690L2268
2208A097513N9068O2816J60293Q8363J74222J38616J75677J89445J61155K68615
2198B575783K75783K87182L31997L60580M09933M74092Q05474R27936J155684
2189G604444J241385J239802N12935j257987j731452j385552r21507p35623o15084
$$ plain form
2267 127374 185868 180980 116783 145758 252895 217976 237269 238461 198526 221688 251670 244781
2255 244781 234458 231440 222521 259438 262684 244210 263865 332228 317186 292496 255460 254380
2243 254380 261184 284342 271693 316339 333658 397143 398931 428173 426134 392704 350489 357247
2231 357247 443399 429245 456468 488615 509295 550580 592940 631995 594183 575122 597074 635627
2219 635627 693773 661820 672822 740244 751411 773677 870484 896489 952555 1065245 1097513
2208 1097513 1156581 1219397 1379690 1468053 1642275 1780891 1956568 2146013 2307168 2575783
2198 2575783 2851566 3138748 3470745 3831325 4241258 4715350 5520824 6448760 7604444
2189 7604444 8845829 10085631 10598566 9340579 7609127 6223575 5302068 4566445 3951361
2180C951361n39746n20007l33012l12231j73201j62081k42839j30020j50913j62772
2170A224539j76412k23067j01292l7620q5904n8665j8225l4160m55k7829r942
2159D50968N9676O286m4055K529m335p6562l3639L1283l3712r7671K234n7414
2147B05588l0648M9280j5592o1846p2648P472l1371L1520j7569k37K6474k299
2135H8124l423M696M627J7882L3944j3008L6465j4180Q556m739k7575p188L0583
2122A54764p7124K0951j6408o8648J3418N9486k6939m0997k7443P989n9400k7325
2110h7676J1164N3763o3597j2571J19741k213L2525K9488l8841K7788m8598l0106
2098i133J00309p1632m9386Q960K2546o931p9792J3867o848M700l5990J3682l002
$$ plain form
2180 3951361 3411615 2891608 2558596 2246365 2073164 1911083 1668244 1538224 1387311 1224539
2170 1224539 1048127 825060 723768 686148 600244 541579 523354 489194 488739 460910 450968
2159 450968 510644 516930 472875 475404 471069 394507 360868 392151 358439 260768 263002 205588
2147 205588 174940 224220 208628 146782 74134 81606 50235 81755 64186 63949 90423 88124
2135 88124 84701 89397 94024 111906 145850 132842 169307 155127 163683 158944 131369 124181 154764
2122 154764 77640 98591 82183 13535 26953 86439 59500 18503 -8940 -951 -60351 -87676
2110 -87676 -76512 -22749 -86346 -98917 20824 18611 51136 80624 41783 69571 20973 -9133
2098 -9133 91176 19544 -29842 -20882 1664 -5267 -85059 -71192 -78040 -73340 -109330 -95648 -98650
2085i8650m6414L780J9999K6424K2001J4922j1273J426O3899K6651K1237L1637
2073G5639n9200p740m9688J6019M0007J8241K1319j2753J375m4928o953k0485
2061b9147n4075j5690m1961J3008L4788k1809K0547l2326n3992O1842K9671O7588
2049b1556L3889N0195j8134p140j6558O275L2986k0348o0192j9836j7767O1123
2037B937k4449o0710o139j2563n5842k0294R247J1680K1357K6018J2194k2540
2025a19104L2296O2792M0182q258k6224j8495Q8959n6292O169j3853j10963M8218
2013g4573N7671L434Q244m5989p2373q951K988k7283J0961M6838O111k9706k5053
2000a47681P4174J5652j7581J728M0339n2053k5800M2080j3795N349k2116M1927
$$ plain form
2085 -98650 -145064 -141284 -121285 -94861 -72860 -57938 -69211 -67785 -3886 22765 44002 75639
2073 75639 16439 8699 -40989 -24970 15037 33278 54597 41844 43219 -1709 -8662 -29147
2061 -29147 -83222 -98912 -140873 -127865 -93077 -114886 -94339 -126665 -180657 -118815 -89144 -21556
2049 -21556 12333 62528 44394 37254 20696 26971 59957 39609 -20583 -40419 -58186 2937
2037 2937 -21512 -82222 -88361 -100924 -156766 -177060 -167813 -156133 -134776 -108758 -96564 -119104
2025 -119104 -86808 -24016 16166 7908 -18316 -36811 52148 -4144 2025 -11828 -122791 -74573
2013 -74573 -16902 -13468 -5224 -51213 -123586 -132537 -129549 -156832 -145871 -99033 -92922 -122628 -147681
2000 -147681 -73507 -57855 -75436 -73708 -33369 -85422 -111222 -69142 -82937 -77588 -99704 -57777
1988e7777K4983m5862L0205L6871n5148Q352j6434N926j9935J0443K6457l9104
1976i1023k1482r6054N5301Q4180j6775K0276K2420r733k4872K7634N1951o2487
1964f0664K1789o3079N2834L2870j8378m691l5440J1688K0395J1170j9886k5996
1952g7388q8365N5156N0236J6537k0028p944j6189k9437l290K5200K8537L4280
1940c2695j3325j4634o502J7639K658O5433k0789j4616k2931Q795j4242K969o5947
1927a08187p161J0457j8834J6759L0293O1783k4736L8480o2573n5867N8105M3128
1915a8353J2956J9216l9497k5482K599L342k6938n3657N8495M5501l1957J741
1903e2034k1945n2877P554J8497p6419J7495K9162J5522j5307N036K9283r080
$$ plain form
1988 -57777 -32794 -78656 -48451 -11580 -66728 -58376 -74810 -68884 -88819 -78376 -51919 -91023
1976 -91023 -112505 -208559 -153258 -69078 -85853 -65577 -43157 -52890 -77762 -50128 1823 -60664
1964 -60664 -38875 -101954 -49120 -16250 -34628 -39319 -74759 -63071 -42676 -31506 -51392 -77388
1952 -77388 -165753 -110597 -60361 -43824 -63852 -71796 -87985 -117422 -120712 -95512 -66975 -32695
1940 -32695 -46020 -60654 -67156 -49517 -46859 18574 -2215 -16831 -39762 -30967 -45209 -42240 -108187
1927 -108187 -115348 -104891 -123725 -106966 -76673 -14890 -39626 -1146 -63719 -119586 -61481 -18353
1915 -18353 -5397 13819 -25678 -51160 -48561 -45219 -72157 -125814 -67319 -21818 -53775 -52034
1903 -52034 -73979 -126856 -119302 -100805 -177224 -159729 -130567 -115045 -130352 -125316 -96033 -105113
1891a05113N0818l5031q4782L2941P7707K3107l8336j7395N680j8467K0864L6311
1879e1696l1857n6740r291j5793K6264N6440n1704K6660L4427o8782j9059N4654
1867a06477K5014k7905m374l645l4396J2231O5876k2782q551K6949N7271M6248
1855B5459n7671P2703j3032r623m2455m6725q26J6167n8915j8030j6802q7139
1843b36889P4815k3694M7756J0295M6723q314j2901l4648o0426K4786O6845Q902
1831i6750O8473K3131j2937l053O962q651p6584J7504m7179P8836M6090m1895
1819d6053l1372k3779l8803K615K7985M3733m7156K3284L9974j8367K1248j22654
1807a69345L1443K2397j5130R471O5858j5949K2349L6771j0763l4156o3715P238
$$ plain form
1891 -105113 -54295 -89326 -174108 -141167 -63460 -40353 -78689 -96084 -90404 -108871 -88007 -51696
1879 -51696 -83553 -140293 -149584 -165377 -139113 -82673 -134377 -107717 -73290 -142072 -161131 -106477
1867 -106477 -81463 -109368 -113742 -117387 -151783 -139552 -73676 -96458 -105009 -78060 -20789 25459
1855 25459 -32212 40491 27459 17836 -24619 -71344 -72170 -56003 -114918 -132948 -149750 -236889
1843 -236889 -162074 -185768 -138012 -127717 -80994 -89308 -102209 -136857 -197283 -172497 -105652 -96750
1831 -96750 -28277 -5146 -18083 -21136 -14174 -22825 -99409 -81905 -129084 -50248 -4158 -46053
1819 -46053 -77425 -101204 -140007 -137392 -109407 -65674 -112830 -89546 -49572 -67939 -46691 -169345
1807 -169345 -137902 -115505 -130635 -121164 -55306 -71255 -48906 -12135 -22898 -57054 -120769 -113531
1795a13531K7247K57m7682O756J4874M2942P5621L255k5639j3121j2165j6269
1783e7455J106Q325o3649J6490N8298L690o6437N5243K9462j2898k4828k1963
$$ plain form
1795 -113531 -86284 -86027 -133709 -126953 -112079 -69137 6484 9739 -15900 -29021 -41186 -57455
1783 -57455 -56349 -48024 -111673 -95183 -36885 -33195 -99632 -44389 -14927 -27825 -52653 -74616
$$ [...]
##END NTUPLES=NMR SPECTRUM
##END=
