##TITLE=1H_CG-1201-0
 CDCl3
 8 sc, 
 5.4.2024
##JCAMPDX= 6.0         $$ Bruker NMR JCAMP-DX V2.0
##DATA TYPE= NMR SPECTRUM
##DATA CLASS= NTUPLES
##ORIGIN= UXNMR, Bruker Analytische Messtechnik GmbH
##OWNER= root
$$ XWIN-NMR		Version 3.5
$$ Fri Apr  5 14:10:08 2024 Russian Standard Time (UT+4h)  she@DPX200
##.OBSERVE FREQUENCY= 200.1309
##.OBSERVE NUCLEUS= ^1H
##.ACQUISITION MODE= SIMULTANEOUS
##.ACQUISITION SCHEME= undefined
##.AVERAGES= 8
##.DIGITISER RES= 18
##SPECTROMETER/DATA SYSTEM= spect
##.PULSE SEQUENCE= zg30
##.SOLVENT NAME= MeOD
##.SHIFT REFERENCE= (INTERNAL, MeOD, 0, 15.7282)
##AUDIT TRAIL= $$ (NUMBER, WHEN, WHO, WHERE, WHAT)
$$ ##TITLE= Audit trail, XWIN-NMR		Version 3.5
$$ ##JCAMPDX= 5.01
$$ ##ORIGIN= Bruker BioSpin GmbH
$$ ##OWNER= she
$$ F:/spectra/data/she/nmr/H-F/1/pdata/1/auditp.txt
$$ ##AUDIT TRAIL=  $$ (NUMBER, WHEN, WHO, WHERE, WHAT)
(   1,<2024-04-05 14:08:58.35 +0400>,<she>,<DPX200>,
      <created by zg, POWCHK disabled, PULCHK disabled
       configuration hash MD5:
       00 E9 B6 7A A2 85 ED C7 34 08 36 98 17 FE 4E 26
       data hash MD5: 16K
       D4 B0 EE 94 CD 21 6D A2 A7 3F 32 E9 E5 73 81 79>)
(   2,<2024-04-05 14:09:00.85 +0400>,<she>,<DPX200>,
      <Start of raw data processing
       efp BC_mod = 2 LB = 0.24 FT_mod = 6 PKNL = 1 PHC0 = -25453.3 PHC1 = 6.58731 SI = 16K 
       data hash MD5: 16K
       EA B5 96 44 1B DB 8D F6 A9 AA 29 B8 EA AA 8C 6E>)
(   3,<2024-04-05 14:09:19.62 +0400>,<she>,<DPX200>,
      <pk PHC0 = -0.5399867 PHC1 = 2 
       data hash MD5: 16K
       15 44 7D B6 20 BA 7D 96 7A 0B 6F 89 78 91 CD AD>)
(   4,<2024-04-05 14:09:25.70 +0400>,<she>,<DPX200>,
      <abs ABSG = 5 
       data hash MD5: 16K
       06 7C 22 4D 4E 0F 2B 29 F0 11 36 18 C3 DE ED C2>)
$$ ##END=
$$ 
$$ hash MD5
$$ DE 8B 4A 19 2B 07 74 4F C1 38 62 04 BD D9 B7 6E
##$RELAX= 
##$RELAX= 
##$RELAX= 
##$RELAX= 
##$RELAX= 
##$RELAX= 
$$ Bruker specific parameters
$$ --------------------------
##$DU= <F:/spectra>
##$EXPNO= 1
##$NAME= <H-F>
##$PROCNO= 1
##$TYPE= <nmr>
##$USER= <she>
##$AMP= (0..31)
100 100 100 100 100 100 100 100 100 100 100 100 100 100 100 100 100 100 
100 100 100 100 100 100 100 100 100 100 100 100 100 100 
##$AQSEQ= 0
##$AQ_mod= 1
##$AUNM= <au_zg>
##$AUTOPOS= <>
##$BF1= 200.13
##$BF2= 200.13
##$BF3= 200.13
##$BF4= 200.13
##$BF5= 200.13
##$BF6= 200.13
##$BF7= 200.13
##$BF8= 200.13
##$BYTORDA= 1
##$CFDGTYP= 0
##$CFRGTYP= 5
##$CHEMSTR= <none>
##$CNST= (0..31)
1 1 145 1 1 1 1 1 1 1 1 1 1 1 1 1 1 1 1 1 1 1 1 1 1 1 1 1 1 1 1 1 
##$CPDPRG= <>
##$CPDPRG1= <>
##$CPDPRG2= <>
##$CPDPRG3= <>
##$CPDPRG4= <mlev>
##$CPDPRG5= <mlev>
##$CPDPRG6= <mlev>
##$CPDPRG7= <mlev>
##$CPDPRG8= <mlev>
##$CPDPRGB= <>
##$CPDPRGT= <>
##$D= (0..31)
0 1.2 0 0 0 0 0 0 0 0.06 0 0.03 0 0 0 0 0.0002 0 0 0 0 0 0 0 0 0 0 0 0 
0 0 0 
##$DATE= 1712311737
##$DBL= (0..7)
120 120 120 120 120 120 120 120 
##$DBP= (0..7)
150 150 150 150 150 150 150 150 
##$DBP07= 0
##$DBPNAM0= <>
##$DBPNAM1= <>
##$DBPNAM2= <>
##$DBPNAM3= <>
##$DBPNAM4= <>
##$DBPNAM5= <>
$$ [...]
##$SUBNAM3= <"">
##$SUBNAM4= <"">
##$SUBNAM5= <"">
##$SUBNAM6= <"">
##$SUBNAM7= <"">
##$SUBNAM8= <"">
##$SUBNAM9= <"">
##$SW= 18.0517689322627
##$SWIBOX= (0..15)
0 0 2 0 0 0 0 0 0 0 0 0 0 0 0 0 
##$SW_h= 3612.71676300578
##$TD= 16384
##$TD0= 1
##$TE= 0
##$TE2= 300
##$TE3= 300
##$TEG= 300
##$TL= (0..7)
0 120 120 120 120 120 120 120 
##$TP= (0..7)
150 150 150 150 150 150 150 150 
##$TP07= 0
##$TPNAME0= <>
##$TPNAME1= <>
##$TPNAME2= <>
##$TPNAME3= <>
##$TPNAME4= <>
##$TPNAME5= <>
##$TPNAME6= <>
##$TPNAME7= <>
##$TPOAL= (0..7)
0.5 0.5 0.5 0.5 0.5 0.5 0.5 0.5 
##$TPOFFS= (0..7)
0 0 0 0 0 0 0 0 
##$TUNHIN= 0
##$TUNHOUT= 0
##$TUNXOUT= 0
##$USERA1= <user>
##$USERA2= <user>
##$USERA3= <user>
##$USERA4= <user>
##$USERA5= <user>
##$V9= 5
##$VALIST= <valist>
##$VCLIST= <CCCCCCCCCCCCCCC>
##$VD= 0
##$VDLIST= <DDDDDDDDDDDDDDD>
##$VPLIST= <PPPPPPPPPPPPPPP>
##$VTLIST= <TTTTTTTTTTTTTTT>
##$WBST= 1024
##$WBSW= 4
##$XGAIN= (0..3)
0 0 0 0 
##$XL= 0
##$YL= 0
##$YMAX_a= 463250
##$YMIN_a= -505019
##$ZGOPTNS= <>
##$ZL1= 120
##$ZL2= 120
##$ZL3= 120
##$ZL4= 120
##$ABSF1= 15.66319
##$ABSF2= -2.3887
##$ABSG= 5
##$ABSL= 3
##$ALPHA= 0
##$AQORDER= 0
##$ASSFAC= 0
##$ASSFACI= 0
##$ASSFACX= 0
##$ASSWID= 0
##$AUNMP= <proc_1d>
##$AZFE= 0.1
##$AZFW= 0.1
##$BCFW= 0
##$BC_mod= 2
##$BYTORDP= 0
##$COROFFS= 0
##$CY= -3
##$DATMOD= 1
##$DC= 0
##$DFILT= <>
##$DTYPP= 0
##$F1P= 0
##$F2P= 0
##$FCOR= 1
##$FTSIZE= 16384
##$FT_mod= 6
##$GAMMA= 0
##$GB= 0
##$INTBC= 1
##$INTSCL= 3.70164e-10
##$ISEN= 128
##$LB= 0.24
##$LEV0= 0
##$LPBIN= 0
##$MAXI= 10000
##$MC2= 0
##$MEAN= 0
##$ME_mod= 0
##$MI= 1.114404
##$NCOEF= 0
##$NC_proc= -7
##$NLEV= 6
##$NOISF1= 3.799351
##$NOISF2= 2.8
##$NSP= 0
##$NTH_PI= 0
##$NZP= 0
##$OFFSET= 15.72819
##$PC= 1
##$PHC0= -25453.84
##$PHC1= 8.58731
##$PH_mod= 1
##$PKNL= yes
##$PPARMOD= 0
##$PSCAL= 0
##$PSIGN= 0
##$REVERSE= no
##$SF= 200.129558681966
##$SI= 16384
##$SIGF1= 3
##$SIGF2= 2
##$SINO= 5.538805
##$SIOLD= 16384
##$SREGLST= <1H.CDCl3>
##$SSB= 0
##$STSI= 16384
##$STSR= 0
##$SW_p= 3612.71676300577
##$SYMM= 0
##$S_DEV= 0
##$TDeff= 16384
##$TDoff= 0
##$TI= <>
##$TILT= no
##$TM1= 0
##$TM2= 0
##$TOPLEV= 0
##$USERP1= <user>
##$USERP2= <user>
##$USERP3= <user>
##$USERP4= <user>
##$USERP5= <user>
##$WDW= 1
##$XDIM= 16384
##$YMAX_p= 416106843
##$YMIN_p= -750993
$$ End of Bruker specific parameters
$$ ---------------------------------
##NTUPLES= NMR SPECTRUM
##VAR_NAME=  FREQUENCY,     SPECTRUM/REAL,   SPECTRUM/IMAG
##SYMBOL=    X,             R,               I
##VAR_TYPE=  INDEPENDENT,   DEPENDENT,       DEPENDENT
##VAR_FORM=  AFFN,          ASDF,            ASDF
##VAR_DIM=   16384,         16384,           16384
##UNITS=     HZ,            ARBITRARY UNITS, ARBITRARY UNITS
##FACTOR=    0.220516191357247, 1,           1
##FIRST=     3147.67580803241, 0,            0
##LAST=      -465.040954973357, 0,           0
##MIN=       -465.040954973357, -750993,     0
##MAX=       3147.67580803241, 416106843,    0
$$ Real data points
##PAGE= N=1
##DATA TABLE= (X++(R..R)), XYDATA
$$ [...]
5962B455872K9503k8247O5281P4435m5182o3863O649J3435q792L3545q050l7535
5950B487051l6814Q7392M5281M4610j2497R027o707N8777l260J6215M6381M1811
5938B777267N5623J4268j3306N515K9560J0851J6331K3516j9224N0064M8143m42
5926B998166K5930J21993J7977J5097J21013M1161n9999j5623K7827M4941K5631
5915C364114J87185J9177l3644Q5757k877K5978j8509P3559m562Q2511K4267J7501
5903C820457M2776M1855L0049j3456K4212O6661j4464L9638O5906K3211K3022
5892D149867R6422M1648R7424Q9539R2682O4587J00209J28031L7402M0485N9787
5881D998083P9295j4960P0657J4377N0423M6320r725j07113p7463M6882n9978
$$ plain form
5962 2455872 2485375 2457128 2522409 2596844 2551662 2487799 2494448 2507883 2499091 2532636 2524586 2487051
5950 2487051 2450237 2537629 2582910 2627520 2615023 2624050 2617343 2676120 2672860 2689075 2735456 2777267
5938 2777267 2832890 2847158 2833852 2839367 2868927 2879778 2896109 2919625 2900401 2950465 2998608 2998166
5926 2998166 3024096 3146089 3164066 3179163 3300176 3341337 3281338 3265715 3293542 3338483 3364114
5915 3364114 3551299 3570476 3536832 3622589 3619712 3645690 3627181 3700740 3696178 3778689 3802956 3820457
5903 3820457 3863233 3905088 3935137 3921681 3945893 4012554 3998090 4037728 4103634 4126845 4149867
5892 4149867 4246289 4287937 4385361 4474900 4567582 4632169 4732378 4860409 4897811 4938296 4998083
5881 4998083 5077378 5062418 5133075 5147452 5197875 5244195 5234470 5127357 5049894 5096776 5036798
5870E036798o5779M2510m6116O8951J20927N1444Q0083N3741P4308Q6214J75359
5859E678440J03462P2621K5536N9879J50474J4069K2890O5134Q0375j2226P1721
5848F332375N880j150k4266n978K123P0757O8667J6351R2570J39626J62683P7287
5836F936925P2353R0281J52382J53627J57719J06759J19843J76729J20566N1396
5826H138580Q5296J25910R1520j377L6152Q9622k3588J1817J00599P9661L1261
5815H765453J39276K40595J57048J13863J59629K54404K69948J80142K15781K27060
5805A0723199J75944J77053K10161K37374K05304J77661J26484J60418J72949
5796A2366547J93459J79106K15029K42676J94318K22693K36572K82946L02859
$$ plain form
5870 5036798 4971019 5013529 4967413 5036364 5157291 5208735 5288818 5342559 5416867 5503081 5678440
5859 5678440 5781902 5854523 5880059 5939938 6090412 6104481 6127371 6192505 6272880 6260654 6332375
5848 6332375 6338255 6337105 6312839 6306861 6308984 6379741 6448408 6464759 6557329 6696955 6859638 6936925
5836 6936925 7009278 7099559 7251941 7405568 7563287 7670046 7789889 7966618 8087184 8138580
5826 8138580 8223876 8349786 8441306 8439929 8476081 8565703 8542115 8553932 8654531 8734192 8765453
5815 8765453 8904729 9145324 9302372 9416235 9575864 9830268 10100216 10280358 10496139 10723199
5805 10723199 10899143 11076196 11286357 11523731 11729035 11906696 12033180 12193598 12366547
5796 12366547 12560006 12739112 12954141 13196817 13391135 13613828 13850400 14133346 14436205
5787A4436205L13701L73219L01233K44561L25005L18025L01106L22950M81784
5778A7417789K94783K13221L88251K92240K39192L13385L85993K66593L30350
5769B0141797L69856M14405L15152L49547M57199M71866L66791M47030M94076
5760B3827719N49282N68384M67902N91218O64169N91362O33711P79808P49627
5751B9423182Q36058Q27810R10987Q59558R42091J020245J012078J016411J126670
5742C7975090J293990J314858J393077J598103J670550J904038K109982K304068
5734E1563756K609803L014291L219498L417455L510504L446896L247912K694383
5726G6724498K196651J624502J174955P09481J58417m04963p42740q28199p19179
$$ plain form
5787 14436205 14749906 15123125 15424358 15668919 15993924 16311949 16613055 16936005 17417789
5778 17417789 17712572 17925793 18314044 18606284 18845476 19158861 19544854 19811447 20141797
5769 20141797 20511653 20926058 21241210 21590757 22047956 22519822 22886613 23333643 23827719
5760 23827719 24377001 24945385 25413287 26004505 26668674 27260036 27893747 28673555 29423182
5751 29423182 30259240 31087050 31998037 32857595 33799686 34819931 35832009 36848420 37975090
5742 37975090 39269080 40583938 41977015 43575118 45245668 47149706 49259688 51563756
5734 51563756 54173559 57187850 60407348 63824803 67335307 70782203 74030115 76724498
5726 76724498 78921149 80545651 81720606 82430087 82588504 82183541 81440801 80612602 79893423
5717G9893423n61310l03490K1660N29514R89382J566407K131457K669413L243794
5708I0180250L943825M641800N315742N984326O598753O884894O666157N906646
5700A36122393M616783L066041J474340L21792p76998j992020l019876l578505
5692A36233950l538612l100057k198711j296243n85585M4374M59746O41938Q21337
5683A27482137R51618R18488J051446R79154P60702Q03700Q87962Q69391O15061
5674A35319659L07616j67370m39789p53095q25517r09944q47160n59085o2520
5665A31062795Q85484J778095K583248L254623L511481L119638K258552J172721
5657A49626637K09519q19593j908219l182722m549447n897017o624084o881271
$$ plain form
5717 79893423 79332113 79028623 79050283 79579797 80569179 82135586 84267043 86936456 90180250
5708 90180250 94124075 98765875 104081617 110065943 116664696 123549590 130215747 136122393
5700 136122393 140739176 143805217 145279557 145601349 144824351 142832331 139812455 136233950
5692 136233950 132695338 129595281 127396570 126100327 125514742 125559116 126018862 126660800 127482137
5683 127482137 128433755 129352243 130403689 131382843 132143545 132947245 133835207 134704598 135319659
5674 135319659 135627275 135459905 135020116 134267021 133441504 132531560 131684400 131125315 131062795
5665 131062795 131948279 133726374 136309622 139564245 143075726 146195364 148453916 149626637
5657 149626637 149836156 149016563 147108344 143925622 139376175 133479158 126855074 119973803
5649A19973803o803334o335963n990916n354582m615736l872558l104550k369790
5641H1526374j525369q48349j17954M72461J015226J262997J329403J192999P07663
5632H5015451J57092k99907j023548j710090k282229l080824l668622m060871
5624F9046452m333598m311796m284984m117740l797453l495542l159115k789520
5616C8756704k461636k350640k108457j801660j718612j480419j322719j275752
5608B4236809j102648r65886r91344p91676q40535p66078o24587o42638n57017
5599A6954400m65210n02855m40915m32914l11512m21079l77436l13894k79984
5590A3408601l14054l32541j29427l08883l04396k51772j62584k22444k29686
$$ plain form
5649 119973803 113170469 106834506 100843590 95489008 90873272 87000714 83896164 81526374
5641 81526374 80001005 79152656 79034702 79507163 80522389 81785386 83114789 84307788 85015451
5632 85015451 85172543 84872636 83849088 82138998 79856769 76775945 73107323 69046452
5624 69046452 64712854 60401058 56116074 51998334 48200881 44705339 41546224 38756704
5616 38756704 36295068 33944428 31835971 30034311 28315699 26835280 25512561 24236809
5608 24236809 23134161 22168275 21176931 20385255 19544720 18778642 18154055 17511417 16954400
5599 16954400 16489190 15986335 15545420 15112506 14800994 14379915 14002479 13688585 13408601
5590 13408601 13094547 12762006 12632579 12323696 12019300 11767528 11604944 11382500 11152814
5581A1152814j16537j74222k64069j93382j44304j35363j62742q3149j62017j59931
5571I557098j37473j49095k45685j77047j12431j82674j35158j33077j42900n6271
5561H085287j40692j6716j44956j30022m4447k9051m8065r9924l2390k3421r0252
5550G285351k0002k6519o1622R497l1219k9845j01070j16986j03837o3003r9431
5539F641314j43104j22857r1591j31328j14278l3667j51908n0901Q165o8128q2429
5528E659288n3242Q974K2700j6273J9079q2152N7329N0112q564m4819q350j1363
5516E592719o4643m9034j63744o3700m6173k4546n3903n6061j04213n3862n8689
5505D854151J1512o1076m2764N704j3842j6788K3950m8811k0788k6263l5495m2963
$$ plain form
5581 11152814 11036277 10862055 10597986 10404604 10260300 10124937 9962195 9879046 9717029 9557098
5571 9557098 9419625 9270530 9024845 8847798 8735367 8552693 8417535 8284458 8141558 8085287
5561 8085287 7944595 7927879 7782923 7652901 7608454 7579403 7531338 7431414 7399024 7375603 7285351
5550 7285351 7265349 7238830 7177208 7186705 7155486 7125641 7024571 6907585 6803748 6740745 6641314
5539 6641314 6498210 6375353 6283762 6152434 6038156 6004489 5852581 5801680 5809845 5741717 5659288
5528 5659288 5606046 5615020 5637720 5621447 5640526 5558374 5615703 5665815 5657251 5612432 5604082 5592719
5516 5592719 5528076 5479042 5315298 5251598 5205425 5180879 5126976 5070915 4966702 4912840 4854151
5505 4854151 4865663 4804587 4761823 4767527 4753685 4736897 4760847 4712036 4691248 4664985 4629490 4586527
5493D586527j2928q5340j8258n771M1149K4395j0102l5143K4115l5227J0505j0454
5481D473468o4778l884n3932Q628l1779k4220O2590P174J686l3484l769O411m9897
5468D294214K3431r161l3361M28m6066j877J21264N0467L6679l0877r01K4705
5456D428945N6582k7241N3755R0584L9433J9451K6064N108N6337q922N1458k4052
5444D767502r129J15986K2773k4972K5003J2648M6316O9089M4336N2333L959K1818
5432E147662O1298O8405L7615J24944O8868L1031R1902N7115Q6980Q0234P8384
5421E934438P7718J32346Q9687O9415O0967R9893K484N1138K6880j1823p8851
5410F454292L153R2678N309l065R9435N7567K6429P2960Q9831P2677L8065J45947
$$ plain form
5493 4586527 4573599 4488259 4470001 4464230 4505379 4529774 4519672 4484529 4508644 4473417 4483922 4473468
5481 4473468 4408690 4404806 4350874 4359502 4327723 4303503 4366093 4373267 4374953 4341469 4337700 4344111 4294214
5468 4294214 4317645 4308484 4275123 4275551 4229485 4227608 4348872 4399339 4436018 4405141 4404240 4428945
5456 4428945 4485527 4458286 4512041 4602625 4642058 4661509 4687573 4692681 4749018 4740096 4791554 4767502
5444 4767502 4758373 4874359 4897132 4872160 4897163 4909811 4956127 5025216 5069552 5121885 5125844 5147662
5432 5147662 5208960 5277365 5314980 5439924 5508792 5539823 5631725 5688840 5775820 5856054 5934438
5421 5934438 6012156 6144502 6234189 6303604 6364571 6464464 6466948 6518086 6544966 6533143 6454292
5410 6454292 6457445 6550123 6555432 6552367 6651802 6709369 6735798 6808758 6898589 6971266 7009331 7155278
5398G155278J17583J49150J28953J99501J18469J78932J67763J04505Q8543O3504
5388H472181L5635k8911j2318M5772k0284J961N4580l737j9232J5592N9801O7325
5376H668365J20025P0961R8750J26404J95283J41530Q4466J40721R7798J59226
5366I903529J43320J17394J09751J38589L3978Q0485Q8658J17510J14353Q4670
5356A0932237R4223J10696J40290J70599K44250K34742J83635J35378J30632J72083
5346A2548765J56880J60209P8514J37671J49906O6287N9140O7280O8785J33125
5336A3626562J73421J68449J76232K24484J75536K69115K82495K68376L54025
5327A5718695M12289M20954M27093L84126L04285L45858L46695L56486L53627
$$ plain form
5398 7155278 7272861 7422011 7550964 7750465 7868934 8047866 8215629 8320134 8408677 8472181
5388 8472181 8507816 8478905 8466587 8512359 8492075 8494036 8548616 8544879 8525647 8541239 8601040 8668365
5376 8668365 8788390 8859351 8958101 9084505 9279788 9421318 9505784 9646505 9744303 9903529
5366 9903529 10046849 10164243 10273994 10412583 10446561 10527046 10615704 10733214 10847567 10932237
5356 10932237 11026460 11137156 11277446 11448045 11692295 11927037 12110672 12246050 12376682 12548765
5346 12548765 12705645 12865854 12944368 13082039 13231945 13298232 13357372 13424652 13493437 13626562
5336 13626562 13799983 13968432 14144664 14369148 14544684 14813799 15096294 15364670 15718695
5327 15718695 16130984 16551938 16979031 17363157 17667442 18013300 18359995 18716481 19070108
5318A9070108M05735L51986K71314L42776K56730K43439L16567L96075M22580
5309B2077310M40556M17355M08819M71602M53064M49866L89986L92681M38640
5300B5939879M82920M29961M82818M93329O42361O09431N44115O36873O74863
5291C0936550O93990P48712P96104R10967Q36988Q42286J068900J140730J150580
5282C9125807J245334J158652J119154J131629J205547J164954J180745J262828
5274D8594650J377423J533410J702941K011221K222345K519814K924240L283766
5266F6169810L618563L938809M370193M435434M485880M097782L384006K644401
5258I7144878J717695Q54192L3816n72856j256676j640333j554875j367274j051755
$$ plain form
5318 19070108 19475843 19827829 20099143 20441919 20698649 20942088 21258655 21654730 22077310
5309 22077310 22517866 22935221 23344040 23815642 24268706 24718572 25108558 25501239 25939879
5300 25939879 26422799 26852760 27335578 27828907 28471268 29080699 29624814 30261687 30936550
5291 30936550 31630540 32379252 33175356 34086323 34923311 35765597 36834497 37975227 39125807
5282 39125807 40371141 41529793 42648947 43780576 44986123 46151077 47331822 48594650
5274 48594650 49972073 51505483 53208424 55219645 57441990 59961804 62886044 66169810
5266 66169810 69788373 73727182 78097375 82532809 87018689 91116471 94500477 97144878
5258 97144878 98862573 99716765 99750581 99177725 97921049 96280716 94725841 93358567 92306812
5249I2306812m49280J17473P74768J393938K106785K847629L668926M636442N591894
5240A12995387O547486P642971Q910688R942706J0408549J0210507R016761P087690
5232A82762745N244314L092963Q03872j736581m079422n726935o711660p281199
5224A66368097p291976p023289o507335n652109m844421l888041k891195j891798
5216A26377933q62146L73533J443997K758248L927164N059006O185406P245505
5208A52508646P932481P892137P065239N564627L433104J220932q39288k707970
5200A82069908m607850o827796q576889r544066r695406r578188r013749q402044
5192A15823920p839730p027512o172678n196878m295168l304689k558564j823394
$$ plain form
5249 92306812 91857532 91975005 92749773 94143711 96250496 99098125 102767051 107403493 112995387
5240 112995387 119542873 127185844 136096532 146039238 156447787 166658294 175675055 182762745
5232 182762745 188007059 191100022 191903894 190167313 186087891 180360956 173649296 166368097
5224 166368097 159076121 152052832 145545497 139893388 135048967 131160926 128269731 126377933
5216 126377933 125515787 125889320 127333317 130091565 134018729 139077735 145263141 152508646
5208 152508646 160441127 168333264 175398503 180963130 184396234 185617166 184777878 182069908
5200 182069908 177462058 170634262 162057373 152513307 142817901 133239713 124225964 115823920
5192 115823920 107984190 100956678 94784000 89587122 85291954 81987265 79428701 77605307
5184G7605307j095327n00108O4486N65307P32728O94096N03366O1378n45506j140095
5174G6945632j602350k137135k885641l389321l617601l748178l755666l803574
5166E2006166l552177l219243l077023k863467k630704k288782k011878j965229
5158C0397663j640292j552425j351961j240083j118575j003192r50894q63105
5150B0677136q18811p65887o31947p08939o62062n60575n62650m95627m83809
5141A4986829l80937m51588m47353m07091l37847l47199l49258l45900j88132
5132A1731524k58506k85566j97638k14161k11704j97930j10519j94504j63603
5123I897393q1125k11563k06125r2551j22821p7831j25517j1218J457m754O2764
$$ plain form
5184 77605307 76509980 76009872 76074358 76639665 77372393 78066489 78569855 78631233 78085727 76945632
5174 76945632 75343282 73206147 70320506 66931185 63313584 59565406 55809740 52006166
5166 52006166 48453989 45234746 42157723 39294256 36663552 34374770 32362892 30397663
5158 30397663 28757371 27204946 25852985 24612902 23494327 22491135 21540241 20677136
5150 20677136 19858325 19092438 18460491 17751552 17089490 16528915 15966265 15470638 14986829
5141 14986829 14605892 14154304 13706951 13299860 12962013 12614814 12265556 11919656 11731524
5132 11731524 11473018 11187452 10989814 10775653 10563949 10366019 10255500 10060996 9897393
5123 9897393 9816268 9604705 9398580 9306029 9183208 9105377 8979860 8968642 8970099 8965345 9028109
5112I028109L8712O8706P082R3609J02729O2245P1075J3586L4836J06047J17343
5101I744079K26493L07730L49569M02031M15838L00202O7242p4174k48963m02348
5091A1087699n72671o56704o63423o33294n37151m22572l99546l60513k99085
5082F542740k17377j86708k44070j97428j95998j53395p0883n2516j86023j00604
5072D937738j06039p9787j244p0693r7027n7207r6775o4070k1712r0618q6489
5061D166077j9891J437o2719j07862J0240q364p6350m7366p2560j1287N3490j4982
5049C809863r7558k6599l1704N7314K0933l9737j0625r5182P785l2305R987J5728
5037C587900n7749J7262n2767m5572M4928m3245l5642l9539L3542l044k7723L5189
$$ plain form
5112 9028109 9066821 9135527 9142609 9236218 9338947 9401192 9472267 9485853 9520689 9626736 9744079
5101 9744079 9970572 10278302 10627871 11029902 11445740 11745942 11813184 11739010 11490047 11087699
5091 11087699 10515028 9858324 9194901 8561607 8024456 7601884 7202338 6841825 6542740
5082 6542740 6325363 6138655 5894585 5697157 5501159 5347764 5276881 5224365 5038342 4937738
5072 4937738 4831699 4751912 4750668 4679975 4582948 4525741 4428966 4364896 4343184 4252566 4166077
5061 4166077 4146186 4147623 4084904 3977042 3987282 3978918 3902568 3855202 3782642 3771355 3824845 3809863
5049 3809863 3712305 3685706 3654002 3711316 3732249 3692512 3681887 3586705 3594490 3562185 3572172 3587900
5037 3587900 3530151 3547413 3494646 3449074 3494002 3450757 3415115 3375576 3409118 3406074 3378351 3413540
5025C413540p4559K6244J2615J37p20k4233k4597L3791p7686k3995r346p3535
5013C177656o8095J7092m0415p8723K8518J2122j3510QO0067k864n3043m6542
5001B992271o9060l2402M4868L500K7825l4903p1412j2356J2409K9045n5379N0014
4989B884420r1086m2950k0333K0828N9363L715k13Q329k4488K5557p5590r0323
4977B657229R9743l0071o2302m167l7158P609L3968m15J2079M527n6765L5075
4965B659352J9691l1372M6618l4848m269j2149n4505J6789J42212j12576O45K3629
4953B659217p6091J0358L5422m1691N8409l3183j8107O4590M2137J7304P880K6650
4941B752895L6377R6064L8568O797L6120j4899M2927K9810l5081K4361l0108J1702
$$ plain form
5025 3413540 3338981 3365225 3377840 3377977 3377257 3353024 3328427 3362218 3284532 3260537 3251191 3177656
5013 3177656 3109561 3126653 3086238 3007515 3036033 3048155 3034645 3034653 3094720 3091856 3038813 2992271
5001 2992271 2923211 2890809 2935677 2939177 2967002 2932099 2860687 2848331 2860740 2889785 2834406 2884420
4989 2884420 2793334 2750384 2730051 2750879 2810242 2813957 2813744 2822073 2797585 2823142 2747552 2657229
4977 2657229 2756972 2726901 2664599 2660432 2623274 2630883 2664851 2664436 2676515 2681042 2624277 2659352
4965 2659352 2679043 2647671 2694289 2659441 2655172 2643023 2588518 2605307 2747519 2634943 2635588 2659217
4953 2659217 2583126 2593484 2628906 2587215 2645624 2612441 2594334 2658924 2701061 2718365 2726245 2752895
4941 2752895 2789272 2885336 2923904 2930701 2966821 2951922 2994849 3024659 2989578 3013939 2983831 2995533
4929B995533q6285j4899J0404j5677l3045o8J6012k8774L6367O2227m8609O1622
4917B954808K7063K5844J10776P1781J6136P6612M0318O013M1202L2367K5532
4906C428452l2999k3423o5439k0493J7706j229k1926m2452m8563M2022K2673L2080
4894C286409k9841m8380L5924Q5481m5930P9506j3101L6876N4324L5360k1486
4883C455142J5374O6461M6866M4376q2504K1124m201m2211m0608o9615j0376m5624
4871C354204l3862M6730m0206l5002j01109j5419j8457M0728K9394j3213m3569
4860C170219L4509N1592M8114q1661k1747Q4301P7321M763n475J8038O556K7038
4848C413568n704K578p0333k6886J0872P8833M7762r419j3643M5980n554O758
$$ plain form
4929 2995533 2909248 2894349 2904753 2889076 2856031 2855963 2871975 2843201 2879568 2941795 2893186 2954808
4917 2954808 2981871 3007715 3118491 3190272 3206408 3283020 3323338 3329351 3370553 3402920 3428452
4906 3428452 3395453 3372030 3306591 3286098 3303804 3302575 3280649 3238197 3189634 3231656 3254329 3286409
4894 3286409 3256568 3208188 3244112 3329593 3283663 3363169 3350068 3386944 3441268 3476628 3455142
4883 3455142 3470516 3536977 3583843 3628219 3545715 3566839 3562638 3520427 3479819 3410204 3399828 3354204
4871 3354204 3320342 3367072 3326866 3291864 3190755 3175336 3156879 3197607 3227001 3213788 3170219
4860 3170219 3204728 3256320 3304434 3222773 3201026 3285327 3362648 3367411 3361936 3379974 3386530 3413568
4848 3413568 3407864 3410442 3340109 3313223 3324095 3402928 3450690 3441271 3427628 3473608 3468054 3474812
4836C474812N6079l064k8135j6618M877j4245N440O1360O1188P8451m8991o6025
4824C565129J2072M3390j4840Q6046L0566j0148J3008O9596N4545J1074J18811
4813C979249n2130P2055j7489r253O9051p025k319J8484Q1012J3816k9984M6210
4801D161677J0300N9197o3556k4686N3976J4981L3646R7985l5695M8909J17639
4790D474373j6213K6109J5185K2396O2613J3241P6481O7028j5715l9639l7120
4779D648739P0909M9763O0695Q8346K3624J6405Q80M276J30134K3273q702M2448
4767E150790N9856K6376Q0623K5910J078Q6186O934M7864Q7540l6558J18032Q2368
4755E736999J0990J8514K6081L2102M3210k6660J71531Q8293N6271r585M7408
$$ plain form
4836 3474812 3530891 3527827 3499692 3483074 3487951 3473706 3479146 3540506 3601694 3680145 3631154 3565129
4824 3565129 3577201 3620591 3605751 3691797 3722363 3712215 3725223 3794819 3849364 3860438 3979249
4813 3979249 3927119 3999174 3981685 3972432 4041483 4034458 4032139 4050623 4131635 4145451 4115467 4161677
4801 4161677 4171977 4231174 4167618 4142932 4196908 4211889 4245535 4343520 4307825 4356734 4474373
4790 4474373 4458160 4484269 4499454 4521850 4584463 4597704 4674185 4741213 4725498 4685859 4648739
4779 4648739 4719648 4769411 4830106 4918452 4942076 4958481 4959361 4963637 5093771 5117044 5108342 5150790
4767 5150790 5210646 5237022 5317645 5343555 5344633 5430819 5437753 5485617 5573157 5536599 5654631 5736999
4755 5736999 5747989 5766503 5792584 5824686 5867896 5841236 6012767 6101060 6157331 6147746 6195154
4744F195154M2379O2308J00327n5687J6780L4049k3262R181M9528K2851L0838
4733F484446j8731R7021O2067M7402k5015L5592K3953J2197O7941L0657L1081
4722F848611M8772O4077M2415J7938N9653P9172K4494M0799R3094L0461l5973
4711G313513R8125J50096J783N0871N3249L2249J10476P5437P7765N5350M4221
4700H063135J10123P6628P5232K8645J00731Q9350M1858M7011J06020J7656J07360
4689H863749J77358Q0746J48469Q1953P2565J05872M4245J64726O8540J41542
4679I949765Q1223R4861J13868J16179O3488J20935K05676O5339J35100J06384
4669A1052818L801Q0151Q9496J28339J42227R6701J29863J18188J41250Q9068
$$ plain form
4744 6195154 6237533 6299841 6400168 6344481 6361261 6395310 6372048 6381229 6430757 6453608 6484446
4733 6484446 6465715 6562736 6624803 6672205 6647190 6682782 6706735 6718932 6786873 6817530 6848611
4722 6848611 6897383 6961460 7003875 7021813 7081466 7160638 7185132 7225931 7319025 7349486 7313513
4711 7313513 7411638 7561734 7563517 7614388 7667637 7699886 7810362 7885799 7963564 8018914 8063135
4700 8063135 8173258 8249886 8325118 8353763 8454494 8543844 8585702 8632713 8738733 8756389 8863749
4689 8863749 9041107 9121853 9270322 9352275 9424840 9530712 9574957 9739683 9808223 9949765
4679 9949765 10030988 10125849 10239717 10355896 10419384 10540319 10745995 10811334 10946434 11052818
4669 11052818 11056619 11136770 11226266 11354605 11496832 11593533 11723396 11841584 11982834 12071902
4659A2071902J71124J30068O4657J58726J84202K18874J14408J66842K68497J32468
4649A3681768J75597J99197J62258K37483J65443J94762L61969K60688K83817
4640A5722982L01382L89141M24792M79669N14815P12016Q70946Q94108R27774
4631B1237625R33982O50376M47257M56513J95001J6715p1671j67116m21978n38198
4621B2738506o01662o04541m18827m36777j97249j63119r5807J5703N3733J25763
4611B0415723J33105R7584J25647K00986K48253K79921K45301K34303L05103L39509
4601B2625435L51056K63889L67117L31268L84430L91501L67410L25100M50246
4592B5857452M77781M72882M81019M88521M94183O40128O13060N31120O35457
$$ plain form
4659 12071902 12243026 12373094 12437751 12596477 12780679 12999553 13113961 13280803 13549300 13681768
4649 13681768 13857365 14056562 14218820 14456303 14621746 14816508 15178477 15439165 15722982
4640 15722982 16024364 16413505 16838297 17317966 17832781 18544797 19415743 20309851 21237625
4631 21237625 22171607 22821983 23269240 23725753 23920754 23937469 23865798 23698682 23276704 22738506
4621 22738506 22136844 21532303 21113476 20676699 20479450 20316331 20220524 20236227 20289960 20415723
4611 20415723 20548828 20646412 20772059 20973045 21221298 21501219 21746520 21980823 22285926 22625435
4601 22625435 22976491 23240380 23607497 23938765 24323195 24714696 25082106 25407206 25857452
4592 25857452 26335233 26808115 27289134 27777655 28271838 28911966 29525026 30056146 30691603
4583C0691603N98894P17867P00822P09632P70107P81282Q73651R39922Q98711
4574C7682491R79561J018566J108953J236869J202100J325075J467794J476696
4566D7498105J505785J751663J816515J884923J924972K022280K129561K051677
4558F2585481K206400K139492K187001K066262K068611J937526J950546J919484
4550G9060803J842483J528357J427101J290512J174265J207795J119449J267279
4542H9918044J349744J487093J712499J925147K097476K297389K509876K779626
4534A06076894K975522L165845L374644L181738L166029L015715K820445K431042
4526A30207874K219071J902207J458736R41017M02470j03038m46383o43175p95966
$$ plain form
4583 30691603 31290497 32008364 32709186 33418818 34188925 34970207 35843858 36783780 37682491
4574 37682491 38662052 39680618 40789571 42026440 43228540 44553615 46021409 47498105
4566 47498105 49003890 50755553 52572068 54456991 56381963 58404243 60533804 62585481
4558 62585481 64791881 66931373 69118374 71184636 73253247 75190773 77141319 79060803
4550 79060803 80903286 82431643 83858744 85149256 86323521 87531316 88650765 89918044
4542 89918044 91267788 92754881 94467380 96392527 98490003 100787392 103297268 106076894
4534 106076894 109052416 112218261 115592905 118774643 121940672 124956387 127776832 130207874
4526 130207874 132426945 134329152 135787888 136728905 137131375 137028337 136581954 135938779 135142813
4517A35142813q05943p71675p21928o00655n71512m28913j44826l9605J95106
4508A31252862L85730N17256O95607P70748Q52227R51530Q03316Q04557P71938
4499A37805771P55118P01033O61802O66660O37971O55478P17172O95769Q34453
4490A44131227R29872R77724R94907Q95838Q87476P93649O05071M88507L59868
4481A51064139j8710j32744j36027j02513l5144J38317L05757N38555Q95112J187259
4471A53704001J481989J764344K157767K437419K589419K717024K818967K696738
4463A72367668K596441K219381J894963J496350J065296M93426k05910r36017
4455A80991598j462030j876494k189038k459755k404807k479201k457015k201116
$$ plain form
4517 135142813 134336870 133565195 132843267 132242612 131671100 131242187 131097361 131057756 131252862
4508 131252862 131638592 132155848 132851455 133622203 134474430 135425960 136229276 137033833 137805771
4499 137805771 138560889 139261922 139923724 140590384 141228355 141883833 142601005 143296774 144131227
4490 144131227 145061099 146038823 147033730 147929568 148817044 149610693 150215764 150704271 151064139
4481 151064139 151045429 150912685 150776658 150674145 150639001 150777318 151083075 151621630 152516742 153704001
4471 153704001 155185990 156950334 159108101 161545520 164134939 166851963 169670930 172367668
4463 172367668 174964109 177183490 179078453 180574803 181640099 182133525 181927615 180991598
4455 180991598 179529568 177653074 175464036 173004281 170599474 168120273 165663258 163462142
4447A63462142k057635j829974j602920j264785r66587p29448n21656l66656j21478
4438A54001003p9052j5779N4334p6160o1150p8474k03706l95603l62128k29109
4428A52554176k73995p6842J23253L40254M78479P30678R23640J028018J132819
4419A56960480J134454J231098J239451J284414J290961J155712J209145J283972
4411A66789687J307556J295739J379617J497208J707327J800321J865676K066169
4403A79709300K110892K277900K428628K530267K596316K629750K601951K354478
4395A99239482K058126J585573R85349N25241K765l68222p53255j275519j852323
4386B00147217k279356k775644l186858l509720l792852l952474l965757l830723
$$ plain form
4447 163462142 161404507 159574533 157971613 156706828 155740241 155010793 154489137 154122481 154001003
4438 154001003 153921951 153906172 153960506 153884346 153823196 153744722 153541016 153145413 152783285 152554176
4428 152554176 152280181 152203339 152326592 152666846 153145325 153876003 154799643 155827661 156960480
4419 156960480 158094934 159326032 160565483 161849897 163140858 164296570 165505715 166789687
4411 166789687 168097243 169392982 170772599 172269807 173977134 175777455 177643131 179709300
4403 179709300 181820192 184098092 186526720 189056987 191653303 194283053 196885004 199239482
4395 199239482 201297608 202883181 203868530 204393771 204396536 204028314 203275059 201999540 200147217
4386 200147217 197867861 195092217 191905359 188395639 184602787 180650313 176684556 172853833
4378A72853833l729309l543270l272158k957412k726184k508832k193336k047453
4370A49875879j945258j944941j983146k079639k202265k442252k570984k759948
4362A31947446k994617l123808l317862l580370l784658l879449m002057l979057
4354A03285568l874104l727607l630078l552158l429976l231418l020268k871762
4346G5948197k789073k583985k373194k284065k121657k050713j948685k012902
4338E7783923j853422j807526j779988j711475j665020j568685j575021j530228
4330D4292558j506413j419327j319424j279667j183570j110576j032237r50998
4322C4490346r89263r12996p21935q40643q25364o88177o15416o73899p31786
$$ plain form
4378 172853833 169124524 165581254 162309096 159351684 156625500 154116668 151923332 149875879
4370 149875879 147930621 145985680 144002534 141922895 139720630 137278378 134707394 131947446
4362 131947446 128952829 125829021 122511159 118930789 115146131 111266682 107264625 103285568
4354 103285568 99411464 95683857 92053779 88501621 85071645 81840227 78819959 75948197
4346 75948197 73159124 70575139 68201945 65917880 63796223 61745510 59796825 57783923
4338 57783923 55930501 54122975 52342987 50631512 48966492 47397807 45822786 44292558
4330 44292558 42786145 41366818 40047394 38767727 37584157 36473581 35441344 34490346
4322 34490346 33501083 32588087 31866152 31025509 30200145 29511968 28896552 28222653 27490867
4313B7490867n89545n90401o32117n60643n06762n10396m75697m59406m33749
4304B2732151m26442m29866m19631m12346l20261k92768l45292l02612k89910
4295A9493023l83669k50966k20120k82165k70064k38476k06545k21856k97496
4286A7121666k25686j72847k19833k15952j87501k51522k12177j26631j66937
4277A5342580r1135j00052r2301j68457j29175q3015j03310j014q5918q9226o1983
4266A4336994m9412j46519j61694j49969j76668j87134k45616k58709k81988k01423
4256A2477862j84248j57208j82490j80905k35109o9571j07658j33100j94418m3949
4246A0989206l4569j15977j28337k2833Q779m2243j15373n8489r8904j53071p7972
$$ plain form
4313 27490867 26901322 26310921 25678804 25118161 24611399 24101003 23625306 23165900 22732151
4304 22732151 22305709 21875843 21456212 21043866 20723605 20430837 20085545 19782933 19493023
4295 19493023 19109354 18858388 18638268 18356103 18086039 17847563 17641018 17419162 17121666
4286 17121666 16895980 16723133 16503300 16287348 16099847 15848325 15636148 15509517 15342580
4277 15342580 15251445 15151393 15059092 14890635 14761460 14678445 14575135 14574121 14488203 14398977 14336994
4266 14336994 14287582 14141063 13979369 13829400 13652732 13465598 13219982 12961273 12679285 12477862
4256 12477862 12293614 12136406 11953916 11773011 11537902 11468331 11360673 11227573 11033155 10989206
4246 10989206 10954637 10838660 10710323 10687490 10696269 10654026 10538653 10480164 10381260 10228189 10150217
4235A0150217q4706j54933j57895j05388j5993r5448j15692j46158n9343j14968
4225I099693j04769l7003p9741l6256o7284n2717j24120n7590r0797j62088m7782
4214H239546n9981j764k8391j54006n2268j5066J9692q0048m1035M8785K2864
4203G898328L3923o5619J829N6690r7629M61q515k4446O0254Q4742M1681Q187
4191G989886m0980M4567N0911J9170J21257O4241l1074M9168m0461r575J8236
4180H235346M3918J5380M8902N6223M9086J0147R445M9055J8843M8796J21018
4169H706159N8135K8035Q4330K9231J45429R0624O0428J09112P0234J03342L1891
4158I516950P1002Q4778P9947P2208J55955O2092P6764Q9134P9721K7728J25190
$$ plain form
4235 10150217 10065511 9910578 9752683 9647295 9631302 9535854 9420162 9274004 9214661 9099693
4225 9099693 8994924 8957921 8878180 8841924 8774640 8721923 8597803 8540213 8449416 8287328 8239546
4214 8239546 8179565 8177801 8149410 7995404 7943136 7928070 7947762 7867714 7826679 7875464 7898328
4203 7898328 7932251 7866632 7868461 7925151 7827522 7827983 7819468 7795022 7855276 7940018 7981699 7989886
4191 7989886 7948906 7993473 8044384 8063554 8184811 8249052 8217978 8267146 8226685 8217110 8235346
4180 8235346 8279264 8294644 8343546 8399769 8448855 8459002 8468447 8517502 8536345 8585141 8706159
4169 8706159 8764294 8792329 8876659 8905890 9051319 9141943 9202371 9311483 9381717 9485059 9516950
4158 9516950 9587952 9672730 9752677 9824885 9980840 10042932 10119696 10208830 10288551 10316279 10441469
4147A0441469J22717J06421J40102J08211J07607Q0834K22475J71054K06235J20691
4137A1827816J11111J24123J51577J87501J17553J68843J92799J48831K15352
4128A3245506J47711J81543K25415K62406J81179J64317K17889K25469J36495
4119A4987930J94751K46001J48242K28489K52343M6215M082P5008K2543J47550
4109A6353154J21348J46350J72944J64509K27609K23690K94558K87070K47746
4100A8238978K98803L31718M39325M29252L57968M33252N48814N21104O24838
4091B2224052N83534P08770Q01901Q89306J016672J054731J100729J181488J368187
4082C0929370J531428J718341J900735K192470K470550K839904L208552L769989
$$ plain form
4147 10441469 10564186 10670607 10810709 10918920 11026527 11107361 11329836 11500890 11707125 11827816
4137 11827816 11938927 12063050 12214627 12402128 12519681 12688524 12881323 13030154 13245506
4128 13245506 13393217 13574760 13800175 14062581 14243760 14408077 14625966 14851435 14987930
4119 14987930 15182681 15428682 15576924 15805413 16057756 16103971 16108053 16183061 16205604 16353154
4109 16353154 16474502 16620852 16793796 16958305 17185914 17409604 17704162 17991232 18238978
4100 18238978 18537781 18869499 19308824 19738076 20096044 20529296 21078110 21599214 22224052
4091 22224052 22807586 23516356 24318257 25207563 26224235 27278966 28379695 29561183 30929370
4082 30929370 32460798 34179139 36079874 38272344 40742894 43582798 46791350 50561339
4074E0561339M320201M919304N629379O384054P261485P980114Q065677O902763
4066A02024316L467820j718685o509337r073807r631613q977456p949897o781224
4058E4850117n615224m633941l903235l381561k840665k483259k101729j891755
4050B7998748j553945j325192j158662j082810j027373q88785q24573o50820o19965
4041A8866623n53907n30674m68624l69674l14999k27181l17078k50975j88322
4032A5645189j96445j91103j66916j05375j77952j20240j01638j20399j96153
4023A4268968j09403j55905j85366p1973j24652j94031j14487n9391j27487p2618
4013A3053655k8803m8078q7342o2359K112l5075l1498j08565m4318j3670q0257
$$ plain form
4074 50561339 54881540 59800844 65430223 71814277 79075762 87055876 95121553 102024316
4066 102024316 105492136 103773451 97264114 88190307 78558694 69581238 61631341 54850117
4058 54850117 49234893 44600952 40697717 37316156 34475491 31992232 29890503 27998748
4050 27998748 26444803 25119611 23960949 22878139 21850766 20961981 20137408 19486588 18866623
4041 18866623 18312716 17782042 17313418 16943744 16628745 16401564 16084486 15833511 15645189
4032 15645189 15448744 15257641 15090725 14985350 14807398 14687158 14585520 14465121 14268968
4023 14268968 14159565 14003660 13818294 13746321 13621669 13427638 13313151 13253760 13126273 13053655
4013 13053655 13024852 12976774 12889432 12827073 12829185 12794110 12762612 12654047 12609729 12596059 12515802
4002A2515802j16177o6722J306k6545N7618L256n6508k1073p14r014j3779M9541
3990A2316991Q8035m2005J7785l7224k4026J0325N9636n1367O156n734l4906p3620
3978A2230046q0442M6023N010l543r1305M7884O4503l140P1096N3133j5250k9493
3966A2294522J06627P1416K9845L2964m6596J2840O4630R2094k036N8542K6252
3955A2741100P6933N4980K8512l3564O0670J12977Q8871Q2957J6068P8636P0898
3944A3379038J06279J08568P6915L0189Q3633N1987R0050J53389P6006L2168J59734
3933A4347956n184J78263J47730l0047J08963J08436J85873N1252Q5517J28777
3923A5307536J33193J11396J22525J00827R5163N4146J07549K37458J28607J68811
$$ plain form
4002 12515802 12399625 12332903 12334209 12307664 12365282 12368538 12312030 12290957 12290243 12281229 12267450 12316991
3990 12316991 12405026 12363021 12380806 12343582 12319556 12329881 12389517 12338150 12344306 12338572 12303666 12230046
3978 12230046 12149604 12195627 12200637 12197094 12105789 12153673 12218176 12215036 12286132 12339265 12324015 12294522
3966 12294522 12401149 12472565 12502410 12535374 12488778 12501618 12566248 12658342 12656306 12714848 12741100
3955 12741100 12818033 12873013 12901525 12867961 12928631 13041608 13130479 13213436 13229504 13308140 13379038
3944 13379038 13485317 13593885 13670800 13700989 13784622 13836609 13926659 14080048 14156054 14188222 14347956
3933 14347956 14342772 14521035 14668765 14638718 14747681 14856117 15041990 15093242 15178759 15307536
3923 15307536 15440729 15552125 15674650 15775477 15870640 15924786 16032335 16269793 16398400 16567211
3913A6567211J39276J49001J96924J08027J10682J54596J86653J62241J86592
3904A7961203J20178J21959J75367J98861J86379K11877J89160J48753J94624
3895A9508361K52395K83600K29307L05392J95099K44734K97244K02038K87046
3886B1805216K76041L09487K31235K98635L27626L67402L63374L40101K85486
3877B4604603L22574L47302M30664L66145M46584M23303M08021M10348M17794
3868B8177338N15640L70534N53924M89756N28664N05502N37680M71827N06304
3859C2657169O69798O28971O29753N65882O14625P09593O96476P29317P37694
3850C8639278P04708P75268Q48427Q80601R35142R62046R72017R64117J104921
$$ plain form
3913 16567211 16706487 16855488 17052412 17160439 17271121 17425717 17612370 17774611 17961203
3904 17961203 18081381 18203340 18378707 18577568 18763947 18975824 19164984 19313737 19508361
3895 19508361 19760756 20044356 20273663 20579055 20774154 21018888 21316132 21518170 21805216
3886 21805216 22081257 22390744 22621979 22920614 23248240 23615642 23979016 24319117 24604603
3877 24604603 24927177 25274479 25705143 26071288 26517872 26941175 27349196 27759544 28177338
3868 28177338 28692978 29063512 29617436 30107192 30635856 31141358 31679038 32150865 32657169
3859 32657169 33326967 33955938 34585691 35151573 35766198 36475791 37172267 37901584 38639278
3850 38639278 39343986 40119254 40967681 41848282 42783424 43745470 44717487 45681604 46786525
3841D6786525J145107J173036J187343J327249J288928J414788J447287J404035
3833E7174298J485732J551887J555015J603555J601392J625605J724504J688476
3825G0010464J702804J772856J742136J673988J798814J906997J842617J866858
3817H4317534J926439K050987J852622J856560J813099J814594J942810J907056
3809I9481701K070212K053357K119218K076824K143723K109162K150918K146670
3801A16351785K271861K488761K532426K514843K642585K686271K730507K948027
3793A37167066L042111L106668L316957L332338L353244L198627L126092K977529
3785A62620632K963081K999346L047108L266768L234538L272320L194580L124867
$$ plain form
3841 46786525 47931632 49104668 50292011 51619260 52908188 54322976 55770263 57174298
3833 57174298 58660030 60211917 61766932 63370487 64971879 66597484 68321988 70010464
3825 70010464 71713268 73486124 75228260 76902248 78701062 80608059 82450676 84317534
3817 84317534 86243973 88294960 90147582 92004142 93817241 95631835 97574645 99481701
3809 99481701 101551913 103605270 105724488 107801312 109945035 112054197 114205115 116351785
3801 116351785 118623646 121112407 123644833 126159676 128802261 131488532 134219039 137167066
3793 137167066 140209177 143315845 146632802 149965140 153318384 156517011 159643103 162620632
3785 162620632 165583713 168583059 171630167 174896935 178131473 181403793 184598373 187723240
3777A87723240L112548L116366L159430L403890L575628L700066L895450M068523
3769B15755141M419698M768177M966256N267768N700449N941495O061081O101488
3761B58981553N980353N590427N262005M860958M501712M235432M051024L902941
3753B97366405L630171L277779K878984K512894K038789J593260J219055Q15509
3745C15332846N13480K13301k06925m66752o15767o04957n61796n95921o08804
3736C12398705o56067q41884j193141j647621k235251k791124l303488l729867
3728B96000262m026979m261827m197808m121911m208924m369018m563810m790591
3720B61459394n208230n582802n937026o000181o073191n981793n830804n626796
$$ plain form
3777 187723240 190835788 193952154 197111584 200515474 204091102 207791168 211686618 215755141
3769 215755141 220174839 224943016 229909272 235177040 240877489 246818984 252880065 258981553
3761 258981553 264961906 270552333 275814338 280675296 285177008 289412440 293463464 297366405
3753 297366405 300996576 304274355 307153339 309666233 311705022 313298282 314517337 315332846
3745 315332846 315846326 316059627 315852702 315385950 314770183 314165226 313603430 313007509 312398705
3736 312398705 311742638 310900754 309707613 308059992 305824741 303033617 299730129 296000262
3728 296000262 291973283 287711456 283513648 279391737 275182813 270813795 266249985 261459394
3720 261459394 256251164 250668362 244731336 238731155 232657964 226676171 220845367 215218571
3712B15218571n248010m997556m717888m353030m021950l773439l426071l245884
3704A81434743l132830l027631l020702l021742l037949k977053k763161k509938
3696A57943737k335593k196842k177204k181152k209678k407751k506287k577656
3688A39351574k460385k383717k292439k145490j937231j718009j695583j581372
3680A23137348j389719j258117j173401j067345q30615q98191q33034p43533q24936
3671A14118457q21151p48118q93814r66587j016130j069799j137516j222597j241972
3662A05000773j428185j282849j262419j357317j415053j350595j362052j521478
3654I4020825j493217j546208j583000j599196j572338j617596j641446j684631
$$ plain form
3712 215218571 209970561 204973005 200255117 195902087 191880137 188106698 184680627 181434743
3704 181434743 178301913 175274282 172253580 169231838 166193889 163216836 160453675 157943737
3696 157943737 155608144 153411302 151234098 149052946 146843268 144435517 141929230 139351574
3688 139351574 136891189 134507472 132215033 130069543 128132312 126414303 124718720 123137348
3680 123137348 121747629 120489512 119316111 118248766 117418151 116519960 115686926 114943393 114118457
3671 114118457 113297306 112549188 111655374 110688787 109672657 108602858 107465342 106242745 105000773
3662 105000773 103572588 102289739 101027320 99670003 98254950 96904355 95542303 94020825
3654 94020825 92527608 90981400 89398400 87799204 86226866 84609270 82967824 81283193
3646H1283193j608952j667153j732365j755582j809635j817333j871361j917425
3638F7103387j854283j780821j658929j587168j480225j353901j243082j214274
3630E4930704j173536j093482j100266r57068r24589r88192r25556q03502q38920
3621D6125593q41440q37462q32420q95831q29882p56169p35844o71259o46283
3612C9079003p19090o70900n61206m46652n06388n51457n14623l38092n37063
3603C4233532m87211l71662l95198m05902l74730l57641l55938l43065k83093
3594C0859092l38080l68746k34577k72683k97662k91280k05830l09621l23827
3585B8216786k85008l17025k83492k68742k53847k06727j89033j49171k39078
$$ plain form
3646 81283193 79674241 78007088 76274723 74519141 72709506 70892173 69020812 67103387
3638 67103387 65249104 63468283 61809354 60222186 58741961 57388060 56144978 54930704
3630 54930704 53757168 52663686 51563420 50606352 49681763 48693571 47768015 46964513 46125593
3621 46125593 45284153 44446691 43614271 42718440 41888558 41132389 40396545 39725286 39079003
3612 39079003 38359913 37689013 37127807 36681155 36174767 35623310 35108687 34770595 34233532
3603 34233532 33746321 33374659 32979461 32573559 32198829 31841188 31485250 31142185 30859092
3594 30859092 30521012 30152266 29917689 29645006 29347344 29056064 28850234 28540613 28216786
3585 28216786 27931778 27614753 27331261 27062519 26808672 26601945 26412912 26263741 26024663
3576B6024663k20120j77004k21771j87989j41946j93700k05711j54435q1743j31347
3566B4308897j16066j12035n7061o5825j16550j14837J9275L1236l4358j1615
3556B3731061o0266q8976P8541m0034m5183o2704l9498j4087R961M8577o496K9473
3544B3540369N973K2828l2973M3988R1353j554M0903R270N227J04270j1878J0197
3532B3827973P956Q7492R7064K6071L4198O2592K7369R2940P7589J06800J11092
3521B4559136P3754N4467O2528J50455J26544O9609J8545L3965O4169J38671R9283
3510B5451126q756K3380P5541L1456L2650J5066K6551O0761Q7247J15535M9442
3499B5959999j2534P3869J36353M0085J13154J32564j8536J6136J27946N4830
$$ plain form
3576 26024663 25804543 25627539 25405768 25217779 25075833 24882133 24676422 24521987 24440244 24308897
3566 24308897 24192831 24080796 24023735 23957910 23841360 23726523 23745798 23777034 23742676 23731061
3556 23731061 23670795 23581819 23660360 23620326 23575143 23512439 23472941 23458854 23468815 23517392 23510896 23540369
3544 23540369 23546342 23569170 23536197 23580185 23671538 23669984 23710887 23720157 23725384 23829654 23817776 23827973
3532 23827973 23835929 23923421 24020485 24046556 24080754 24143346 24170715 24263655 24341244 24448044 24559136
3521 24559136 24632890 24687357 24749885 24900340 25026884 25096493 25115038 25149003 25213172 25351843 25451126
3510 25451126 25442370 25465750 25541291 25572747 25605397 25620463 25647014 25707775 25795022 25910557 25959999
3499 25959999 25947465 26021334 26157687 26197772 26310926 26443490 26424954 26441090 26569036 26623866
3489B6623866J10881J393M3951J16204J01508J42489O1986l7662R6031L7423P554
3478B7305624L768N33l9410q7674O9845K7063j0524L909N5102J00287M8712M7756
3466B7524991O3803L4386R6666K9394O3228J29390J1014N6243J30781M7881O7199
3455B8254976N0759O9263M6976O2581J25799L5973J2721P3728j6855m5731N1380
3444B8721570N0698P4628P5741L9416J21457L1983J02587Q1096l1753R7067J44525
3433B9509015P7324J15690J59207J18318P3655O3319J74090J21195J22245J38020
3423C0672078O2473J04555P8646J07060Q8316J42906J66215J63838J34442N7572
3413C1778101J76135J36509J21825J77445J71279J95073J44154K39337K16434
$$ plain form
3489 26623866 26734747 26736140 26780091 26896295 26997803 27140292 27202278 27164616 27260647 27298070 27305624
3478 27305624 27309392 27309925 27270515 27182841 27252686 27279749 27269225 27273134 27328236 27428523 27477235 27524991
3466 27524991 27588794 27623180 27719846 27749240 27812468 27941858 27952872 28009115 28139896 28187777 28254976
3455 28254976 28305735 28374998 28421974 28484555 28610354 28646327 28659048 28732776 28715921 28670190 28721570
3444 28721570 28772268 28846896 28922637 28962053 29083510 29115493 29218080 29299176 29267423 29364490 29509015
3433 29509015 29586339 29702029 29861236 29979554 30053209 30116528 30290618 30411813 30534058 30672078
3423 30672078 30734551 30839106 30917752 31024812 31113128 31256034 31422249 31586087 31720529 31778101
3413 31778101 31954236 32090745 32212570 32390015 32561294 32756367 32900521 33139858 33356292
3404C3356292K31408K37733K35281K73306K67768K04808J96899K54940K60480
3395C5518915L42068K58276K59359K81224K89086L33217M06688L61139K50415
3386C8300387K63535L72333L60409L37012L51474L41035L41221L97381M33544
3377D1498331M12213M10184M02745N09354M40055L95632M25393M87381M81165
3368D5462453M32915M05683N09993N74363N56512N37690O58222O31104O16423
3359E0385358N89079O47342O76874O61879Q11578Q33508P21953P77587P90305
3350E6895463P97066Q31318Q02059Q93756Q95296R90936R42073R42189R78835
3341F4968991J064890J064482J083577J144429J088944J102474J031325J032979
$$ plain form
3404 33356292 33587700 33825433 34060714 34334020 34601788 34806596 35003495 35258435 35518915
3395 35518915 35860983 36119259 36378618 36659842 36948928 37282145 37688833 38049972 38300387
3386 38300387 38563922 38936255 39296664 39633676 39985150 40326185 40667406 41064787 41498331
3377 41498331 41910544 42320728 42723473 43232827 43672882 44068514 44493907 44981288 45462453
3368 45462453 45895368 46301051 46811044 47385407 47941919 48479609 49137831 49768935 50385358
3359 50385358 50974437 51621779 52298653 52960532 53772110 54605618 55327571 56105158 56895463
3350 56895463 57692529 58523847 59325906 60219662 61114958 62105894 63047967 63990156 64968991
3341 64968991 66033881 67098363 68181940 69326369 70415313 71517787 72549112 73582091
3333G3582091J064849R42083R76000Q89081R77727R27502R37847R19910Q99244
3324H2116334J022708R77498R49310J090253J091071J092689J183336J229278
3316I0752477J269122J329261J418560J356747J426534J537909J591257J587461
3308A02269328J586453J664835J561145J649291J796062J747601J741977J824346
3300A15841038J809900J862913J923803J854646J866156J997367J960882J897519
3292A31014224K060974K087286K166379K210482K281758K408028K501666K647078
3284A49377875K747763K908469L091010L131644L381207L618724L852283M109310
3276A76218285M340096M656361M971353N308950N589186N912192O356241O804570
$$ plain form
3333 73582091 74646940 75589023 76565023 77454104 78431831 79359333 80297180 81217090 82116334
3324 82116334 83139042 84116540 85065850 86156103 87247174 88339863 89523199 90752477
3316 90752477 92021599 93350860 94769420 96126167 97552701 99090610 100681867 102269328
3308 102269328 103855781 105520616 107081761 108731052 110527114 112274715 114016692 115841038
3300 115841038 117650938 119513851 121437654 123292300 125158456 127155823 129116705 131014224
3292 131014224 133075198 135162484 137328863 139539345 141821103 144229131 146730797 149377875
3284 149377875 152125638 155034107 158125117 161256761 164637968 168256692 172108975 176218285
3276 176218285 180558381 185214742 190186095 195495045 201084231 206996423 213352664 220157234
3268B20157234P298408P779673Q383957Q920064R442788J0088102J0680763J1228040
3260B93979029J1837092J2378041J2730370J3124474J3142082J2951695J2363903
3253C82506686J1194372R480904P280492M492811J151578k538008o445265j0344413
3245C96779157j3597387j5482867j5961510j5390791j4289528j3069464j1743688
3238B97243922j0610557r778333q879896q370247p823673p431233p107260o713680
3230B30529043o435289o157921n875078n654130n530782n298794n132030m969797
3222A85475222m786369m668867m540813m433990m192294m051251l845883l740746
3214A51215009l726263l802724l764047l548760l469706l453031l264691l083356
$$ plain form
3268 220157234 227455642 235235315 243619272 252539336 261982124 272070226 282750989 293979029
3260 293979029 305816121 318194162 330924532 344049006 357191088 370142783 382506686
3253 382506686 393701058 403181962 410462454 414955265 416106843 413568835 407123570 396779157
3245 396779157 383181770 367698903 351737393 336346602 322057074 308987610 297243922
3238 297243922 286633365 276855032 267975136 259604889 251781216 244349983 237242723 230529043
3230 230529043 224093754 217935833 212060755 206406625 200875843 195577049 190445019 185475222
3222 185475222 180688853 176019986 171479173 167045183 162852889 158801638 154955755 151215009
3214 151215009 147488746 143686022 139921975 136373215 132903509 129450478 126185787 123102431
3206A23102431k942409k697857k629254k538392k380350k297626k135358k042539
3198A03438646k021828j922780j799831j664151j634093j498701j466934j347360
3190I0082968j261839j260483j233850j136120j128080j095045r90640j025469
3182H0951442r33595q71459j012493j032990j045344r93146q41306q74011r15743
3173G2431355p80757p85974q02164p25419o15223p28667o35403o06419n88151
3164F6163178n42782n88930n35774n05277m52118n26797m93313m49261m81880
3155F1587046n20765o04496n25297n26968n93551n43580n54829m67347m61761
3146E6788452m88429m73786m96462m38357l00909m56083m56235m84739m34625
$$ plain form
3206 123102431 120160022 117462165 114832911 112294519 109914169 107616543 105481185 103438646
3198 103438646 101416818 99494038 97694207 96030056 94395963 92897262 91430328 90082968
3190 90082968 88821129 87560646 86326796 85190676 84062596 82967551 81976911 80951442
3182 80951442 80017847 79146388 78133895 77100905 76055561 75062415 74221109 73347098 72431355
3173 72431355 71650598 70864624 70062460 69337041 68721818 67993151 67357748 66751329 66163178
3164 66163178 65620396 65031466 64495692 63990415 63538297 63011500 62518187 62068926 61587046
3155 61587046 61066281 60461785 59936488 59409520 58815969 58272389 57717560 57250213 56788452
3146 56788452 56300023 55826237 55329775 54891418 54590509 54134426 53678191 53193452 52758827
3137E2758827l75204l56027l88088m53115m19772k95930l95146l36304k91548
3128D9447693l16814k65192k76565l42761k65180l29274k81005k58761k32047
3119D6880094k45643k98018j93054k71309k17582j97926k82141k01903j75246
3110D4797272k07793j41269j42943k22721k73798j97079j07882j37446j90586
3101D3175755j95791k04917j46372j32322j09024j60849j70527k24438j89597
3092D1641918j56589j90359k71915j95216k39503k30842k20149j95216k36370
3083C9705759k19905k28582k53324k37495j97008k89373k40102k49831l04589
3074C7485550k67583k76104k61951j57702k69858j62024j98120k74248j78194
$$ plain form
3137 52758827 52383623 52027596 51639508 51186393 50766621 50470691 50075545 49739241 49447693
3128 49447693 49130879 48865687 48589122 48246361 47981181 47651907 47370902 47112141 46880094
3119 46880094 46634451 46336433 46143379 45872070 45654488 45456562 45174421 44972518 44797272
3110 44797272 44589479 44448210 44305267 44082546 43808748 43611669 43503787 43366341 43175755
3101 43175755 42979964 42775047 42628675 42496353 42387329 42226480 42055953 41831515 41641918
3092 41641918 41485329 41294970 41023055 40827839 40588336 40357494 40137345 39942129 39705759
3083 39705759 39485854 39257272 39003948 38766453 38569445 38280072 38039970 37790139 37485550
3074 37485550 37217967 36941863 36679912 36522210 36252352 36090328 35892208 35617960 35439766
3065C5439766j89104k28936k32771j47215k04196k07008j90115j72904j27457
3056C3740060j54626k31038k12922l03882j98474k48505k73084j96709k32645
3047C1688175k24325j93907j66799k29494k55780j98358j46679j61252j74818
3038B9936763q7852j50756j20283o5823q9840m3619m9740m5199l3643N2355r483
3027B9292880O7442K3156j458N1169j5623Q3204o679O3540P8541O3301N5749J01769
3015B9856991L7526J16602J42124J49946J01944K18527J74239J06021J42951K83277
3005C1330148K23778J70837K84701K82488L10419K94247K61746L19586M06740
2996C3884690K76471L81712L56129M26000L42617L82375M57059L97470L05676
$$ plain form
3065 35439766 35250662 35021726 34788955 34641740 34437544 34230536 34040421 33867517 33740060
3056 33740060 33585434 33354396 33141474 32837592 32639118 32390613 32117529 31920820 31688175
3047 31688175 31463850 31269943 31103144 30873650 30617870 30419512 30272833 30111581 29936763
3038 29936763 29848911 29698155 29577872 29512049 29422209 29378590 29328850 29283651 29250008 29302363 29292880
3027 29292880 29360322 29383478 29382020 29433189 29417566 29500770 29494091 29557631 29636172 29699473 29755222 29856991
3015 29856991 29894517 30011119 30153243 30303189 30405133 30623660 30797899 30903920 31046871 31330148
3005 31330148 31553926 31724763 32009464 32291952 32602371 32896618 33158364 33477950 33884690
2996 33884690 34161161 34542873 34899002 35325002 35667619 36049994 36507053 36904523 37210199
2987C7210199M58260M74477M27826M37611M57118M71507M81681M66525M27717
2978D1312921L90744L65906N49915M88625M33333N30643N54623N17957O34639
2969D5779306O44637O67376O04364O36654O95152P41724P03271P33606Q23449
2960E2029539R26167R35144R18479J045736J083229J135028J226059J284734J270318
2951F1854433J298576J432185J411818J602277J635720J628993J743258J775134
2943G4382394J846366J844439J888267J867494J871498J846917J808735J747917
2935H9104027J567045J468368J399793J311914J327846J281094J296579J447322
2927A00203988J528651J738150J904724K014775K220595K490617K588491K693696
$$ plain form
2987 37210199 37668459 38142936 38570762 39008373 39465491 39936998 40418679 40885204 41312921
2978 41312921 41703665 42069571 42619486 43108111 43541444 44072087 44626710 45144667 45779306
2969 45779306 46423943 47091319 47695683 48332337 49027489 49769213 50472484 51206090 52029539
2960 52029539 52955706 53890850 54809329 55855065 56938294 58073322 59299381 60584115 61854433
2951 61854433 63153009 64585194 65997012 67599289 69235009 70864002 72607260 74382394
2943 74382394 76228760 78073199 79961466 81828960 83700458 85547375 87356110 89104027
2935 89104027 90671072 92139440 93539233 94851147 96178993 97460087 98756666 100203988
2927 100203988 101732639 103470789 105375513 107390288 109610883 112101500 114689991 117383687
2919A17383687K976987L078105L323909L379191L496185L620983L804332L786653
2911A44850032L744382L516374K902636K278982J519037Q91223J91119q75385
2903A59018400k015182k955400k817617k174555j414158o50643j78704L48635
2895A47160776P61951J028099J216639J359336J464914J456155J408419J240322
2887A57096611J076171R48173P53792M00271K5316m27267r17507j423663j844654
2878A55687243k216486k633024k748234k780754k938777l365219l488488l337854
2870A32178407k990502k539991k068655j780058j541955j560216j564727j414676
2862A16717627j563779j609620j877222k133325k393113k615282k807290k989654
$$ plain form
2919 117383687 120360674 123438779 126762688 130141879 133638064 137259047 141063379 144850032
2911 144850032 148594414 152110788 155013424 157292406 158811443 159702666 159893785 159018400
2903 159018400 157003218 154047818 151230201 149055646 147641488 146990845 146812141 147160776
2895 147160776 147922727 148950826 150167465 151526801 152991715 154447870 155856289 157096611
2887 157096611 158172782 159120955 159874747 160275018 160300334 159873067 158955560 157531897 155687243
2878 155687243 153470757 150837733 148089499 145308745 142369968 139004749 135516261 132178407
2870 132178407 129187905 126647914 124579259 122799201 121257246 119697030 118132303 116717627
2862 116717627 115153848 113544228 111667006 109533681 107140568 104525286 101717996 98728342
2854I8728342l236344l425029l610491l693720l560901l473030l229372l025196
2846G1474259k677760k633646k363535k126762j943432j722369j638407j569603
2838E4798745j538399j331887j275693j245822j218549j259041j188699j272931
2830D4467724j196936j209776j135216j062460j053215r79828j103843j028248
2822C5698202r22426r14450q81443r07792q43825p26564p06861o48607p49756
2813B8396478o66540n60463o04179m83379m60454n01650m93026m02495l79213
2804B3845079m38753l52776l41835l40158l21184l79114l20509k63629k93144
2795B0793977k81791k26514l15189l47238l42856m26773l75356l88173l47971
$$ plain form
2854 98728342 95491998 92066969 88456478 84762758 81201857 77728827 74499455 71474259
2846 71474259 68796499 66162853 63799318 61672556 59729124 58006755 56368348 54798745
2838 54798745 53260346 51928459 50652766 49406944 48188395 46929354 45740655 44467724
2830 44467724 43270788 42061012 40925796 39863336 38810121 37830293 36726450 35698202
2822 35698202 34775776 33861326 32979883 32072091 31228266 30501702 29794841 29146234 28396478
2813 28396478 27729938 27169475 26565296 26081917 25621463 25119813 24626787 24224292 23845079
2804 23845079 23406326 23053550 22711715 22371557 22050373 21671259 21350750 21087121 20793977
2795 20793977 20512186 20285672 19970483 19623245 19280389 18853616 18478260 18090087 17742116
2786A7742116l53318l47498l40344l43897l33577l32269k51259l00305k49752
2777A4889897j82655l24254k55103k14417k18908k01814j37277j02016k24434
2768A3029019j41647j53973j86970j78752k25041j97735k38812j81770k26500
2759A1297819k63352k16805k11114j34661j64119j89339k16734k26882j19504
2750I555309k10044j03048j41270j82349j28850k29387j09287o3575j56947r2063
2740H138489j19494j07133j4479n6918j56987j66009j32029j44210o8132j21173
2730G051925r4862j17709q3866o6850l4644o6208j92858j4115m3039q9421q9986
2719F158367p2813l5317o2949j26743n0516R820q7940l3937K171j14576o4669
$$ plain form
2786 17742116 17388798 17041300 16700956 16357059 16023482 15691213 15439954 15139649 14889897
2777 14889897 14707242 14382988 14127885 13913468 13694560 13492746 13355469 13253453 13029019
2768 13029019 12887372 12733399 12546429 12367677 12142636 11944901 11706089 11524319 11297819
2759 11297819 11034467 10817662 10606548 10471887 10307768 10118429 9901695 9674813 9555309
2750 9555309 9345265 9242217 9100947 8918598 8789748 8560361 8451074 8387499 8230552 8138489
2740 8138489 8018995 7911862 7897383 7840465 7683478 7517469 7385440 7241230 7173098 7051925
2730 7051925 6957063 6839354 6755488 6688638 6653994 6587786 6394928 6380813 6337774 6248353 6158367
2719 6158367 6085554 6050237 5987288 5860545 5810029 5819849 5731909 5697972 5700143 5585567 5520898
2708E520898K0471k3655q4778m6705j5024m6396m02r5049p8753R131K294l7348
2696E124684m0634K893m1963q1192l7972J0010n5170n3923l3284m3831k3958p9375
2684D646285K1870j2094o7188q8917L6939j5356m7287k7339l5233l6193o6469
2673D309018j4252r460N1876q0261j2158j315j9680J0531n3264k8477K3216l2171
2661D143603j03033j6157k7938K6152n3896m4376R923n6802l4990Q0352J0880
2650C933718n0366l7280m2017m5105O9321Q5643q8514p6276k0993M7460K2837
2639C798428L5004j384p6673n8414K2774J119L1082L5264J7326J0684n4986L7589
2627C797813o7018q983J670J4019l0410r7694J0007O649n9568n3178J0607n4572
$$ plain form
2708 5520898 5541369 5517714 5432936 5386231 5371207 5324811 5324409 5229360 5150607 5159738 5162032 5124684
2696 5124684 5084050 5086943 5044980 4963788 4925816 4935826 4880656 4826733 4793449 4749618 4725660 4646285
2684 4646285 4668155 4656061 4588873 4499956 4536895 4521539 4474252 4446913 4411680 4375487 4309018
2673 4309018 4294766 4285306 4337182 4256921 4244763 4243448 4223768 4234299 4181035 4152558 4175774 4143603
2661 4143603 4040570 4024413 3996475 4022627 3968731 3924355 3934278 3877476 3842486 3922838 3933718
2650 3933718 3883352 3846072 3804055 3758950 3828271 3913914 3825400 3749124 3728131 3775591 3798428
2639 3798428 3833432 3832048 3755375 3696961 3719735 3720854 3751936 3787200 3804526 3815210 3760224 3797813
2627 3797813 3730795 3721812 3723482 3737501 3707091 3609397 3619404 3626053 3566485 3513307 3523914 3469342
2615C469342o1185Q899L2379k8074M3313l902q6213J6417j07893J4054J31762
2604C428899R308q2046m3832m9534J9971R1521m3234p4992l1353o2777n7952P1746
2592C175725J5446j9206j18417n1093n116m7128l9395K4613J9744m0461J796L3696
2580B950204q5384O1017l1095p2830m3055j0722l5029m4712n059q9773l4025m5426
2568B514111K4275l7620m4452n0763n8502r8462M5400N837j13950K6732j9208
2557B193398k2099j6934K5263K0189l1877k2468j6897o5721q894k7686m20J178
2545B027032J0853Q485k8526j3208j6843l8381j3617l4387q287o039m1046Q31
2533A846867L7153j7922n4716l8057K7655J7185l7884K9089p3857p2331P319P056
$$ plain form
2615 3469342 3408157 3417056 3449435 3421361 3464674 3460772 3374559 3390976 3283083 3297137 3428899
2604 3428899 3438207 3356161 3312329 3262795 3282766 3374287 3331053 3256061 3224708 3161931 3103979 3175725
2592 3175725 3191171 3171965 3053548 3002455 2997339 2950211 2910816 2935429 2955173 2914712 2916508 2950204
2580 2950204 2864820 2925837 2894742 2821912 2778857 2768135 2733106 2688394 2683335 2593562 2559537 2514111
2568 2514111 2538386 2500766 2456314 2405551 2347049 2248587 2293987 2299824 2185874 2212606 2193398
2557 2193398 2171299 2154365 2179628 2199817 2167940 2145472 2128575 2062854 2053960 2026274 2025854 2027032
2545 2027032 2037885 2046370 2017844 2004636 1987793 1949412 1935795 1901408 1893121 1887082 1846036 1846867
2533 1846867 1884020 1866098 1811382 1773325 1800980 1818165 1780281 1809370 1735513 1663182 1670501 1677557
2521A677557L1708J1339p255l0041r005m2799Q55l9532o3783O4523k3278o1419
2509A508870k5906l6783l0058l036M8829j1759p1491k6541m2654J4372J2250L2869
2497A368962J6245j9621n7330m9152j6688L8098r725l3912l5909N2829M4366J5907
2485A314070r7123l7489j1113K282J3343M5064k6113m6866o0020M4429P1849l4656
2473A177657o1510n7982Q84J8090J3326l6521J5859o1844o4603K6479r061k051
2461I58723L7363K3003l8109m7914K813n4225R952J9231l2646n0599K6942j3118
2449H41416k635k4640L482K2036N4487j36279L50N7625l4552o8418K1727R7602
2437H32201n3997n6589m664J373m9998m8731M6877O841k7192o085M3447Q3892
$$ plain form
2521 1677557 1709265 1720604 1713349 1683308 1674303 1631504 1632359 1592827 1529044 1593567 1570289 1508870
2509 1508870 1482964 1446181 1416123 1413087 1461916 1450157 1378666 1352125 1309471 1323843 1336093 1368962
2497 1368962 1385207 1365586 1308256 1259104 1242416 1280514 1270789 1236877 1200968 1253797 1298163 1314070
2485 1314070 1216947 1179458 1168345 1170627 1183970 1229034 1202921 1156055 1096035 1140464 1212313 1177657
2473 1177657 1116147 1058165 1059049 1077139 1090465 1053944 1069803 1007959 943356 969835 960774 958723
2461 958723 996086 1019089 980980 933066 935879 881654 891606 910837 878191 827592 854534 841416
2449 841416 838781 814141 817623 839659 894146 757867 758217 815842 781290 712872 734599 832201
2437 832201 778204 721615 716951 718324 668326 619595 666472 673313 646121 640036 683483 767375
2425G67375r9712K5723l3515K9125J055j6413o4128n0613P9717K0288m0675n163
2413F13064q4072M999J0483K5719P0001o6312j037o9258K2420L6189k2557m1950
2401D97689J076K0894k4164p2710J1513M7396n391J0178j3407l889o0945N3944
2389D62184j6526O5533l1492m2973K1175n711J9671K4810l8046m3826k6519L4186
2377D22466J02789l875p1289j4144l4243k3251O846n7026J2680m2433M9292L2447
2365C80259k3448k322k0512k8096M2030l1568O7860m4940j2775K8534k5812q5865
2353B43345L3570N746j1488r95k3288l833J9917k036k6902j1912l1976L8989L8728
2340B67865n8537L5642J4063J1436j2810o6730l4162J1076O603l4585L418L2014
$$ plain form
2425 767375 667663 693386 659871 688996 690051 673638 609510 558897 638614 658902 618227 613064
2413 613064 528992 533991 544474 570193 640194 573882 572845 503587 526007 562196 539639 497689
2401 497689 498765 519659 495495 422785 434298 481694 476303 486481 473074 469185 408240 462184
2389 462184 445658 511191 479699 436726 457901 452190 471861 496671 458625 414799 388280 422466
2377 422466 525255 521380 450091 435947 401704 378453 385299 328273 340953 298520 347812 380259
2365 380259 356811 354489 333977 305881 347911 316343 384203 339263 326488 355022 329210 243345
2353 243345 276915 282661 271173 270178 246890 243057 262974 260938 234036 222124 190148 229137 267865
2340 267865 209328 244970 259033 270469 257659 190929 156767 167843 174446 139861 143279 175293
2328A75293O446o5897J8267N5360k2501n7117l4077K6145K0015k862P2193L6335
2316B27600M4277m6706l2213N7607l0244j6149K1787n0386M0320n2282m5377P642
2304A25876K9143O775p9043M9117Q7593p2447K0782K2435l8667n1168k0129J9843
2292A00110L5936p178l8943m3812O1659J8701J1228N1311k1548l2366n3561r34
2280H0603k7344k520O0432l873j8276M1791M7986Q154k7178n3939m9091k0388
2268C6357j0299O4588M459M194K6211n4589n830L0848J7177K5638l5880j6408
2256H6466n1094O094J2210K5807J894N5379j0879q9051n346l1565r5L1961N9453
2243I1234l0753j334J7787O333n458L8811j2696o1220M4202N7393l4678j08793
$$ plain form
2328 175293 181739 115842 134109 189469 166968 109851 75774 101919 121934 119072 191265 227600
2316 227600 271877 225171 192958 250565 220321 204172 225959 175573 215893 163611 118234 125876
2304 125876 155019 161794 82751 131868 219461 147014 167796 190231 151564 100396 80267 100110
2292 100110 136046 128868 89925 46113 107772 126473 137701 189012 167464 135098 81537 80603
2280 80603 53259 50739 111171 107298 89022 130813 178799 186953 159775 105836 56745 36357
2268 36357 26058 90646 95105 99299 125510 70921 65091 95939 113116 138754 102874 86466
2256 86466 35372 41466 53676 79483 81377 136756 125877 36826 31480 -85 -180 31781 91234
2243 91234 60481 59147 76934 83267 77809 116620 103924 42704 86906 144299 109621 828
2231H28m0958R4109k6017J3510M3697j9206J7198J0936k2614m4878J6568P4853
2219A18026q624K1604R191M0540p9848k0670O7592j7059k376r768K7393M5361
2207A91362l5702J3264J7565j16803M1246j50o334M7087O829R607l1557m4461
2195I1953O8677M3767j6725K6789J7309q2078m3847O8510M9626J1974L8572k2726
2183B51801P7952k1016m8466K2563j1959k1391J5005k1801J5769l2668k4169L6367
2171B37987n778N1567k0021J6696m7072M5416M5970p732p4477J2181N5517M2275
2159C52529P8236n0762o0533Q1168l7092j6045m520Q311N0718M2926j3257o0503
2147C71176K5567Q2835Q5979k8714l8n686J7150J6678J15473L8321j3759J10385
$$ plain form
2231 828 -40130 53979 27962 41472 85169 65963 83161 94097 71483 26605 43173 118026
2219 118026 109402 131006 140197 180737 100889 80219 147811 130752 128376 118608 146001 191362
2207 191362 155660 168924 186489 69686 110932 110782 104448 151535 158364 167971 136414 91953
2195 91953 160630 204397 187672 214461 231770 149692 105845 174355 223981 235955 274527 251801
2183 251801 329753 308737 260271 282834 270875 249484 264489 242688 258457 225789 201620 237987
2171 237987 232209 283776 263755 280451 233379 278795 324765 317033 242556 254737 310254 352529
2159 352529 430765 380003 319470 400638 363546 347501 342981 351292 402010 444936 431679 371176
2147 371176 396743 479578 565557 536843 536805 531119 548269 564947 680420 718741 704982 815367
2135H15367K3884J9198Q1020J12154P3486J38622M6996K7081J44162M6193K19846
2124A748009J39376J36772J40768J23340K42399K68991L91038M08524M98961O31270
2114D729448M99034M02766M20700N65513O10972K23606r60075j338503j004462
2105D148999p13270m76640l17291k95169k66866k51311k17919j26710n9193p2061
2095A352569j06124j53762p4854o7096p6265j02086r5602l1203n3860l4634j5358
2084E41725m2987r0720L0728L5971q0617j13745K7284J6767n2426r8156o0618
2073A13206K4847o628K8733L6024l4204p416j4529K3716L644k7654N1578J6979
2061B08296p8897L5913K9395p2411j06553K8923Q4161L3034j04178J0547j6421
$$ plain form
2135 815367 839251 858449 939469 1051623 1125109 1263731 1310727 1337808 1481970 1528163 1748009
2124 1748009 1887385 2024157 2164925 2288265 2530664 2799655 3190693 3599217 4098178 4729448
2114 4729448 5228482 5631248 6051948 6617461 7228433 7452039 6491964 5153461 4148999
2105 4148999 3435729 2959089 2641798 2346629 2079763 1828452 1610533 1483823 1424630 1352569
2095 1352569 1246445 1092683 1017829 950733 874468 772382 676780 645577 591717 557083 541725
2084 541725 498738 408018 438746 474717 394100 280355 307639 324406 271980 173824 113206
2073 113206 138053 131425 160158 196182 161978 154562 140033 163749 167393 139739 191317 208296
2061 208296 129399 165312 194707 122296 15743 44666 128827 161861 57683 68230 51809
2050E1809j6586K4487Q6554o0502j4867J5611k1431l899m0735k1267k0140Q511
2038a2455O5819O913n6180m5201K0908l1262r051l3519o2191M6451O3784k8128
2026g4112k4756K4672k9734J8590O1795o0347J6959P1398L209m8119j2590L8251
2014a4784k6658j8064J0827R18l7047K8632L34J5390j8406m2719N1654R0517k7471
2001A3123k6700j2924J2735m1836n9207o886Q1441R044m4513M1451M7257j2604
1989C81m9890k9354J1348K0490k6562J5748l3888L1071M0420J6274J0059n5774
1977d9677m8342N0212J7052O3931o7368m7896L9643m9491M2298N5453n367m8946
1965d8498k2832o975O702L1719J12161j16875K2560p775m6471J708k5626P167
$$ plain form
2050 51809 35223 59710 146264 85762 70895 86506 65075 61176 20441 -826 -20966 -12455
2038 -12455 53364 60277 4097 -41104 -20196 -51458 -60509 -94028 -156219 -109768 -45984 -74112
2026 -74112 -98868 -74196 -103930 -85340 -23545 -83892 -66933 4465 7674 -40445 -53035 -14784
2014 -14784 -41442 -59506 -48679 -47761 -84808 -56176 -55842 -40452 -58858 -101577 -49923 40594 13123
2001 13123 -13577 -26501 -13766 -55602 -114809 -121695 -40254 -31210 -75723 -34272 12985 381
1989 381 -49509 -78863 -67515 -47025 -73587 -57839 -91727 -60656 -20236 -3962 6097 -49677
1977 -49677 -98019 -47807 -30755 33176 -34192 -82088 -42445 -91936 -49638 5815 448 -48498
1965 -48498 -71330 -78305 -71603 -39884 72277 -44598 -22038 -29813 -76284 -74576 -100202 -93035
1953i3035l8217J8547K181l2268Q9617k6635r0899M0982M6032J8883o615k1654
1941i3081j4946L3031K4904j0820N3948j1925p7517r64Q6659j58632n3856J07852
1929a15347M7441j108r70p996K4599k6462k7832k1939m5935J4086M6394M3840
1917g1229m6031M4053j1812J0818N3706l677L2720K282o3665m8081K0654M7168
1905c3094J5668l3776K1639m0378p3476N1190o760m5442K9076L1804j3619n082
1893a02250K4263L7606n0166l7155o8328J5516L4333R032j1194M9193l7975K2011
1881a15114k8632J1686J9927N451K6548m4205j1251r09Q1364K6244j7048m6407
1869i2346j8792J01272n123k2595O001J3736N383q991k7550q095m394R981j2642
$$ plain form
1953 -93035 -131252 -112705 -110524 -142792 -53175 -79810 -170709 -129727 -83695 -64812 -71427 -93081
1941 -93081 -108027 -74996 -50092 -60912 -6964 -18889 -96406 -97370 -10711 -169343 -223199 -115347
1929 -115347 -67906 -69014 -69984 -77980 -53381 -79843 -107675 -129614 -175549 -161463 -115069 -71229
1917 -71229 -117260 -73207 -85019 -74201 -20495 -24172 8548 10830 -52835 -100916 -80262 -33094
1905 -33094 -17426 -51202 -29563 -69941 -143417 -92227 -98987 -144429 -115353 -83549 -97168 -102250
1893 -102250 -77987 -40381 -90547 -127702 -196030 -180514 -146181 -137149 -148343 -99150 -137125 -115114
1881 -115114 -143746 -132060 -112133 -106682 -80134 -124339 -135590 -136499 -55135 -28891 -45939 -92346
1869 -92346 -111138 -9866 -14989 -37584 -31583 -17847 -12464 -21455 -49005 -57100 -61494 -51513 -64155
1856f4155l5625r140R455P471n703L4580L6021m7443J3761K9075m5596J3580L2050
1843c1669L409L7837K5575j17264j8161q274L443O75M7117n221l1305l4316M9212
1830g8942j5933Q785l5191j5457M1738K7857J2200J9387j2352k2387j3943L2824
1818e1414k5718K716N3740k3470O32L3042m0333q1329N2778L4916o1340j350Q4628
1805b2502j0626n9840P399K7157l0269K4330p0204N1389M2850j5043j6337K0316
1793e1380j8480p5232O336R9438q7592r533L6619K9900N7502k3206j9867n8817
1781a14312L3836j7487m4901M2885J7791N7771p9493m972J4771m11K3174J4839
1769e6509P2439l7999l07n11p5845m666N911P0692J4445k7171O9018m312o6587
$$ plain form
1856 -64155 -99780 -108920 -99465 -91994 -97697 -63117 -27096 -74539 -60778 -31703 -77299 -63719 -31669
1843 -31669 -28260 9577 35152 -82112 -100273 -108547 -105104 -104429 -57312 -62533 -93838 -128154 -78942
1830 -78942 -94875 -86090 -121281 -136738 -95000 -67143 -54943 -35556 -47908 -70295 -84238 -51414
1818 -51414 -77132 -74416 -20676 -44146 -43514 -10472 -50805 -132134 -79356 -44440 -105780 -107130 -22502
1805 -22502 -33128 -92968 -85569 -58412 -88681 -64351 -134555 -83166 -40316 -55359 -71696 -51380
1793 -51380 -69860 -145092 -138756 -39318 -126910 -136443 -99824 -69924 -12422 -35628 -55495 -114312
1781 -114312 -80476 -97963 -142864 -99979 -82188 -24417 -103910 -108882 -94111 -94522 -71348 -56509
1769 -56509 15930 -22069 -22376 -22887 -98732 -103398 -97487 -26795 -12350 -39521 29497 25185 -41402
1756d1402o5533L6678N3602n7927K7824N6723m1890l3203m232l1864l176J9307
1744h5093k0339L8356K1799j4421L1083o470l5104j1061n7548J06883m7283j3098
1732i2296J3225m8550j3702k930K0513Q954L0193K9610n1847N1171O562p6124
1720a25221K884O0249o4102l4154L0159n614l629j9614L8694r820k2758K8702
1708a24224Q6527l5006k5870l0421N673q420L9177n3775O963O361J560j8082k9597
1695a79134K2001P38K0368K9619K3615J1096J0127L4794K0188j17288Q7002l8349
1683g5223n303k1471O6857j5750k9628m756P474m3096j8265L0468J2847K6567
1671f9279K5178r117k2385l768J1030j1018J08390m4307l0456J5003J0215J5584
$$ plain form
1756 -41402 -106935 -70257 -16655 -74582 -46758 9965 -31925 -65128 -69360 -101224 -104400 -85093
1744 -85093 -105432 -67076 -45277 -59698 -28615 -35085 -70189 -81250 -138798 -31915 -79198 -92296
1732 -92296 -79071 -127621 -141323 -144253 -123740 -114786 -84593 -54983 -106830 -55659 -49097 -125221
1720 -125221 -122337 -62088 -126190 -160344 -130185 -135799 -139428 -159042 -120348 -130168 -152926 -124224
1708 -124224 -37697 -72703 -98573 -128994 -123321 -131741 -92564 -146339 -139376 -133015 -131455 -149537 -179134
1695 -179134 -157133 -156395 -136027 -106408 -82793 -71697 -61570 -26776 -6588 -123876 -36874 -75223
1683 -75223 -80526 -101997 -35140 -50890 -80518 -85274 -77800 -120896 -139161 -108693 -95846 -69279
1671 -69279 -44101 -53218 -75603 -79371 -68341 -79359 29031 -15276 -45732 -30729 -20514 -4930
1659d930l2757N4974n9162L3889m0973J9853K7740m2157k7242K2868k3905Q0714
1647H912l9730J8508K9837m2764j820J0962k6126k3404n8431m1487J6799P5402
1635g3342n4348M861J6229l6849M8235N8384K2103J3499q9449m5280K3581J7027
1623i5349M7281k6407j2010l5299j126L4207K2244K7393Q232q4156l9529J1953
1611a42566l4664M6426N8085j7689R199O2069q1289j2219K3390m1213r206J2415
1599a27262J5975m44n626K6572J9206k6900M3521L4214o338j119l012n8124M5205
1586d4132J7489p211n910n2021O5550J3725j02089M6498P4688o946o3105m7580
1574a11044N7291l3067j2489J5466L0395l8180l5912P7011k5279O965O3534N1001
$$ plain form
1659 -4930 -37687 17287 -41875 -7986 -48959 -29106 -1366 -43523 -70765 -47897 -71802 8912
1647 8912 -30818 -12310 17527 -25237 -27057 -16095 -42221 -65625 -124056 -165543 -148744 -73342
1635 -73342 -127690 -122829 -106600 -143449 -95214 -36830 -14727 -1228 -90677 -135957 -112376 -95349
1623 -95349 -48068 -74475 -86485 -121784 -122910 -88703 -66459 -39066 -30834 -114990 -154519 -142566
1611 -142566 -177230 -130804 -72719 -90408 -81209 -19140 -100429 -112648 -89258 -130471 -139677 -127262
1599 -127262 -111287 -111731 -117357 -90785 -71579 -98479 -54958 -20744 -27082 -28201 -31213 -89337 -44132
1586 -44132 -26643 -33854 -39764 -91785 -26235 -12510 -114599 -68101 6587 -359 -63464 -111044
1574 -111044 -53753 -86820 -99309 -83843 -53448 -91628 -127540 -50529 -75808 -68843 -5309 45692
1562D5692q7112m9634m6264O3036K363k6515l5255o5999R8489m5716M390j5205
1550a57730J4426K8563Q2772K6895j9677L019J0710M0262l3618L5717j3518m2482
1538b4661k8514k4617o965J3949Q884K3900m6214L9973m1992J3866O7333o1091
1526f6149j5299l1402J1825J3677O251J7820m1887K5979n212L3289R850r9457
1514a40715o1R750k177K7666m463J8435J0878N4448N6728o2985L7314n2611l9348
1501h7141Q8569j7538j057r1058l8532J18227J9912n6753k5023M0860J7572L2602
1489F40j5433n5448M5300n6751l2809N8316k8851j9562K149R5675l2981J5136
1477b4619j0728n6974r937m8237K7820O1761K7170p1115n253L2620P6666l5132
$$ plain form
1562 45692 -41420 -91054 -137318 -74282 -71919 -98434 -133689 -199688 -101199 -146915 -142525 -157730
1550 -157730 -143304 -114741 -31969 -5074 -24751 -21732 -11022 29240 -4378 31339 17821 -24661
1538 -24661 -53175 -77792 -84757 -70808 -61924 -38024 -84238 -44265 -86257 -72391 -5058 -66149
1526 -66149 -81448 -112850 -101025 -87348 -81097 -63277 -105164 -79185 -84397 -51108 -41258 -140715
1514 -140715 -140776 -131026 -133203 -105537 -110000 -91565 -80687 -26239 30489 -32496 4818 -47793 -87141
1501 -87141 1428 -16110 -17167 -108225 -146757 -28530 -8618 -65371 -90394 -49534 -31962 640
1489 640 -14793 -70241 -24941 -81692 -114501 -56185 -85036 -104598 -102449 -6774 -39755 -24619
1477 -24619 -35347 -92321 -102258 -150495 -122675 -60914 -33744 -104859 -110112 -77492 -826 -35958
1465c5958j8224L9946l1527J1919J579m160j2515J4142J06732j701q2692k0587
1453c3046k1441J699M231Q234M6892j958o8846J3755L7904p5509J5330k1117m1253
1440a35125O0841K2064J5469l4916l0692L2606n234k216N473J4513p474j2140
1428g6831J9989O0873M2995n1372o4409j3501O0499m987K5412M793l2785k0841
1416e0165K1540N4741J7203m7065p3839k721J12280J3768j9445K301m3268L3947
1404A9277J2852m3217j8329M3558l9684m0998N4262N0182q9461M487k5629L102
1392f9598j355j8787L8564j4225P221n1586L9934M2050n3014K1524n68k9873N4002
1379c5711k6195J2211J6619M4171n9503k1433j0271J3609O1340R403o9296n7929
$$ plain form
1465 -35958 -54182 -14236 -45763 -33844 -32265 -36425 -48940 -34798 71934 70233 -12459 -33046
1453 -33046 -54487 -52788 -48557 -40323 6569 4611 -64235 -50480 -12576 -88085 -72755 -93872 -135125
1440 -135125 -74284 -52220 -36751 -71667 -102359 -69753 -74987 -77203 -71730 -57217 -64691 -76831
1428 -76831 -56842 4031 47026 -4346 -68755 -82256 -21757 -26744 -1332 3461 -29324 -50165
1416 -50165 -28625 26116 43319 -3746 -77585 -80306 31974 45742 26297 28598 -14670 19277
1404 19277 32129 -11088 -29417 14141 -25543 -66541 -12279 37903 -51558 -47071 -72700 -69598
1392 -69598 -70953 -89740 -51176 -65401 -58180 -109766 -69832 -27782 -80796 -59272 -59840 -89713 -35711
1379 -35711 -61906 -49695 -33076 11095 -48408 -69841 -80112 -66503 -5163 4240 -65056 -122985
1367a22985P8631l3833L0783K9209n8407K7425l035J283J4953j8850K4828l1894
1355f1892m2117K5546O3088M7765l0918k2843L6480l2839j339L5188l9397j2634
1343c5912m7916m2586K4849Q3636k0903J6111l5037L6520J2458j7770k4350L962
1331d6938k7183n531J1822M3288j8778J7872L3488j8372N2610p6209n7203N8196
1319c2938l524n5164J4600P136J3123P803J12003k8178M6213l6455j1333l0454
1307B832k0802K7198O3404l5461K571n1232k0370m4892J8039j1116L0580M7217
1295G968M961j7313k4442j682n4020L4637n998j8747N381Q031K026M6260o455
1282a9393N0967p6191n6306p958k5666L9992P4839n200M864J3930L34J294o510
$$ plain form
1367 -122985 -44354 -78187 -47404 -18195 -76602 -49177 -52212 -50929 -35976 -54826 -29998 -61892
1355 -61892 -104009 -78463 -15375 32390 1472 -21371 15109 -17730 -19069 16119 -23278 -35912
1343 -35912 -83828 -126414 -101565 -17929 -38832 -22721 -57758 -21238 -8780 -26550 -50900 -46938
1331 -46938 -74121 -79652 -67830 -24542 -43320 -25448 8040 -10332 42278 -33931 -91134 -32938
1319 -32938 -36462 -91626 -77026 -69890 -56767 -48964 63039 34861 81074 44619 33286 2832
1307 2832 -17970 9228 72632 37171 39742 -11490 -31860 -76752 -58713 -69829 -39249 7968
1295 7968 12929 -4384 -28826 -30508 -84528 -49891 -55889 -74636 -69255 -61224 -59198 -12938 -19393
1282 -19393 31574 -44617 -100923 -108881 -134547 -94555 -19716 -24916 -20052 -6122 -5788 -4494 -11004
1269a1004l5215j3541N9470K4901o1546k0588L4457J6410o1745L3980J4153j3576
1257c3844j6365j6119J2762p989j5470L1384Q1647L6860k7721p1052J6385n3834
1245f3356j736n58k2105j1859n917M302L2601M0095M0621r4805L724k42O347P3848
1231I60o0715R834M0371L3229p2340l0212M73N5872k2782k6759J8341j4L7622
1218a6120k895J6356O8750p7647p775j9950J7138K7063N1992j7480j16493L5389
1206d1672K8664L107n6265j4245P2962J3367j8469m0353n1082O5971J3299J120
1194b3596J3448K2864l0175M178n011J844L2841j4571L3360l8154o7562K3215
1182d7319r780l5194R1750K3408J8048q280K1463L1267k1787n2703p8441P040
$$ plain form
1269 -11004 -46219 -59760 -290 24611 -36935 -57523 -23066 -6656 -68401 -34421 -20268 -33844
1257 -33844 -50209 -66328 -53566 -61555 -77025 -45641 36006 72866 45145 -25907 -9522 -63356
1245 -63356 -65092 -65650 -87755 -99614 -105531 -101229 -68628 -28533 12088 -82717 -78993 -79235 -72888 960
1231 960 -59755 -49921 -9550 23679 -48661 -78873 -78400 -22528 -45310 -72069 -53728 -53742 -16120
1218 -16120 -19015 -2659 66091 -11556 -19331 -39281 -22143 4920 56912 39432 -77061 -41672
1206 -41672 -13008 -9901 -66166 -80411 -7449 5918 -12551 -52904 -103986 -38015 -24716 -23596
1194 -23596 -10148 12716 -17459 -13281 -18292 -16448 16393 1822 35182 -2972 -70534 -47319
1182 -47319 -57099 -92293 -543 22865 40913 32633 54096 85363 63576 10873 -67568 -60528
1170f0528L2094k6167L8728J4309R011j6615l0738J23759K1276j00461j9713k687
1158a7732l1546R260k0816l214k735L4042M3203j7557L3030j9152o0291n050K8746
1145b9812j1197K154L5620q506k5831O1728P369j23909L3851Q4802J7226J582
1133D5077n4592m6837M171m0691j8632J5399N7897m626L1243m4617L0559O2399
1121C6750k5737k8189O5999j6511j1069l3526m5556k6462R257J21720m2933j8108
1109a4365r097l6758Q579L8390k2680m9728m984J8487L8658O8908K8528m794l1435
1096B7709L107k5057j2136M2955J4401n3144m3374l8266K5836M7959J405l8863
1084d7468j1166j1500j7964N7844R259l0287k3668K0224p568Q4096o639p2101
$$ plain form
1170 -60528 -28434 -54601 -15873 -1564 7447 -9168 -39906 83853 105129 4668 -15045 -17732
1158 -17732 -49278 -40018 -60834 -64048 -66783 -32741 10462 -7095 25935 6783 -53508 -58558 -29812
1145 -29812 -41009 -38855 -3235 -11741 -37572 24156 31525 -92384 -58533 26269 43495 45077
1133 45077 -9515 -56352 -52181 -92872 -111504 -96105 -38208 -42834 -11591 -56208 -25649 36750
1121 36750 11013 -17176 48823 32312 21243 -12283 -57839 -84301 -75044 46676 3743 -14365
1109 -14365 -23462 -60220 -51641 -13251 -35931 -85659 -90643 -72156 -33498 35410 63938 59144 27709
1096 27709 30816 5759 -6377 36578 50979 -2165 -45539 -83805 -57969 -10010 -8605 -47468
1084 -47468 -58634 -70134 -88098 -30254 -20995 -51282 -74950 -54726 -62294 21802 15163 -56938
1072e6938P2997k3095J661M7538m7320m4529M4385r604O3378R98m3012L769m3285
1059c3057O7544n8864N4711M4905p763p5888n4006o574k911N5442K222K8189k8979
1046a5029J9613K2473P8079k0028j2909l3860n0657k980J8949K4136M165K6576
1034E8528J5533j5254k4038k6077M8255n892m6346K9840n2192k6617p515j0297
1022f2072J8984J9034P5275k9592m6798l8498M7910M8008k4355J2815j04385j2277
1010i5951N2599L7088m6993K7046K0008n077J5097L4770k7584o4864M628M428
998d4805O1114l1914m0076k3752O5375P3819l6635j1520j9069j9359J5144k903
986a4581l2704Q657j9436J7475M6299K0226m9754j0493P5740l3170o1280N0994
$$ plain form
1072 -56938 16059 -7036 -5375 42163 -5157 -49686 -5301 -14905 48473 49471 6459 10228 -33057
1059 -33057 34487 -24377 30334 75239 67476 -8412 -62418 -68992 -71903 -16461 -14239 13950 -15029
1046 -15029 4584 27057 105136 85108 72199 38339 -12318 -15298 3651 27787 31952 58528
1034 58528 74061 58807 34769 8692 56947 51055 4709 34549 -17643 -44260 -51775 -62072
1022 -62072 -43088 -24054 51221 21629 -25169 -63667 -15757 32251 7896 20711 -83674 -95951
1010 -95951 -43352 -6264 -53257 -26211 -6203 -11280 3817 38587 11003 -53861 -49233 -44805
998 -44805 16309 -15605 -55681 -79433 -14058 59761 23126 11606 -7463 -26822 -11678 -14581
986 -14581 -47285 -38628 -58064 -40589 5710 25936 -23818 -34311 41429 8259 -53021 -2027
974b027J2732j0783k2197k0286r293L2700j7339n7497N415K1427Q2999K970j4281
961D540k9491l5241M1860L5271m7838O3281J3402m2831j5358L2387k9735j8925
949b8678j0589L2431j8001O3788P6952p3989n3397Q0250l841n0491K2097j9072
937A7460o680P674K6790J6999o4554l2570Q3448J6390k7377p9592k2837R420M0613
924a4816J9104j1739r625J0088m9521j161M3403J12300J0816l1001o7746l002
912G100J5639k6697k2456J05K1895J5968O2957r7480K786j9029k3973J8582Q5565
899D0962J9056l3798O6944m1520q3508N7110M6059j05691Q342J8628J9220J9703
887C1507L4518j9083K5362k4235j7295o3927L4388p400m726N3156M545o2761n210
$$ plain form
974 -2027 10705 -78 -22275 -42561 -51854 -19154 -36493 -93990 -88575 -67148 15851 18821 4540
961 4540 -24951 -60192 -18332 16939 -30899 32382 45784 2953 -12405 19982 -9753 -28678
949 -28678 -39267 -6836 -24837 38951 115903 41914 -11483 68767 64926 14435 36532 17460
937 17460 10780 18454 45244 62243 -2311 -34881 48567 64957 37580 -42012 -64849 -55429 -14816
924 -14816 4288 -7451 -17076 -6988 -56509 -57670 -14267 98033 108849 77848 10102 7100
912 7100 22739 -3958 -26414 -26309 -4414 11554 74511 -22969 -20183 -39212 -63185 -44603 40962
899 40962 60018 26220 93164 51644 -31864 25246 71305 -34386 -26044 -7416 11804 31507
887 31507 66025 46942 72304 48069 30774 -33153 1235 -6165 -10891 42265 46810 -15951 -21161
874b1161K4718j04447N0054P5200J6215m7481Q800J05732m7799r9093J9268l4134
862e4128M1403M3228k5139j8361J6500N0019K835j0353j501j0153R127K7049J8646
849H9172l4164j9145j3774J4950l3187J3190L832M172K4768M641L633l0471K2779
836E0396K3802j01028J029Q4758Q597n2118O593Q294n0957m5301N4808N4467N388
823D8728P2746q3770M713M682j13146M502M6698J3419J9629k540m7253o5423Q1390
810a5625M9193p3348J6260M4684J6258j6271M7864m2103L3686m936k3996o1894
798c0228j6480M0709k2671K5456J8492j4752l522j201k1933j5832j7385M1848
786a7499M6305j7677l858l2542l027L4560j8605O198O942O0734j5401l8763l1997
$$ plain form
874 -21161 3557 -100890 -50836 24364 40579 -6902 1898 107630 59831 -39262 -19994 -54128
862 -54128 -12725 30503 5364 -12997 3503 53522 56357 46004 44503 34350 43477 70526 89172
849 89172 55008 35863 22089 37039 3852 17042 20874 25046 49814 54455 58088 27617 50396
836 50396 74198 -26830 -25801 58957 67554 15436 22029 30323 -20634 -65935 -11127 43340 48728
823 48728 121474 37704 42417 47099 -66047 -61545 -14847 -1428 18201 15661 -31592 -97015 -15625
810 -15625 33568 -39780 -23520 21164 37422 21151 69015 26912 60598 55662 31666 -30228
798 -30228 -46708 -5999 -28670 -3214 15278 526 -2996 -4197 -26130 -41962 -59347 -17499
786 -17499 28806 11129 7271 -25271 -28298 6262 -12343 -6145 797 61531 46130 7367 -24630
773b4630q736l4678K0351P2898K687k3314p0396j9438P2204j048n8633J2689p389
760f7433J7393l5956n721J10300l3976m431k953J4514N8001Q493J3672p108r634
747E5161J5421K5893o8503J4052Q520k7098k8396N2605K4872m3138J6118J3815
735E9322l1785l0520O3186J4613q9266j8282J1544P4728l8508j2387l9484m8361
723h5200Q7445K1059n9273O5514K8011n4033L6405n3309r020K9752L1319o1020
711b2350L3560M2812j4971K4939M8470j7049K7759J8639j04425o9801N8181J4690
699D0454J8966k6872q11l0207r515K3619L397p722Q164k2225l3873K1773N1577
686C6725M848l4183n5129O6075N6443n9445J0739J2623l374j312L7715K8254M5074
$$ plain form
773 -24630 -33366 -68044 -47693 25205 27892 4578 -65818 -85256 -13052 -14100 -72733 -60044 -67433
760 -67433 -50040 -85996 -91717 18583 -15393 -19824 -22777 -8263 49738 58231 71903 64795 55161
747 55161 70582 96475 27972 42024 50544 23446 -4950 47655 72527 29389 45507 59322
735 59322 27537 -2983 60203 74816 -14450 -32732 -21188 53540 15032 2645 -36839 -85200
723 -85200 2245 23304 -35969 29545 57556 3523 39928 -13381 -22401 7351 38670 -22350
711 -22350 11210 54022 39051 63990 112460 95411 123170 141809 37384 -32417 25764 40454
699 40454 59420 32548 31737 1530 -7985 15634 19031 11309 19473 -2752 -36625 -14852 36725
686 36725 41573 7390 -47739 18336 74779 15334 26073 38696 35322 34010 71725 99979 145053
673A45053o9781p1163M3914j052k1680K0557K8524m8394L8195j5465j4134L9386
661G3960J7760j7066l6268M959m0157n7317K5459J9640J4233R230L016P9716n3599
648D3566J2374q377K2591O3639j6602o0012j5423k8160O249j7350M8172O2567
636A13234m3661L8474m5733j5493J8117j6619l362n6867J0005J7406L3867M4646
624I4014K0428k8537m1289K8479J4417o3280j4857l34o31p345Q431P6947P321
611I3764m4496K297J656O600N3931L5315r9071j4143N4045L0908M5790n9385m5441
598F1770k943K6511r5574N5379j3173j4978O7840k5323k340K3675j9343q9585
586b8084J00572K6305m1284j4480J167L7813m8014m7250L8537M4752O0405K2817
$$ plain form
673 145053 75272 4109 48023 46971 25291 45848 74372 25978 64173 48708 34574 73960
661 73960 91720 74654 38386 43345 3188 -54129 -28670 -9030 5203 14433 17449 97165 43566
648 43566 55940 47563 70154 133793 117191 57179 41756 13596 19845 2495 50667 113234
636 113234 69573 108047 62314 46821 64938 48319 44957 -11910 -1905 15501 49368 94014
624 94014 114442 85905 44616 73095 87512 24232 9375 9041 8410 1065 9496 86443 93764
611 93764 49268 51565 53221 59821 113752 149067 49996 35853 89898 120806 166596 107211 61770
598 61770 58827 85338 -10236 45143 31970 16992 84832 59509 57169 80844 61501 -28084
586 -28084 72488 98793 57509 43029 44196 82009 33995 -13255 25282 70034 130439 153256
574A53256j7905j3008n9935l7774N3549m3887N2086l4374l6858L2046j1852K1920
562E7264J938m464J7508o7730l3398J3101Q5102O2993q4158P722l4717Q525O851
549C6537K8877K1690q1089K8004L9288l9904p416l5382J9929N6435n7668O4540
537G3841k1161m8099m326R282m2643M4637P0136j3530J1360o7926k2980p799P0488
524E1280k442l1075P0687l4798q805P0441j3743j4586K6753l0917l6206l294J5078
511E8373K0759J0568o9387l351P8308n1558K3034J0378J115L2907K2717m2086
499I1777o0331m5928K4902k9598K6175L5558k1974l6969j6852P1069O8996k5680
487H1145N5976m8268n4872j3235k880J8255N6020N7482K9309p5749j25482m436
$$ plain form
574 153256 135351 122343 62408 24634 78183 34296 86382 52008 15150 47196 35344 57264
562 57264 59202 54738 72246 4516 -28882 -15781 69321 132314 48156 55878 21161 29686 36537
549 36537 65414 87104 6015 34019 73307 33403 25987 -9395 10534 66969 9301 73841
537 73841 52680 4581 255 9537 -33106 11531 81667 68137 79497 11571 -11409 -19208 51280
524 51280 48838 17763 88450 53652 44847 115288 101545 86959 113712 82795 46589 43295 58373
511 58373 79132 89700 20313 16962 95270 43712 66746 77124 78239 111146 133863 91777
499 91777 31446 -14482 10420 -19178 6997 42555 20581 -16388 -33240 37829 106825 81145
487 81145 137121 88853 33981 20746 17866 36121 92141 149623 178932 103183 -22299 -26735
475b6735P9189K1826J9368k0607k5638k1727J22823k6406m6194J0716n0696j9409
463A6510R139L0447N374M8627K3120j0836l6907K8747p127m2036l0463J9874j0689
450D3780k9567K1118L3759m2599l208k1658N0237M3213k8918o8478n741R133j3657
437a2586k3198J3410K4434J4940M2860M4083o631l1730J6863m2314m917O288p5198
424c3696M838N4182L2495J7879K8819l9830k9327J1242n344K892K1029n3224N982
411A7937K9538N4749l095J3754o115N5129m2077n9114o732j8397L7766j125K7584
398I9802l5860n5859J9584o342Q695j4213J1695R938n1231K0520J7350O1681J8819
385A04579o2721L5859l5662J7005K0765q3146P7514m598K036L8487p0528k2005
$$ plain form
475 -26735 52454 74280 93648 73041 47403 25676 148499 122093 75899 86615 35919 16510
463 16510 25649 56096 61470 110097 133217 122381 85474 114221 107094 65058 34595 54469 43780
450 43780 14213 35331 69090 26491 23283 1625 51862 95075 66157 -2321 -8062 1071 -12586
437 -12586 -35784 -22374 2060 17000 59860 103943 97312 65582 82445 40131 35214 41502 -33696
424 -33696 -28858 25324 57819 75698 104517 64687 35360 46602 41258 44150 65179 11955 17937
411 17937 47475 102224 99129 112883 106768 161897 119820 60706 53974 35577 73343 72218 99802
398 99802 63942 8083 27667 21325 30020 15807 27502 37440 -13791 6729 24079 85760 104579
385 104579 41858 77717 42055 59060 79825 -3321 74193 69595 71631 110118 39590 17585
373A7585j4668N794J7593m566j4193l4968J2766R817j3652p827Q3644j2293n3647
360h615J5956K1236O491j6937M4015L8267k9785L0365m6052l039N5163q9605j9036
347a576K7668J6195p274L3967q558L3517J9104o9705P7792R746l5674J5188o169
334A04221n4223J4336K7070m0478M1358K1169l957o7894J5675R0240q5095R523
322G1945J08284R958k7621j03902N2754L8861n7817J8769n3362k7794P591p624
310C0042L6380K8791k7247m18m1332j2592J9631M1922M0808J3642m6076L074J8040
297A04665l2067p2142M659M6079N4482O662m0230l4536N7880l5180j0460J761
285E1573k1860M269N464N400J5531N8988m0626o4665r85K3279k0469M2021o449
$$ plain form
373 17585 2917 8711 26304 21738 7545 -27423 -14657 -4840 -18492 -26319 57325 45032 -8615
360 -8615 7341 28577 35068 18131 62146 100413 70628 100993 54941 51902 107065 17460 -1576
347 -1576 26092 42287 35013 68980 60422 93939 113043 43338 121130 130876 95202 110390 104221
334 104221 49998 64334 91404 50926 92284 113453 109496 41602 57277 147517 62422 71945
322 71945 180229 190187 162566 58664 111418 150279 92462 111231 57869 30075 37666 30042
310 30042 66422 95213 67966 67548 26216 13624 33255 75177 115985 129627 83551 86625 104665
297 104665 72598 456 5115 51194 105676 112338 72108 37572 95452 60272 49812 51573
285 51573 29713 33982 39446 44846 60377 119365 78739 14074 13089 36368 15899 57920 51471
272E1471K1425m5299K7904j0439q358J9623o084N8117M6313j07842q9257O8933
260B6507Q7033J1228k8343l1363n5513o0742J5085O5162k2212L104M9399K3118
248H2463o5252l593k5119n5630L7968P2216j0516l6273l379P096J7952K179l7013
235a6901M9979j2289Q406o6011p5249M0725L9368J6504K8931L1134k7065K1576
223C9108N698n0681L6002j6975J2556k8722M6423k275K1081K217o0106k0060L0744
210A5010p003p2250J6026N7924l6923J4171L6098j6683M8250l8840r0994j5738
198i0952M3665L7398K2836k1398M9363m2352J2145p132n8196m5917N1105l51N2119
185B333n596P898l8957o5282N4232L4086m6085o861l9151k4356J7856L0543l5450
$$ plain form
272 51471 72896 27597 55501 45062 36704 56327 50243 108360 154673 46831 -42426 26507
260 26507 113540 124768 96425 65062 9549 -51193 -36108 29054 6842 9946 59345 82463
248 82463 17211 13618 -11501 -67131 -29163 43053 32537 -3736 -7115 -19 17933 20112 -16901
235 -16901 33078 20789 29195 -36816 -112065 -71340 -31972 -15468 13463 44597 17532 39108
223 39108 44806 -5875 30127 13152 25708 -3014 43409 41134 62215 64432 4326 -15734 15010
210 15010 8007 -64243 -48217 9707 -27216 -13045 23053 6370 54620 15780 -75214 -90952
198 -90952 -47287 -9889 12947 -8451 40912 -1440 10705 3573 -54623 -100540 -49435 -49786 2333
185 2333 -3263 4635 -34322 -99604 -45372 -11286 -57371 -64232 -103383 -127739 -109883 -79340 -114790
172a14790P1355j0000J8716J134n6773j5875J0943L1405k8697N1144l8488m2780
160a22706J05800l1569o8893j0444M1271J4756O08l1659l4069K0488L2765N199
148g8453l8457k2936K2290M4800l5388M9599L847l6506l2908k0719l4491l4794
136b14116K929J4712N1874j7934k6127N3831K9224j1955o6015k4498j9892O3109
124a64858J6359m1127m0612K8210M7067j418j5466l7984K3430q179J8539m041
112a80080j19514O8484J5917J0182k6060j831p573K2709R645o2985L831K8717
100b38558l920j6035j2085k2331O2208n939j2203k6007j5078K222j1813O5825
88b33714l125k9151k6161m1765j3096K4928P1768k1767r271j3643r973L0986j4230
$$ plain form
172 -114790 -43435 -53435 -34719 -33585 -90358 -106233 -95290 -63885 -92582 -41438 -79926 -122706
160 -122706 -16906 -48475 -117368 -127812 -86541 -71785 -71177 -102836 -136905 -116417 -83652 -78453
148 -78453 -116910 -139846 -117556 -72756 -108144 -58545 -54698 -91204 -124112 -144831 -179322 -214116
136 -214116 -211187 -196475 -144601 -162535 -188662 -134831 -105607 -117562 -183577 -208075 -227967 -164858
124 -164858 -148499 -189626 -230238 -202028 -154961 -156379 -171845 -209829 -186399 -194578 -176039 -180080
112 -180080 -299594 -231110 -215193 -205011 -231071 -232902 -240475 -217766 -208121 -271106 -267275 -238558
100 -238558 -242478 -258513 -270598 -292929 -230721 -236660 -248863 -274870 -289948 -287726 -299539 -233714
88 -233714 -236839 -265990 -292151 -333916 -347012 -322084 -250316 -272083 -281354 -294997 -304970 -273984 -288214
75b88214r5641L0906J4065m4843K4802J6454p173l3895K1101M412k6578m8216
63d32820L9244j5609K9243o1659R662N3240l0718J2429m7686L974L6062K1552
51c83086m9114k0698j1172R095o191k3060P928M8835M5379n9574n2879K4169m4957
38e15325k538j3865L61j1026M4430L9173l2564j0142m8326J9992m2689K7494j4583
25e59608k5691J7337O085K0822m50r150K6065l8230k1312j3738K916k0000l5596
12f50550l1483J8674k6508J281M4936l3369l0388m3586L0193K175M454l3752
0g47923
$$ plain form
75 -288214 -383855 -352949 -338884 -383727 -358925 -342471 -349644 -383539 -362438 -358026 -384604 -432820
63 -432820 -393576 -409185 -379942 -441601 -431939 -378699 -409417 -396988 -444674 -440700 -404638 -383086
51 -383086 -432200 -452898 -464070 -454975 -461166 -484226 -476298 -427463 -382084 -441658 -494537 -470368 -515325
38 -515325 -517863 -531728 -531367 -542393 -497963 -458790 -491354 -501496 -549822 -529830 -572519 -545025 -559608
25 -559608 -585299 -567962 -561877 -541055 -541505 -550655 -524590 -562820 -584132 -597870 -594954 -614954 -650550
12 -650550 -682033 -663359 -689867 -688586 -643650 -677019 -707407 -750993 -720800 -718625 -714171 -747923
0 -747923
$$ Imaginary data points
$$ [...]
##END NTUPLES=NMR SPECTRUM
##END=
