##TITLE=1H_CG-1200
 CDCl3
 8 sc, 
 3.4.2024
##JCAMPDX= 6.0         $$ Bruker NMR JCAMP-DX V2.0
##DATA TYPE= NMR SPECTRUM
##DATA CLASS= NTUPLES
##ORIGIN= UXNMR, Bruker Analytische Messtechnik GmbH
##OWNER= root
$$ XWIN-NMR		Version 3.5
$$ Wed Apr  3 14:36:13 2024 Russian Standard Time (UT+4h)  she@DPX200
##.OBSERVE FREQUENCY= 200.1309
##.OBSERVE NUCLEUS= ^1H
##.ACQUISITION MODE= SIMULTANEOUS
##.ACQUISITION SCHEME= undefined
##.AVERAGES= 8
##.DIGITISER RES= 18
##SPECTROMETER/DATA SYSTEM= spect
##.PULSE SEQUENCE= zg30
##.SOLVENT NAME= MeOD
##.SHIFT REFERENCE= (INTERNAL, MeOD, 0, 15.7106)
##AUDIT TRAIL= $$ (NUMBER, WHEN, WHO, WHERE, WHAT)
$$ ##TITLE= Audit trail, XWIN-NMR		Version 3.5
$$ ##JCAMPDX= 5.01
$$ ##ORIGIN= Bruker BioSpin GmbH
$$ ##OWNER= she
$$ F:/spectra/data/she/nmr/H-F/1/pdata/1/auditp.txt
$$ ##AUDIT TRAIL=  $$ (NUMBER, WHEN, WHO, WHERE, WHAT)
(   1,<2024-04-03 14:32:22.64 +0400>,<she>,<DPX200>,
      <created by zg, POWCHK disabled, PULCHK disabled
       configuration hash MD5:
       00 E9 B6 7A A2 85 ED C7 34 08 36 98 17 FE 4E 26
       data hash MD5: 16K
       7D A6 E5 F6 2D 54 29 C8 F8 40 26 B0 4D 2B BE 4A>)
(   2,<2024-04-03 14:34:58.12 +0400>,<she>,<DPX200>,
      <Start of raw data processing
       efp BC_mod = 2 LB = 0.24 FT_mod = 6 PKNL = 1 PHC0 = -25299.96 PHC1 = 12.98731 SI = 16K 
       data hash MD5: 16K
       3D 8B 67 17 5D BE D3 2A F0 37 EB 90 24 D6 49 BC>)
(   3,<2024-04-03 14:35:21.23 +0400>,<she>,<DPX200>,
      <pk PHC0 = -156.3071 PHC1 = -3.2 
       data hash MD5: 16K
       B9 91 47 E6 55 51 FF 36 0C 20 19 53 A0 1B 80 BA>)
(   4,<2024-04-03 14:35:24.65 +0400>,<she>,<DPX200>,
      <abs ABSG = 5 
       data hash MD5: 16K
       A3 E1 54 A9 8D 81 33 F0 B3 2C 23 19 12 C4 CD 04>)
$$ ##END=
$$ 
$$ hash MD5
$$ CC EE AB 05 E2 DF 8D 62 6B 85 41 68 7E 4B E0 4A
##$RELAX= 
##$RELAX= 
##$RELAX= 
##$RELAX= 
##$RELAX= 
##$RELAX= 
$$ Bruker specific parameters
$$ --------------------------
##$DU= <F:/spectra>
##$EXPNO= 1
##$NAME= <H-F>
##$PROCNO= 1
##$TYPE= <nmr>
##$USER= <she>
##$AMP= (0..31)
100 100 100 100 100 100 100 100 100 100 100 100 100 100 100 100 100 100 
100 100 100 100 100 100 100 100 100 100 100 100 100 100 
##$AQSEQ= 0
##$AQ_mod= 1
##$AUNM= <au_zg>
##$AUTOPOS= <>
##$BF1= 200.13
##$BF2= 200.13
##$BF3= 200.13
##$BF4= 200.13
##$BF5= 200.13
##$BF6= 200.13
##$BF7= 200.13
##$BF8= 200.13
##$BYTORDA= 1
##$CFDGTYP= 0
##$CFRGTYP= 5
##$CHEMSTR= <none>
##$CNST= (0..31)
1 1 145 1 1 1 1 1 1 1 1 1 1 1 1 1 1 1 1 1 1 1 1 1 1 1 1 1 1 1 1 1 
##$CPDPRG= <>
##$CPDPRG1= <>
##$CPDPRG2= <>
##$CPDPRG3= <>
##$CPDPRG4= <mlev>
##$CPDPRG5= <mlev>
##$CPDPRG6= <mlev>
##$CPDPRG7= <mlev>
##$CPDPRG8= <mlev>
##$CPDPRGB= <>
##$CPDPRGT= <>
##$D= (0..31)
0 1.2 0 0 0 0 0 0 0 0.06 0 0.03 0 0 0 0 0.0002 0 0 0 0 0 0 0 0 0 0 0 0 
0 0 0 
##$DATE= 1712140342
##$DBL= (0..7)
120 120 120 120 120 120 120 120 
##$DBP= (0..7)
150 150 150 150 150 150 150 150 
##$DBP07= 0
##$DBPNAM0= <>
##$DBPNAM1= <>
##$DBPNAM2= <>
##$DBPNAM3= <>
##$DBPNAM4= <>
##$DBPNAM5= <>
$$ [...]
##$SUBNAM3= <"">
##$SUBNAM4= <"">
##$SUBNAM5= <"">
##$SUBNAM6= <"">
##$SUBNAM7= <"">
##$SUBNAM8= <"">
##$SUBNAM9= <"">
##$SW= 18.0517689322627
##$SWIBOX= (0..15)
0 0 2 0 0 0 0 0 0 0 0 0 0 0 0 0 
##$SW_h= 3612.71676300578
##$TD= 16384
##$TD0= 1
##$TE= 0
##$TE2= 300
##$TE3= 300
##$TEG= 300
##$TL= (0..7)
0 120 120 120 120 120 120 120 
##$TP= (0..7)
150 150 150 150 150 150 150 150 
##$TP07= 0
##$TPNAME0= <>
##$TPNAME1= <>
##$TPNAME2= <>
##$TPNAME3= <>
##$TPNAME4= <>
##$TPNAME5= <>
##$TPNAME6= <>
##$TPNAME7= <>
##$TPOAL= (0..7)
0.5 0.5 0.5 0.5 0.5 0.5 0.5 0.5 
##$TPOFFS= (0..7)
0 0 0 0 0 0 0 0 
##$TUNHIN= 0
##$TUNHOUT= 0
##$TUNXOUT= 0
##$USERA1= <user>
##$USERA2= <user>
##$USERA3= <user>
##$USERA4= <user>
##$USERA5= <user>
##$V9= 5
##$VALIST= <valist>
##$VCLIST= <CCCCCCCCCCCCCCC>
##$VD= 0
##$VDLIST= <DDDDDDDDDDDDDDD>
##$VPLIST= <PPPPPPPPPPPPPPP>
##$VTLIST= <TTTTTTTTTTTTTTT>
##$WBST= 1024
##$WBSW= 4
##$XGAIN= (0..3)
0 0 0 0 
##$XL= 0
##$YL= 0
##$YMAX_a= 500271
##$YMIN_a= -424812
##$ZGOPTNS= <>
##$ZL1= 120
##$ZL2= 120
##$ZL3= 120
##$ZL4= 120
##$ABSF1= 15.77117
##$ABSF2= -2.280722
##$ABSG= 5
##$ABSL= 3
##$ALPHA= 0
##$AQORDER= 0
##$ASSFAC= 0
##$ASSFACI= 0
##$ASSFACX= 0
##$ASSWID= 0
##$AUNMP= <proc_1d>
##$AZFE= 0.1
##$AZFW= 0.1
##$BCFW= 0
##$BC_mod= 2
##$BYTORDP= 0
##$COROFFS= 0
##$CY= -3
##$DATMOD= 1
##$DC= 0
##$DFILT= <>
##$DTYPP= 0
##$F1P= 0
##$F2P= 0
##$FCOR= 1
##$FTSIZE= 16384
##$FT_mod= 6
##$GAMMA= 0
##$GB= 0
##$INTBC= 1
##$INTSCL= 3.70164e-10
##$ISEN= 128
##$LB= 0.24
##$LEV0= 0
##$LPBIN= 0
##$MAXI= 10000
##$MC2= 0
##$MEAN= 0
##$ME_mod= 0
##$MI= 1.114404
##$NCOEF= 0
##$NC_proc= -6
##$NLEV= 6
##$NOISF1= 3.799351
##$NOISF2= 2.8
##$NSP= 0
##$NTH_PI= 0
##$NZP= 0
##$OFFSET= 15.71056
##$PC= 1
##$PHC0= -25456.27
##$PHC1= 9.787311
##$PH_mod= 1
##$PKNL= yes
##$PPARMOD= 0
##$PSCAL= 0
##$PSIGN= 0
##$REVERSE= no
##$SF= 200.129562210141
##$SI= 16384
##$SIGF1= 3
##$SIGF2= 2
##$SINO= 5.538805
##$SIOLD= 16384
##$SREGLST= <1H.CDCl3>
##$SSB= 0
##$STSI= 16384
##$STSR= 0
##$SW_p= 3612.71676300577
##$SYMM= 0
##$S_DEV= 0
##$TDeff= 16384
##$TDoff= 0
##$TI= <>
##$TILT= no
##$TM1= 0
##$TM2= 0
##$TOPLEV= 0
##$USERP1= <user>
##$USERP2= <user>
##$USERP3= <user>
##$USERP4= <user>
##$USERP5= <user>
##$WDW= 1
##$XDIM= 16384
##$YMAX_p= 302764507
##$YMIN_p= -387200
$$ End of Bruker specific parameters
$$ ---------------------------------
##NTUPLES= NMR SPECTRUM
##VAR_NAME=  FREQUENCY,     SPECTRUM/REAL,   SPECTRUM/IMAG
##SYMBOL=    X,             R,               I
##VAR_TYPE=  INDEPENDENT,   DEPENDENT,       DEPENDENT
##VAR_FORM=  AFFN,          ASDF,            ASDF
##VAR_DIM=   16384,         16384,           16384
##UNITS=     HZ,            ARBITRARY UNITS, ARBITRARY UNITS
##FACTOR=    0.220516191357247, 1,           1
##FIRST=     3144.14746385021, 0,            0
##LAST=      -468.569299155563, 0,           0
##MIN=       -468.569299155563, -387200,     0
##MAX=       3144.14746385021, 302764507,    0
$$ Real data points
##PAGE= N=1
##DATA TABLE= (X++(R..R)), XYDATA
$$ [...]
$$ plain form
7674 4398 -2517 -33306 -46419 -68789 -65342 -52807 -22567 -11677 -28486 -16578 -59402 -31320
7662 -31320 40848 78614 73298 40747 15415 24105 -4444 5740 66068 94438 77484 97940
7650 97940 91142 104175 98106 49703 73760 93100 92952 129177 136663 168511 223424 226214 262967
7637 262967 270354 246951 255276 296430 319353 309562 293126 279273 274243 268305 304800 339027 342333
7624 342333 311479 321873 313103 274738 244465 225540 232065 236672 215346 216359 224203 193778 150642
7611 150642 132457 142590 176533 170301 193862 163714 124758 103228 104338 125589 96863 127930
7599 127930 183753 220867 215234 215631 232669 207158 250275 294633 278207 298246 285926 304980
7587 304980 313236 291689 325459 306411 300908 331655 320602 286694 291361 270057 212695 241111
$$ packed form
7674D398o915l0789j3113k2370L447J2535L0240J0890j6809J1908m2824K8082
7662c1320P2168L7766n316l2551k5332Q690k8549J0184O0328K8370j6954K0456
7650I7940o798J3033o069m8403K4057J9340j48L6225P486L1848N4913K790L6753
7637B62967P387k3403Q325M1154K2923r791j6436j3853n030n938L6495L4227L306
7624C42333l0854J0394q770l8365l0273j8925O525M607k1326J013P844l0425m3136
7611A50642j8185J0133L3943o232K3561l0148l8956k1530J110K1251k8726L1067
7599A27930N5823L7114n633L97J7038k5511M3117M4358j6426K0039j2320J9054
7587C04980Q256k1547L3770j9048n503L0747j1053l3908M667k1304n7362K8416
$$ plain form
7575 241111 204955 190334 205141 149573 121025 99451 75065 102133 95457 101270 84148 77225
7563 77225 33974 65047 50254 -1918 -20588 16310 31635 -2076 -50382 -24166 27701 8282
7551 8282 11789 -34685 -8646 -32674 -20894 -2302 -15070 -9547 -21091 -42501 -52655 -56963 -10553
7538 -10553 -13021 -13514 -10936 -2152 -6140 8432 12636 -10553 13480 29001 -25533 -15468 9870
7525 9870 -27961 243 45852 33186 40353 39896 15781 20028 55411 59749 44920 65892 28866
7512 28866 53820 82707 72208 86286 95118 89966 80804 47699 13185 47525 55544 55298 71253
7499 71253 62291 47419 46525 42790 45163 74365 66317 74574 72847 44791 60066 62450 49600 65317
7485 65317 71059 56534 69048 50249 23367 10495 25938 -2247 24276 44508 73148 124669
$$ packed form
7575B41111l6156j4621J4807n5568k8548k1574k4386K7068o676N813j7122o923
7563G7225m3251L1073j4793n2172j8670L6898J5325l3711m8306K6216N1867j9419
7551H282L507m6474K6039k4028J1780J8592j2768N523j1544k1410j0154m308M6410
7538a0553k468m93K578Q784l988J4572M204k3189K4033J5521n4534J0065K5338
7525I870l7831K8204M5609j2666P167m57k4115M247L5383M338j4829K0972l7026
7512B8866K4954K8887j0499J4078Q832n152r162l3105l4514L4340Q019k46J5955
7499G1253q962j4872q94l735K373K9202q048Q257j727k8056J5275K384j2850J5717
7485F5317N742j4525J2514j8799k6882j2872J5443k8185K6523K0232K8640N1521
$$ plain form
7473 124669 57939 39439 60093 73407 99135 100385 79291 62171 69900 71031 55028 57643
7461 57643 35185 51809 34827 64883 77314 71120 70968 68981 68592 43818 53345 84618 54370
7448 54370 86849 96420 64717 63250 23644 -1403 16167 -2701 5945 29052 37814 46238 52972
7435 52972 22978 24952 28957 57067 18430 10454 20521 7457 1719 17458 8709 4461 25666
7422 25666 35201 35693 46541 -4692 -3929 30245 4687 3663 -29916 -41529 -8788 15434 29389
7409 29389 25107 7107 20439 3627 4322 3985 12558 31570 60846 37039 -12184 -24313 -18709
7396 -18709 -45295 -10793 22322 59720 23732 27721 24375 23720 4308 1428 23673 35749 13876
7383 13876 13367 11237 33213 -14147 -7954 22816 -3357 4330 1507 8052 -4139 -24189 -50868
$$ packed form
7473A24669o6730j8500K0654J3314K5728J250k1094j7120P729J131j6003K615
7461E7643k2458J6624j6982L0056J2431o194j52j987l89k4774R527L1273l0248
7448E4370L2479R571l1703j467l9606k5047J7570j8868Q646K3107Q762Q424O734
7435E2972k9994J974M005K8110l8637p976J0067j3064n738J5739q749m248K1205
7422B5666R535M92J0848n1233P63L4174k5558j024l3579j1613L2741K4222J3955
7409B9389m282j8000J3332j6812O95l37Q573J9012K9276k3807m9223j2129N604
7396a8709k6586L4502L3115L7398l5988L989l346o55j9412k880K2245J2076k1873
7383A3876n09k130K1976m7360O193L0770k6173P687k823O545j2191k0050k6679
$$ plain form
7370 -50868 -38273 3313 24084 -12446 5936 7002 -23591 -2241 -15810 7080 2034 -22274
7358 -22274 -37851 -40416 -15279 -107 -9310 -27927 -41399 -57026 -53035 -47924 -47116 -34339 -67158
7345 -67158 -107358 -96871 -67189 -53329 -45459 -72224 -75822 -57602 -80834 -101373 -94593 -63880
7333 -63880 -72158 -66918 -74893 -66655 -77739 -96562 -82519 -75103 -77998 -87645 -90781 -91458 -74351 -110452
7319 -110452 -112034 -87532 -88564 -74840 -60334 -60380 -60954 -69122 -79061 -34091 -49712 -101612 -92787 -76900
7305 -76900 -71039 -100570 -84460 -94137 -129450 -120946 -128219 -69943 -90901 -96991 -106786 -96153 -100071
7292 -100071 -99524 -78497 -54396 -59916 -73321 -97412 -106519 -102011 -86101 -56470 -66771 -74812 -85166
7279 -85166 -77252 -91773 -105024 -86262 -116740 -89183 -82013 -106150 -74291 -74652 -95558 -105260 -97394
$$ packed form
7370e0868J2595M1586K0771l6530J8382J066l0593K1350j3569K2890n046k4308
7358b2274j5577k565K5137J5172r203j8617j3472j5627L991N111Q08J2777l2819
7345f7158m0200J0487K9682J3860P870k6765l598J8220k3232k0539O780L0713
7333f3880q278N240p975Q238j1084j8823J4043P416k895r647l136o77J7107l6101
7319a10452j582K4502j032J3724J4506m6n74q168r939M4970j5621n1900Q825J5887
7305g6900N861k9531J6110r677l5313Q504p273N8276k0958o090r795J0633l918
7292a00071N47K1027K4101n520j3405k4091r107M508J5910K9631j0301q041j0354
7279h5166P914j4521j3251J8762l0478K7557P170k4137L1859l61k0906r702P866
$$ plain form
7266 -97394 -85831 -72497 -88222 -121238 -108524 -103360 -48027 -32563 -73161 -48219 -81445 -98833
7254 -98833 -60303 -65218 -71289 -53779 -23370 -49949 -52520 -31677 -49319 -40310 -7915 -22333 -52181
7241 -52181 -39817 -20726 -13896 -67150 -80737 -42887 -51309 -50642 -43855 -15833 -24012 -35351 -35292 -21266
7227 -21266 -23465 -11778 39978 39210 2160 22340 31230 2036 43150 43083 17744 48651 62808
7214 62808 59673 69852 34616 67239 76681 117653 107135 77166 71006 69631 78576 107369 96549
7201 96549 50836 25182 65150 95099 94126 133771 132425 100563 88277 113215 135626 155637
7189 155637 158322 178338 149728 134144 147701 177106 183294 199009 205094 209536 223670 206848
7177 206848 218905 215530 220559 202385 215119 207506 216345 229859 229231 176756 185685 220925 249785
$$ packed form
7266i7394J1563J3334j5725l3016J2714N164N5333J5464m0598K4942l3226j7388
7254i8833L8530m915o071J7510L0409k6579k571K0843j7642R009L2395j4418k9848
7241e2181J2364J9091O830n3254j3587L7850q422O67O787K8022q179j1339N9J4026
7227b1266k199J1687N1756p68l7050K0180Q890k9194M1114o7k5339L0907J4157
7214F2808l135J0179l5236L2623R442M0972j0518k9969o160j375Q945K8793j0820
7201I6549m5713k5654L9968K9949r73L9645j346l1862j2286K4938K2411K0011
7189A55637K685K0016k8610j5584J3557K9405O188J5715O085M442J4134j6822
7177B06848J2057l375N029j8174J2734p613Q839J3514o28n2475Q929L5240K8860
$$ plain form
7164 249785 238171 222167 173937 164865 182212 176942 170532 174772 176208 171471 191767 184131 202281
7151 202281 167622 183951 195053 189296 182091 171632 166104 159891 170640 145650 138471 129165 114536
7138 114536 135674 155354 168176 180875 187673 147672 86200 58876 68683 68146 68300 39769 58973
7125 58973 88021 81483 33987 47843 81132 62673 24411 -6871 -528 27446 50518 59509
7113 59509 453 -22991 -28382 -21172 1110 -5815 -1747 22037 8105 5448 -12448 -19985 2249
7100 2249 -4374 -19158 -22932 -57983 -47574 -47359 -29920 -15873 -62911 -55209 -73688 -62932 -49088
7087 -49088 -43585 -88407 -82077 -81922 -91023 -75139 -61502 -88937 -70900 -62129 -65419 -56488 -72205
7074 -72205 -67135 -116720 -102062 -113800 -98481 -99420 -110751 -113673 -158342 -141550 -102168 -111132 -122703
$$ packed form
7164B49785j1614j6004m8230r072J7347n270o410M240J436m737K0296p636J8150
7151B02281l4659J6329J1102n757p205j0459n528o213J0749k4990p179r306j4629
7138A14536K1138J9680J2822J2699O798m0001o1472k7324R807n37J54k8531J9204
7125E8973K9048o538m7496J3856L3289j8459l8262l1282O343K7974K3072Q991
7113E9509n9056k3444n391P210K2282o925M068K3784j3932k657j7896p537K2234
7100B249o623j4784l774l5051J0409K15J7439J4047m7038P702j8479J0756J3844
7087d9088N503m4822O330J55r101J5884J3637k7435J8037Q771l290Q931j5717
7074g2205N070m9585J4658j1738J5319r39j1331k922m4669J6792L9382q964j1571
$$ plain form
7061 -122703 -86150 -69567 -51036 -65351 -69144 -71761 -96286 -82100 -71433 -73010 -73642 -83932 -91728
7048 -91728 -98363 -110489 -154918 -108291 -119394 -90402 -88504 -115805 -111740 -97633 -57191 -63180 -57872
7035 -57872 -86167 -108142 -113337 -95339 -104059 -125617 -99700 -74880 -78000 -43406 -74256 -117344
7023 -117344 -115562 -92873 -81310 -105712 -125203 -127348 -103507 -91108 -88002 -85875 -72614 -80015 -97783
7010 -97783 -88674 -72817 -75314 -94498 -123839 -106486 -91033 -124573 -156403 -125592 -77805 -73364
6998 -73364 -98866 -102702 -96713 -117111 -128302 -121351 -96026 -90347 -88163 -123648 -105220 -132802 -133830
6985 -133830 -120341 -101235 -85743 -93559 -114135 -146039 -111700 -116651 -109878 -88030 -108599 -142775
6973 -142775 -145878 -128377 -97484 -89242 -102544 -114285 -94609 -107473 -124613 -121821 -110485 -119623
$$ packed form
7061a22703L6553J6583J8531j4315l793k617k4525J4186J0667j577o32j0290p796
7048i1728o635j2126m4429M6627j1103K8992J898k7301M065J4107M0442n989N308
7035e7872k8295k1975n195J7998q720k1558K5917K4820l120L4594l0850m3088
7023a17344J782K2689J1563k4402j9491k145K3841J2399L106K127J3261p401j7768
7010i7783R109J5857k497j9184k9341J7353J5453l3540l1830L0811M7787M441
6998g3364k5502l836N989k0398j1191O951K5325N679K184l5485J8428k7582j028
6985a33830J3489J9106J5492p816k0576l1904L4339m951O773K1848k0569l4176
6973a42775l103J7501L0893Q242j3302j1741J9676j2864j7140K792J1336r138
$$ plain form
6961 -119623 -161320 -123957 -101061 -119766 -112494 -119325 -115965 -122986 -126545 -152619 -141567 -109720 -121319
6948 -121319 -122744 -143971 -135246 -107658 -119179 -132406 -85415 -111657 -123944 -138274 -158739 -136158
6936 -136158 -115124 -119167 -104137 -127175 -127666 -114151 -145760 -156998 -144332 -121720 -110281 -109503 -97187
6923 -97187 -138160 -133646 -112474 -123059 -136376 -144547 -158891 -111737 -84389 -99402 -106375 -143987
6911 -143987 -134267 -122652 -106962 -97823 -71420 -95466 -92429 -92507 -108966 -120201 -94650 -95511 -124627
6898 -124627 -131344 -110996 -108947 -116383 -121265 -88670 -117446 -141985 -143706 -138829 -139147 -123167 -83595
6885 -83595 -77895 -115626 -127767 -123672 -106573 -138478 -138681 -139336 -123844 -95989 -125383 -114733 -131193
6872 -131193 -91467 -84343 -67683 -34607 -80984 -57474 -76951 -82498 -81281 -80229 -78662 -75625 -107084
$$ packed form
6961a19623m1697L7363K2896j8705P272o831L360p021l559k6074J1052L1847j1599
6948a21319j425k1227Q725K7588j1521j3227M6991k6242j2287j4330k0465K2581
6936a36158K1034m043J5030k3038m91J3515l1609j1238J2666K2612J1439P78J2316
6923i7187m0973M514K1172j0585j3317q171j4344M7154K7348j5013o973l7612
6911a43987R720J1615J5690R139K6403k4046L037p8j6459j1235K5551q61k9116
6898a24627o717K0348K049p436m882L2595k8776k4539j721M877l18J5980L9572
6885h3595N700l7731j2141M095J7099l1905k03o55J5492K7855k9394J0650j6460
6872a31193L9726P124J6660L3076m6377K3510j9477n547J217J052J567L037l1459
$$ plain form
6859 -107084 -112774 -86179 -83374 -49511 -47922 -63950 -61811 -83997 -79712 -105673 -102876 -120637 -108083
6846 -108083 -30044 -39562 -35923 -57049 -41675 -51581 -87838 -86240 -82141 -77237 -56941 -52415 -63005
6833 -63005 -96025 -107725 -125994 -115461 -96073 -89760 -99376 -97684 -96417 -86454 -116676 -134045 -102484
6820 -102484 -81492 -114503 -129867 -114382 -93145 -83691 -87270 -105508 -120874 -95152 -96410 -93850
6808 -93850 -67086 -70703 -97958 -75210 -85615 -110062 -89758 -97142 -108378 -119110 -114745 -148426
6796 -148426 -121331 -127872 -100968 -91922 -88663 -122258 -124472 -78427 -78562 -74632 -95792 -113631 -91204
6783 -91204 -86755 -56262 -51444 -54356 -57139 -81518 -78418 -66899 -78098 -67576 -66699 -32752 -25716
6770 -25716 -46472 -43522 -46845 -19262 -10364 -30308 -31173 -18559 -33090 -73496 -95340 -80123 -84112
$$ packed form
6859a07084n690K6595K805L3863J589j6028K139k2186M285k5961K797j7761J2554
6846a08083P8039r518L639k1126J5374r906l6257J598M099M904K0296M526j0590
6833f3005l3020j1700j8269J0533J9388O313r616J692J267R963l0222j7369L1561
6820a02484K0992l3011j5364J5485K1237R454l579j8238j5366K5722j258K560
6808i3850K6764l617k7255K2748j0405k4447K0304p384j1236j0732M365l3681
6796a48426K7095o541K6904R046L259l3595k214M6045j35L930k1160j7839K2427
6783i1204M449L0493M818k912k783k4379L100J1519j1199J0522Q77L3947P036
6770b5716k0756K950l323K7583Q898j9944q65J2614j4531m0406k1844J5217l989
$$ plain form
6757 -84112 -88862 -101485 -92249 -88762 -74375 -57481 -36674 -79967 -88608 -102600 -74544 -61016 -68349
6744 -68349 -81556 -56682 -61563 -45505 -41067 -61571 -59128 -91619 -94512 -70368 -48437 -74569 -101926
6731 -101926 -73277 -76038 -64262 -59312 -41425 -16005 -26007 -54396 -41706 -59664 -67332 -66857 -81859
6718 -81859 -74790 -54038 -70475 -69476 -28960 -27190 -45079 -56232 -30029 -19708 21977 79723 94237
6705 94237 68801 79480 110586 75743 23323 -16305 -13837 -41418 -47401 -51668 -51992 -51621 -57447
6692 -57447 -56330 -34175 -73037 -116287 -94233 -91781 -86392 -59270 -82430 -82988 -59035 -60783 -42897
6679 -42897 -66612 -32785 -85038 -31589 -59609 -68696 -49457 -61651 -77419 -63504 -48377 -41668
6667 -41668 -61803 -102893 -100405 -82991 -75172 -86461 -68817 -51288 -66020 -88286 -77835 -70304
$$ packed form
6757h4112m750j2623R236L487J4387J6894K0807m3293q641j3992K8056J3528p333
6744f8349j3207K4874m881J6058M438k0504K443l2491k893K4144K1931k6132k7357
6731a01926K8649k761J1776M950J7887K5420j0002k8389J2690j7958p668M75j5002
6718h1859P069K0752j6437R99M0516J770j7889j1153K6203J0321M1685N7746J4514
6705I4237k5436J0679L1106l4843n2420l9628K468k7581n983m267l24L71n826
6692e7447J117K2155l8862m3250K2054K452N389K7122k3160n58K3953j748J7886
6679d2897k3715L3827n2253N3449k8020r087J9239j2194j5768J3915J5127O709
6667d1668k0135m1090K488J7414P819j1289J7644J7529j4732k2266J0451P531
$$ plain form
6655 -70304 -27813 -43824 11181 5414 -32688 -63879 -104874 -91650 -74926 -55074 -27767 -32742
6643 -32742 -63497 -87119 -77347 -65309 -65743 -47100 -44145 -47621 -78461 -91545 -85423 -64997 -20289
6630 -20289 -38668 -25743 -33670 -60014 -83630 -75698 -48946 -31736 -45555 -44106 -37407 -78523 -55420
6617 -55420 -50154 -57625 -31358 -63570 -89362 -53041 -57683 -28143 -32133 -42290 -40636 -55530 -84872
6604 -84872 -89479 -94975 -68964 -44414 -86817 -70939 -78301 -91357 -67329 -48677 -34595 -10315
6592 -10315 -26225 -61054 -53116 -48561 -49040 -57906 -58442 -57784 -48807 -102166 -94823 -62594 -70124 -71437
6578 -71437 -86666 -75358 -81101 -77488 -89869 -83922 -73743 -64834 -54589 -81182 -63577 -41955 -55762
6565 -55762 -24101 -4728 -33665 -26825 -45851 -44475 -34715 -30276 -40784 -52009 -60334 -63829 -47646
$$ packed form
6655g0304M2491j6011N5005n767l8102l1191m0995J3224J6724J9852K7307m975
6643c2742l0755k3622R772J2038m34J8643K955l476l0840j3084O122K0426M4708
6630b0289j8379J2925p927k6344k3616P932K6752J7210j3819J449O699m1116K3103
6617e5420N266p471K6267l2212k5792L6321m642K9540l990j0157J654j4894k9342
6604h4872m607n496K6011K4550m2403J5878p362j3056K4028J8652J4082K4280
6592a0315j5910l4829P938M555m79q866n36O58Q977n3359P343L2229p530j313
6578g1437j5229J1308n743L613j2381N947J0179Q909J0245k6593J7605K1622j3807
6565e5762L1661J9373k8937O840j9026J376R760M439j0508j1225q325l495J6183
$$ plain form
6552 -47646 -46318 -90071 -86393 -75606 -39832 -28463 -52674 -79700 -88771 -60142 -69483 -74669 -77985
6539 -77985 -45143 -46727 -6843 -3714 9768 -40719 -53228 -52267 -67916 -47439 -8620 8321 25037
6526 25037 33913 11372 8672 -888 42776 47467 58502 46180 254 -15990 23909 36801 32606
6513 32606 23581 36672 37397 -1892 22889 21836 18001 34372 -5381 -18555 -2176 5118 26225
6500 26225 19860 -12605 -2585 29344 47600 40084 31100 -6881 8498 15874 11544 34190 41818
6487 41818 29616 36363 55287 42166 57183 61713 55590 51096 54722 71416 67306 57077 38860
6474 38860 7358 20973 30177 27892 38766 86381 103263 88037 90711 78417 57857 33410
6462 33410 41469 56954 57784 71294 55146 63087 58108 56140 47488 55532 93750 116535 77230
$$ packed form
6552d7646J328m3753L678J0787L5774J1369k4211k7026r071K8629r341n186l316
6539g7985L2842j584L9884L129J3482n0487j2509R61j5649K0477L8819J6941J6716
6526B5037Q876k2541k700r560M3664M691J1035j2322m5926j6244L9899J2892m195
6513C2606r025J3091P25l9289K4781j053l835J6371l9753j3174J6379P294K1107
6500B6225o365l2465J0020L1929J8256p516q984l7981J5379P376m330K2646P628
6487D1818j2202O747J8924j3121J5017M530o123m494L626J6694m110j0229j8217
6474C8860l1502J3615R204k285J0874M7615J6882j5226K674j2294k0560k4447
6462C3410Q059J5485Q30J3510j6148P941m979j968q652Q044L8218K2785l9305
$$ plain form
6449 77230 60838 72760 97217 52860 57219 66602 50556 68659 91669 87065 114034 112763 72420
6436 72420 94938 106942 120386 149879 126541 85461 90445 73684 76878 73685 84897 66500
6424 66500 49053 88430 121982 92372 79178 56425 58203 71876 71101 124105 137181 109898
6412 109898 79650 83841 87756 83092 97815 70579 75430 82430 87547 94315 67562 91580 66912
6399 66912 47826 112032 92204 98327 88030 124385 118471 120626 119294 113247 120151 112587 114242
6386 114242 117073 96033 96643 113233 114991 125853 134221 110068 129447 114648 92844 117994 86184
6373 86184 104433 111177 114226 126799 136645 134071 159533 136496 178077 164327 168417 202709 165620
6360 165620 154459 154735 184592 181586 181251 170926 154884 201628 212005 207968 224738 209547 152396
$$ packed form
6449G7230j6392J1922K4457m4357M359R383j6046J8103K3010m604K6969j271m0343
6436G2420K2518J2004J3444K9493k3338m1080M984j6761L194l193J1212j8397
6424F6500j7447L9377L3552k9610j3194k2753J778J3673p75N3004J3076k7283
6412A09898l0248M191L915m664J4723k7236M851P000N117O768k6753K4018k4668
6399F6912j9086O4206j9828O123j0297L6355n914K155j332o047O904p564J655
6386A14242K831k1040O10J6590J758J0862Q368k4153J9379j4799k1804K5150l1810
6373H6184J8249O744L049J2573R846k574K5462k3037M1581j3750M090L4292l7089
6360A65620j1161K76K9857l006l35j0325j6042M6744J0377m037J6770j5191n7151
$$ plain form
6347 152396 142099 172242 216545 251567 214807 201560 199323 204138 224953 222340 242883 245500
6335 245500 232225 238250 243835 262236 257165 247397 211273 251196 249947 292485 292361 280315 282496
6322 282496 246339 287617 301019 323481 303770 298729 323259 293791 319102 340335 314461 359146
6310 359146 365935 327385 292245 334789 369157 356892 323965 302690 295662 321982 364537 345368
6298 345368 318582 299588 279133 315078 345313 333630 362291 361092 338378 357706 363903 363768
6286 363768 352798 339220 346993 379641 361413 380851 365435 377171 403886 385355 382368 393644
6274 393644 385059 389379 378920 389974 416024 394545 395637 392426 377593 393113 452291 441015
6262 441015 459903 461206 454209 445589 473604 489905 488911 495296 510246 480956 469308 497484 485216
$$ packed form
6347A52396j0297L0143M4303L5022l6760j3247k237M815K0815k613K0543K617
6335B45500j3275O025N585J8401n071r768l6124L9923j249M2538j24j2046K181
6322B82496l6157M1278J3402K2462j9711n041K4530k9468K5311K1233k5874M4685
6310C59146O789l8550l5140M2544L4368j2265l2927k1275p028K6320M2555j9169
6298C45368k6786j8994k0455L5945L0235j1683K8661j199k2714J9328O197j35
6286C63768j0970j3578P773L2648j8228J9438j5416J1736K6715j8531k987J1276
6274C93644q585M320j0459J1054K6050k1479J092l211j4833J5520N9178j1276
6262D41015J8888J303o997q620K8015J6301r94O385J4950k9290j1648K8176j2268
$$ plain form
6249 485216 504886 511708 518934 539592 549880 547170 567539 532718 587854 586604 580187 597922 591306
6236 591306 619391 650742 664647 636037 628758 629608 673051 683243 689568 697103 751435 772206 746551
6223 746551 779231 833176 810929 844389 870295 863707 871988 876235 828352 852805 866623 912851
6211 912851 957436 929933 926420 939612 952940 947936 977096 999793 1017873 1029285 1043394 1094577
6199 1094577 1083808 1075098 1092463 1076213 1064227 1055051 1098856 1086665 1101407 1119356 1105886 1077002
6187 1077002 1082287 1120744 1116023 1136609 1174624 1180066 1150970 1139295 1214325 1204570 1169006 1144575
6175 1144575 1183140 1193717 1148857 1149047 1153476 1171512 1192035 1212562 1231851 1238605 1242725 1257587
6163 1257587 1263947 1239943 1240175 1262002 1280237 1309952 1315647 1282327 1320946 1344621 1318534 1368074
$$ packed form
6249D85216J9670O822P226K0658J0288k710K0369l4821N5136j250o417J7735o616
6236E91306K8085L1351J3905k8610p279Q50M3443J0192O325P535N4332K0771k5655
6223G46551L2680N3945k2247L3460K5906o588Q281M247m7883K4453J3818M6228
6211I12851M4585k7503l513J3192J3328n004K9160K2697J8080J1412J4109N1183
6199A094577j0769q710J7365j6250j1986r176M3805j2191J4742J7949j3470k8884
6187A077002N285L8457m721K0586L8015N442k9096j1675P5030r755l5564k4431
6175A144575L8565J0577m4860J90M429J8036K0523K0527J9289O754M120J4862
6163A257587O360k4004K32K1827J8235K9715N695l3320L8619K3675k6087M9540
$$ plain form
6151 1368074 1412440 1406739 1446215 1469178 1479630 1542088 1569364 1610957 1639658 1674889 1701915 1745117
6139 1745117 1820554 1870209 1899517 1891252 1877495 1843394 1860329 1838634 1827725 1836165 1863927 1835452
6127 1835452 1834933 1871305 1886668 1926139 1888346 1932834 1966188 1980299 1991503 1981924 1981965 2017078 2028613
6114 2028613 2015958 2007888 2040838 2049949 2042921 2038391 2032279 1999777 1997695 2009264 1989452 1975385 1979841
6101 1979841 1959943 1962002 1985910 1995962 2010552 2018503 2042673 2036989 2019016 1969664 1965770 1963671
6089 1963671 1944257 1975458 1976919 1951698 1949239 1978697 1952623 1975495 1984758 2044056 2044238 2028763
6077 2028763 2047926 2053877 2092550 2102928 2135526 2159554 2187943 2198844 2254568 2312489 2339934 2335266
6065 2335266 2392438 2468595 2488763 2527404 2569613 2575647 2579335 2593785 2600226 2615094 2644208 2684818
$$ packed form
6151A368074M4366n701L9476K2963J0452O2458K7276M1593K8701L5231K7026M3202
6139A745117P5437M9655K9308q265j3757l4101J6935k1695j0909Q440K7762k8475
6127A835452n19L6372J5363L9471l7793M4488L3354J4111J1204r579M1L5113J1535
6114B028613j2655q070L2950R111p028m530o112l2502k082J1569j9812j4067M456
6101A979841j9898K059K3908J0052J4590P951K4170n684j7973m9352l894k099
6089A963671j9414L1201J461k5221k459K9458k6074K2872R263N9298J82j5475
6077B028763J9163N951L8673J0378L2598K4028K8389J0901N5724N7921K7445m668
6065B335266N7172P6157K0168L8641M2209O034L688J4450O441J4868K9114M0610
$$ plain form
6053 2684818 2704137 2735386 2786846 2836610 2853432 2893658 2982930 3008431 3040541 3104156 3156961
6042 3156961 3245443 3310147 3340227 3405701 3451830 3475013 3515844 3561733 3538612 3575487 3621970
6031 3621970 3628533 3658855 3720750 3753036 3820101 3906388 4033130 4134455 4231183 4323801 4396491
6020 4396491 4490675 4648381 4771150 4835020 4895817 4903910 4907637 4899631 4894962 4894510 4930662 4998156
6008 4998156 5111692 5196376 5350403 5422931 5508786 5666914 5834515 5986784 6123360 6274710
5998 6274710 6444334 6597887 6647085 6718779 6749610 6760780 6828194 6902864 6938579 6995365 7076440
5987 7076440 7097750 7148674 7256546 7321790 7384355 7495340 7629257 7800324 7929395 8044284
5977 8044284 8153166 8249172 8325356 8382923 8411943 8448919 8490820 8480852 8472207 8471754 8488576 8513810
$$ packed form
6053B684818J9319L1249N1460M9764J6822M0226Q9272K5501L2110O3615N2805
6042C156961Q8482O4704L0080O5474M6129K3183M0831M5889k3121L6875M6483
6031C621970O563L0322O1895L2286O7065Q6287J26742J01325R6728R2618P2690
6020D396491R4184J57706J22769O3870O0797Q093L727q006m669m52L6152O7494
6008D998156J13536Q4684J54027P2528Q5855J58128J67601J52269J36576J51350
5998F274710J69624J53553M9198P1694L0831J1170O7414P4670L5715N6786Q1075
5987G076440K1310N0924J07872O5244O2565J10985J33917J71067J29071J14889
5977H044284J08882R6006P6184N7567K9020L6976M1901r968q645m53J6822K5234
$$ plain form
5965 8513810 8587617 8649400 8761581 8830635 8949785 9062488 9155163 9236394 9351815 9446007 9509763
5954 9509763 9629298 9713847 9822302 9928913 10046972 10092807 10136572 10224733 10335788 10414981
5944 10414981 10547917 10671420 10794091 10931752 11083138 11255809 11475411 11704742 11878217
5935 11878217 12134788 12347372 12538741 12741817 12960100 13196975 13442081 13710582 13968180
5926 13968180 14244342 14506981 14763771 15016235 15335198 15641280 15986836 16300286 16605561
5917 16605561 16962343 17347132 17728809 18116324 18517668 18901761 19373071 19821645 20254089
5908 20254089 20672222 21092536 21551853 22027606 22538712 23128766 23760375 24427585 25146704
5899 25146704 25943405 26813549 27799545 28857070 30062733 31428248 32964566 34677239 36595136
$$ packed form
5965H513810P3807O1783J12181O9054J19150J12703R2675Q1231J15421R4192O3756
5954I509763J19535Q4549J08455J06611J18059M5835M3765Q8161J11055P9193
5944A0414981J32936J23503J22671J37661J51386J72671K19602K29331J73475
5935A1878217K56571K12584J91369K03076K18283K36875K45106K68501K57598
5926A3968180K76162K62639K56790K52464L18963L06082L45556L13450L05275
5917A6605561L56782L84789L81677L87515M01344L84093M71310M48574M32444
5908B0254089M18133M20314M59317M75753N11106N90054O31609O67210P19119
5899B5146704P96701Q70144R85996J057525J205663J365515J536318J712673J917897
$$ plain form
5890 36595136 38774405 41296517 44195895 47558712 51396177 55537323 59461243 62685602
5882 62685602 64923178 66005928 65993311 65184885 64219586 63570803 63495516 64016548 65334194
5873 65334194 67371692 69850350 72337768 74632205 76719764 78581400 80413040 82643536
5865 82643536 85228263 87812273 89964312 91433524 92371075 92839520 93326796 94181010 95580030
5856 95580030 97326960 98674557 99257834 98870553 97451429 95252146 92755111 90634839
5848 90634839 89304037 88915039 89451388 90718834 92207573 93329583 93616244 92906225 91280727
5839 91280727 89017889 86768120 85090146 84198465 84111750 84996572 86751653 89149739 91647596
5830 91647596 93617017 94402889 93621521 91089264 87170558 82337806 77140001 72113415
$$ packed form
5890C6595136K179269K522112K899378L362817L837465M141146L923920L224359
5882F2685602K237576J082750j2617q08426r65299o48783p5287N21032J317646
5873F5334194K037498K478658K487418K294437K087559J861636J831640K230496
5865H2643536K584727K584010K152039J469212R37551M68445M87276Q54214J399020
5856I5580030J746930J347597N83277l87281j419124k199283k497035k120272
5848I0634839j330802l88998N36349J267446J488739J122010K86661p10019j625498
5839I1280727k262838k249769j677974q91681q6715Q84822J755081K398086K497857
5830I1647596J969421P85872p81368k532257l918706m832752n197805n026586
$$ plain form
5822 72113415 67407652 63219201 59557406 56511573 54039312 52090852 50589450 49461132
5814 49461132 48691998 48254834 48168790 48486262 49230185 50325926 51671999 53202417 54585567
5805 54585567 55547202 55712831 54926330 53297090 50884039 48025234 44965107 41876431 38946875
5796 38946875 36237622 33754217 31539280 29617921 27947298 26488901 25191680 24006405
5788 24006405 22877770 21843457 20941550 20127589 19409931 18793682 18216533 17690508 17209109
5779 17209109 16757013 16333644 15990999 15697424 15478351 15286346 15084801 14965021 14888873 14784738
5769 14784738 14748173 14744529 14790191 14827543 14909337 14993881 15052916 15081016 15093776 15113205 15155755
5758 15155755 15194208 15238781 15311839 15407943 15513405 15638391 15821211 16060071 16379424 16764393
$$ packed form
5822G2113415m705763m188451l661795l045833k472261j948460j501402j128318
5814D9461132p69134m37164q6044L17472P43923J095741J346073J530418J383150
5805E4585567R61635J65629p86501j629240k413051k858805l060127l088676k929556
5796C8946875k709253k483405k214937j921359j670623j458397j297221j185275
5788B4006405j128635j034313r01907q13961p17658o16249n77149n26025m81399
5779A7209109m52096m23369l42645k93575k19073j92005k01545j19780p6148j04135
5769A4784738l6565l644M5662L7352Q1794Q4544N9035K8100J2760J9429M2550
5758A5155755L8453M4573P3058R6104J05462J24986J82820K38860L19353L84969
$$ plain form
5748 16764393 17256610 17779614 18400211 19071682 19815823 20674138 21657533 22744216 23942420
5739 23942420 25195889 26386488 27439120 28258705 28807134 29002644 28921888 28571270 28114699
5730 28114699 27602947 27095092 26606518 26133910 25741754 25533547 25521109 25663275 26053339 26684720
5720 26684720 27506847 28464166 29660190 31096204 32762957 34670300 36829572 39169378
5712 39169378 41491715 43565898 45136311 45891990 45694823 44509865 42625483 40315519
5704 40315519 37833717 35405056 33103308 31004606 29179105 27692455 26482411 25522247
5696 25522247 24784696 24237626 23857040 23689515 23713161 23906760 24258139 24778374 25417938 26084139
5686 26084139 26795217 27355074 27567451 27383665 26789982 25767208 24506340 23017087 21449458
$$ packed form
5748A6764393M92217N23004O20597O71471P44141Q58315R83395J086683J198204
5739B3942420J253469J190599J052632Q19585N48429J95510q0756l50618m56571
5730B8114699n11752n07855m88574m72608l92156k08207j2438J42166L90064O31381
5720B6684720Q22127R57319J196024J436014J666753J907343K159272K339806
5712C9169378K322337K074183J570413P55679j97167j184958j884382k309964
5704D0315519k481802k428661k301748k098702j825501j486650j210044r60164
5696B5522247p37551n47070l80586j67525K3646J93599L51379N20235O39564O66201
5686B6084139P11078N59857K12377j83786n93683j022774j260868j489253j567629
$$ plain form
5677 21449458 19890740 18370471 16979272 15682197 14549456 13561400 12643402 11824974 11109086
5668 11109086 10509015 10026455 9551864 9136995 8741712 8421200 8084968 7763247 7462544
5659 7462544 7217534 7007533 6776994 6557851 6385646 6211276 6034884 5903366 5724573 5617445
5649 5617445 5498718 5376973 5283049 5202803 5117352 5044526 4949001 4902061 4856567 4813683 4755937
5638 4755937 4710921 4624255 4560086 4553295 4532733 4473419 4450103 4462995 4448967 4438129 4413222 4390147
5626 4390147 4376950 4400525 4358310 4335859 4336238 4340779 4383897 4390749 4383627 4387791 4395879 4447086 4503227
5613 4503227 4497507 4521604 4520807 4508684 4545102 4565049 4580276 4640181 4662992 4733951 4793203 4823435
5601 4823435 4822003 4869465 4863893 4814744 4823011 4807680 4831081 4812084 4797731 4764351 4730384 4696668
$$ packed form
5677B1449458j558718j520269j391199j297075j132741r88056r17998q18428p15888
5668A1109086o00071m82560m74591m14869l95283l20512l36232l21721l00703
5659G462544k45010k10001k30539k19143j72205j74370j76392j31518j78793j07128
5649E617445j18727j21745r3924q0246q5451p2826r5525m6940m5494m2884n7746
5638D755937m5016q6666o4169o791k0562n9314k3316J2892j4028j0838k4907k3075
5626D390147j3197K3575m2215k2451L79M541M3118O852p122M164Q088N1207N6141
5613D503227n720K4097p97j2123L6418J9947J5227N9905K2811P0959N9252L0232
5601D823435j432M7462n572m9149Q267j5331K3401j8997j4353l3380l3967l3716
$$ plain form
5589 4696668 4684752 4718418 4737256 4747566 4812982 4828680 4841406 4816554 4826980 4832539 4896646 4971111
5577 4971111 5060883 5067445 5052595 5059741 5046083 5017008 4985852 4976822 4970192 4925221 4876481 4843272
5565 4843272 4825190 4830992 4837259 4883190 4940533 4976321 4986210 5021476 5024843 5046016 5100794 5127848
5553 5127848 5153285 5234307 5336181 5381097 5468166 5568738 5597483 5662989 5749643 5833229 5959396
5542 5959396 6091885 6202652 6303843 6398203 6510960 6612093 6636357 6745351 6886703 6950914
5532 6950914 7021050 7088583 7194016 7308058 7418257 7565853 7708678 7870968 8028070 8205027
5522 8205027 8337578 8474723 8601154 8759244 8914124 9091667 9265698 9436920 9620983 9758502
5512 9758502 9958189 10133329 10294104 10438220 10614482 10838780 11046779 11191671 11361617 11472934
$$ packed form
5589D696668j1916L3666J8838J0310O5416J5698J2726k4852J0426N559O4107P4465
5577D971111Q9772O562j4850P146j3658k9075l1156r030o630m4971m8740l3209
5565D843272j8082N802O267M5931N7343L5788R889L5266L367K1173N4778K7054
5553E127848K5437Q1022J01874M4916Q7069J00572K8745O5506Q6654Q3586J26167
5542E959396J32489J10767J01191R4360J12757J01133K4264J08994J41352O4211
5532F950914P0136O7533J05433J14042J10199J47596J42825J62290J57102J76957
5522H205027J32551J37145J26431J58090J54880J77543J74031J71222J84063J37519
5512I758502J99687J75140J60775J44116J76262K24298K07999J44892J69946J11317
$$ plain form
5502 11472934 11588999 11695338 11826370 11979728 12122180 12256248 12382281 12484436 12590888
5493 12590888 12722272 12853354 13015238 13202946 13448617 13684617 13941907 14232519 14507672
5484 14507672 14815209 15173197 15609891 15980634 16302297 16572412 16768797 16988720 17174365
5475 17174365 17387170 17647415 17942160 18329875 18728434 19172340 19616828 20115310 20713749
5466 20713749 21397813 22195691 23102768 24192958 25392144 26738045 28273757 29990160 31889685
5457 31889685 34005944 36446403 39126279 42152173 45422156 48812458 52129113 55017883
5449 55017883 57097539 58107909 57954032 56803495 55025062 52967032 50905777 48947248
5441 48947248 47290853 45984488 45174358 44878365 45053272 45643803 46665819 48187043 50182782
$$ packed form
5502A1472934J16065J06339J31032J53358J42452J34068J26033J02155J06452
5493A2590888J31384J31082J61884J87708K45671K36000K57290K90612K75153
5484A4507672L07537L57988M36694L70743L21663K70115J96385K19923J85645
5475A7174365K12805K60245K94745L87715L98559M43906M44488M98482N98439
5466B0713749O84064P97878R07077J090190J199186J345901J535712J716403J899525
5457C1889685K116259K440459K679876L025894L269983L390302L316655K888770
5449E5017883K079656J010370j53877j150537j778433k058030k061255j958529
5441D8947248j656395j306365q10130k95993J74907N90531J022016J521224J995739
$$ plain form
5432 50182782 52695195 55756302 59496131 63918664 69017727 74674095 80328163 85045478
5424 85045478 87923561 88395763 86419513 82514017 77531092 72189173 66883474 61862783
5416 61862783 57314556 53357716 50052650 47367724 45246393 43562004 42281389 41373811
5408 41373811 40798407 40616917 40771194 41290330 42151119 43294137 44595228 45932082 47053626
5399 47053626 47664228 47503693 46470457 44691137 42430668 39903352 37297881 34874868
5391 34874868 32618091 30581860 28745406 27184193 25888210 24744893 23780449 22882439
5383 22882439 22032477 21245417 20513333 19906646 19380154 18907634 18505536 18131964 17839544
5374 17839544 17622142 17433162 17298311 17142320 16952229 16768756 16558371 16385741 16221485
$$ packed form
5432E0182782K512413L061107L739829M422533N099063N656368N654068M717315
5424H5045478K878083M72202j976250l905496m982925n341919n305699n020691
5416F1862783m548227l956840l305066k684926k121331j684389j280615r07578
5408D1373811n75404j81490J54277N19136Q60789J143018J301091J336854J121544
5399D7053626O10602j60535j033236j779320k260469k527316k605471k423013
5391C4874868k256777k036231j836454j561213j295983j143317r64444q98010
5383B2882439q49962p87060p32084o06687n26492m72520m02098l73572k92420
5374A7839544k17402j88980j34851j55991j90091j83473k10385j72630j64256
$$ plain form
5365 16221485 16114358 16041295 16015938 16014070 16062480 16113491 16217404 16321100 16370160 16423412 16534764
5354 16534764 16630095 16742782 16879228 16992398 17087349 17227463 17344467 17538147 17667912 17781875
5344 17781875 17877273 17917892 18018891 18120548 18223134 18351492 18493017 18640145 18792134 18972471
5334 18972471 19230068 19469631 19756926 20046361 20364842 20712030 21079504 21470913 21874499
5325 21874499 22237842 22614543 22966243 23331008 23665611 24022272 24390593 24810059 25292674
5316 25292674 25771146 26245697 26776996 27406588 28060790 28788916 29556917 30439105 31397880
5307 31397880 32508974 33744848 35119904 36723117 38534011 40558770 42824250 45394064
5299 45394064 48306541 51684652 55598668 60065606 64950625 69731857 73894452 77148002
$$ packed form
5365A6221485j07127p3063k5357j868M8410N1011J03913J03696M9060N3252J11352
5354A6534764R5331J12687J36446J13170R4951J40114J17004J93680J29765J13963
5344A7781875R5398M0619J00999J01657J02586J28358J41525J47128J51989J80337
5334A8972471K57597K39563K87295K89435L18481L47188L67474L91409M03586
5325B1874499L63343L76701L51700L64765L34603L56661L68321M19466M82615
5316B5292674M78472M74551N31299O29592O54202P28126P68001Q82188R58775
5307C1397880J111094J235874J375056J603213J810894K024759K265480K569814
5299D5394064K912477L378111L914016M466938M885019M781232M162595L253550
$$ plain form
5291 77148002 79352718 80496582 80725216 80595707 80685431 81283465 82457330 84199668 86141877
5282 86141877 87861888 88998688 89536428 89485678 88998880 88487667 88399245 88941027 89790210
5273 89790210 90552177 91011767 90994916 90490726 89636687 88858548 88451605 88436396 88542792 88694261
5263 88694261 88921762 89172078 89506187 90118144 91272745 92820511 94323346 95273258 95450050
5254 95450050 94668074 92803373 89840307 85837985 80827983 75085292 69108905 63429995
5246 63429995 58295555 53710985 49745183 46321207 43432490 41069619 39202337 37704948
5238 37704948 36545714 35674991 35085557 34676107 34400588 34229530 34030386 33663855 33022777
5229 33022777 32065133 30807903 29304217 27692861 26031614 24403281 22871639 21497207
$$ packed form
5291G7148002K204716J143864K28634j29509Q9724N98034J173865J742338J942209
5282H6141877J720011J136800N37740n0750m86798n11213q8422N41782Q49183
5273H9790210P61967M59590j6851n04190q54039p78139m06943j5209J06396J51469
5263H8694261K27501K50316L34109O11957J154601J547766J502835R49912J76792
5254I5450050p81976j864701k963066m002322n010002n742691n976387n678910
5246F3429995n134440m584570l965802l423976k888717k362871j867282j497389
5238C7704948j159234q70723n89434m09450k75519j71058j99144l66531o41078
5229C3022777r57644j257230j503686j611356j661247j628333j531642j374432
$$ plain form
5221 21497207 20309003 19199816 18222414 17339586 16600052 15901829 15277179 14717635 14209544
5212 14209544 13765197 13379515 13083238 12825400 12554601 12316167 12143084 12019605 11924714 11915794
5202 11915794 11913196 11915379 11915059 11933026 11978338 12039491 12189426 12373616 12629813 12933515 13192756
5191 13192756 13395437 13566948 13588258 13462261 13210292 12834475 12348357 11840852 11298130 10720890
5181 10720890 10198853 9678476 9193257 8784761 8395308 8003580 7654008 7322867 7036672
5172 7036672 6813532 6576408 6344210 6167479 5990791 5832995 5678874 5556316 5441175 5327854
5162 5327854 5192180 5135778 5039064 4954872 4885558 4784083 4680820 4531926 4427634 4345959
5152 4345959 4295720 4254768 4199911 4185205 4157967 4125615 4146281 4189264 4221551 4250166 4283981
$$ packed form
5221B1497207j188204j109187r77402q82828p39534o98223o24650n59544n08091
5212A4209544m44347l85682k96277k57838k70799k38434j73083j23479r4891q920
5202A1915794k598K183l20J7967M5312O1153J49935J84190K56197L03702K59241
5191A3192756K02681J71511K1310j25997k51969l75817m86118n07505n42722n77240
5181A0720890n22037n20377m85219m08496l89453l91728l49572l31141k86195
5172G036672k23140k37124k32198j76731j76688j57796j54121j22558j15141j13321
5162E327854j35674n6402r6714q4192o9314j01475j03263j48894j04292q1675
5152D345959n0239m0952n4857j4706k7238l2352K0666M2983L2287K8615L3815
$$ plain form
5141 4283981 4379397 4479767 4474852 4427866 4292168 4149991 3970697 3867894 3758030 3665803
5131 3665803 3552869 3497235 3436844 3340236 3314202 3272859 3234114 3201787 3179747 3137169 3123535
5120 3123535 3089173 3059804 3018498 2960725 2904429 2855092 2822603 2791618 2790061 2762642 2753619 2747694
5108 2747694 2728926 2746887 2751760 2776800 2771120 2841503 2865624 2851121 2861676 2917858 2884069 2844734
5096 2844734 2825182 2798705 2762394 2688777 2645397 2596707 2588377 2593740 2586869 2593271 2583986 2555481
5084 2555481 2555885 2551969 2591494 2602347 2607037 2653907 2730070 2791465 2850596 2861718 2857423 2875234
5072 2875234 2860927 2815384 2777047 2724368 2655500 2577019 2507075 2469877 2441252 2406063 2375828
5061 2375828 2372040 2382488 2381982 2390869 2367660 2365018 2396691 2437819 2504439 2587653 2701051 2729348
$$ packed form
5141D283981R5416J00370m915m6986j35698j42177j79294j02803j09864r2227
5131C665803j12934n5634o0391r6608k6034m1343l8745l2327k2040m2578j3634
5120C123535l4362k9369m1306n7773n6296m9337l2489l0985j557k7419r023n925
5108B747694j8768J7961M873K5040n680P0383K4121j4503J0555N6182l3789l9335
5096B844734j9552k6477l6311p3617m3380m8690q330N363o871O402r285k8505
5084B555481M04l916L9525J0853M690M6870P6163O1395N9131J1122m295J7811
5072B875234j4307m5543l8337n2679o8868p8481o9944l7198k8625l5189l0235
5061B375828l788J0448n06Q887k3209k642L1673M1128O6620Q3214J13398K8297
$$ plain form
5049 2729348 2821629 2930875 3012867 3128137 3297602 3540732 3734690 3881096 3989282 4008704
5039 4008704 3874114 3654492 3412109 3237557 3069720 2914624 2846379 2753172 2648474 2573769
5029 2573769 2577958 2526406 2533449 2546846 2595640 2614789 2641317 2692808 2697218 2783086 2871216 2981094
5017 2981094 3099120 3220992 3373816 3563071 3728121 3941909 4084855 4227889 4348850 4402641
5007 4402641 4268887 4076644 3806510 3574150 3379396 3195269 3030227 2924950 2838549 2768726
4997 2768726 2682558 2645298 2619043 2602766 2592221 2619142 2624462 2648145 2739265 2756349 2807266 2838149
4985 2838149 2878031 2940645 3020703 3107484 3228222 3309665 3429044 3488243 3502247 3498780 3499971
4974 3499971 3447740 3408715 3318297 3233901 3167650 3107128 3014825 2941608 2908384 2906509 2892197 2898347
$$ packed form
5049B729348R2281J09246Q1992J15270J69465K43130J93958J46406J08186J9422
5039D008704j34590k19622k42383j74552j67837j55096o8245r3207j04698p4705
5029B573769M189n1552P043J3397M8794J9149K6528N1491M410Q5868Q8130J09878
5017B981094J18026J21872J52824J89255J65050K13788J42946J43034J20961N3791
5007D402641j33754j92243k70134k32360j94754j84127j65042j05277q6401o9823
4997B768726q6168l7260k6255j6277j0545K6921N320K3683R1120J7084N0917L0883
4985B838149L9882O2614Q0058Q6781J20738Q1443J19379N9199J4004l467J191
4974C499971n2231l9025r0418q4396o6251o0522r2303p3217l3224j875j4312O150
$$ plain form
4962 2898347 2892143 2895136 2875696 2868116 2876477 2876241 2901498 2949752 2996921 3047100 3070566 3086842 3125918
4949 3125918 3145885 3213197 3237597 3287517 3344264 3395335 3420774 3458217 3443999 3469232 3556669
4938 3556669 3590018 3592185 3619510 3626622 3670957 3690813 3688268 3718919 3775280 3827343 3916936 3963822
4926 3963822 3981292 4028587 4081312 4095214 4068992 4108460 4103346 4120313 4120852 4120061 4141216 4111389
4914 4111389 4098883 4133675 4235520 4333465 4451114 4550459 4599251 4689292 4731496 4738349 4733183
4903 4733183 4728669 4755741 4786827 4820278 4896440 4948289 5032643 5179511 5326493 5520635 5813064
4892 5813064 6133979 6446368 6644519 6721766 6681427 6561357 6393275 6265326 6096472 5963550
4882 5963550 5835811 5743735 5650184 5581037 5526081 5504377 5516108 5517810 5510434 5508846 5480989 5445087
$$ packed form
4962B898347o204K993j9440p580Q361k36K5257M8254M7169N0179K3466J6276L9076
4949C125918J9967O7312K4400M9920N6747N1071K5439L7443j4218K5233Q7437
4938C556669L3349K167K7325P112M4335J9856k545L0651N6361N2063Q9593M6886
4926C963822J7470M7295N2725J3902k6222L9468n114J6967N39p91K1155k9827
4914D111389j2506L4792J01845R7945J17649R9345M8792R0041M2204O853n166
4903D733183m514K7072L1086L3451P6162N1849Q4354J46868J46982J94142K92429
4892E813064L20915L12389J98151P7247m0339j20070j68082j27949j68854j32922
4882E963550j27739r2076r3551o9147n4956k1704J1731J702p376j588k7857l5902
$$ plain form
4870 5445087 5314971 5168872 5047379 4984228 4958091 4900581 4864010 4837705 4816178 4825562 4826207
4859 4826207 4872683 4933360 4997788 5126155 5198113 5234332 5273014 5285821 5264034 5270966 5267120 5303104
4847 5303104 5287705 5352987 5358000 5373675 5364308 5405528 5447957 5476308 5507298 5509468 5520449 5527575
4835 5527575 5490476 5524949 5523782 5516403 5558557 5688896 5812988 5992048 6201141 6454855 6835207
4824 6835207 7259841 7736408 8121226 8230653 8113990 7730047 7323443 6973793 6706845 6459103
4814 6459103 6222706 6103160 6033733 6002559 5996547 6045462 6129385 6234274 6369618 6456310 6580164
4803 6580164 6722017 6819761 6920751 7061057 7238372 7479558 7783640 8117371 8467297 8820775
4793 8820775 9185165 9439131 9575055 9406908 8983779 8516051 8192838 7944944 7750397 7578525
$$ packed form
4870E445087j30116j46099j21493o3151k6137n7510l6571k6305k1527R384O45
4859D826207M6476O0677O4428J28367P1958L6219L8682J2807k1787O932l846L5984
4847E303104j5399O5282N013J5675r367M1220M2429K8351L0990K170J0981P126
4835E527575l7099L4473j167p379M2154J30339J24092J79060K09093K53714L80352
4824F835207M24634M76567L84818J09427j16663l83943m06604l49650k66948k47742
4814F459103k36397j19546o9427l1174o012M8915Q3923J04889J35344Q6692J23854
4803F580164J41853R7744J00990J40306J77315K41186L04082L33731L49926L53478
4793H820775L64390K53966J35924j68147m23129m67728l23213k47894j94547j71872
$$ plain form
4783 7578525 7424623 7265926 7218502 7165404 7158296 7239522 7329967 7482034 7687075 7918255 8085475
4772 8085475 8127813 8070681 7944481 7805444 7757420 7760250 7749904 7696439 7626899 7619831 7604975
4761 7604975 7611663 7717129 7862673 7973478 8071904 8134700 8194787 8269176 8351460 8425034 8534796
4750 8534796 8763566 8988274 9160549 9334702 9460434 9508585 9505440 9536165 9556074 9582497 9655623
4739 9655623 9729242 9763388 9836824 9943377 10103056 10242631 10419681 10650972 10875591 11096863
4729 11096863 11315185 11570018 11836253 12173862 12590697 13107292 13713712 14255617 14619721
4720 14619721 14750815 14759343 14828095 15066400 15429211 15916231 16544857 17310597 18218649 19202908
4710 19202908 20360123 21816838 23587679 25958083 29009223 32650028 36259835 39381990
$$ packed form
4783G578525j53902j58697m7424n3098p108Q1226R0445J52067K05041K31180J67220
4772H085475M2338n7132j26200j39037m8024K830j0346n3465o9540p068j4856
4761G604975O688J05466J45544J10805R8426O2796O0087P4389Q2284P3574J09762
4750H534796K28770K24708J72275J74153J25732M8151l145L0725J9909K6423P3126
4739I655623P3619L4146P3436J06553J59679J39575J77050K31291K24619K21272
4729A1096863K18322K54833K66235L37609M16835N16595O06420N41905L64104
4720A4619721J31094Q528O8752K38305L62811M87020O28626P65740R08052R84259
4710A9202908J157215J456715J770841K370404L051140L640805L609807L122155
$$ plain form
4702 39381990 41536542 42095858 41007251 38729145 35593375 32159353 29102059 26463973
4694 26463973 24151891 22219283 20661902 19450827 18600221 18000538 17626323 17383323 17224429
4685 17224429 17182769 17224180 17340553 17567075 17938679 18486918 19148259 19965817 20919178 21962324
4675 21962324 23110953 24537660 26330819 28597184 31432321 34908739 38907856 42643242
4667 42643242 44622699 44804903 44076164 41814048 38184090 34653763 31873583 29591570
4659 29591570 27554122 25725695 24211718 23101489 22278918 21660062 21170265 20816477 20575712
4650 20575712 20393295 20263234 20149249 20077038 20021792 20035279 20109241 20236000 20464697 20673623
4640 20673623 20881319 21037194 21234544 21475878 21820725 22239492 22732492 23189064 23638414
$$ packed form
4702C9381990K154552N59316j088607k278106l135770l434022l057294k638086
4694B6463973k312082j932608j557381j211075q50606n99683l74215k43000j58894
4685A7224429m1660M1411J16373K26522L71604N48239O61341Q17558R53361J043146
4675B1962324J148629J426707J793159K266365K835137L476418L999117L735386
4667D2643242J979457J82204p28739k262116l629958l530327k780180k282013
4659B9591570k037448j828427j513977j110229q22571o18856m89797l53788k40765
4650B0575712j82417j30061j13985p2211n5246J3487P3962J26759K28697K08926
4640B0673623K07696J55875J97350K41334L44847M18767M93000M56572M49350
$$ plain form
4631 23638414 24013929 24401315 24777718 25169888 25586899 26099322 26647910 27222922 27778086
4622 27778086 28276391 28696535 29110368 29585634 30167060 30795751 31533699 32256451 32916319
4613 32916319 33625296 34341195 35076264 36013513 37142315 38459585 39940925 41500536 43072064
4604 43072064 44706652 46312240 47909455 49420674 50957643 52453064 53926309 55290108
4596 55290108 56704480 58276130 60115670 62367519 65335868 69071697 73671156 79146762
4588 79146762 85321780 92245994 100042435 108752190 118978655 131472947 147462713 167688034
4580 167688034 193282821 224620407 259973968 291051964 302764507 289098660 258562448
4573 258562448 228347863 203991831 182628387 162061026 143361008 128340401 117154245
$$ packed form
4631B3638414L75515L87386L76403L92170M17011N12423N48588N75012N55164
4622B7778086M98305M20144M13833M75266N81426O28691P37948P22752O59868
4613C2916319P08977P15899P35069R37249J128802J317270J481340J559611J571528
4604D3072064J634588J605588J597215J511219J536969J495421J473245J363799
4596E5290108J414372J571650J839540K251849K968349L735829M599459N475606
4588G9146762O175018O924214P796441Q709755J0226465J2494292J5989766K0225321
4580A67688034K5594787L1337586L5353561L1077996J1712543j3665847l0536212
4573B58562448l0214585k4356032k1363444k0567361j8700018j5020607j1186156
$$ plain form
4566 117154245 108972582 102631589 97521371 93292512 89863088 87167981 85173576 83656922
4558 83656922 82437257 81279592 80132003 78983203 77840377 76855654 76237518 75949226 76035909
4549 76035909 76306753 76833370 77452714 78189468 79126976 80265045 81604679 83244000 85100136
4540 85100136 87032825 88836802 90434766 91612380 92433078 92911389 93005006 92763460 92283583
4531 92283583 91567679 90594764 89396934 88110415 86765414 85628724 84751175 84190823 84036813
4522 84036813 84194443 84595093 85242778 86070135 87140692 88403569 89884655 91517199 93225973
4513 93225973 94878847 96383293 97551228 98288955 98670029 98804010 98676102 98347166 97943137
4504 97943137 97463191 96988531 96484819 96019266 95735122 95662071 95864378 96279135 96913269 97756985
$$ packed form
4566A17154245q181663o340993n110218m228859l429424k695107j994405j516654
4558H3656922j219665j157665j147589j148800j142826r84723o18136k88292Q6683
4549G6035909K70844N26617O19344P36754R37508J138069J339634J639321J856136
4540H5100136J932689J803977J597964J177614Q20698M78311R3617k41546m79877
4531I2283583p15904r72915j197830j286519j345001j136690q77549n60352j54010
4522H4036813J57630M00650O47685Q27357J070557J262877J481086J632544J708774
4513I3225973J652874J504446J167935P37727L81074J33981j27908l28936m04029
4504I7943137m79946m74660n03712m65553k84144p3051K02307M14757O34134Q43716
$$ plain form
4494 97756985 98783482 99883692 101044833 102195286 103368181 104489340 105499705 106400609
4486 106400609 107062279 107383847 107301385 106871961 106160955 105248853 104263885 103292885 102332720
4477 102332720 101279835 100215151 99133544 98047559 96976913 95908012 94848175 93820832
4469 93820832 92773812 91694795 90602921 89476978 88280702 87004764 85665623 84295346
4461 84295346 82888259 81400901 79810545 78134348 76318378 74333580 72291542 70307712
4453 70307712 68391315 66558342 64814609 63119316 61407639 59748198 58132526 56584975
4445 56584975 55146375 53790946 52525948 51362553 50297479 49296076 48396533 47596213
4437 47596213 46905907 46336742 45889778 45428852 45033346 44638011 44222232 43821167 43418933
$$ packed form
4494I7756985J026497J100210J161141J150453J172895J121159J010365R00904
4486A06400609O61670L21568q2462m29424p11006r12102r84968r71000r60165
4477A02332720j052885j064684j081607j085985j070646j068901j059837j027343
4469I3820832j047020j079017j091874j125943j196276j275938j339141j370277
4461H4295346j407087j487358j590356j676197j815970j984798k042038j983830
4453G0307712j916397j832973j743733j695293j711677j659441j615672j547551
4445E6584975j438600j355429j264998j163395j065074j001403q99543q00320
4437D7596213o90306n69165m46964m60926l95506l95335m15779m01065m02234
$$ plain form
4428 43418933 42995718 42614260 42300365 42042486 41804580 41621693 41513277 41426127 41389281 41483776
4418 41483776 41720567 42024982 42373531 42802131 43256756 43656062 44004151 44331364 44554892
4409 44554892 44724537 44744359 44540364 44142680 43566640 42779393 41781979 40653836 39431448
4400 39431448 38195581 36980465 35729960 34555908 33417499 32389938 31432314 30548879
4392 30548879 29797046 29185920 28695293 28250462 27869064 27513285 27137997 26765679 26385899
4383 26385899 25940649 25500714 25064903 24523867 23953661 23287150 22530562 21697095 20852713
4374 20852713 20020797 19178636 18365768 17542211 16786327 16044364 15247717 14507792 13811461
4365 13811461 13153096 12636899 12081900 11588812 11188380 10771046 10392837 10042309 9688903
$$ packed form
4428D3418933m23215l81458l13895k57879k37906j82887j08416q7150l6846R4495
4418D1483776K36791L04415L48549M28600M54625L99306L48089L27213K23528
4409D4554892J69645J9822k03995l97684n76040p87247r97414j128143j222388
4400C9431448j235867j215116j250505j174052j138409j027561r57624q83435
4392C0548879p51833o11126m90627m44831l81398l55779l75288l72318l79780
4383B6385899m45250m39935m35811n41036n70206o66511p56588q33467q44382
4374B0852713q31916q42161q12868q23557p55884p41963p96647p39925o96331
4365A3811461o58365n16197n54999m93088m00432m17334l78209l50528l53406
$$ plain form
4356 9688903 9396867 9139045 8908037 8699320 8508121 8289832 8086344 7849038 7621529 7458417
4346 7458417 7278244 7128153 7009381 6867859 6720529 6547672 6406889 6277724 6159244 6049876
4336 6049876 5942440 5872673 5773859 5649421 5535208 5447951 5331182 5264442 5165599 5095023 5036589
4325 5036589 4994244 4923230 4854574 4800240 4726363 4676743 4611648 4593755 4523218 4457748 4419681
4314 4419681 4355879 4262098 4179087 4156601 4142564 4125683 4070561 4012214 3957805 3898912 3844185
4303 3844185 3779909 3765659 3742449 3710151 3698050 3650746 3613652 3563155 3525628 3498257 3475002
4292 3475002 3491643 3504683 3483177 3426982 3416490 3378652 3333904 3299796 3321698 3303618 3269537
4281 3269537 3273223 3294893 3283311 3242647 3238570 3231130 3241975 3279802 3293894 3338925 3342212 3368179
$$ packed form
4356I688903k92036k57822k31008k08717j91199k18289k03488k37306k27509j63112
4346G458417j80173j50091j18772j41522j47330j72857j40783j29165j18480j09368
4336F049876j07436o9767r8814j24438j14213q7257j16769o6740r8843p0576n8434
4325E036589m2345p1014o8656n4334p3877m9620o5095j7893p0537o5470l8067
4314D419681o3802r3781q3011k2486j4037j6881n5122n8347n4409n8893n4727
4303C844185o4276j4250k3210l2298j2101m7304l7094n0497l7527k7371k3255
4292C475002J6641J3040k1506n6195j0492l7838m4748l4108K1902j8080l4081
4281C269537L686K1670j1582m0664m077p440J0845L7827J4092M5031L287K5967
$$ plain form
4269 3368179 3382594 3353337 3387111 3459991 3553864 3625978 3777920 3930339 4100788 4253087 4257251
4258 4257251 4199978 4096352 3957605 3839855 3727946 3576084 3417605 3296371 3269413 3232004
4248 3232004 3221896 3196516 3163399 3170302 3123070 3064416 3029300 3005692 2996363 2957611 2946573 2964624
4236 2964624 2938934 2909266 2894063 2889069 2862200 2843451 2841932 2882744 2933842 2965221 2964635 2990815
4224 2990815 2965193 2959540 3000273 3037317 3062178 3103883 3127461 3154659 3163703 3114479 3119631 3135611
4212 3135611 3146061 3185548 3230293 3240824 3211326 3201224 3216783 3188660 3198881 3236224 3253287
4201 3253287 3272805 3299160 3323086 3341268 3314143 3303787 3309098 3337017 3393198 3419093 3428518 3428930
4189 3428930 3437443 3421207 3448944 3458144 3447213 3453183 3461569 3466543 3460610 3476213 3456779 3459019 3462972
$$ packed form
4269C368179J4415k9257L3774P2880R3873P2114J51942J52419J70449J52299M164
4258D257251n7273j03626j38747j17750j11909j51862j58479j21234k6958l7409
4248C232004j0108k5380l3117O903m7232n8654l5116k3608r329l8752j1038J8051
4236B964624k5690k9668j5203m994k6869j8749j519M0812N1098L1379n86K6180
4224B990815k5622n653M0733L7044K4861M1705K3578K7198R044m9224N152J5980
4212C135611J0450L9487M4745J0531k9498j0102J5559k8123J0221L7343J7063
4201C253287J9518K6355K3926J8182k7125j0356N311K7919N6181K5895R425M12
4189C428930Q513j6236K7737R200j0931N970Q386M974n933J5603j9434K240L953
$$ plain form
4176 3462972 3461968 3462071 3473581 3468342 3443326 3435531 3422615 3413136 3430263 3462716 3473436 3512738 3505548
4163 3505548 3485720 3502908 3482221 3439046 3458786 3500442 3550916 3564668 3558551 3563030 3544659 3544291
4151 3544291 3544753 3553930 3586499 3592363 3619652 3620922 3608191 3613435 3637878 3649263 3662040 3656415 3694278
4138 3694278 3715453 3771973 3802183 3798849 3817419 3801811 3864887 3900100 3857242 3866638 3846054 3864609
4126 3864609 3902959 3903400 3928727 3957038 4006348 4011121 4059252 4071961 4080323 4064251 4065887 4081191
4114 4081191 4088919 4131440 4198909 4189597 4165980 4167422 4170285 4184944 4206651 4234309 4254802 4285528
4102 4285528 4300637 4362198 4391398 4351143 4351784 4390503 4433719 4463878 4499127 4501129 4511418 4524063
4090 4524063 4562379 4623819 4674588 4713789 4767401 4781480 4831467 4878738 4859721 4833727 4861511
$$ packed form
4176C462972j004J03J1510n239k5016p795j2916r479J7127L2453J0720L9302p190
4163C505548j9828J7188k0687m3175J9740M1656N0474J3752o117M479j8371l68
4151C544291M62R177L2569N864K7289J270j2731N244K4443J1385J2777n625L7863
4138C694278K1175N6520L0210l334J8570j5608O3076L5213m2858R396k0584J8555
4126C864609L8350M41K5327K8311M9310M773M8131J2709Q362j6072J636J5304
4114D081191P728M2521O7469r312k3617J442K863J4659K1707K7658K0493L0726
4102D285528J5109O1561K9200m0255O41L8719M3216L0159L5249K002J0289J2645
4090D524063L8316O1440N0769L9201N3612J4079M9987M7271j9017k5994K7784
$$ plain form
4079 4861511 4894919 4900986 4909497 4914262 4913119 4856116 4842845 4826567 4850306 4879431 4886054 4870578
4067 4870578 4866522 4896193 4885863 4932258 4973315 5021096 5043761 5101546 5184959 5241390 5314635 5356339
4055 5356339 5423845 5478679 5554296 5673171 5736790 5773521 5818281 5769514 5765567 5720842 5675337
4044 5675337 5663282 5608313 5582076 5614205 5590577 5531935 5498776 5523941 5531122 5574784 5620084 5677509
4032 5677509 5764352 5848499 5934098 6042205 6139336 6105865 6099260 6106312 6164215 6254112 6288321 6294077
4020 6294077 6333225 6383457 6402552 6436581 6455912 6434037 6423392 6378037 6333731 6271175 6198933
4009 6198933 6137369 6116394 6099254 6084625 6074104 6064361 6042513 6057384 6034358 6018907 6065059 6076107
3997 6076107 6080330 6152642 6215768 6264390 6328956 6365737 6387913 6457610 6554614 6639300 6726257 6822180
$$ packed form
4079D861511L3408O067Q511M765j143n7003j3271j6278K3739K9125O623j5476
4067D870578m056K9671j0330M6395M1057M7781K2665N7785Q3413N6431P3245M1704
4055E356339O7506N4834P5617J18875O3619L6731M4760m8767l947m4725m5505
4044E675337j2055n4969k6237L2129k3628n8642l3159K5165P181M3662M5300N7425
4032E677509Q6843Q4147Q5599J08107R7131l3471o605P052N7903Q9897L4209N756
4020F294077L9148N0232J9095L4029J9331k1875j0645m5355m4306o2556p2242
4009F198933o1564k0975j7140j4629j0521r743k1848J4871k3026j5451M6152J1048
3997F076107M223P2312O3126M8622O4566L6781K2176O9697R7004Q4686Q6957R5923
$$ plain form
3985 6822180 6863548 6925301 6969448 6996993 7048758 7052820 7071172 7058403 7072406 7087653 7110539 7104803
3973 7104803 7132442 7199781 7257492 7292020 7356752 7388060 7410685 7495267 7558205 7611886 7675724
3962 7675724 7745082 7818833 7880340 7961968 8032763 8121290 8214538 8295012 8408151 8500441 8616099
3951 8616099 8730080 8807370 8911107 9034427 9105358 9230565 9362642 9473630 9593836 9727834
3941 9727834 9846212 9874794 9982226 10084409 10214577 10380976 10517750 10651255 10783293 10948254
3931 10948254 11077080 11198632 11354152 11531016 11684836 11869867 12042757 12228133 12427934
3922 12427934 12621693 12810483 12969925 13196805 13446382 13652605 13865328 14108374 14325988
3913 14325988 14573083 14857230 15122894 15425071 15805728 16186023 16535837 16883159 17287671
$$ packed form
3985F822180M1368O1753M4147K7545N1765M062J8352j2769J4003J5247K2886n736
3973G104803K7639O7339N7711L4528O4732L1308K2625Q4582O2938N3681O3838
3962G675724O9358P3751O1507Q1628P0795Q8527R3248Q0474J13139R2290J15658
3951H616099J13981P7290J03737J23320P0931J25207J32077J10988J20206J33998
3941I727834J18378K8582J07432J02183J30168J66399J36774J33505J32038J64961
3931A0948254J28826J21552J55520J76864J53820J85031J72890J85376J99801
3922A2427934J93759J88790J59442K26880K49577K06223K12723K43046K17614
3913A4325988K47095K84147K65664L02177L80657L80295L49814L47322M04512
$$ plain form
3904 17287671 17708310 18114916 18590363 19077439 19595436 20156814 20702094 21266913 21806441
3895 21806441 22309785 22812477 23353789 23880113 24361977 24849309 25330151 25833334 26363086
3886 26363086 26913661 27476303 28096259 28815250 29555754 30308453 31070983 31826189 32599264
3877 32599264 33337041 34013339 34664153 35330397 35977432 36662595 37346669 37990043 38645651
3868 38645651 39318948 40020527 40728915 41455590 42186214 42944771 43667939 44436165 45239948
3859 45239948 46040354 46928106 47884651 48975490 50157429 51365604 52571291 53770393 54873965
3850 54873965 55810441 56569224 57220987 57842456 58432518 58988822 59553656 60089639 60687266
3841 60687266 61261632 61885626 62574960 63266700 63986370 64716554 65463481 66135442 66877819
$$ packed form
3904A7287671M20639M06606M75447M87076N17997N61378N45280N64819N39528
3895B1806441N03344N02692N41312N26324M81864M87332M80842N03183N29752
3886B6363086N50575N62642O19956P18991P40504P52699P62530P55206P73075
3877C2599264P37777O76298O50814O66244O47035O85163O84074O43374O55608
3868C8645651O73297P01579P08388P26675P30624P58557P23168P68226Q03783
3859D5239948Q00406Q87752R56545J090839J181939J208175J205687J199102J103572
3850E4873965R36476P58783O51763O21469N90062N56304N64834N35983N97627
3841F0687266N74366O23994O89334O91740P19670P30184P46927O71961P42377
$$ plain form
3832 66877819 67618530 68409773 69380590 70475834 71767088 73219327 74794917 76471803 78156014
3823 78156014 79825394 81389514 82813638 84087037 85232477 86287743 87293532 88218868
3815 88218868 89033699 89777628 90453908 91099838 91686075 92194490 92666717 93049337 93494071
3806 93494071 93949447 94453028 95036843 95694510 96348511 97064773 97774083 98368558 98929267
3797 98929267 99366743 99681021 99936716 100181457 100420160 100655224 100926550 101232346 101573821
3788 101573821 101906119 102183406 102447404 102647815 102812396 102987549 103122309 103197601 103252196 103257654
3778 103257654 103256186 103324177 103367987 103324096 103257450 103104134 102923169 102690578 102448563 102282886
3768 102282886 102087576 101892517 101706157 101441885 101149527 100721855 100190512 99584412 98904597
$$ packed form
3832F6877819P40711P91243R70817J095244J291254J452239J575590J676886J684211
3823G8156014J669380J564120J424124J273399J145440J055266J005789R25336
3815H8218868Q14831P43929O76280O45930N86237N08415M72227L82620M44734
3806I3494071M55376N03581N83815O57667O54001P16262P09310N94475N60709
3797I8929267M37476L14278K55695K44741K38703K35064K71326L05796L41475
3788A01573821L32298K77287K63998K00411J64581J75153J34760P5292N4595N458
3778A03257654j468O7991M3810m3891o6646j53316j80965k32591k42015j65677
3768A02282886j95310j95059j86360k64272k92358m27672n31343o06100o79815
$$ plain form
3759 98904597 98181330 97463473 96713924 95975942 95239555 94565198 93920409 93294593 92824507
3750 92824507 92352806 91954922 91546715 91027547 90392181 89549894 88510195 87246426 85930228
3741 85930228 84540144 83039089 81460660 79727498 77886645 75999698 74013125 72001726
3733 72001726 70069153 68095013 66232976 64501862 62856477 61344772 59942273 58612829
3725 58612829 57356793 56196818 55107456 54044725 52970762 51926730 50874121 49766708
3717 49766708 48654585 47608555 46591349 45624636 44640867 43699611 42776374 41903501 40971640
3708 40971640 40007128 39089580 38172591 37249951 36356138 35526004 34710098 33875237 33073200
3699 33073200 32282287 31440446 30680296 29921483 29171714 28461619 27816067 27171854 26515423
$$ packed form
3759I8904597p23267p17857p49549p37982p36387o74357o44789o25816m70086
3750I2824507m71701l97884m08207n19168o35366q42287j039699j263769j316198
3741H5930228j390084j501055j578429j733162j840853j886947j986573k011399
3733G2001726j932573j974140j862037j731114j645385j511705j402499j329444
3725E8612829j256036j159975j089362j062731j073963j044032j052609j107413
3717D9766708j112123j046030j017206r66713r83769r41256r23237q72873r31861
3708D0971640r64512r17548r16989r22640q93813q30134q15906q34861q02037
3699C3073200p90913q41841p60150p58813p49769p10095o45552o44213o56431
$$ plain form
3690 26515423 25932708 25402090 24871920 24411753 23972570 23549340 23153602 22735766 22307683
3681 22307683 21893771 21512615 21090395 20675352 20276068 19906792 19553023 19208685 18925048
3672 18925048 18596834 18296883 17987389 17731116 17444294 17141370 16868515 16648514 16380869
3663 16380869 16106276 15806697 15545099 15325810 15104044 14923865 14735500 14521273 14353484
3654 14353484 14167354 13961996 13766618 13594186 13472948 13384522 13224586 13044178 12958247 12862025
3644 12862025 12768974 12662370 12571728 12507189 12432722 12351819 12257061 12178603 12113747 12028726 11991959
3633 11991959 11932080 11873449 11819141 11740842 11671327 11660757 11635891 11604229 11533311 11487769 11465032
3622 11465032 11431218 11360748 11316321 11244789 11187833 11122224 11094868 11067025 11037602 11020244 10938613
$$ packed form
3690B6515423n82715n30618n30170m60167m39183m23230l95738m17836m28083
3681B2307683m13912l81156m22220m15043l99284l69276l53769l44338k83637
3672A8925048l28214k99951l09494k56273k86822l02924k72855k20001k67645
3663A6380869k74593k99579k61598k19289k21766j80179j88365k14227j67789
3654A4353484j86130k05358j95378j72432j21238q8426j59936j80408q5931r6222
3644A2862025r3051j06604r0642o4539p4467q0903r4758p8458o4856q5021l6767
3633A1991959n9879n8631n4308p8299o9515j0570k4866l1662p0918m5542k2737
3622A1465032l3814p0470m4427p1532n6956o5609k7356k7843k9423j7358q1631
$$ plain form
3611 10938613 10891484 10841559 10790367 10738905 10691340 10660058 10670727 10666480 10609993 10569595 10528674
3600 10528674 10483660 10469074 10421253 10380949 10351589 10348571 10332065 10314572 10344704 10312714 10283041
3589 10283041 10262150 10277309 10284060 10278955 10264279 10282306 10286161 10262788 10277375 10296335 10288062 10277214
3577 10277214 10318004 10319959 10346002 10364844 10378730 10414372 10445375 10471136 10496242 10506740 10527623
3566 10527623 10545153 10586606 10611764 10619494 10614197 10659505 10705574 10736514 10735022 10745653 10776414 10792487
3554 10792487 10787326 10770090 10799988 10849420 10864913 10869621 10881526 10896839 10939787 10996927 11037856 11044155
3542 11044155 11078850 11127836 11169738 11230467 11248210 11266836 11354151 11391752 11470330 11493855 11529841
3531 11529841 11548522 11589670 11634666 11671713 11691606 11729789 11773644 11799041 11825331 11826533 11859736
$$ packed form
3611A0938613m7129m9925n1192n1462m7565l1282J0669m247n6487m0398m0921
3600A0528674m5014j4586m7821m0304k9360l018j6506j7493L0132l1990k9673
3589A0283041k0891J5159O751n105j4676J8027L855k3373J4587J8960q273j0848
3577A0277214M0790J955K6043J8842J3886L5642L1003K5761K5106J0498K0883
3566A0527623J7530M1453K5158P730n297M5308M6069L0940j492J0631L0761J6073
3554A0792487n161j7236K9898M9432J5493M708J1905J5313M2948N7140M0929O299
3542A1044155L4695M8986M1902O0729J7743J8626Q7315L7601P8578K3525L5986
3531A1529841J8681M1148M4996L7047J9893L8183M3855K5397K6290J202L3203
$$ plain form
3520 11859736 11887902 11912556 11930066 11959826 11984308 12036053 12052123 12109026 12162133 12172109 12183560
3509 12183560 12218143 12230592 12251330 12305258 12326992 12373262 12417664 12443988 12464942 12477338 12507059
3498 12507059 12520613 12562648 12614273 12614003 12638824 12619065 12618463 12628773 12656791 12678580 12707425 12701731
3486 12701731 12670981 12710262 12740437 12745425 12764049 12817049 12860376 12889090 12904043 12892480 12908787
3475 12908787 12921791 12966354 13045681 13078554 13098950 13136975 13149429 13154930 13184235 13220170 13229281 13235475
3463 13235475 13250473 13256626 13286083 13264913 13282025 13306955 13342538 13345645 13371957 13441517 13488103 13556251
3451 13556251 13578168 13587727 13680178 13727052 13753485 13788578 13836098 13908536 13955976 14020807 14061754
3440 14061754 14096251 14125739 14183154 14294371 14354046 14414879 14457691 14510401 14559490 14627247 14720239
$$ packed form
3520A1859736K8166K4654J7510K9760K4482N1745J6070N6903N3107R976J1451
3509A2183560L4583J2449K0738N3928K1734M6270M4402K6324K0954J2396K9721
3498A2507059J3554M2035N1625k70K4821j9759o02J0310K8018K1789K8845n694
3486A2701731l0750L9281L0175M988J8624N3000M3327K8714J4953j1563J6307
3475A2908787J3004M4563P9327L2873K0396L8025J2454N501K9305L5935R111O194
3463A3235475J4998O153K9457k1170J7112K4930L5583L107K6312O9560M6586O8148
3451A3556251K1917R559R2451M6874K6433L5093M7520P2438M7440O4831M0947
3440A4061754L4497K9488N7415J11217N9675O0833M2812N2710M9089O7757R2992
$$ plain form
3429 14720239 14809332 14879394 14957748 15051081 15128796 15226835 15340817 15396378 15488918 15573120 15688236
3418 15688236 15808908 15872460 16009645 16161248 16261367 16394424 16540988 16657091 16782123 16923037
3408 16923037 17047164 17150651 17277034 17411748 17592773 17758675 17873145 18040608 18186785
3399 18186785 18370572 18556899 18688753 18855383 19059683 19261282 19434489 19608063 19811633
3390 19811633 20029878 20209683 20413184 20632604 20845089 21054179 21284538 21470744 21719648
3381 21719648 21946343 22230211 22480772 22723009 22989291 23238998 23527701 23842611 24138034
3372 24138034 24424295 24728451 25032018 25362905 25681333 26002969 26328508 26634342 26976880
3363 26976880 27307369 27668879 27975211 28265041 28600908 28929069 29277834 29629987 30019718
$$ packed form
3429A4720239Q9093P0062P8354R3333P7715R8039J13982N5561R2540Q4202J15116
3418A5688236J20672O3552J37185J51603J00119J33057J46564J16103J25032J40914
3408A6923037J24127J03487J26383J34714J81025J65902J14470J67463J46177
3399A8186785J83787J86327J31854J66630K04300K01599J73207J73574K03570
3390A9811633K18245J79805K03501K19420K12485K09090K30359J86206K48904
3381B1719648K26695K83868K50561K42237K66282K49707K88703L14910K95423
3372B4138034K86261L04156L03567L30887L18428L21636L25539L05834L42538
3363B6976880L30489L61510L06332K89830L35867L28161L48765L52153L89731
$$ plain form
3354 30019718 30351995 30698196 31035035 31373902 31749076 32149512 32568887 33007439 33445334
3345 33445334 33893818 34312390 34734237 35146890 35601265 36058566 36536625 37056233 37551747
3336 37551747 38044422 38580168 39152553 39720170 40300120 40899373 41514017 42105520 42748479
3327 42748479 43332184 43940174 44597051 45249744 45954186 46664176 47339559 48086325 48822462
3318 48822462 49558865 50346713 51091988 51875044 52668729 53452919 54289109 55116493 55951250
3309 55951250 56782533 57643129 58511630 59394897 60278820 61225265 62228228 63253143 64302353
3300 64302353 65400574 66537205 67774045 69061242 70414274 71870508 73385215 74989629
3292 74989629 76713868 78511471 80419685 82470410 84637948 87015188 89514372 92183962
$$ packed form
3354C0019718L32277L46201L36839L38867L75174M00436M19375M38552M37895
3345C3445334M48484M18572M21847M12653M54375M57301M78059N19608M95514
3336C7551747M92675N35746N72385N67617N79950N99253O14644N91503O42959
3327D2748479N83705O07990O56877O52693P04442P09990O75383P46766P36137
3318D8822462P36403P87848P45275P83056P93685P84190Q36190Q27384Q34757
3309E5951250Q31283Q60596Q68501Q83267Q83923R46445J002963J024915J049210
3300F4302353J098221J136631J236840J287197J353032J456234J514707J604414
3292G4989629J724239J797603J908214K050725K167538K377240K499184K669590
$$ plain form
3284 92183962 95068090 98171876 101422799 104900280 108577926 112460609 116654161 121142389
3276 121142389 125879753 130883282 136104291 141520048 147054863 152610944 158100847 163373765
3268 163373765 168253675 172504469 175904121 178291412 179491480 179365914 177935173 175271984
3260 175271984 171468572 166686998 161223576 155396669 149596526 143994507 138698308 133830128
3252 133830128 129346835 125238835 121401978 117773641 114206871 110758303 107435121 104352487
3244 104352487 101379231 98572745 95876887 93274216 90821011 88438284 86140655 83911521
3236 83911521 81793840 79733467 77729935 75801423 73919534 72110512 70375859 68683056
3228 68683056 66996363 65351762 63826688 62362044 60986809 59653220 58396506 57219623
$$ packed form
3284I2183962K884128L103786L250923L477481L677646L882683M193552M488228
3276A21142389M737364N003529N221009N415757N534815N556081N489903N272918
3268A63373765M879910M250794L399652K387291J200068j25566j430741k663189
3260A75271984l803412m781574n463422n826907n800143n602019n296199m868180
3252A33830128m483293m108000l836857l628337l566770l448568l323182l082634
3244A04352487k973256k806486k695858k602671k453205k382727k297629k229134
3236H3911521k117681k060373k003532j928512j881889j809022j734653j692803
3228F8683056j686693j644601j525074j464644j375235j333589j256714j176883
$$ plain form
3220 57219623 56086258 55019187 54009993 52987736 52021224 51054599 50073218 49186264 48323178
3211 48323178 47500137 46743066 46077685 45532850 44982506 44514622 44113236 43655841 43182889
3202 43182889 42578445 41871779 41134133 40454126 39822487 39240418 38708610 38106338 37506197
3193 37506197 36988902 36545981 36117181 35699300 35305381 34972202 34628271 34333020 34120262
3184 34120262 33877712 33648571 33466607 33303923 33170060 33069960 33035397 33043942 33107387 33251806
3174 33251806 33438865 33638869 33787889 33807500 33545585 32967300 32296903 31668462 31073742 30487451
3164 30487451 29905397 29326314 28858303 28421955 28045392 27721833 27360906 27017846 26758205
3155 26758205 26533635 26295249 26099076 25921788 25735377 25571726 25469318 25317516 25191716
$$ packed form
3220E7219623j133365j067071j009194j022257r66512r66625r81381q86954q63086
3211D8323178q23041p57071o65381n44835n50344m67884m01386m57395m72952
3202D3182889o04444p06666p37646o80007o31639n82069n31808o02272o00141
3193C7506197n17295m42921m28800m17881l93919l33179l43931k95251k12758
3184C4120262k42550k29141j81964j62684j33863j00100l4563Q545O3445J44419
3174C3251806J87059K00004J49020J9611k61915n78285o70397o28441n94720n86291
3164C0487451n82054n79083m68011m36348l76563l23559l60927l43060k59641
3155B6758205k24570k38386j96173j77288j86411j63651j02408j51802j25800
$$ plain form
3146 25191716 25091963 25035218 25023421 24999984 25034414 25062192 25069327 25048690 24908032 24632257 24260809
3135 24260809 23910418 23591139 23298692 23017583 22725076 22476404 22263169 22065659 21884609
3126 21884609 21757691 21627070 21499438 21335843 21199660 21078079 20967629 20881097 20756462 20634960
3116 20634960 20559857 20458606 20339092 20275414 20218870 20119780 20034867 19928088 19867043 19807226 19728204
3105 19728204 19661642 19562053 19501702 19393745 19249083 19160694 19059580 18942428 18850792 18751086
3095 18751086 18675804 18563251 18424577 18313818 18217148 18107703 18015315 17874224 17773635 17701636
3085 17701636 17570297 17482465 17377362 17276672 17183062 17076869 16990413 16908332 16841826 16739445
3075 16739445 16635548 16556190 16528031 16453944 16336422 16272801 16173467 16112460 16030017 15910995 15817486
$$ packed form
3146B5191716r9753n6745j1797k3437L4430K7778P135k0637j40658k75775l71448
3135B4260809l50391l19279k92447k81109k92507k48672k13235j97510j81050
3126B1884609j26918j30621j27632j63595j36183j21581j10450q6532j24635j21502
3116B0634960p5103j01251j19514o3678n6544r9090q4913j06779o1045n9817p9022
3105A9728204o6562r9589o0351j07957j44662q8389j01114j17152r1636r9706
3095A8751086p5282j12553j38674j10759r6670j09445r2388j41091j00589p1999
3085A7701636j31339q7832j05103j00690r3610j06193q6456q2081o6506j02381
3075A6739445j03897p9358k8159p4087j17522o3621r9334o1007q2443j19022r3509
$$ plain form
3064 15817486 15727727 15632303 15544058 15456400 15343646 15249764 15174791 15109661 15019278 14955972 14898525
3053 14898525 14827403 14806878 14782827 14699514 14634911 14584419 14571422 14572953 14576036 14569334 14560655 14498275
3041 14498275 14502505 14527246 14526185 14575887 14623497 14654352 14660696 14717294 14762145 14803865 14857081 14915853
3029 14915853 14974403 15015395 15058804 15125273 15224827 15319199 15412720 15474128 15553415 15650801 15770359
3018 15770359 15887620 15976540 16080007 16213016 16368729 16523755 16680116 16801937 16953302 17140779
3008 17140779 17339621 17503832 17693072 17855736 18032352 18236636 18408802 18618249 18849047
2999 18849047 19065655 19299281 19550577 19785678 20043265 20254853 20479075 20706782 20920646
2990 20920646 21172358 21392158 21584088 21773904 21987657 22174688 22367768 22636123 22921255
$$ packed form
3064A5817486q9759r5424q8245q7658j12754r3882p4973o5130r0383o3306n7447
3053A4898525p1122k0525k4051q3313o4603n0492j2997J531L083o702q679o2380
3041A4498275M230K4741j061M9702M7610L0855O344N6598M4851M1720N3216N8772
3029A4915853N8550M0992M3409O6469R9554R4372R3521O1408P9287R7386J19558
3018A5770359J17261Q8920J03467J33009J55713J55026J56361J21821J51365J87477
3008A7140779J98842J64211J89240J62664J76616K04284J72166K09447K30798
2999A8849047K16608K33626K51296K35101K57587K11588K24222K27707K13864
2990B0920646K51712K19800J91930J89816K13753J87031J93080K68355K85132
$$ plain form
2981 22921255 23167462 23459170 23749087 24040473 24402978 24764501 25150892 25573688 26006747
2972 26006747 26491700 26994687 27513579 28005890 28551187 29160806 29720881 30302343 30912309
2963 30912309 31607830 32339267 33063589 33841930 34634587 35459515 36269722 37052965 37817774
2954 37817774 38529210 39251341 39945737 40610261 41270389 41883820 42433828 43016071 43581057
2945 43581057 44167323 44779517 45402797 46080728 46843822 47648303 48529646 49487872 50542828
2936 50542828 51664573 52849730 54111360 55405484 56792705 58213701 59765738 61367532
2928 61367532 62919463 64477609 65985626 67393615 68626980 69539709 70160117 70443008 70443517
2919 70443517 70221937 69751810 69075395 68244614 67421223 66773875 66369379 66135780 66121359 66264221
$$ packed form
2981B2921255K46207K91708K89917K91386L62505L61523L86391M22796M33059
2972B6006747M84953N02987N18892M92311N45297O09619N60075N81462O09966
2963C0912309O95521P31437P24322P78341P92657Q24928Q10207P83243P64809
2954C7817774P11436P22131O94396O64524O60128O13431N50008N82243N64986
2945D3581057N86266O12194O23280O77931P63094Q04481Q81343R58226J054956
2936E0542828J121745J185157J261630J294124J387221J420996J552037J601794
2928F1367532J551931J558146J508017J407989J233365R12729O20408K82891N09
2919G0443517k21580m70127o76415q30781q23391o47348m04496k33599j4421J42862
$$ plain form
2909 66264221 66612982 67091002 67606641 68188405 68825857 69470131 70062754 70642303 71143704
2900 71143704 71520231 71726808 71834200 71841642 71597690 71201206 70627018 69809768 68822639 67643229
2890 67643229 66350502 65019010 63687248 62310971 60961149 59634384 58426205 57333938
2882 57333938 56401762 55551279 54777715 54063395 53322834 52574189 51801888 51002538 50168888
2873 50168888 49225191 48173577 47016480 45836322 44589716 43292565 41886818 40392942
2865 40392942 38894192 37426739 36005550 34637557 33339962 32116471 30993226 29972579
2857 29972579 28997369 28096752 27286631 26533393 25816588 25120003 24477575 23851419 23295869
2848 23295869 22734072 22167141 21628269 21057354 20492345 19998711 19490923 19005983 18511046
$$ packed form
2909F6264221L48761M78020N15639N81764O37452O44274N92623N79549N01401
2900G1143704L76527K06577J07392P442k43952l96484n74188q17250r87129j179410
2890F7643229j292727j331492j331762j376277j349822j326765j208179j092267
2882E7333938r32176q50483p73564p14320p40561p48645p72301p99350q33650
2873E0168888r43697j051614j157097j180158j246606j297151j405747j493876
2865D0392942j498750j467453j421189j367993j297595j223491j123245j020647
2857B9972579r75210r00617q10121p53238p16805o96585o42428o26156n55550
2848B3295869n61797n66931n38872n70915n65009m93634n07788m84940m94937
$$ plain form
2839 18511046 18063004 17622778 17160785 16735502 16329313 15934224 15566912 15206058 14874985
2830 14874985 14545594 14217447 13920707 13677669 13370110 13067752 12775911 12543497 12343426
2821 12343426 12130904 11931091 11719223 11566402 11406854 11210158 11036795 10875606 10737340
2812 10737340 10567974 10418312 10254680 10094399 9934795 9794167 9637192 9468493 9304334
2803 9304334 9154520 9022574 8862269 8679419 8498991 8331570 8192722 8060809 7885663 7733270
2793 7733270 7602314 7486585 7368277 7250855 7138274 7015083 6893447 6798131 6680926 6592703
2783 6592703 6511758 6415454 6339052 6252953 6176471 6058288 5951473 5885062 5786765 5662126 5591146
2772 5591146 5481855 5355744 5258698 5149003 5088991 5003615 4932587 4824142 4731857 4664562 4601400
$$ packed form
2839A8511046m48042m40226m61993m25283m06189l95089l67312l60854l31073
2830A4874985l29391l28147k96740k43038l07559l02358k91841k32414k00071
2821A2343426k12522j99813k11868j52821j59548j96696j73363j61189j38266
2812A0737340j69366j49662j63632j60281j59604j40628j56975j68699j64159
2803I304334j49814j31946j60305j82850j80428j67421j38848j31913j75146j52393
2793G733270j30956j15729j18308j17422j12581j23191j21636r5316j17205q8223
2783F592703q0945r6304p6402q6099p6482j18183j06815o6411r8297j24639p0980
2772E591146j09291j26111r7046j09695o0012q5376p1028j08445r2285o7295o3162
$$ plain form
2761 4601400 4521892 4469051 4412355 4342281 4259447 4191907 4134427 4089810 4029634 3942552 3917184
2750 3917184 3865673 3797916 3759146 3707973 3649636 3562927 3525041 3521291 3448313 3373514 3351119 3359217
2738 3359217 3295247 3222884 3191308 3129645 3103309 3094452 3069662 3005831 2981768 2956339 2925245 2911796
2726 2911796 2868775 2838855 2802021 2787076 2810992 2739550 2710186 2696562 2692473 2666244 2597441 2561816
2714 2561816 2599915 2594128 2553901 2522369 2491769 2489161 2486303 2462324 2428698 2451775 2431435 2407170
2702 2407170 2374483 2352903 2291472 2286168 2315453 2300035 2273007 2257731 2248909 2227041 2212334 2185576
2690 2185576 2146703 2117306 2147587 2171288 2135682 2113155 2078025 2051698 2045528 2029000 2046804 2036752
2678 2036752 1991922 2003971 1985878 1976007 1951264 1936063 1947236 1949164 1933475 1918352 1884346 1906406
$$ packed form
2761D601400p9508n2841n6696p0074q2834o7540n7480m4617o0176q7082k5368
2750C917184n1511o7757l8770n1173n8337q6709l7886l750p2978p4799k2395Q098
2738C359217o3970p2363l1576o1663k6336q857k4790o3831k4063k5429l1094j3449
2726B911796m3021k9920l6834j4945K3916p1442k9364j3624m089k6229o8803l5625
2714B561816L8099n787m0227l1532l0600k608k858k3979l3626K3077k0340k4265
2702B407170l2687k1580o1431n304K9285j5418k7028j5276q822k1868j4707k6758
2690B185576l8873k9397L0281K3701l5606k2527l5130k6327o170j6528J7804j0052
2678B036752m4830J2049j8093r871k4743j5201J1173J928j5689j5123l4006K2060
$$ plain form
2666 1906406 1892245 1871028 1829705 1802622 1822094 1830728 1839242 1831214 1802875 1795020 1809594 1782227
2654 1782227 1770729 1784312 1805054 1822135 1836796 1817124 1812049 1793846 1773211 1743591 1776225 1760831
2642 1760831 1747127 1730991 1713655 1719592 1675212 1686606 1679473 1695450 1693908 1674796 1637605 1594191
2630 1594191 1598867 1568747 1562070 1541201 1526555 1543324 1548430 1554664 1576606 1549325 1531621 1532549 1534729
2617 1534729 1534005 1516990 1504493 1520523 1508033 1502888 1486116 1481850 1462573 1471308 1448488 1411572
2605 1411572 1453235 1450172 1401135 1348881 1366655 1370358 1374450 1354288 1333317 1317550 1355466 1346019
2593 1346019 1325873 1294187 1287995 1286893 1303138 1309160 1266852 1249374 1206525 1204811 1173488 1157043
2581 1157043 1137522 1140315 1152756 1119909 1093153 1077303 1078047 1071946 1045468 996930 1016491 1014627
$$ packed form
2666A906406j4161k1217m1323k7083J9472Q634Q514q028k8339p855J4574k7367
2654A782227j1498J3583K0742J7081J4661j9672n075j8203k0635k9620L2634j5394
2642A760831j3704j6136j7336N937m4380J1394p133J5977j542j9112l7191m3414
2630A594191M676l0120o677k0869j4646J6769N106O234K1942k7281j7704R28K180
2617A534729p24j7015j2497J6030j2490n145j6772m266j9277Q735k2820l6916
2605A411572M1663l063m9037n2254J7774L703M092k0162k0971j5767L7916r447
2593A346019k0146l1686o192j102J6245O022m2308j7478m2849j714l1323j6445
2581A157043j9521K793J2441l2847k6756j5850P44o101k6478m8538J9561j864
$$ plain form
2569 1014627 1011081 1002585 977090 970315 974807 988110 1012320 963706 941120 909213 908457 882359 857044
2556 857044 887035 880815 879814 871255 875850 869288 852995 833972 837748 807825 810907 814290 826312
2543 826312 798769 781389 789115 800131 775840 805939 797784 781919 765753 763530 804195 785748
2531 785748 739108 739723 733967 735846 715164 737653 713347 654690 652454 662559 686057 657361 665005
2518 665005 646110 654686 663716 655039 660047 642170 622685 578809 534359 591123 603567 580952
2506 580952 581922 590858 593867 574090 571961 572902 605414 579432 551610 557914 558794 565097 531416 529065
2492 529065 549523 550819 528496 502057 524405 534498 519657 499997 517897 508857 506948 512334
2480 512334 504545 459532 463992 499295 464089 447131 447256 436168 425184 440348 429195 425994 421840
$$ packed form
2569A014627l546q496k5495o775M492J3303K4210m8614k2586l1907p56k6098k5315
2556H57044K9991o220j001q559M595o562j6293j9023L776k9923L082L383J2022
2543H26312k7543j7380P726J1016k4291L0099q155j5865j6166k223M0665j8447
2531G85748m6640O15n756J879k0682K2489k4306n8657k236J0105K3498k8696P644
2518F65005j8895Q576R030q677N008j7877j9485m3876m4450N6764J2444k2615
2506E80952R70Q936L009j9777k129R41L2512k5982k7822O304Q80O303l3681k351
2492E29065K0458J296k2323k6439K2348J0093j4841j9660J7900r040j909N386
2480E12334p789m5013M460L5303l5206j6958J25j1088j0984J5164j1153l201m154
$$ plain form
2467 421840 412124 451326 460033 426583 450297 419794 414897 412735 379756 351480 331406 343808
2455 343808 321726 342744 348389 353391 346516 298231 299472 328725 339301 312487 321834 330274 331343
2442 331343 315922 320147 316778 316204 305186 327172 319995 306475 303228 289123 309888 314722 303165
2429 303165 275579 256326 258795 253839 267572 216509 257979 291733 274354 254790 285916 284106
2417 284106 278302 297065 286593 274357 261102 265294 248683 249739 243054 233141 230774 243207 227998
2404 227998 191350 180972 213805 177837 210886 198717 202968 206703 184394 195165 192587 195964
2392 195964 188193 195065 206391 200826 202439 208653 188322 199633 210862 205519 228236 186329 163077
2379 163077 140790 150925 136354 168150 171015 165945 149591 127211 146980 153081 133104 106984
$$ packed form
2467D21840r716L9202Q707l3450K3714l0503m897k162l2979k8276k0074J2402
2455C43808k2082K1018N645N002o875m8285J241K9253J0576k6814R347Q440J069
2442C31343j5421M225l369n74j1018K1986p177j3520l247j4105K0765M834j1557
2429C03165k7586j9253K469m956J3733n1063M1470L3754j7379j9564L1126j810
2417B84106n804J8763j0472j2236j3255M192j6611J056o685r913k367J2433j5209
2404B27998l6648j0378L2833l5968L3049j2169M251L735k2309J0771k578L377
2392A95964p771O872J1326n565J613O214k0331J1311J1229n343K2717m1907k3252
2379A63077k2287J0135j4571L1796K865n070j6354k2380J9769O101j9977k6120
$$ plain form
2367 106984 125940 120840 96736 125261 157182 125861 131133 119197 116192 124095 136869 143815 144173
2354 144173 105202 93228 105833 126321 142710 139903 142943 125097 160008 142751 106976 106889 90680
2341 90680 116853 119854 114926 83421 91814 141813 129148 114607 103439 126244 144285 121119
2329 121119 132190 129235 88278 101037 92934 109110 83973 94957 95032 79689 103732 82309 71669
2316 71669 46465 54981 69367 79176 74752 93094 89958 78264 78138 61823 80080 83586 85787
2303 85787 92266 129694 87083 26479 60184 78649 56038 57038 55486 74225 87623 87250 68890
2290 68890 48691 56574 54711 74034 62729 78150 95530 103452 58639 73814 59129 17596
2278 17596 39021 62761 45901 44247 27252 32679 71023 59769 29290 8890 30854 47850
$$ packed form
2367A06984J8956n100k4104K8525L1921l1321N272j1936l005P903J2774O946L58
2354A44173l8971j1974J2605K0488J6389k807L040j7846L4911j7257l5775q7j6209
2341I0680K6173L001m928l1505Q393M9999j2665j4541j1168K2805J8041k3166
2329A21119J1071k955m0957J2759q103J6176k5137J0984P5j5343K4043k1423j0640
2316G1669k5204Q516J4386R809m424J8342l136j1694j26j6315J8257L506K201
2303H5787O479L7428m2611o0604L3705J8465k2611J000j552J8739J3398l73j8360
2290F8890k0199P883j863J9323j1305J5421J7380P922m4813J5175j4685m1533
2278A7596K1425K3740j6860j654j6995N427L8344j1254l0479k0400K1964J6996
$$ plain form
2266 47850 28566 5575 29926 58663 53701 44392 26756 37335 31850 47411 41817 50320 45686
2253 45686 46527 66284 60882 70386 45226 53783 17447 47693 61824 41052 69324 38588 72112
2240 72112 48536 47746 87263 98932 108730 110150 80329 86287 86749 63636 79860 90594 97182
2227 97182 88107 76880 71752 116623 117743 104839 99317 63485 72088 91330 68239 76659 96610
2214 96610 88865 71592 80883 94492 84650 90933 69452 94792 139193 131590 134261 140862 129138
2201 129138 136707 126957 133625 118910 108922 160814 137429 119872 136385 137993 141325 127369 134214
2188 134214 108711 123112 134062 136944 182663 128232 125697 134728 116078 166317 164699 156945 177461
2175 177461 170697 157448 151985 192919 191496 202641 208340 221527 200043 212277 230138 238493 251766
$$ packed form
2266D7850j9284k2991K4351K8737m962r309j7636J0579n485J5561n594Q503m634
2253D5686Q41J9757n402R504k5160Q557l6336L0246J4131k0772K8272l0736L3524
2240G2112k3576p90L9517J1669R798J420k9821N958M62k3113J6224J0734O588
2227I7182r075j1227n128M4871J120j2904n522l5832Q603J9242k3091Q420J9951
2214I6610p745j7273R291J3609r842O283k1481K5340M4401p603K671O601j1724
2201A29138P569r750O668j4715r988N1892k3385j7557J6513J608L332j3956O845
2188A34214k5503J4401J0950K882M5719n4431k535R031j8650N0239j618p754K0516
2175A77461o764j3249n463M0934j423J1145N699J3187k1484J2234J7861Q355J3273
$$ plain form
2162 251766 262893 227210 207072 253238 270543 261262 268721 286851 288753 329353 351279 372170
2150 372170 388334 380070 419754 452409 527466 546964 561087 590696 676232 731978 780013 840230
2138 840230 936722 1015373 1112610 1201905 1354677 1548169 1763347 1962381 2247996 2527240
2128 2527240 2693862 2827606 2951276 2966391 3007286 3071361 2794805 2340291 1946462 1706573
2118 1706573 1505536 1317126 1162791 1064026 962189 891675 806945 734664 694684 669326 589547
2107 589547 543302 491327 472991 416422 365325 323196 332518 309900 309239 275380 293119 261250
2095 261250 224223 213061 170487 144488 167941 172481 165520 156604 151683 140969 85310 105967
2083 105967 136853 116347 107540 117542 79537 85116 87698 65782 85795 78218 37950 33326 42041
$$ packed form
2162B51766J1127l5683k0138M6166J7305r281P459J8130J902M0600K1926K0891
2150C72170J6164q264L9684L2655P5057J9498J4123K9609Q5536N5746M8035O0217
2138H40230R6492P8651R7237Q9295J52772J93492K15178J99034K85615K79244
2128B527240J66622J33744J23670J5115M0895O4075k76556m54514l93829k39889
2118A706573k01037j88410j54335r8765j01837p0514q4730p2281l9980k5358p9779
2107E89547m6245n1975j8336n6569n1097m2129R322k2618o61l3859J7739l1869
2095B61250l7027j1162m2574k5999K3453M540o961q916m921j0714n5659K0657
2083A05967L0886k0506q807J0002l8005N579K582k1916K0013p577m0268m624Q715
$$ plain form
2070 42041 45563 40882 40913 27520 37418 39434 44879 61945 66728 55890 36740 46438 59142 29062
2056 29062 17853 21020 -4070 12131 18246 43132 39237 23571 23281 36139 38381 50956 46682
2043 46682 34683 17540 -16221 11710 24346 22195 -5805 -6872 22221 16895 -5482 -11939 -19477
2030 -19477 19386 11364 -15315 -25465 16395 12023 16669 -7718 -35271 -5249 -34596 -9731
2018 -9731 -9756 21811 -627 -7182 25312 -4966 -11049 -6082 -9044 -42096 -45582 -7416 -6563 5574
2004 5574 21230 997 -6826 7767 -10028 -46256 -21447 -27261 -32658 -18233 -17991 -42069 -35753
1991 -35753 -27413 -24790 -26281 7979 -3105 -10287 -6692 12331 -25257 -7569 -4159 -14559 -18624
1978 -18624 -27946 -13680 -27250 -8252 -1964 1665 -1887 -41826 -57775 -33866 -31879 -21941 -31770
$$ packed form
2070D2041L522m681L1j3393R898K016N445J7066M783j0838j9150R698J2704l0080
2056B9062j1209L167k5090J6201O115K4886l895j5666k90J2858K242J2575m274
2043D6682j1999j7143l3761K7931J2636k151k8000j067K9093n326k2377o457p538
2030a9477L8863q022k6679j0150M1860m372M646k4387k7553L0022k9347K4865
2018i731k5L1567k2438o555L2494l0278o083M967k962l3052l486L8166Q53J2137
2004E574J5656k0233p823J4593j7795l6228K4809n814n397J4425K42k4078O316
1991c5753Q340K623j491L4260j1084p182L595J9023l7588J7688L410j0400m065
1978a8624r322J4266j3570J8998O288L629l552l9939j5949K3909J987R938r829
$$ plain form
1965 -31770 -6107 -8629 -9272 -1832 -14805 -33625 -38829 -42097 8722 -14982 -12897 8230 -724
1952 -724 20988 13114 3220 -7637 -24431 -21243 -21617 -57073 -51051 -53428 -31080 -44123 -47745 -42376
1938 -42376 -48737 -56255 -66708 -86284 -71187 -70370 -44688 -55688 -58444 -71996 -76580 -38935 -25738
1925 -25738 -37241 -29093 -46195 -42405 -30734 -39400 -42295 -34535 -6300 19098 23058 -33135 -37345
1912 -37345 -44636 -45136 -33729 22041 -24147 -46731 -28127 -26606 -22344 -7937 4311 -12006 -36520
1899 -36520 -29923 -18038 -21919 -20939 23327 15261 -25097 -25262 -21416 -12673 -35443 -32647 -26375 -21980
1885 -21980 -8428 -354 -13136 2904 10225 -4829 -1581 -28857 -36489 -36348 -32512 -22999 -36036
1872 -36036 -54654 -71000 -53991 -31851 -12114 4407 -48315 -40317 -35096 -44376 -45743 -27599 -33305
$$ packed form
1965c1770K5663k522o43P440j2973j8820n204l268N0819k3704K085K1127q954
1952g24K1712p874r894j0857j6794L188l74l5456O022k377K2348j3043l622N369
1938d2376o361p518j0453j9576J5097Q17K5682j1000k756j3552m584L7645J3197
1925b5738j1503Q148j7102L790J1671q666k895P760K8235K5398L960n6193m210
1912c7345p291n00J1407N5770m6188k2584J8604J521M262J4407J2248j6317k4514
1899c6520O597J1885l881R80M4266q066m0358j65L846Q743k2770K796O272M395
1885b1980J3552Q074j2782J6040P321j5054L248k7276p632J41L836R513j3037
1872c6036j8618j6346J7009K2140J9737J6521n2722P998N221r280j367J8144n706
$$ plain form
1859 -33305 -15726 201 15347 -14211 -17456 12072 678 -40146 -56558 -42361 -57075 -73761
1847 -73761 -85815 -75136 -48429 -60361 -41275 -20525 -25299 -54726 -55272 -73680 -85403 -69365
1835 -69365 -50728 -48569 -50464 -26031 -25679 -63027 -41475 -34895 -45132 -30950 -56397 -54497 -40268
1822 -40268 -9911 -24953 -25498 -22572 -20595 -48442 -60745 -70919 -25346 -15574 13014 -6799 -16596
1809 -16596 -23445 10724 8503 10203 4754 -17868 -34057 -18108 -32095 -40392 -21877 -31768 -41610
1796 -41610 -47721 -58339 -63773 -33967 -38047 -11639 36340 -20241 -61035 -74253 -67527 -68637 -54660
1783 -54660 -53980 -73463 -58481 -78098 -76238 -42666 -31237 -40927 -73799 -60161 -27861 -18166 -18163 -22951
1769 -22951 1566 -11485 -25960 -68166 -27326 -50384 -23131 8587 -31506 -20975 -35067 -22680
$$ packed form
1859c3305J7579J5927J5146k9558l245K9528j1394m0824j6412J4197j4714j6686
1847g3761j2054J0679K6707j1932J9086K0750m774k9427n46j8408j1723J6038
1835f9365J8637K159j895K4433L52l7348K1552O580j0237J4182k5447J900J4229
1822d0268L0357j5042n45K926J977k7847j2303j0174M5573R772K8588j9813r797
1809a6596o849L4169k221J700n449k2622j6189J5949j3987q297J8515r891r842
1796d1610o111j0618n434K9806m080K6408M7979n6581m0794j3218O726j110J3977
1783e4660O80j9483J4982j9617J860L3572J1429r690l2872J3638L2300R695Lm788
1769b2951K4517j3051j4475m2206M0840k3058K7253L1718m0093J0531j4092J2387
$$ plain form
1757 -22680 -10137 -36994 -60689 -40008 -29036 -40411 -27072 -33219 -42755 -82261 -47365 -62816
1745 -62816 -47055 -32202 -39399 -22957 -41684 -44333 -38637 1214 -26768 -38744 -21605 -29732 -57095
1732 -57095 -70407 -57086 -40277 -52801 -63746 -49999 -61063 -70357 -69003 -47610 -63777 -57637
1720 -57637 -80400 -56861 -43233 -62962 -27359 -29608 -46568 -50366 -41539 -18302 -18165 -33974 -51115
1707 -51115 -47546 -21164 -40712 -86414 -83987 -41276 -6564 -27330 -17885 -27327 -52734 -33342 -28505
1694 -28505 -32140 -40362 -13523 -31579 -33391 -26665 -20874 -28246 -41011 -56695 -31284 -24138 -29765
1681 -29765 -46816 -36317 -32964 -23463 -61940 -80247 -66678 -88920 -86244 -78166 -44726 -25953 -34025
1668 -34025 -32980 -33854 -52989 -49005 -40569 -10922 9218 -24856 -29582 -37029 -34165 -24819 -43467 -61275
$$ packed form
1757b2680J2543k6857k3695K0681J0972j1375J3339o147r536l9506L4896j5451
1745f2816J5761J4853p197J6442j8727k649N696L9851k7982j1976J7139q127k7363
1732e7095j3312J3321J6809j2524j0945J3747j1064r294J354K1393j6167O140
1720e7637k2763K3539J3628j9729L5603k249j6960l798Q827K3237J37j5809j7141
1707e1115L569K6382j9548m5702K427M2711L4712k0766R445r442k5407J9392M837
1694b8505l635q222K6839j8056j812O726N791p372j2765j5684K5411P146n627
1681b9765j7051J0499L353R501l8477j8307J3569k2242K676Q078L3440J8773q072
1668c4025J045q74j9135L984Q436K9647K0140l4074m726p447K864R346j8648j7808
$$ plain form
1654 -61275 -61990 -48049 -34978 -41348 -43265 -12003 -21835 -16419 -39882 -62612 -55196 -43700 -31742
1641 -31742 6487 -13638 -53366 -60015 -30160 -10592 -45374 -70036 -69022 -41814 -41663 -53664 -33898
1628 -33898 -35098 -42657 -45084 -30585 -17162 -20389 -8393 -44847 -46606 -75352 -53366 -34822 -49406
1615 -49406 -48552 -62148 -37243 -32817 -27144 -67975 -38935 -18783 8079 -10872 -36882 -10900 -48295
1602 -48295 -40331 -14192 -37358 -62605 -50322 -44923 -40674 -4400 7558 -17574 -26729 -19686 -2035
1589 -2035 -32666 -32864 -17414 -8209 -18116 -42230 -4565 -31957 -38367 -40545 -46549 -35953 -41443 -45640
1575 -45640 -49963 -46539 -56284 -61324 -38988 -62651 -44713 -39833 -35558 -4346 -32223 -37335 -62849
1562 -62849 -67039 -61027 -69959 -81037 -59285 -63732 -75263 -18296 -34988 -69788 -17778 -29445 -46476
$$ packed form
1654f1275p15J3941J3071o370j917L1262r832N416k3463k2730P416J1496J1958
1641c1742L8229k0125l9728o649K9855J9568l4782k4662J014K7208J51j2001J9766
1628c3898j200p559k427J4499J3423l227J1996l6454j759k8746K1986J8544j4584
1615d9406Q54j3596K4905M426N673m0831K9040K0152K6862j8951k6010K5982l7395
1602d8295P964K6139k3166k5247J2283N399M249L6274J1958k5132r155P043J7651
1589b035l0631j98J5450R205r907k4114L7665k7392o410k178o004J0596n490m197
1575d5640m323L424r745n040K2336k3663J7938M880M275L1212k7877n112k5514
1562f2849m190O012q932j1078K1752m447j1531N6967j6692l4800N2010j1667j7031
$$ [...]
##END NTUPLES=NMR SPECTRUM
##END=
