##TITLE=1H_CG-1200-2
 CDCl3
 8 sc, 
 4.4.2024
##JCAMPDX= 6.0         $$ Bruker NMR JCAMP-DX V2.0
##DATA TYPE= NMR SPECTRUM
##DATA CLASS= NTUPLES
##ORIGIN= UXNMR, Bruker Analytische Messtechnik GmbH
##OWNER= root
$$ XWIN-NMR		Version 3.5
$$ Thu Apr  4 14:27:29 2024 Russian Standard Time (UT+4h)  she@DPX200
##.OBSERVE FREQUENCY= 200.1309
##.OBSERVE NUCLEUS= ^1H
##.ACQUISITION MODE= SIMULTANEOUS
##.ACQUISITION SCHEME= undefined
##.AVERAGES= 8
##.DIGITISER RES= 18
##SPECTROMETER/DATA SYSTEM= spect
##.PULSE SEQUENCE= zg30
##.SOLVENT NAME= MeOD
##.SHIFT REFERENCE= (INTERNAL, MeOD, 0, 15.6555)
##AUDIT TRAIL= $$ (NUMBER, WHEN, WHO, WHERE, WHAT)
$$ ##TITLE= Audit trail, XWIN-NMR		Version 3.5
$$ ##JCAMPDX= 5.01
$$ ##ORIGIN= Bruker BioSpin GmbH
$$ ##OWNER= she
$$ F:/spectra/data/she/nmr/H-F/1/pdata/1/auditp.txt
$$ ##AUDIT TRAIL=  $$ (NUMBER, WHEN, WHO, WHERE, WHAT)
(   1,<2024-04-04 14:26:20.28 +0400>,<she>,<DPX200>,
      <created by zg, POWCHK disabled, PULCHK disabled
       configuration hash MD5:
       00 E9 B6 7A A2 85 ED C7 34 08 36 98 17 FE 4E 26
       data hash MD5: 16K
       80 5B F8 44 C5 17 7C 1D E5 A3 4A 51 51 7A 86 C1>)
(   2,<2024-04-04 14:26:23.45 +0400>,<she>,<DPX200>,
      <Start of raw data processing
       efp BC_mod = 2 LB = 0.24 FT_mod = 6 PKNL = 1 PHC0 = -25299.41 PHC1 = 11.18731 SI = 16K 
       data hash MD5: 16K
       F4 CD 73 D2 EE A6 21 3F AC 02 D1 30 4E E6 D2 DA>)
(   3,<2024-04-04 14:26:41.57 +0400>,<she>,<DPX200>,
      <pk PHC0 = -4.009728 PHC1 = 5.6 
       data hash MD5: 16K
       5E 14 E8 4A 09 03 11 2A 7B 76 6E 12 25 6D 7B DB>)
(   4,<2024-04-04 14:26:45.75 +0400>,<she>,<DPX200>,
      <abs ABSG = 5 
       data hash MD5: 16K
       42 08 A0 16 43 EC 1D D3 D8 A0 CA 72 42 86 75 C8>)
$$ ##END=
$$ 
$$ hash MD5
$$ 1D EA 9A 02 3F 71 E2 D0 AF F3 28 A5 FC AF B8 34
##$RELAX= 
##$RELAX= 
##$RELAX= 
##$RELAX= 
##$RELAX= 
##$RELAX= 
$$ Bruker specific parameters
$$ --------------------------
##$DU= <F:/spectra>
##$EXPNO= 1
##$NAME= <H-F>
##$PROCNO= 1
##$TYPE= <nmr>
##$USER= <she>
##$AMP= (0..31)
100 100 100 100 100 100 100 100 100 100 100 100 100 100 100 100 100 100 
100 100 100 100 100 100 100 100 100 100 100 100 100 100 
##$AQSEQ= 0
##$AQ_mod= 1
##$AUNM= <au_zg>
##$AUTOPOS= <>
##$BF1= 200.13
##$BF2= 200.13
##$BF3= 200.13
##$BF4= 200.13
##$BF5= 200.13
##$BF6= 200.13
##$BF7= 200.13
##$BF8= 200.13
##$BYTORDA= 1
##$CFDGTYP= 0
##$CFRGTYP= 5
##$CHEMSTR= <none>
##$CNST= (0..31)
1 1 145 1 1 1 1 1 1 1 1 1 1 1 1 1 1 1 1 1 1 1 1 1 1 1 1 1 1 1 1 1 
##$CPDPRG= <>
##$CPDPRG1= <>
##$CPDPRG2= <>
##$CPDPRG3= <>
##$CPDPRG4= <mlev>
##$CPDPRG5= <mlev>
##$CPDPRG6= <mlev>
##$CPDPRG7= <mlev>
##$CPDPRG8= <mlev>
##$CPDPRGB= <>
##$CPDPRGT= <>
##$D= (0..31)
0 1.2 0 0 0 0 0 0 0 0.06 0 0.03 0 0 0 0 0.0002 0 0 0 0 0 0 0 0 0 0 0 0 
0 0 0 
##$DATE= 1712226379
##$DBL= (0..7)
120 120 120 120 120 120 120 120 
##$DBP= (0..7)
150 150 150 150 150 150 150 150 
##$DBP07= 0
##$DBPNAM0= <>
##$DBPNAM1= <>
##$DBPNAM2= <>
##$DBPNAM3= <>
##$DBPNAM4= <>
##$DBPNAM5= <>
$$ [...]
##$SUBNAM3= <"">
##$SUBNAM4= <"">
##$SUBNAM5= <"">
##$SUBNAM6= <"">
##$SUBNAM7= <"">
##$SUBNAM8= <"">
##$SUBNAM9= <"">
##$SW= 18.0517689322627
##$SWIBOX= (0..15)
0 0 2 0 0 0 0 0 0 0 0 0 0 0 0 0 
##$SW_h= 3612.71676300578
##$TD= 16384
##$TD0= 1
##$TE= 0
##$TE2= 300
##$TE3= 300
##$TEG= 300
##$TL= (0..7)
0 120 120 120 120 120 120 120 
##$TP= (0..7)
150 150 150 150 150 150 150 150 
##$TP07= 0
##$TPNAME0= <>
##$TPNAME1= <>
##$TPNAME2= <>
##$TPNAME3= <>
##$TPNAME4= <>
##$TPNAME5= <>
##$TPNAME6= <>
##$TPNAME7= <>
##$TPOAL= (0..7)
0.5 0.5 0.5 0.5 0.5 0.5 0.5 0.5 
##$TPOFFS= (0..7)
0 0 0 0 0 0 0 0 
##$TUNHIN= 0
##$TUNHOUT= 0
##$TUNXOUT= 0
##$USERA1= <user>
##$USERA2= <user>
##$USERA3= <user>
##$USERA4= <user>
##$USERA5= <user>
##$V9= 5
##$VALIST= <valist>
##$VCLIST= <CCCCCCCCCCCCCCC>
##$VD= 0
##$VDLIST= <DDDDDDDDDDDDDDD>
##$VPLIST= <PPPPPPPPPPPPPPP>
##$VTLIST= <TTTTTTTTTTTTTTT>
##$WBST= 1024
##$WBSW= 4
##$XGAIN= (0..3)
0 0 0 0 
##$XL= 0
##$YL= 0
##$YMAX_a= 117154
##$YMIN_a= -180009
##$ZGOPTNS= <>
##$ZL1= 120
##$ZL2= 120
##$ZL3= 120
##$ZL4= 120
##$ABSF1= 15.69073
##$ABSF2= -2.361159
##$ABSG= 5
##$ABSL= 3
##$ALPHA= 0
##$AQORDER= 0
##$ASSFAC= 0
##$ASSFACI= 0
##$ASSFACX= 0
##$ASSWID= 0
##$AUNMP= <proc_1d>
##$AZFE= 0.1
##$AZFW= 0.1
##$BCFW= 0
##$BC_mod= 2
##$BYTORDP= 0
##$COROFFS= 0
##$CY= -3
##$DATMOD= 1
##$DC= 0
##$DFILT= <>
##$DTYPP= 0
##$F1P= 0
##$F2P= 0
##$FCOR= 1
##$FTSIZE= 16384
##$FT_mod= 6
##$GAMMA= 0
##$GB= 0
##$INTBC= 1
##$INTSCL= 3.70164e-10
##$ISEN= 128
##$LB= 0.24
##$LEV0= 0
##$LPBIN= 0
##$MAXI= 10000
##$MC2= 0
##$MEAN= 0
##$ME_mod= 0
##$MI= 1.114404
##$NCOEF= 0
##$NC_proc= -9
##$NLEV= 6
##$NOISF1= 3.799351
##$NOISF2= 2.8
##$NSP= 0
##$NTH_PI= 0
##$NZP= 0
##$OFFSET= 15.65547
##$PC= 1
##$PHC0= -25303.42
##$PHC1= 16.78731
##$PH_mod= 1
##$PKNL= yes
##$PPARMOD= 0
##$PSCAL= 0
##$PSIGN= 0
##$REVERSE= no
##$SF= 200.129573234822
##$SI= 16384
##$SIGF1= 3
##$SIGF2= 2
##$SINO= 5.538805
##$SIOLD= 16384
##$SREGLST= <1H.CDCl3>
##$SSB= 0
##$STSI= 16384
##$STSR= 0
##$SW_p= 3612.71676300577
##$SYMM= 0
##$S_DEV= 0
##$TDeff= 16384
##$TDoff= 0
##$TI= <>
##$TILT= no
##$TM1= 0
##$TM2= 0
##$TOPLEV= 0
##$USERP1= <user>
##$USERP2= <user>
##$USERP3= <user>
##$USERP4= <user>
##$USERP5= <user>
##$WDW= 1
##$XDIM= 16384
##$YMAX_p= 461804570
##$YMIN_p= -4732646
$$ End of Bruker specific parameters
$$ ---------------------------------
##NTUPLES= NMR SPECTRUM
##VAR_NAME=  FREQUENCY,     SPECTRUM/REAL,   SPECTRUM/IMAG
##SYMBOL=    X,             R,               I
##VAR_TYPE=  INDEPENDENT,   DEPENDENT,       DEPENDENT
##VAR_FORM=  AFFN,          ASDF,            ASDF
##VAR_DIM=   16384,         16384,           16384
##UNITS=     HZ,            ARBITRARY UNITS, ARBITRARY UNITS
##FACTOR=    0.220516191357247, 1,           1
##FIRST=     3133.12250875871, 0,            0
##LAST=      -479.594254247057, 0,           0
##MIN=       -479.594254247057, -4732646,    0
##MAX=       3133.12250875871, 461804570,    0
$$ Real data points
##PAGE= N=1
##DATA TABLE= (X++(R..R)), XYDATA
$$ [...]
7373g35635P46287L3868m8677N9246K87395l36065l64289q2182J89445R47301
7363F96694n35978J05798N47978j18320p84829o4141J04517L37918P9500l37716
7353C1421M2219K88115j45965k25076n30476l15821M98716Q9526O08435O33403
7343I74497k80853M60685K93322m5896m99338j253821P47082M98177q62617p41322
7333g10084J72028M89305L07857k82287p7095M22699o23398J25255J131984J52362
7323A108626n57056o7148N74519K30647l14023Q2788K93574M56128m2552m70052
7313A295451m70620l51269l19083L96666K53320J64335O90578J58479k84622l16498
7303A216737L22258m18252J26119K04536r26008j60062j1132N45072M53758k11470
$$ plain form
7373 -735635 10652 44520 -4157 55089 342484 6419 -357870 -440052 -250607 696694
7363 696694 160716 266514 814492 696172 -88657 -152798 -48281 289637 369137 31421
7353 31421 73640 361755 215790 -9286 -539762 -855583 -356867 -267341 341094 974497
7343 974497 693644 1154329 1447651 1401755 902417 -351404 395678 893855 31238 -710084
7333 -710084 -538056 -48751 259106 -23181 -100276 322423 -300975 -175720 956264 1108626
7323 1108626 551570 484422 1058941 1289588 975565 1058353 1351927 1808055 1765503 1295451
7313 1295451 824831 473562 154479 551145 804465 968800 1659378 1817857 1533235 1216737
7303 1216737 1538995 1120743 1246862 1451398 525390 365328 354196 899268 1353026 1141556
7293A141556k16702j14395M04931k78213l63592n32776M60130O68218Q00261k29734
7283A739684n42882p45819J70775J39030l7236R77491l13612N37150o0216j48288
7273A716077q24443M79864J44025m72575K85514J496k71376j07669L7310L93040
7263A381263q1825J96316M86972k49612k13827p42821k46412M64036q97487N17377
7253F13980Q60748m93958q80813O51286Q81436P0200n19322l32202l05242Q9075
7243F35188J032177K19466k18454l48895l0891l09091l13961p22803J97234O65460
7233H05430k6240n5653l16070q20362P26114J47647m66144P84495Q7384L22309
7223A188910l31683j006O12568l82490k94494j82190K50504m09694K90933n36185
$$ plain form
7293 1141556 924854 810459 1215390 937177 573585 40809 500939 1169157 1969418 1739684
7283 1739684 1196802 450983 621758 760788 723552 1701043 1387431 1924581 1864365 1716077
7273 1716077 891634 1371498 1515523 1042948 1328462 1329958 1058582 950913 988223 1381263
7263 1381263 1299438 1495754 1982726 1733114 1519287 776466 530054 994090 96603 613980
7253 613980 1474728 980770 99957 751243 1632679 1702879 1183557 851355 546113 635188
7243 635188 1667365 1886831 1668377 1319482 1288591 979500 665539 -57264 139970 805430
7233 805430 779190 723537 407467 -412895 313219 460866 -5278 779217 866601 1188910
7223 1188910 857227 856221 1468789 1086299 791805 609615 860119 450425 741358 205173
7213B05173L5979j77402K86899P01377N1946J54351J6055Q017l2045o42216M20841
7202A028975o35975k59425O33095N8920l27221o20178N350K20166R52582r27946
7192A28343m74794k69670N97004k05933j50996R42482m46527O87491l08972k55072
7182B43356J34425o00007J85487j61207R09617q90036m93478M75455L40818k11983
7172f7553L96175M28312q59946k05696L97162j36444j86533l14361P7461R82687
7162E11264m9217n43894P25539j361418n48148Q02081L56022M21910j63926l69961
7152b19748L02469N20329j97653R4140r22709O09091j63621j52336p8707O3479
7142a45266k38848R6882q3152J86291J95944m71504j47097N94770K40070R3261
$$ plain form
7213 205173 241152 63750 350649 1052026 1103972 1258323 1274378 1282395 1250350 608134 1028975
7202 1028975 393000 133575 766670 825590 498369 -121809 -116459 103707 1056289 128343
7192 128343 -346451 -616121 -19117 -225050 -376046 566436 119909 807400 498428 243356
7182 243356 377781 -222226 -36739 -197946 711671 -178365 -671843 -196388 144430 -67553
7172 -67553 328622 756934 -103012 -308708 88454 -47990 -234523 -548884 -471423 511264
7162 511264 462047 -81847 643692 -717726 -1265874 -463793 -107771 314139 150213 -219748
7152 -219748 82721 603050 405397 499537 -423172 185919 22298 -130038 -208745 -145266
7142 -145266 -384114 -287232 -370384 -184093 11851 -459653 -606750 -11980 228090 321351
7132C21351n04018M42832M96127o71879m88966K4119K67033J46254O22195m20651
7122B34397P67631p98192m49704N44012l3091m28615M8174J31380m71527M88531
7112C2996k61964N87304j57955n07688P4620l85044J047574k12788L49027J56978
7102G23060p46194k76097q0506L48910n82697O36136M62483M28318o23062j12249
7092A78102O1593n82615m38881Q17820k50530k44567J010407J86575k38723p55637
7082b56456K71393O69807K88865j146873l71160n16122M85569K08800L66696j93408
7072a92889Q05617O614k14460k37629q04807R87560L12342o73416L494l49520
7062c57094l72880J73075p42447o1471K36787L07652m54938Q06075Q25378N65669
$$ plain form
7132 321351 -182667 260165 756292 84413 -404553 -380434 -113401 32853 655048 234397
7122 234397 1002028 203836 -245868 298144 265053 -163562 -115388 15992 -455535 32996
7112 32996 -228968 358336 200381 -307307 -232687 -617731 429843 217055 566082 723060
7102 723060 -23134 -299231 -379737 -30827 -613524 22612 485095 913413 290351 178102
7092 178102 239695 -342920 -781801 36019 -214511 -459078 551329 737904 499181 -256456
7082 -256456 14937 684744 973609 -173264 -544424 -1060546 -574977 -366177 519 -192889
7072 -192889 612728 619342 404882 167253 -637554 350006 662348 -11068 -7574 -357094
7062 -357094 -729974 -556899 -1299346 -1360817 -1124030 -816378 -1271316 -465241 360137 925806
7052I25806J2798J9845L62696j479080R3870j12342K85809O21769j92991l46310
7042A91870n56585l28982k17493K11446O60531k16785m2081l8588K33404Q77761
7032G74498j119733n81914M44573P26223K58254k43596L29807l34575k14976J86890
7022B25451m00111o55051Q99630j73555l44110N18516J89494K75115n2260j65731
7012C17388n07135K31653L02307N0201j83730O11304p61157N96622P25886j140856
7002B42483l66876L31827M68149r312p2386j94727j32909J90799n90189L25171
6992A92030j106136M38909j24167K69207j30934J335900K21300p52253R32956
6983A276812k06695L66586r41964m71556O81025K71696l90246m45632r2181l63711
$$ plain form
7052 925806 938604 958449 1321145 -157935 -64065 -176407 109402 731171 538180 191870
7042 191870 -364715 -693697 -911190 -699744 -39213 -255998 -298079 -336667 -103263 774498
7032 774498 -345235 -927149 -482576 243647 501901 258305 588112 253537 38561 225451
7022 225451 -174660 -829711 69919 -103636 -447746 70770 260264 535379 483119 317388
7012 317388 -189747 41906 344213 394414 210684 821988 60831 657453 1383339 242483
7002 242483 -124393 207434 675583 666271 593885 399158 266249 457048 -133141 192030
6992 192030 -914106 -475197 -599364 -330157 -461091 874809 1096109 343856 1276812
6983 1276812 1070117 1436703 494739 23183 704208 975904 585658 140026 47845 -315866
6973c15866J33511J106096m85321o98152J3231O72072L27820k50137j039644o1984
6963e98374J71195L14919L066r9716q8703p19777j87863J177102K0080o3060J72699
6952A01568M36790j6589j80420n4988J61502l94591P61216O37646p16121p81631
6942d5618j74341N20350J85168j38339r65123K87448L08320K28341o3487K40903
6932C83622k66206l70697j97577N2059N64360p50799n27456O54139N54836L08562
6922D04843Q15922p05488n7809K22635j48496M96415k97738j554681J84933P27813
6912H8349l8559N95436l14531j27070M34276k70966P214N30100k64725o73156
6902c3632l70567L66845L96571L20367p27193N4090Q84744j95332l6373m48203
$$ plain form
6973 -315866 -182355 923741 438420 -259732 -246501 425571 753391 503254 -536390 -598374
6963 -598374 -427179 -112260 -109194 -208910 -297613 -1017390 -1205253 -28151 -8071 -71131 101568
6952 101568 538358 521769 341349 286361 447863 53272 814488 1452134 736013 -45618
6942 -45618 -219959 300391 485559 347220 -617903 -330455 -22135 206206 142719 383622
6932 383622 117416 -253281 -450858 -398799 165561 -585238 -1112694 -458555 96281 404843
6922 404843 1220765 515277 457468 680103 531607 1028022 730284 -824397 -639464 88349
6912 88349 49790 645226 330695 203625 637901 366935 374149 904249 639524 -33632
6902 -33632 -404199 -37354 359217 679584 -47609 6481 891225 695893 659520 211317
6892B11317l11119O03592N58259j96485l36993o10833M63652M27262r2540j147496
6882d31384l02442N26722K62164L49004O99711n32249J35615J4772p21624p8976
6872g8687P25901M79624j17986p1387l54288J84999O17325O4770q81991P60342
6862A328622l61364o48269M3092K47199L23603P48227k90909j26292l04658P31776
6852A691027Q47693j80823n98469k05515M83349o33985o30785K7951n7680J101628
6842A844391m16154n48405K31681J36723k62533l43034j34165J81837k24200n14751
6832d8610j48875M16621K86137J75528P8968M86418p58742n66040P33890o51011
6822D284O93806q13806k52464P56020P48889M85572L47696r69882p03015j4863
$$ plain form
6892 211317 -99802 503790 1062049 865564 528571 -82262 381390 808652 716112 -431384
6882 -431384 -733826 -207104 55060 404064 1103775 571526 707141 721913 289 -78687
6872 -78687 647214 1126838 1008852 937465 583177 768176 1385501 1450271 568280 1328622
6862 1328622 967258 318989 362081 609280 932883 1681110 1390201 1263909 959251 1691027
6852 1691027 2538720 2357897 1759428 1553913 2037262 1403277 772492 800443 742763 1844391
6842 1844391 1428237 879832 1111513 1248236 985703 642669 508504 690341 466141 -48610
6832 -48610 -197485 219136 505273 680801 759769 1246187 487445 -78595 655295 4284
6822 4284 698090 -115716 -368180 387840 1136729 1622301 1969997 1000115 297100 282237
6812B82237n83257J31028J11910N71816k92555L41729j5826q8248O99759k51303
6802I07290j33034N2007o98580k0027N98034j17043l63161k1997L55614M02656
6792I61759k47564k14685L8243j18858k08483N65374q5823r21925R78850Q49224
6782A596112q17862j97751p3362l41753K73401L10469q30683K15060k85081L02013
6772A50563p2404K41625M07927n81098P05727O72222j018678r23667L31364O62696
6762E76277N55782J42728j90732l07910M94950l66094m83333L87891q2735j005214
6752b78390J92352N78534L05613k61573O2398k78974M69001L27225j78273l69826
6742E68087l09380K16258K08701j56837K58400n80275m27990R03831N29925m91323
$$ plain form
6812 282237 -301020 -169992 -58082 513734 221179 562908 547082 458834 1158593 907290
6802 907290 774256 826263 127683 107656 705690 588647 225486 203489 559103 961759
6792 961759 714195 499510 537753 418895 210412 775786 689963 -231962 746888 1596112
6782 1596112 778250 580499 507137 165384 438785 749254 -81429 133631 -151450 150563
6772 150563 78159 319784 727711 146613 852340 1524562 505884 -417783 -86419 576277
6762 576277 1132059 1274787 1084055 776145 1271095 905001 421668 809559 726824 -278390
6752 -278390 -86038 492496 798109 536536 598934 319960 788961 1116186 937913 568087
6742 568087 258707 474965 683666 526829 785229 204954 -223036 680795 1210720 719397
6732G19397J65633q56974R34739m82828k25404O29961j48386J77305J093037m57766
6722A548714p7446J19579n27007K19654o02585l36149o48097m49123K63793J028018
6712E39351K93827J76723k05019J82162K37659L8582p04286L44808L51184m23860
6702H31131K6359k93273q3931l094K93297Q02890k95788m38561m89765N44986
6692H94251P13186k76696l91540n26248J39316l20766J93067Q55127j55375J79662
6682A303984m95062k96788O12929o25700j18767L67466P41586l83299l74140M41157
6672A173366n54249j70443N95733M59482K1949K09039L91000r4691m52159R82323
6662B561350r9345j117926j001774J042828K35419k95006p9207Q25562k60494
$$ plain form
6732 719397 885030 28056 962795 479967 254563 884524 736138 913443 2006480 1548714
6722 1548714 1471268 1590847 1063840 1283494 680909 344760 -303337 -752460 -488667 539351
6712 539351 833178 1009901 804882 987044 1224703 1263285 558999 903807 1254991 831131
6702 831131 857490 564217 480286 477192 770489 1573379 1277591 839030 349265 894251
6692 894251 1607437 1330741 939201 412953 552269 231503 424570 1279697 1124322 1303984
6682 1303984 808922 512134 1125063 499363 380596 748062 1489648 1106349 732209 1173366
6672 1173366 619117 448674 1044407 1503889 1525838 1734877 2125877 2031186 1579027 2561350
6662 2561350 2462005 1344079 342305 1385133 1620552 1325546 1246339 2071901 1811407
6653A811407l19892l8638l73616M3390k4501J15382K15484k97031l10111o1946
6643G59928O20980Q30163M26742Q0291l58863j394339M87768J32154k82037J11698
6633A414485o40935L53823N61556R86896j20906J23727k51063n22548m32014K08740
6623A681761O82145o35953k46738N32965j15354o01284M82556k18891k8166R73136
6613B506177p77523k55117k81697j63623K24550M94104o80088N84053L08270N8454
6603B017560J2425l00565m29326J73274n77238j26941J21634l85917J142233k55472
6593A391667m6096J96761j58466K21386J272238m23648m00572l57827K89465k41018
6583A743890k62375n46573L88660K47669n1973k00477M11467O54019k78041O25773
$$ plain form
6653 1811407 1491515 1452877 1079261 1122651 1098150 1213532 1429016 1131985 821874 759928
6643 759928 1380908 2211071 2637813 2718104 2359241 964902 1452670 1584824 1302787 1414485
6633 1414485 773550 1127373 1688929 2675825 2554919 2678646 2427583 1905035 1473021 1681761
6623 1681761 2363906 1727953 1481215 2014180 1898826 1297542 1780098 1561207 1533041 2506177
6613 2506177 1728654 1473537 1191840 1028217 1252767 1746871 1066783 1650836 1959106 2017560
6603 2017560 2029985 1729420 1300094 1473368 896130 769189 890823 504906 1647139 1391667
6593 1391667 1345571 1542332 1383866 1605252 2877490 2453842 2053270 1695443 1984908 1743890
6583 1743890 1481515 934942 1323602 1571271 1519298 1318821 1730288 2384307 2106266 2732039
6573B732039K08491J82473P2774l89204l42612L76691L42874K08125l56905o22600
6563B412146m11306N48256l93526O96294n85841k52339k33728L83640M75513p40128
6553A898981L92569M0541r21973O49786M75196J03537J86783K95737J9898p90220
6543B350835k58965R3486J01393N98513l61566k07975K43174K68272p11325J77663
6533B293505n02270j87548K61933J14051O80179R85728O39161q23328L14152m2534
6523C733029m51563K40972J89796m39856q59231j33504P18987M35215j256358
6514B177487p82364M2067O40063M44171P4799N86856o58414k4610p708l67058
6504B125289n9550P66127m4883M64524r42304J20439O83085K27054m17989j36471
$$ plain form
6573 2732039 2940530 3123003 3195777 2806573 2463961 2840652 3183526 3391651 3034746 2412146
6563 2412146 2000840 2549096 2155570 2851864 2266023 2013684 1779956 2163596 2639109 1898981
6553 1898981 2291550 2332091 1410118 2059904 2535100 2638637 2825420 3121157 3141055 2350835
6543 2350835 2091870 2185356 2286749 2885262 2523696 2315721 2558895 2827167 2115842 2293505
6533 2293505 1791235 1603687 1865620 1979671 2659850 3645578 4284739 3461411 3775563 3733029
6523 3733029 3281466 3522438 3712234 3272378 2413147 2279643 2998630 3433845 2177487
6514 2177487 1395123 1437190 2077253 2521424 2596223 3183079 2524665 2500055 2492347 2125289
6504 2125289 2065739 2831866 2786983 3251507 2309203 2429642 3112727 3339781 2921792 2785321
6494B785321P85833n53573k53275O92921l1502p18598l09633P30220l40285p20986
6484B066443j34102J028966K48774q9723k24567L10800Q10520n45395o91729P6853
6474B856840J072466M14222M66858o93921n90583J22237M9027k82792J162j37087
6464C278429j0174M34488j12282J85430R23014J395917p49268m31477k13860R9585
6454D799802p094L52072L87260Q25579l14703j19727K1785o02898J101711m46975
6444E996812O7926N70544k32259o09301j77802j7609o690K88400O26136L22377
6434F828534r1446j13030J5935K64496L61125K8371M77958O17209L02260k24681
6424H466731o5363o39380l25482o5217r88063J03456l0955k69293j09608N71961
$$ plain form
6494 2785321 3571154 3017581 2764306 3457227 3425725 2707127 2397494 3127714 2787429 2066443
6484 2066443 1932341 2961307 3210081 3120358 2895791 3206591 4017111 3471716 2779987 2856840
6474 2856840 3929306 4343528 4810386 4116465 3525882 3648119 3697146 3414354 3415516 3278429
6464 3278429 3268255 3702743 3590461 3775891 4698905 6094822 5345554 4914077 4700217 4799802
6454 4799802 4792708 5144780 5532040 6357619 6042916 5923189 5944974 5342076 6443787 5996812
6444 5996812 6064738 6635282 6403023 5793722 5615920 5598311 5591621 5880021 6506157 6828534
6434 6828534 6737088 6624058 6639993 6904489 7265614 7293985 7771943 8389152 8691412 8466731
6424 8466731 8401368 7761988 7436506 7371289 6383226 6486682 6455727 6186434 6076826 6648787
6414F648787j11800L8883o28181j06679M19586m35831K72598k41744l8867k60749
6404E556003L99463P61325M70022K13144j50478q35997L69071k2632r17727j28637
6394E713557m93165o2016J257344q55956N3559j87409L27243k16791m81989K78451
6384E332828q48294k56187R66951J48116o91696o40409k8408K92034k61569J101055
6374E114421M97561j8293k34756L82047P3396o64928l88822Q8288m75909Q91175
6364E264180L24674j68109N86743n96997k79581L14948J4950l44848j34149k46424
6354D735387N45536N36913j59345n46471L39755K29628j1233j89482N35135n80653
6344E435170P06453K41890k43528l89281o04924R2112o52797R17555Q97299J58265
$$ plain form
6414 6648787 6536987 6575870 5947689 5841010 6260596 5824765 6097363 5855619 5816752 5556003
6404 5556003 5955466 6716791 7186813 7399957 7249479 6413482 6782553 6759921 5842194 5713557
6394 5713557 5220392 5158376 6415720 5559764 5613323 5425914 5753157 5536366 5054377 5332828
6384 5332828 4484534 4228347 5195298 5343414 4651718 4011309 3982901 4274935 4013366 5114421
6374 5114421 5611982 5593689 5358933 5740980 5814376 5149448 4760626 4848914 4373005 5264180
6364 5264180 5588854 5420745 6007488 5410491 5130910 5445858 5460808 5115960 4981811 4735387
6354 4735387 5280923 5817836 5658491 5112020 5451775 5681403 5670170 5480688 6015823 5435170
6344 5435170 6141623 6383513 6139985 5750704 5145780 5237892 4585095 5502650 6399949 6558214
6334F558214K55392n99724m07812J152774k34162L38438k37650K03032j36752
6325F891750l70671L76434P51487o03912j116334P19359M42054m65784n00996
6316F123387K15492M36453j8632j336700K56515J283819K4262N59142P4702o6870
6306G551570j118834J210574K64388K0698k48138k05159l69108K101k45954n03591
6296F358547M67981J14232N46781K75779l1183K66961M44213l00018K40817j29711
6286H254399K49109M31992Q49329M77351l23652p53270o94040R84928k75131m25702
6276H775313K03614O40400k09072k85633L30115Q87045O2612k39917R33469m3172
6266A1054774r7232L87740N01666M09472l75838p37465O74943O89475L02324J13118
$$ plain form
6334 6558214 6813606 6213882 5806070 6958844 6724682 7063120 6825470 7028502 6891750
6325 6891750 6521079 6897513 7649000 7045088 5928754 6648113 7090167 6624383 6123387
6316 6123387 6338879 6775332 6756700 5420000 5676515 6960334 6984596 7543738 7618440 7551570
6306 7551570 6432736 7643310 7907698 7928396 7680258 7475099 7105991 7108092 6862138 6358547
6296 6358547 6826528 6940760 7487541 7763320 7732137 7999098 8443311 8143293 8384110 8254399
6286 8254399 8503508 8935500 9784829 10262180 9938528 9185258 8491218 9476146 9201015 8775313
6276 8775313 8978927 9619327 9410255 9124622 9454737 10341782 10404394 10164477 11097946 11054774
6266 11054774 10957542 11345282 11846948 12256420 11880582 11143117 11818060 12507535 12809859 12922977
6256A2922977P8878j662338j98475l59293J170895M13039O1272L74101M30832
6247A3231888l63879J40992k03401J00410L011N34732P74023j53572r6800J65808
6237A4133212J7770O56395J70391j324264J20687L76852m33085P87903l37368
6228A4168493n2429O76705k0814N14467N62002l49535k48720n1452J58923R70649
6218A6328289k02249K14671k66873M74711n0106J56930O54047j51001K00411L78395
6208A7737225m1075P5246m02017R04548R0740R9987K78818K01729N04896N35462
6198A9985559o91098j66026L33259k81112J128234J08321n6573J86897j07357
6189B0440104R56612J009675P71149q64433K40241o4961K11826J055242K94675
$$ plain form
6256 12922977 13001855 11339517 11141042 10781749 11952644 12365683 12426955 12801056 13231888
6247 13231888 12868009 13009001 12805600 12906010 12909021 13443753 14217776 14064204 13967404 14133212
6237 14133212 14150982 14807377 14977768 13653504 13774191 14151043 13717958 14505861 14168493
6228 14168493 14116064 14792769 14771955 15286422 15848424 15498889 15250169 15198717 15357640 16328289
6218 16328289 16126040 16340711 16073838 16548549 16498443 16655373 17309420 17158419 17358830 17737225
6208 17737225 17696150 17771396 17369379 18273927 18364667 18464654 18743472 18945201 19450097 19985559
6198 19985559 19294461 19128435 19461694 19180582 20308816 20417137 20360564 20547461 20440104
6189 20440104 21396716 22406391 23177540 22313107 22553348 22488387 22700213 23755455 24050130
6180B4050130O94308M11879P25896N79555L95406J677040Q15853J019619M65876
6171C0835562L63876J10466k3010L34881k58073o7106R99543J444805K72765N06203
6161C4519912R67865P11673M16917P56246N93729J113774N66196Q71345N74187
6152D1091844O92470J38090p81078J151969J356750J344822J944936J086565M72066
6143D8498434R99398L54296L72904K700872J272718K305034L709380K793698J797982
6134F4804716L775793M655759M629285M198185L977938M149567K806962K086839
6126I5085044J65993J51998j09519N33460J860904K660534K505133R81258j178745
6117A02656060j86072J91437K014567L153777J696656J693225K074974K333982
$$ plain form
6180 24050130 24744438 25156317 25882213 26461768 26857174 28534214 29350067 30369686 30835562
6171 30835562 31199438 31309904 31286894 31621775 31363702 31296596 32296139 33740944 34013709 34519912
6161 34519912 35487777 36199450 36616367 37372613 37966342 39080116 39646312 40517657 41091844
6152 41091844 41784314 41922404 41141326 42293295 43650045 44994867 46939803 48026368 48498434
6143 48498434 49497832 49852128 50225032 52925904 54198622 56503656 60213036 63006734 64804716
6134 64804716 68580509 73236268 77865553 82063738 86041676 90191243 92998205 95085044
6126 95085044 95251037 95403035 95293516 95826976 97687880 100348414 102853547 103834805 102656060
6117 102656060 102469988 102661425 104675992 107829769 109526425 111219650 113294624 115628606
6109A15628606L570881L899216J589715j407060k769096q75969r75828Q26220
6101A19486685J510837l69305k401223l934183m381759l648050k125319k12067
6093A03925616N67467J924340J260011j525655l09046J44953O55629m45927k538200
6084A03659188l363176k330761j907975j091038l15863k688033n660566n193929
6076H1107847l461859l707988l006325k048297j425341k212517j290682j301287
6068F2653551m42504r08669j00476j54947l46083m18297j24577P13010L0855R86413
6058F1888276j5978l78391N60605J771749J252543J767388K377010K135696K619368
6049G3978266K192060K260462K904230L591515L833462L398557L778671K471953
$$ plain form
6109 115628606 119199487 123098703 124688418 123281358 120512262 119636293 118660465 119486685
6101 119486685 120997522 120628217 118226994 114292811 109911052 106263002 104137683 103925616
6093 103925616 104493083 106417423 107677434 106151779 105842733 105987686 106643315 106197388 103659188
6084 103659188 100296012 97965251 96057276 94966238 94650375 91962342 86301776 81107847
6076 81107847 77645988 73938000 70931675 68883378 67458037 65245520 63954838 62653551
6068 62653551 62211047 61302378 61201902 61046955 60700872 60282575 60157998 60871008 60901863 61888276
6058 61888276 61872298 61493907 62054512 63826261 65078804 66846192 69223202 71358898 73978266
6049 73978266 76170326 78430788 81335018 84926533 88759995 92158552 95937223 98409176
6041I8409176K548460L169792L838363M452094N380423P581209O761237K251927
6033A34392681j811374k530657k655881k016138j096493r73115J713598L045159
6025A28067780M540764N428461N963630L976578J76530o9246Q59336K328860L855455
6016A55128148N054203N080880K555527j573417l830875l445412j504733J386613
6008A58850934M743523O201789N279832M956465L867133M874790O118670L583267
6000A98476403K658011J351925L69825J849170K597970J743958o19735n570763
5992B02856764q268448r433970q063803o752115m481493k955266j806226J393693
5984A62489136K088059M786302O227570P489646R948271Q482188R992368J1601672
$$ plain form
6041 98409176 100957636 104127428 107965791 112417885 117798308 125379517 132140754 134392681
6033 134392681 132581307 130050650 127394769 125378631 124282138 123309023 125022621 128067780
6025 128067780 132608544 138037005 144000635 147977213 148153743 148084497 148943833 151272693 155128148
6016 155128148 160182351 165263231 167818758 166245341 162414466 158969054 157464321 158850934
6008 158850934 163594457 169796246 175076078 180032543 183899676 188774466 194893136 198476403
6000 198476403 201134414 202486339 202856164 204705334 207303304 209047262 208427527 202856764
5992 202856764 194588316 185154346 177090543 170338428 165856935 162901669 161095443 162489136
5984 162489136 164577195 169363497 175591067 183080713 193028984 201511172 211503540 223105212
5976B23105212J1231575R131135L423131l288611o851166r442563r291196p630866
5968B10386651n522465k963756l552036l459953m472944n147972m438033l542875
5960A77286617k610852j948239J116408L166401N084125N609345N438105M489206
5952A97631116J007622K77642k072790l398497n951157q807040j0403934r610296
5944A58672666q756007q270880n926636l977632k855428k781605l446590m544271
5936A18113617l918577m404571l579354k325550k195152j405980j123639o23422
5928I8537372k349383m177809m243683n094263o378959n259989m410883l890715
5920F2731688l860649l289717k823391k574123k059696j970764k115197j901436
$$ plain form
5976 223105212 234336787 243467922 246891053 243602442 236751276 227308713 218017517 210386651
5968 210386651 204864186 201900430 198348394 194888441 190415497 185267525 180829492 177286617
5960 177286617 174675765 172727526 173843934 177010335 182094460 187703805 193141910 197631116
5952 197631116 198638738 198916380 196843590 193445093 187493936 178686896 168282962 158672666
5944 158672666 149916659 141645779 135719143 131741511 128886083 126104478 122657888 118113617
5936 118113617 114195040 109790469 106211115 103885565 101690413 100284433 99160794 98537372
5928 98537372 96187989 92010180 87766497 82672234 76293275 71033286 66622403 62731688
5920 62731688 58871039 55581322 52757931 50183808 48124112 46153348 44038151 42136715
5912D2136715j392700o40297q95610r81926j239814n04946n41014q24401j077242
5903C4038765j455946j065272j426897l12853K388k57500m07089l94256j187087
5894B7534253r87685N80457J02629K96833N23627o27057J73488N33361j28513
5885B8001393l2696j108467K85820J41980j353015q13435J69447m3554k17689
5876B5029784P02566L0990K84390r82997Q36435O57579q81795J48363j20212m47132
5866B5257971m97252m66111J8930L285j1456o40182m38916q58443n15164K16504
5856B2069166m97404N27786L83474M28843j88655J12700R42439J082466J72118
5847B5032933K56199l34733p50203r10759j170132q9442n31115N83635j012497
$$ plain form
5912 42136715 40744015 40103718 39208108 38226182 36986368 36481422 35940408 35116007 34038765
5903 34038765 32582819 31517547 30090650 29777797 29780185 29522685 29115596 28721340 27534253
5894 27534253 26546568 27127025 27229654 27526487 28050114 27423057 27596545 28129906 28001393
5885 28001393 27968697 26860230 27146050 27288030 25935015 25121580 25291027 25247473 25029784
5876 25029784 25732350 25763340 26047730 25064733 25901168 26558747 25676952 25825315 25705103 25257971
5866 25257971 24760719 24294608 24313538 24316823 24305367 23665185 23226269 22367826 21852662 22069166
5856 22069166 21571762 22099548 22483022 22911865 22723210 22835910 23778349 24860815 25032933
5847 25032933 25289132 24954399 24204196 23293437 22123305 22033863 21502748 22086383 21073886
5838B1073886o15416l668p16047q53125r94080J24088J22791K55323k25700m5429
5828A8122623n8816m06719r6095l61188K35328J03630K89949p1738J19651p64265
5818A7112360n108j23438j6776N06211J09277o92958o61878K34348l53106M4604
5808A6153536q94511k59815P2482J38160J72822l00759j28158J07720j04220J83016
5798A5140273k68665q43084M84106o5251m04843m89366r2595N16260m42716K77473
5788A3811592Q60880P6299J21685k05319J21965k29555R7670q3282r870P7568
5778A4639633N26623L5423l86067R86594M86850M9176m64715P11937m83667M18190
5768A6519977p51616o8581J73807M23059K70100n97095o86078l87914L43546N69519
$$ plain form
5838 21073886 20458470 20454802 19738755 18885630 17891550 18015638 18138429 18393752 18168052 18122623
5828 18122623 18063807 17657088 17560993 17199805 17435133 17538763 17828712 17756974 17876625 17112360
5818 17112360 17107252 16983814 16967038 17473249 17582526 16889568 16227690 16462038 16108932 16153536
5808 16153536 15259025 14999210 15071692 15209852 15382674 15081915 14953757 15061477 14957257 15140273
5798 15140273 14871608 14028524 14512630 14447379 14042536 13553170 13460575 13976835 13534119 13811592
5788 13811592 14672472 14748771 14870456 14665137 14787102 14557547 14655217 14571935 14562065 14639633
5778 14639633 15166256 15201679 14815612 15802206 16289056 16338232 15873517 16585454 16101787 16519977
5768 16519977 15768361 15699780 15873587 16296646 16566746 15969651 15283573 14895659 15239205 15808724
5758A5808724L54404k33895J01773J530734O69416r2094M41660l06160j467175
5749A6807387n87526J323693m03616O49423R34848l81097p0040J073793M45060
5740A9791925m49859Q04865M05907O57784J49569n37487Q40236j27258k66465
5731B1269217m46374L81476m22740k01581J061688R60554k2709m32395m75408
5722B1671728n24034J274262P63274L95941N90789n97169J81548N86217P7903
5713B4420459l35928Q05824M8156J45535R31344L0837N67775J227299R74966l09971
5703B8506296k48474K07829q07334J25669M03680k75208N86359K94937Q51623
5694B9645377k23465J70869K52786K2622J032445P70082j7121r4182J470396O22247
$$ plain form
5758 15808724 16163128 15929233 16031006 17561740 18231156 18139062 18580722 18274562 16807387
5749 16807387 16219861 17543554 17139938 17789361 18724209 18343112 18273072 19346865 19791925
5740 19791925 19342066 20146931 20552838 21210622 21360191 20822704 21662940 21535682 21269217
5731 21269217 20822843 21204319 20781579 20579998 21641686 22602240 22579531 22147136 21671728
5722 21671728 21147694 22421956 23185230 23581171 24171960 23574791 23756339 24342556 24420459
5713 24420459 24084531 24890355 24938511 25084046 26015390 26046227 26614002 27841301 28816267 28506296
5703 28506296 28257822 28465651 27658317 27783986 28187666 27912458 28498817 28793754 29645377
5694 29645377 29421912 29592781 29845567 29868189 30900634 31670716 31653595 31559413 33029809 33652056
5684C3652056o92193M61569N83075J00785J001039M34786N20601Q54894o45505
5675C6271107Q53893J882852K80198J074096J120487Q03912K62039O35722L46658
5666D3530964K16656R8575r8173R09850R02818k11461L2530O91534K64419J87533
5656D6525245m98778J535412K148204M32781K82043J714599J308336J057807K208720
5647E6714369R10965J205409J935554J128018J745775M52690Q20346R06172J453499
5638F7272797J668296J506287K945884L142172K360014L974757L295952K823305
5630H8989464L706391M104052N167098N257937L404524K566445r0842k418305
5622A10686764l426266l761830k655550j753389j582206j576682l68664P27037
$$ plain form
5684 33652056 32959863 33421432 34004507 34105292 35106331 35541117 36061718 36916612 36271107
5675 36271107 37125000 39007852 39288050 40362146 41482633 42286545 42548584 43184306 43530964
5666 43530964 43747620 43846195 43748022 44657872 45560690 45349229 45381759 46073293 46337712 46525245
5656 46525245 46026467 47561879 49710083 50142864 50424907 52139506 53447842 54505649 56714369
5647 56714369 57625334 58830743 60766297 61894315 63640090 64092780 64913126 65819298 67272797
5638 67272797 68941093 70447380 73393264 76535436 78895450 82870207 86166159 88989464
5630 88989464 92695855 96799907 101967005 107224942 110629466 113195911 113105069 110686764
5622 110686764 107260498 103498668 100843118 99089729 97507523 95930841 95562177 96289214
5614I6289214J664229J818449K511537K344753K990968L795355M113479M233056
5606A19761040N829788P358236Q504088Q894423P780633P252735M397770P57518
5598A70536231j649946l349459k970230k892936j057799P83860K732639L952666
5590A66085026L303275J330107n01626l309323k902809l316899m069315k725375
5582A53893061j512748k51383J161564J371531L215468M899662N887479O531573
5574A75196207M955450N553814O096078M773807L781610L237083N511601P593506
5566B16699156R838022J1190504P484351J319035m312649n587038n465569l540308
5558B27625504m78650M38291p37695k368937l532139o222121n815793l862429
$$ plain form
5614 96289214 97953443 99771892 102283429 104628182 107619150 111414505 115527984 119761040
5606 119761040 125590828 132949064 141453152 150347575 158128208 165380943 169778713 170536231
5598 170536231 168886285 165536826 162566596 159673660 158615861 159399721 162132360 166085026
5590 166085026 169388301 170718408 170216782 166907459 164004650 160687751 156618436 153893061
5582 153893061 152380313 152128930 153290494 154662025 157877493 162777155 168664634 175196207
5574 175196207 180151657 185705471 191801549 196575356 200356966 203594049 209105650 216699156
5566 216699156 226537178 237727682 245212033 246531068 242218419 236631381 231165812 227625504
5558 227625504 227146854 227585145 226847450 224478513 220946374 214724253 208908460 205046031
5550B05046031k032836R52608M326266O813626P363871P951376N953576M381109
5542B40755627L257101J164263j412556j442447j448392j002861j654857k773993
5534B35441885j582358k095576P80947L500343N328002J976923l292691o729082
5526B33328393r936360r357226o649494m277183j512004p80841k047478k216494
5518A96551313l408129m368089m164609l293824n301326n706235p586318p681055
5510A55041728n740159l717184k893858j475504M04864J416722K630654K179690
5502A47846953K785210K158598k283984m876158o323470n868535m365264m834036
5494A24239314m269772l853104k368527k144350l071060k134322j951091j541696
$$ plain form
5550 205046031 203013195 203965803 208292069 215105695 222469566 230420942 236374518 240755627
5542 240755627 244012728 245176991 243764435 242321988 240873596 239870735 238215878 235441885
5534 235441885 233859527 231763951 232544898 236045241 241373243 243350166 240057475 233328393
5526 233328393 223392033 214034807 207385313 203108130 201596126 200815285 198767807 196551313
5518 196551313 193143184 188775095 184610486 181316662 176015336 170309101 162722783 155041728
5510 155041728 149301569 145584385 142690527 141215023 141619887 143036609 145667263 147846953
5502 147846953 150632163 152790761 150506777 145630619 139307149 133438614 129073350 124239314
5494 124239314 119969542 116116438 113747911 111603561 108532501 106398179 104447088 102905392
5486A02905392j006906n47842q44769K28415k1495k94299J309250k13624N19469
5477A02033591J32434P97034J749911P59205o2171P38188J501691Q70703O69134
5468A09189720O64454J970229K318682K562232K786629K753377K853871K654905
5460A27754099J785413R98603P11482R40701K949791K474070L281951M345723
5452A45241833N511688O521067P675594R771713Q872211O520137N40717k920781
5444A87734179m683802m129217k534174j465985J032757O96212J330887K716615
5436A80697472M081857L588765K52818j405223j655972j133448L22068J920761
5428A86669098M687074N294701L485323m40177k732751l120389k741839J96611
$$ plain form
5486 102905392 101898486 101350644 100505875 100734290 100712795 100418496 101727746 101514122 102033591
5477 102033591 102166025 102963059 104712970 105472175 105410004 106148192 107649883 108520586 109189720
5468 109189720 109854174 111824403 114143085 116705317 119491946 122245323 125099194 127754099
5460 127754099 129539512 130538115 131249597 132190298 135140089 137614159 140896110 145241833
5452 145241833 150753521 157274588 164950182 174721895 183594106 190114243 190654960 187734179
5444 187734179 183050377 178921160 176386986 174921001 175953758 176649970 177980857 180697472
5436 180697472 184779329 188368094 188620912 187215689 185559717 184426269 184748337 186669098
5428 186669098 191356172 196650873 200136196 199696019 196963268 193842879 191101040 191297651
5420A91297651J142716R94294j504887l450480k773124j711530m12290K120277
5412A85702627L972460N263516O119021P317579O101782O259492M097153L15281
5404B25148911k866754l057842l670029l384221n417288o593319l247331k116117
5396A94796010M88109K213952L115381K040556J028653j129991m240029n877681
5388A92434960o811109n166456k544726m72037j003995l525585k053018k048240
5380A68809794k035698k201934j800143j875467k345514j790481o14975N43746
5372A56689328O15740L216905L414178J833590o5107j348852j805980j776570
5364A60773232k095881j185430J254054Q24878K496311L13242j880761m505917
$$ plain form
5420 191297651 192440367 193434661 191929774 188479294 185706170 183994640 183582350 185702627
5412 185702627 189675087 194938603 201057624 208375203 214476985 220736477 224833630 225148911
5404 225148911 222282157 219224315 215554286 212170065 206752777 200159458 196912127 194796010
5396 194796010 195284119 197498071 200613452 202654008 203682661 202552670 198312641 192434960
5388 192434960 185623851 180457395 177912669 177440632 176436637 172911052 170858034 168809794
5380 168809794 166774096 164572162 162772019 160896552 158551038 156760557 156145582 156689328
5372 156689328 157305068 160521973 163936151 165769741 165704634 164355782 162549802 160773232
5364 160773232 158677351 157491921 158745975 159570853 162067164 162380406 160499645 155993728
5356A55993728m893020o104367n701904m565752m311423m200112l264899l823087
5348A19129164n210588n194867m655457l690916k781783k932147l808513l254281
5340H7600612l068332k356206r48135q37588k049953q17328k629083k465161j970964
5331G0457862k251222j747588r10847j19374M80533N30216Q08040R36285J21070
5322F8304975L68927R7730Q74874J463068K77508k590024l288901l757156j845882
5313E9905119k558005k395556k186802k369777p67231j020019j70938O63032M41821
5304D9541644K48494N82771P11969O804r5714J114191J025192M61968q23588j142469
5294E1631262k359098k394946k732682k686129j148071n56844q70483p31645n23545
$$ plain form
5356 155993728 151100708 144996341 139294437 134728685 130417262 126217150 122952251 119129164
5348 119129164 113918576 108723709 104068252 100377336 97595553 94663406 90854893 87600612
5340 87600612 84532280 82176074 81227939 80390351 78340398 77523070 74893987 72428826 70457862
5331 70457862 68206640 66459052 65548205 65428831 65909364 66439580 67247620 68183905 68304975
5322 68304975 68673902 68771632 69646506 71109574 71387082 68797058 65508157 61751001 59905119
5313 59905119 57347114 54951558 52764756 50394979 49627748 48607729 48436791 49099823 49541644
5304 49541644 49790138 50372909 51084878 51091682 50995968 52110159 53135351 53597319 52773731 51631262
5294 51631262 49272164 46877218 44144536 41458407 40310336 39753492 38883009 38151364 37627819
5285C7627819j317564j062786N12560o0460N45273R07855j02573n11512J89672
5276C6728284j529056j718814k642273j714419j717336j035423j14901j226820
5268B5029242q82651j493306o30466L9546Q3909o33450o09144k91923m70391j12085
5258B0029281J12533p39287k33534j69516M78836M00893J80882O82620m00340
5249B0342368M56220n25376p50581J97563k59952r72096J20431K79592m71235
5240A8416934K58321M51905j156934o65444r99418Q20072j23261r84352m00090
5231A5617733M7757K69624J15988j67472l32063L82482K67439R14591M3582q54651
5221A6305010K29510j67910p91758M22786o05734r1709j31094l50357P6048o76255
$$ plain form
5285 37627819 36310255 35247469 35760029 35699569 36244842 37152697 37050124 36538612 36728284
5276 36728284 35199228 33480414 30838141 29123722 27406386 26370963 26256062 25029242
5268 25029242 24146591 22653285 22022819 22062365 22146274 21512824 20903680 20611757 20141366 20029281
5258 20029281 20141814 19402527 19168993 18999477 19478313 19879206 20060088 20742708 20342368
5249 20342368 20798588 20273212 19522631 19720194 19460242 18488146 18608577 18888169 18416934
5240 18416934 18675255 19127160 17970226 17304782 16305364 17125436 17002175 16017823 15617733
5231 15617733 15665490 15935114 16051102 15883630 15551567 15934049 16201488 17116079 17159661 16305010
5221 16305010 16534520 16366610 15574852 15997638 15391904 15300195 15169101 14818744 14894792 14218537
5211A4218537j368779N43417k42711n35693K00603K13664r975m61356k76094L47349
5201A2628962N43921P954k56680j011901M81956P77777q17456p55590L10012P2775
5191A1981730J67631R65972r10722J53779j50257k76132N3521L05190M51248m0370
5181A2701590k00631L13784j22117l28856k12515K00062O25988j00348o6919K95591
5171A3105629M23731O90241K23397q15040n18722P07231J073693j96642k6128
5162A4667390P68811o0461m460R2464j77312M18547m9621p44404N57862P50989
5152A6219805p8650j113696n97677K39852Q03925p55283Q8000O23219o3253q73928
5142A4492314k71652m50231l84723N24265R9648J58343L5460l34335L42986P25542
$$ plain form
5211 14218537 12849758 13393175 13150464 12614771 12815374 13029038 13019063 12557707 12281613 12628962
5201 12628962 13172883 13180837 12924157 11912256 12394212 13171989 12354533 11598943 11908955 11981730
5191 11981730 12149361 13115333 12204611 12358390 12208133 11932001 11985522 12290712 12741960 12701590
5181 12701590 12500959 12814743 12692626 12363770 12151255 12351317 12977305 12876957 12810038 13105629
5171 13105629 13529360 14219601 14442998 13627958 13109236 13816467 14890160 14693518 14667390
5162 14667390 15436201 15375740 15371280 15463744 15286432 15704979 15655358 14910954 15468816 16219805
5152 16219805 16141155 15027459 14429782 14669634 15473559 14718276 14806276 15429495 15366242 14492314
5142 14492314 14220662 13770431 13385708 13909973 14009621 14167964 14203424 13869089 14212075 14937617
5132A4937617j07457L7785L02496J157527L04605P1365J41091j360599N81042
5123A6065472J242535P6339l58070K86534L59752p48750K01714K02391k59728
5114A7068189j0592q3147n21718K9148q82195k02284P98756j02679l40410R98610
5104A6751678q62511m11833m49558R30327L95876Q59186Q00262l89842j85978
5095A7437607K75936Q75242Q27955K03933k65800J11170j03469N3603k37570P15792
5085A9894399k39759L18468K93813k87122p53775J60780Q28152j54846M45375
5076B0505485j91904K591l68440m02559O66696P1288N83355Q77420M36829o96448
5066B1484313j084437L80605J254290O42125P92367J76528K40503P21662m63767
$$ plain form
5132 14937617 14830160 14867945 15170441 16327968 16632573 16703938 16845029 15484430 16065472
5123 16065472 17308007 17384346 17026276 17312810 17672562 16923812 17125526 17327917 17068189
5114 17068189 17057597 16974450 16452732 16481880 15599685 15397401 16196157 16093478 15753068 16751678
5104 16751678 15889167 15477334 15027776 15958103 16353979 17213165 18013427 17623585 17437607
5095 17437607 17713543 18588785 19416740 19620673 19354873 19466043 19362574 19416177 19178607 19894399
5085 19894399 19654640 19973108 20266921 19979799 19226024 19386804 20214956 20060110 20505485
5076 20505485 20313581 20316172 19947732 19545173 20211869 20283157 20866512 21743932 22180761 21484313
5066 21484313 20399876 20780481 22034771 22676896 23469263 23645791 23886294 24607956 24144189
5057B4144189J262497p0248J002727J21207n2516R55869L20477R18846O95497
5048B9298545Q41340K40354J208666O38558j67916J478806J440291K273019J977031
5039C9228694J510962K343453L250683M292726K700892L559781L786869K538424
5031F3212484K019814J563411k26104p47726k200915k61212M14730m05064O99604
5022F4069022K148440J344326J506988K344176J762668J069345K24402j80424
5014G4288943j439592j412374k415139q59053j222343M2870Q98208P15642K642365
5005G1239527M127470L824326M534707N398614O545992N384818L611443K799484
4997A07466381l69469j022054l021437l213997k522684k040551j721261p39941
$$ plain form
5057 24144189 25406686 25336438 26339165 26460372 26407856 27363725 27684202 28603048 29298545
5048 29298545 30139885 30380239 31588905 32227463 32059547 33538353 34978644 37251663 39228694
5039 39228694 40739656 43083109 46333792 50626518 53327410 56887191 60674060 63212484
5031 63212484 65232298 66795709 66569605 65821879 63620964 63359752 63774482 63369418 64069022
5022 64069022 66217462 67561788 69068776 71412952 73175620 74244965 74469367 74288943
5014 74288943 72849351 71436977 69021838 68162785 66940442 66983312 67881520 68597162 71239527
5005 71239527 75366997 79191323 83726030 89124644 95670636 101055454 104666897 107466381
4997 107466381 107096912 106074858 103053421 99839424 97316740 95276189 93554928 92814987
4989I2814987R60103R99522K216666M189529M865003L803565K765569J940945
4981A14555889J04059k794745l934985m683126n422863n212210l550084k342843
4973H6719092j072881N30239J769475L131194L899597N262961O047612P151881
4965A13439170M991222j314578n026533p024210o787158n752705m243648k708478
4957H5573082k563486o70739k71740J280103J52769K255365L266927K461264J933838
4948I3417383L96788k34782j185769k400541l245174m198398n271943m266119
4940G3011445k842267k717411k160036q72403N33609L63335o69383J564579J155771
4931F7367239K054597L412172M156046M638582P305468P358609P929536R935131
$$ plain form
4989 92814987 93775090 94774612 96991278 101180807 106045810 109849375 112614944 114555889
4981 114555889 114659948 111865203 107930218 103247092 97824229 92612019 89061935 86719092
4973 86719092 85646211 86176450 87945925 91077119 94976716 100239677 106287289 113439170
4965 113439170 118430392 117115814 112089281 105065071 98277913 92525208 88281560 85573082
4957 85573082 83009596 82338857 82067117 83347220 83499989 85755354 89022281 91483545 93417383
4948 93417383 93814171 93579389 92393620 89993079 86747905 82549507 77277564 73011445
4940 73011445 70169178 67451767 65291731 64419328 64952937 65316272 64646889 66211468 67367239
4931 67367239 69421836 72834008 76990054 81628636 88934104 96292713 104222249 114157380
4923A14157380J1823739J4793467J9158296K2178540K4139179N090670k3812719
4916A87528552k8424349k4097800j7311449j2571874j0312146q595747m662028
4909H1553159l963896m739404l962036l220249k939962j255549j632875n84650
4901E9254538P9935o84131J54693N76140l28344O61204J020837J654737J862694
4892F4252303K426988K523909M031947M462172N283339L607331l358077n257180
4884G7972732m781943m753254m283682j853288j641039q67709q10463k05904K84326
4875E9059776Q59448N70084J242954K110574N93401K863322M210779M808637N569987
4866H1888962N934877O894253Q027274R038501J2384689J4574498J7129423J2737525
$$ plain form
4923 114157380 125981119 140774586 159932882 182111422 206250601 211341271 187528552
4916 187528552 159104203 135006403 117694954 105123080 94810934 86215187 81553159
4909 81553159 77589263 72849859 68887823 65667574 62727612 61472063 59839188 59254538
4901 59254538 59334473 58650342 58805035 59381175 59052831 59714035 60734872 62389609 64252303
4892 64252303 66679291 69203200 73235147 77697319 82980658 86587989 83229912 77972732
4884 77972732 73190789 68437535 64153853 62300565 60659526 59791817 58981354 58775450 59059776
4875 59059776 59919224 60489308 61732262 63842836 64436237 67299559 71510338 76318975 81888962
4866 81888962 87823839 94718092 102745366 111783867 124168556 138743054 155872477 168610002
4858A68610002j684295m767933l686634r64769L783464Q437261J2625593J9723189
4850B02075878K1881013J1952323J58043j0779199k4439082k6842826k2574675
4843A51431475j8389604j3986609j1819798r947199p919252o577423o092019m360790
4835G2338781l370167l870557k959325j891179j639265j828340k602554j767169
4827E2410225M250j541879j70898Q60639k72969j595044J82631N50577k41165
4818E0186367q95084M69191K9336J193J199614N8229n19849j33993J348143Q04320
4808E2547467m56958J133151R36230J364768J748709J629432K039163J218876
4800F2160838K796317L418358M067451L659717M533345O443886P807068Q527267
$$ plain form
4858 168610002 166925707 162157774 158471140 157506371 161289835 169727096 182352689 202075878
4850 202075878 223956891 235909214 236067257 225288058 200848976 174006150 151431475
4843 151431475 133041871 119055262 107235464 97288265 89369013 82791590 76699571 72338781
4835 72338781 68968614 65098057 62138732 60247553 58608288 56779948 54177394 52410225
4827 52410225 52414475 50872596 50701698 51562337 51289368 49694324 49876955 50427532 50186367
4818 50186367 49291283 49760474 49789810 49791003 50990617 51048846 50528997 50395004 51743147 52547467
4808 52547467 52090509 53223660 54159890 55524658 57273367 58902799 60941962 62160838
4800 62160838 64957155 68375513 72442964 76102681 80636026 87079912 94886980 103414247
4792A03414247J0519867J1823126J3961329J6597591K0083522K2353613J2464904
4785B11218199L93732l078091j3666120k3138352k3682580j9312609j4547402
4778A14186777j0664191q386250o774190n561975n167834m488724l634369k333345
4770F7175899j579231k483065J38491j479500q95855n48669n07477J499956J063845
4761F2384394R70313J361103O98755J743964L27703O6057n42050O76383K26979
4752F7913601O83961n03440L69680P70443N0449J786874Q15600J037235K4938
4743G2949341k16583l21852M72842p1651J99968J611004K006495J820029K413336
4734H0862929K292950K379989L478668L880165M500501O600649N533198O931104
$$ plain form
4792 103414247 113934114 125757240 139718569 156316160 176399682 198753295 211218199
4785 211218199 211611931 208533840 194867720 171729368 148046788 128734179 114186777
4778 114186777 103522586 95136336 88362146 82800171 77632337 73143613 69509244 67175899
4770 67175899 65596668 63113603 63252094 61772594 60876739 60328070 59820593 61320549 62384394
4761 62384394 63354707 64715810 65414565 67158529 67486232 67552289 67010239 67686622 67913601
4752 67913601 68597562 68094122 68463802 69234245 69284694 71071568 71887168 72924403 72949341
4743 72949341 72732758 72410906 72883748 72812097 73012065 74623069 76629564 78449593 80862929
4734 80862929 83155879 85535868 89014536 92894701 97395202 103995851 109529049 116460153
4726A16460153Q898554J0877780J4182196J7204717J9393521K2582991K5667513
4719B35267425L1994839M1203346M9969706N9266604M4102650k0415414n2318887
4712C89070269n5560756n2197432l8565550k9550758k3083755j9127934j5091684
4705A55892400j3404166j0726517r726363q326095p477970o020365m548021m429319
4697I1233584m028750k449447k176718o15073k124547j61073J17659O93430R59963
4688H1449028J373815J053817K479880L021399L399511L228995K449073K008105
4680A00463623L158271K687408L139615L470240L121217J944992L703396M254576
4672A25943338K691471L950762K917086L607015K349177J689919J363636J704828
$$ plain form
4726 116460153 125358707 136236487 150418683 167623400 187016921 209599912 235267425
4719 235267425 267262264 308465610 358435316 417701920 461804570 441389156 389070269
4712 389070269 333509513 281312081 242746531 213195773 190112018 170984084 155892400
4705 155892400 142488234 131761717 122035354 113709259 106231289 100210924 95662903 91233584
4697 91233584 87204834 84755387 82578669 81963596 79839049 79677976 79795635 80489065 81449028
4688 81449028 82822843 83876660 86356540 89377939 92777450 96006445 98455518 100463623
4680 100463623 103621894 106309302 109448917 112919157 116040374 117985366 121688762 125943338
4672 125943338 128634809 132585571 135502657 139109672 141458849 143148768 144512404 146217232
4664A46217232N86798K96340N07641M59509M84728k73796P58862J307711K007959
4655A52352984K783871L174687L274202M713554M828030N726085O272384O719015
4647A89844812O557993N553914N725543N501042M590526K667495K178463M14924
4639B23034712k144295k898539l753360n232340m692711n185345o079770m991302
4631A88057050n221303n518434k663200j725774j158458K61682P65462J568526
4623A74365551K946236L567053N378339N433040O142999N928254O340486O758527
4615B16860485N787836N732579M694874K172768O20321j599864j480029k688283
4607B30100687l892086m084838m211240m248678m109148k978822k232308k08796
$$ plain form
4664 146217232 146804030 147100370 147608011 148067520 148552248 148278452 149037314 150345025 152352984
4655 152352984 155136855 158311542 161585744 166299298 171127328 176853413 183125797 189844812
4647 189844812 196402805 201956719 207682262 213183304 217773830 220441325 222619788 223034712
4639 223034712 220890417 217991878 214238518 209006178 204313467 199128122 193048352 188057050
4631 188057050 182835747 177317313 174654113 172928339 171769881 172031563 172797025 174365551
4623 174365551 177311787 180878840 186257179 191690219 197833218 203761472 210101958 216860485
4615 216860485 222648321 228380900 233075774 235248542 235868863 234268999 232788970 230100687
4607 230100687 226208601 222123763 217912523 213663845 209554697 206575875 204343567 204134771
4599B04134771p79548j42666K12417J660109K539875L538236L691839N321542
4591B20176575N863144N388073M717895N571042N890009N224213M136266L279294
4583B60246511K405947P79388l45268p18201j630339k663559l650355m086530
4575B50337594l170446m074541l075667l645368l468956k569162k205256k608281
4567B25519917k474465k180063j163581j087803k402835j360500p65689j898569
4559B12186412j446517l379655l343400k932520l536671m033779m507624m369039
4551A84637207n649690n068646n089794n619933n523477m845205m173418m600978
4543A44066066l545178m335018l475156l159710l561565j826516k386860j315961
$$ plain form
4599 204134771 203355223 203212557 203424974 205085083 207624958 211163194 214855033 220176575
4591 220176575 226039719 231427792 236145687 241716729 247606738 252830951 256967217 260246511
4583 260246511 262652458 263431846 263086578 262368377 260738038 258074479 254424124 250337594
4575 250337594 247167148 243092607 240016940 236371572 232902616 230333454 228128198 225519917
4567 225519917 223045452 220865389 219701808 218614005 216211170 214850670 214084981 212186412
4559 212186412 210739895 207360240 204016840 201084320 197547649 193513870 189006246 184637207
4551 184637207 178987517 173918871 168829077 163209144 157685667 152840462 148667044 144066066
4543 144066066 140520888 136185870 132710714 129551004 125989439 124162923 121776063 120460102
4535A20460102j319440j649639j691331k087378k479906q65724j696460k024985
4527A06645239k396004j782343l187328k398502l259978k902086j559460l300629
4519H5858909k519443k388344j774346k427265j786807j075136j181664n66540
4511G2139364n4198j171580j394650m85885o26603k340376p12823j473289k515814
4502F1364146k287863j988682k312553j608467j368412k930559l026176k587680
4494D3253754k056118j821036p27190j944838j392596j977253j231247L45069
4486C2448545j587794j298351l21007j317043k28791j31677r50161j121485j081058
4477B4411178k93985q90040q89354L28417q68135p01192N13914j244196r66822
$$ plain form
4535 120460102 119140662 117491023 115799692 113712314 111232408 110366684 108670224 106645239
4527 106645239 104249235 102466892 99279564 96881062 93621084 90718998 89159538 85858909
4519 85858909 83339466 80951122 79176776 76749511 74962704 73887568 72705904 72139364
4511 72139364 72085166 70913586 69518936 69033051 68406448 66066072 65353249 63879960 61364146
4502 61364146 59076283 57087601 54775048 53166581 51798169 48867610 45841434 43253754
4494 43253754 41197636 39376600 38649410 36704572 35311976 33334723 32103476 32448545
4486 32448545 30860751 29562400 29241393 27924350 27695559 27563882 26613721 25492236 24411178
4477 24411178 24117193 23227153 22337799 22666216 21798081 21096889 21610803 20366607 19399785
4468A9399785j06316r22064n19221K5304j134595J4632n33538p67565N00583k42657
4458A5714348p07766m25326L30334R68166j67353q03538m16819j83222l66420
4449A3942404l05236l2265l63470j93420K34790P36165r04097j5449l03686l5088
4439A2760648l26812p72769j91517J42359m3979k13204M67009j20915r70232k76654
4429A0453934K07474J63007j31881o52319l36254j76449M58185J35749j52250
4420I969196M03253r398p24519K45675m57250m28535J41962P94490n96979k03004
4410I134891K13073P29895J10171n41805K36556M20859M39971l33822p72108J45994
4400I783675J4849k43893J48869j77001p8704L3914k04427q07607M4740l71673
$$ plain form
4468 19399785 19293469 18371405 17852184 17877488 16742893 16757525 16223987 15456422 15957005 15714348
4458 15714348 15006582 14581256 14911590 15879756 15712403 14908865 14492046 14308824 13942404
4449 13942404 13637168 13604903 13241433 13048013 13282803 14018968 13114871 13099422 12795736 12760648
4439 12760648 12433836 11661067 11469550 11611909 11567930 11354726 11821735 11700820 10730588 10453934
4429 10453934 10661408 10824415 10692534 10040215 9703961 9527512 9985697 10121446 9969196
4420 9969196 10372449 10363051 9638532 9884207 9426957 8998422 9140384 9934874 9337895 9134891
4410 9134891 9347964 10077859 10188030 9646225 9882781 10303640 10743611 10409789 9637681 9783675
4400 9783675 9798524 9554631 9703500 9526499 9447795 9481709 9277282 8469675 8514415 8142742
4390H142742J21542K97033k10039O1812n04154j98981M10190L04331j33788M04325
4380H695013k03787k03357K9312o82101L92842k51662J38271J98037k40060J67887
4370H040395l35092L43042l19304l17675K63745q09278k85350J186197J42014
4361G908694K36471l91502n4874j29747k19333l6462N69396L41661R65814P74123
4351I964241q98014p95087J78177N31725K6692L31427k53210J30198m34650m38854
4341H342645J47534j7190j030223j57731Q53590m05765P8165P58854j120470N54421
4331H003830j56495M21553N69465o1263k41771k37694M40595l82112N6786P08081
4321I120975j69614q18667R54486J76579j128922N95405Q50416M56238j87094
$$ plain form
4390 8142742 8264284 8561317 8351278 8413090 7908936 7709955 8120145 8424476 8290688 8695013
4380 8695013 8491226 8287869 8317181 7635080 8027922 7776260 7914531 8112568 7872508 8040395
4370 8040395 7705303 8048345 7729041 7411366 7675111 6865833 6580483 7766680 7908694
4361 7908694 8145165 7753663 7698789 7569042 7349709 7313247 7882643 8224304 9190118 9964241
4351 9964241 9066227 8271140 8449317 8981042 9007734 9339161 9085951 9216149 8781499 8342645
4341 8342645 8490179 8472989 7442766 7285035 8138625 7732860 7811025 8569879 7449409 8003830
4331 8003830 7847335 8268888 8838353 8777090 8535319 8297625 8738220 8356108 8412894 9120975
4321 9120975 8951361 8132694 9087180 9263759 8134837 8730242 9580658 10036896 9849802
4312I849802L27003m93972K83594O9751o28576N02818J40103K52874m9751J029895
4302A1283541k07793j052931m86306J138518M54931o09271J54957M15327j31246
4293A0959727p35415M34261M94375P6590P92976n34191j11641o5668P5616p33881
4283A0652749Q5642O89288j24604M89166L38522R7934L76664m49927j76547J194567
4273A3173454p03090q1582j67963j17206O80714l95915k80365N91295o2288O4344
4263A2701398J076467M6542l07833M64587P22005l76396J76425j02356j77640
4254A4223199m3259N01652Q83429K76463j30394p12693R39606j76283m10935Q2551
4244A5433336Q15892L77051M70004k32645q882J84385p11420L46072L80322j25966
$$ plain form
4312 9849802 10176805 9682833 9966427 10036178 9407602 9910420 10050523 10303397 10253646 11283541
4302 11283541 11075748 10022817 9536511 10675029 11129960 10520689 10675646 11090973 10959727
4293 10959727 10224312 10658573 11152948 11229538 12022514 11488323 11376682 11311014 11386630 10652749
4283 10652749 10738391 11427679 11303075 11792241 12130763 12228697 12605361 12155434 11978887 13173454
4273 13173454 12470364 12388782 12220819 12103613 12784327 12388412 12108047 12699342 12637054 12701398
4263 12701398 13777865 13824407 13516574 13981161 14703166 14326770 14503195 14400839 14223199
4254 14223199 14179940 14681592 15565021 15841484 15711090 14998397 15938003 15761720 15350785 15433336
4244 15433336 16249228 16626279 17096283 16863638 16854756 17039141 16327721 16673793 17054115 16928149
4234A6928149M77948n6190L09948J247399N08180K9012L85802O3601O60195J84168
4224B0738212l55051K71932q6839M07013L06211j56048J98160M0724k05921K57650
4214B1416043M56465K66410Q33324K21545J94480L28182l42329K79502N42423
4205B4196045J193799O42696J12661M31895J226235J705603J761924R16962R38579
4196C3126399Q29036J065535l30003p9310o91552j174535l20700o37440K34436
4187C2021866l25403L09745o21955m93264N12770j95170Q83409J0295N01809J39995
4177C2744097L4805N42443L97613J471011Q02123O25552O24085J518392K584651
4168D1344772L211063L011427K540946K888731J754287L339965K218704J322533
$$ plain form
4234 16928149 17406097 17349907 17659855 18907254 19415434 19444446 19830248 19893849 20554044 20738212
4224 20738212 20383161 20655093 20568254 20975267 21281478 21125430 21323590 21364314 21158393 21416043
4214 21416043 21872508 22138918 22972242 23193787 23388267 23716449 23374120 23653622 24196045
4205 24196045 25389844 26032540 26145201 26577096 27803331 29508934 31270858 32187820 33126399
4196 33126399 33955435 35020970 34690967 34611657 33920105 32745570 32424870 31787430 32021866
4187 32021866 31696463 32006208 31384253 30890989 31403759 31208589 32091998 32102293 32604102 32744097
4177 32744097 32778902 33321345 33718958 35189969 35992092 36617644 37241729 38760121 41344772
4168 41344772 44555835 47567262 50108208 52996939 54751226 58091191 60309895 61632428
4160F1632428M60898j238510k398772l255393k497932k666493j755337j312654
4152D6968235k391714o92486J13364m47384k17191O6825J044471J688303R10717
4143D7043140J888794J403075k225266p96026o37760o40686J152613J353809J487723
4134E0029416K664613K072049K616513L111494L418191K990947J839198J680496
4126G0422917j29288j761018k302260l768831m262336k960504l950906l214957
4118D8072817j909485k530086j960538p93869q36405k259709q76660l3386o74454
4109C6198225m15813O48197p13814M58879P10466m33500J163234J195713J144941
4100C9956528N14055J497535K277299J863601J989321K282548K615591Q80688
$$ plain form
4160 61632428 62093326 60854816 58456044 55200651 52702719 50036226 48280889 46968235
4152 46968235 44576521 43884035 43997399 43550015 43332824 43399649 44444120 46132423 47043140
4143 47043140 48931934 50335009 48109743 47313717 46675957 46035271 47187884 48541693 50029416
4134 50029416 52694029 54766078 57382591 60494085 63912276 66903223 68742421 70422917
4126 70422917 70293629 68532611 66230351 62461520 58199184 55238680 51287774 48072817
4118 48072817 46163332 43633246 41672708 40878839 40042434 37782725 36906065 36872679 36198225
4109 36198225 35782412 36430609 35716795 36175674 36886140 36452640 37615874 38811587 39956528
4100 39956528 40470583 41968118 44245417 46109018 48098339 50380887 52996478 53877166
4092E3877166m43798j422135k567920k714448j787709k248458k220820j076786
4084C9395092k759506j155558l34842q42365j385153j278443o26193n37666n51357
4075B9924009j17324n98763j13493q06923l17436j09132J111399M57585m28756
4066B9001166J43509J177371N32724N22460J550717l50014J485494q24738k17162
4057C3021527N23214l67915o93279j99867n62296r85935l55237N98861j05901
4048C0873172o54820j41830n06272J0635K5626p24911N8406j68560R65923k69431
4038B9467938j00287j64321m31685L92272J064502L07474J54353J247013L90812
4029C2328071p36115O9259Q78394L27679K01394k0685R62632m20449K93164J290059
$$ plain form
4092 53877166 53433368 52011233 49443313 46728865 44941156 42692698 40471878 39395092
4084 39395092 36635586 35480028 35145186 34302821 32917668 31639225 31013032 30475366 29924009
4075 29924009 29806685 29207922 29094429 28287506 27970070 27860938 28972337 29429922 29001166
4066 29001166 29144675 30322046 30854770 31377230 32927947 32577933 34063427 33238689 33021527
4057 33021527 33544741 33176826 32483547 32283680 31721384 30735449 30380212 30979073 30873172
4048 30873172 30218352 30076522 29570250 29580885 29606511 28881600 28940006 28771446 29737369 29467938
4038 29467938 29367651 29203330 28771645 29163917 30228419 30535893 30690246 31937259 32328071
4029 32328071 31591956 31661215 32539609 32867288 33068682 33047997 34010629 33590180 33883344 35173403
4019C5173403J063677J09989N31781l03565p44270Q74360N38900K51058R44057
4010C8439390M78617M27541M12554p94824M44836L75349N74432K75980M81984
4001D1115859O44572J81817Q79176Q04189J131990N21414J339675J472928Q44696
3992D8936316P08432K471729J353127R83887J519994J586413J298348J566296
3984F0424542J961649J115369J497097J253834J205973J940955J963098P77586
3976G2140103N81861J344704N98048K339603J805620K120625J050427J677124
3968H3658115K895340K178515J149033J347538J398990J599586J459110J823343
3960I7509570J798272J749329J827791R17919J564683K552326K454699J063587
$$ plain form
4019 35173403 36237080 36347069 36878850 36575285 35831015 36705375 37244275 37495333 38439390
4010 38439390 38918007 39345548 39758102 38963278 39408114 39783463 40357895 40633875 41115859
4001 41115859 41760431 41942248 42821424 43625613 44757603 45279017 46618692 48091620 48936316
3992 48936316 49644748 52116477 53469604 54453491 55973485 57559898 58858246 60424542
3984 60424542 62386191 63501560 64998657 66252491 67458464 69399419 71362517 72140103
3976 72140103 72721964 74066668 74664716 77004319 78809939 80930564 81980991 83658115
3968 83658115 86553455 88731970 89881003 91228541 92627531 94227117 95686227 97509570
3960 97509570 99307842 101057171 102884962 103802881 105367564 107919890 110374589 111438176
3952A11438176J342030J400235J567451J180424K552389L164970J778684K323559
3944A26747918L610105K685439K876281K814953L107429K292307J791634J066888
3936A46992954J091280K175266J790464J102298J070727J529326Q95708M41491
3928A57089514J208103J594913J987825P80578L39567J130894J784338M70448
3920A66386180J847935J135860P28430K512351K237994L005100L243682L513068
3912A84610600K666700K779083K960338K915331K792725K607182L187214K113688
3904B06632861K079044K121243J818896J024709P92403J569761Q18214J256522
3896B18113653R69236m10524R82230J117561J095876J496297K232553K548830
$$ plain form
3952 111438176 112780206 114180441 115747892 116928316 119480705 122645675 124424359 126747918
3944 126747918 130358023 133043462 135919743 138734696 141842125 144134432 145926066 146992954
3936 146992954 148084234 150259500 152049964 153152262 154222989 155752315 156648023 157089514
3928 157089514 158297617 159892530 161880355 162660933 163000500 164131394 165915732 166386180
3920 166386180 168234115 169369975 170098405 172610756 174848750 177853850 181097532 184610600
3912 184610600 187277300 190056383 193016721 195932052 198724777 201331959 204519173 206632861
3904 206632861 208711905 210833148 212652044 213676753 214469156 216038917 216857131 218113653
3896 218113653 219082889 218672365 219654595 220772156 221868032 223364329 225596882 228145712
3888B28145712J490509J457334J874982Q72741j08173m3974Q76010p85204j041848
3879B32738089l13679L6069l32371O35241J68058J391739J134094K20897J170581
3870B36848718Q58467M58449J40130J73433n59136K78943n15197j505494j161563
3861B35016750j581396k052080j792345l092323k435041k858691l085083l085959
3853B15033832k319101k206775j055145r44403r39352R1624K06472l94167J056880
3844B08529865J87134j47518o53656K30986L65614p52579o36031j4419K21448
3835B07330844o46632r46541M99911p8275k079667k483919k405871k695946j925838
3826A94568066l044392k625252p61415k147687o99595q64j665307r62795m74362
$$ plain form
3888 228145712 229636221 231093555 232968537 233841278 233733105 233689131 234565141 233779937 232738089
3879 232738089 232424410 232460479 232128108 232763349 232931407 234323146 235457240 235678137 236848718
3870 236848718 237707185 238165634 238305764 238479197 237920061 238199004 237683807 236178313 235016750
3861 235016750 233435354 231383274 229590929 226498606 224063565 221204874 218119791 215033832
3853 215033832 212714731 210507956 209452811 208508408 207569056 207660680 207867152 207472985 208529865
3844 208529865 208716999 208569481 207915825 208146811 208512425 207759846 207123815 207109396 207330844
3835 207330844 206684212 205737671 206237582 206159307 204079640 201595721 199189850 196493904 194568066
3826 194568066 191523674 188898422 188137007 185989320 185289725 185288861 183623554 182660759 182186397
3817A82186397l28682k02506L41119q7239l00807P52156j64617K53124j924642
3808A80524303j903750k213049k281160k599121k927048k304482l472473k686611
3800A60136609k031897l160968k938167k501664l115876j822913j908558k894032
3792A39762534j754648j837552j741694j026915n52960j431529j641947k151557
3784A27623732k295511l342273k922444l263761m053017m988237n450359m194930
3776I7113200l512765l990735l537373l117402k658528j537757j927576k537130
3768G4293934j753436k534093j628970n20935j924369j410683k045390k084663
3760F0391395l36228j722775j509490j353366o07878j448862k111755m47986j487201
$$ plain form
3817 182186397 181857715 181655209 181996328 181909089 181608282 182360438 182195821 182448945 180524303
3808 180524303 178620553 176407504 174126344 171527223 168600175 166295693 162823220 160136609
3800 160136609 158104712 154943744 152005577 149503913 146388037 144565124 142656566 139762534
3792 139762534 138007886 136170334 134428640 133401725 132848765 131417236 129775289 127623732
3784 127623732 125328221 121985948 119063504 115799743 111746726 106758489 101308130 97113200
3776 97113200 93600435 89609700 86072327 82954925 80296397 78758640 76831064 74293934
3768 74293934 72540498 70006405 68377435 67856500 65932131 64521448 62476058 60391395
3760 60391395 60055167 58332392 56822902 55469536 54861658 53412796 51301041 50853055 49365854
3751D9365854j838996k006934j628541j841866n68836j067537j648497j344027
3743C7420620m83722j194340m61094n16451q83794j200297n30237j011829m60482
3734C0678374o34803n80264n62491l96224l34790r78309m30544j393607m21769
3725B4945573k44949p86534j086240n02598K75683q51238m76253n62762j586919
3716A9123763l53605L06615p22826j225382M69847m17509o07924p3762j43029
3707A6356188j082829j158940O56917j155m60291j12429M5610L67812q08072r44095
3697A2858716o0185P43054m83540p85920K4161m85354n65813Q7734N56027K05341
3687A2094221o07561p63253m53151J36456k68793k48017K29773j92505P68320
$$ plain form
3751 49365854 47526858 45519924 43891383 42049517 41480681 40413144 38764647 37420620
3743 37420620 36936898 35742558 35281464 34765013 33881219 32680922 32150685 31138856 30678374
3734 30678374 30043571 29463307 28900816 28504592 28169802 27191493 26760949 25367342 24945573
3725 24945573 24700624 23914090 22827850 22325252 22600935 21749697 21273444 20710682 19123763
3716 19123763 18770158 19076773 18353947 17128565 17598412 17180903 16572979 16499217 16356188
3707 16356188 15273359 14114419 14771336 14770181 14309890 14197461 14243071 14610883 13802811 12858716
3697 12858716 12798531 13541585 13058045 12272125 12296286 11810932 11245119 11332853 11888880 12094221
3687 12094221 11486660 10723407 10270256 10406712 10137919 9889902 10119675 9927170 10695490
3678A0695490L48165q75690n21692n70594J010012j65080k64935l43838J86221
3669I498059P06170p03534J61445l94121J62475n80169N5406J192900K57180l92194
3659I963617K25085l10051p54201O37545k38493j238648J03939J66707O5897R82720
3649I604117n311j094698J38614M17056J72147m34078O1838o13594o97026J93343
3639G742408j30654Q69002J33253k60119m2333J79110k03695j65862m9728n36666
3629G534716K85813J48875R3736n42783K09053k60119j06068N77086R05919n84726
3619H261502p19150j42349j71572k23989K39241J06579l24024M80250j262683
3610F243805K10209O10848L94806l21024k30506p31252J62935R8129N38299K06500
$$ plain form
3678 10695490 11043655 10167965 9646273 9075679 10085691 9920611 9655676 9311838 9498059
3669 9498059 10204229 9500695 9662140 9268019 9430494 8850325 8905731 10098631 10355811 9963617
3659 9963617 10188702 9878651 9124450 9761995 9523502 8284854 8388793 8555500 8621397 9604117
3649 9604117 9598806 8504108 8642722 9059778 9231925 8797847 8859685 8246091 7549065 7742408
3639 7742408 7611754 8480756 8614009 8353890 8311557 8490667 8286972 8121110 8071382 7534716
3629 7534716 7820529 7969404 8063140 7520357 7729410 7469291 7363223 7940309 8846228 8261502
3619 8261502 7542352 7400003 7228431 7004442 7243683 7350262 7026238 7506488 6243805
3610 6243805 6454014 7064862 7459668 7138644 6908138 6176886 6339821 6437950 6976249 7182749
3600G182749L55689K63415k28475k0227k98407m88625q0601k40079k53285P91170
3590F983324k65978J15213l45781j15301L77871l94695O51980O72496j092347
3581F586782r1901j04798J57876J8297M1313l45328Q53351M04251n55981r85774
3571E978088L95041P47453l18734o00094j97056j18758k46589K9938P80095N10252
3561F959636j30059o27190M7606M84594r58092n5281l88696N78247K32860O30859
3551F774484k27040j44955k00143K39225p6047o17903M7730l21410n85168K20624
3541E109397K66584M0396O68415J4928M87854k52151o29181m58270J34719k02021
3531E180670K70815K2490n17371K74313j54310P96720j90559l79100J00194j48378
$$ plain form
3600 7182749 7538438 7801853 7573378 7553151 7254744 6766119 6685518 6445439 6192154 6983324
3590 6983324 6717346 6832559 6486778 6371477 6749348 6354653 7006633 7679129 6586782
3581 6586782 6494881 6390083 6547959 6566256 6607569 6262241 7115592 7519843 6963862 5978088
3571 5978088 6373129 7120582 6801848 6201754 6004698 5885940 5639351 5669289 6449384 6959636
3561 6959636 6829577 6202387 6249993 6734587 5776495 5721214 5332518 5910765 6143625 6774484
3551 6774484 6547444 6402489 6202346 6441571 6365524 5747621 5795351 5473941 4888773 5109397
3541 5109397 5375981 5416377 6084792 6099720 6587574 6335423 5706242 5247972 5382691 5180670
3531 5180670 5451485 5473975 4956604 5230917 5076607 5873327 5682768 5303668 5403862 5255484
3521E255484K17495Q83L36189j93345k6370N46691m60382k14203k9958p7757o78332
3510D676395m18899N27878K30301K62465N23958k73988J20126p64134Q22309k60939
3500E445472l38178J10916J73459K33855l71802N12113m69035J21941N86877N26394
3490F532012p72420L5852j82049j40314n5715k970L16376m87475r91542K24216
3480D475971N98833l334o01720L56414J99269n26271l40856J04914M55085n5793
3470D662512k37248P43305R63610j27333r44708m78421M67182L64243k35648J19877
3460E297371o3597n62727k91810K05541j27433N09473J86185k05078p6682L20113
3450E191356m66308j92456K2735J321443k61531j048618L70878k59865J92817
$$ plain form
3521 5255484 5472979 5473862 5810051 5616706 5590336 6137027 5676645 5462442 5432484 5354727 4676395
3510 4676395 4257496 4785374 5015675 5278140 5802098 5528110 5648236 4884102 5706411 5445472
3500 5445472 5107294 5218210 5391669 5625524 5253722 5765835 5296800 5418741 6005618 6532012
3490 6532012 5759592 5795444 5613395 5473081 5417366 5414396 5730772 5243297 4251755 4475971
3480 4475971 5074804 5071470 4469750 4826164 5025433 4499162 4158306 4263220 4718305 4662512
3470 4662512 4425264 5168569 6132179 6004846 5060138 4581717 5048899 5413142 5177494 5297371
3460 5297371 5233774 4671047 4379237 4584778 4457345 4966818 5153003 4947925 4871243 5191356
3450 5191356 4725048 4532592 4555327 5876770 5615239 4566621 4937499 4677634 4870451
3441D870451O11536J21974o53567j43825J570953p38039n51371O24667p07719
3432E005060Q05024J79661l62678k63198M01938m76612j40648j100029L5193R79354
3422E063065J227309p23433J88032k09286K22120m16136n52844J21486r7056J10436
3412D933693M80010M45212M75168l6150n74476k57650l28940J061664Q04517j6989
3402F986059l02340j064715k07070K62791K63357Q60261j15413k23614l54398
3393F104918L87626o44250J40913L78834Q44421m91394R3749K78353P97795n81543
3383G309422m17239J01532k53106n26649N40592M16631M79115N5556N47353j71305
3373H081902n1198L09088l78991R78912K80026p9145K12658Q55594q7184J86484
$$ plain form
3441 4870451 5481987 5603961 4950394 4806569 6377522 5639483 5088112 5712779 5005060
3432 5005060 5810084 5989745 5627067 5363869 5765807 5289195 5148547 4048518 4083711 5063065
3422 5063065 6290374 5566941 5754973 5545687 5767807 5351671 4798827 4920313 4823257 4933693
3412 4933693 5413703 5858915 6334083 6297933 5723457 5465807 5136867 6198531 7003048 6986059
3402 6986059 6683719 5619004 5411934 5674725 5938082 6798343 6682930 6459316 6104918
3393 6104918 6492544 5848294 5989207 6368041 7212462 6721068 6814817 7093170 7890965 7309422
3383 7309422 6892183 6993715 6740609 6213960 6754552 7171183 7650298 7705854 8253207 8081902
3373 8081902 8030704 8339792 7960801 8939713 9219739 9140594 9353252 10208846 10121662 10308146
3363A0308146J2861K45130r01610N04093m1504l06294P0401j25797R4286L28396
3353A0188108p6422k78802n8581l85706M90648J33631o18169M12890P69997J005727
3343A1583321J86978l0749O96998N98099n66486l5796Q58266J277445J49971J60240
3333A4878287J125315P26752L85818L87127o15188P22730N11215Q325M31065N23020
3323A9084466P99168K09749J037201N53273J125534L60537K17620J12825O00557
3314B4100930n07883m67843q16299j229796k66348q96762l85896j133761q94347
3305A7501995r15445N77575p2981j045128m98405j83649j92479j200436m07999
3296A3563048j112013j90280L06661q91621j352950K94815M38198r44048l50961
$$ plain form
3363 10308146 10321007 10566137 9664527 10168620 10127116 9820822 9891223 9765426 9859712 10188108
3353 10188108 10111686 9832884 9774303 9388597 9879245 10012876 9394707 9807597 10577594 11583321
3343 11583321 11770299 11739550 12436548 13034647 12468161 12432365 13290631 14568076 14718047 14878287
3333 14878287 16003602 16730354 17116172 17503299 16888111 17610841 18122056 18130381 18561446 19084466
3323 19084466 19883634 20093383 21130584 21683857 22809391 23169928 23387548 23500373 24100930
3314 24100930 23593047 23125204 22308905 21079109 20812761 19915999 19530103 18396342 17501995
3305 17501995 16586550 17164125 17091144 16046016 15547611 15363962 15171483 13971047 13563048
3296 13563048 12451035 12260755 12567416 11675795 10322845 10617660 11055858 10111810 9760849
3287I760849m02225k62394R1484N01933j02304n45626L44582J54785l63480o29624
3277H547980L3705M3643M54395R24057N33162M80322p61915p01358m19517p37002
3267H397472O9911j123048k28633j36343k70598M03927j7145M30394j86627l93561
3257F945749j82162j063639j8062j36129J89450k20045Q2900M04090k95768l3867
3247E672517J20972k79658L64234N51588o76869P4292p5672O30012p13913l26391
3237E341112O71232k56152j18827k74429P614j12870p42918K46857r42499m45551
3227C373569J07002n87130K31610N99410K32107L63652q22501O35192O88163k70232
3217D550842r27410j42878K05377k36738O820j95501K6066n77127Q82377J64075
$$ plain form
3287 9760849 9358624 9096230 9187714 9689647 9587343 9041717 9386299 9541084 9177604 8547980
3277 8547980 8581685 8625328 9079723 10003780 10536942 11017264 10255349 9553991 9134474 8397472
3267 8397472 8467383 7344335 7115702 6979359 6708761 7112688 7095543 7525937 7339310 6945749
3257 6945749 6763587 5699948 5681886 5545757 5735207 5515162 5598062 6002152 5706384 5672517
3247 5672517 5793489 5513831 5878065 6429653 5752784 5827076 5751404 6381416 5667503 5341112
3237 5341112 6012344 5756192 5637365 5362936 5370550 5257680 4514762 4761619 3819120 3373569
3227 3373569 3480571 2893441 3125051 3724461 3956568 4320220 3497719 4132911 4821074 4550842
3217 4550842 3623432 3480554 3685931 3449193 3456013 3260512 3286578 2709451 3591828 3755903
3207C755903k17083j065834Q46579J32828O90564m47725n42874m06108N63443
3198C309693K89481j01895m02733r75798P58137O06567o84298l71496M77906m60141
3188B445423N31602n55238o79493L39117K0359m79902J044311K83452m5475j3837
3178B890319L81507o19572J11442p59240K7038L43221N1258J61201k54129L06059
3168B639104j4375j73320p4599L30411N03607o98356m45276K86820N89590j16028
3158B827578J3308K37186j5166r79698j132J30340k15110J61703J74648M85332
3148B818989n1821n53179o74774N19267J02376J62608n0129L74099r08132O7514
3138A806818L56274k3271j25816L67071k78338L68127L8037j07735J56724O632
$$ plain form
3207 3755903 3538820 2472986 3319565 3452393 4142957 3695232 3152358 2746250 3309693
3198 3309693 3599174 3497279 3094546 2118748 2876885 3483452 2799154 2427658 2905564 2445423
3188 2445423 2977025 2421787 1742294 2081411 2101770 1621868 2666179 2949631 2904156 2890319
3178 2890319 3271826 2652254 2763696 2004456 2031494 2374715 2425973 2587174 2333045 2639104
3168 2639104 2624729 2451409 2376810 2707221 3210828 2512472 2067196 2354016 2943606 2827578
3158 2827578 2840886 3078072 3062906 2083208 2082076 2212416 1997306 2159009 2333657 2818989
3148 2818989 2767168 2213989 1539215 2058482 2160858 2323466 2273337 2647436 1739304 1806818
3138 1806818 2163092 2139821 2014005 2381076 2102738 2470865 2508902 2401167 2557891 2564523
3128B564523M56222L31709j20232l32942k20258q0113k04827P17383m43642q09148
3118A858675N11386l95795M36632l61591P71106n01124p50647m6599l38036R37387
3108B121394J75409l0413m91600j47097M01163l09615M62300M31838j027324J63856
3098A749911p05604k27746M60515k19874M292j999K85801k83703l83139O87274
3088A365728N52N49472o9207Q36776N07672L6797l05873K67281n01838q23989
3078A863371R80891P57250r27376q01746K53304n72586J98773J88939K84899m70530
3068A755189r8917J24199Q06522l7806m39795N49867P98452k11954j46540m73893
3058B625324Q30731r6766m73421j072471J018533L98171j40559k08327J98733
$$ plain form
3128 2564523 3020745 3352454 3232222 2899280 2679022 2598909 2394082 3111465 2667823 1858675
3118 1858675 2370061 1974266 2410898 2049307 2820413 2319289 1568642 1522043 1184007 2121394
3108 2121394 2296803 2266390 1774790 1627693 2028856 1719241 2181541 2613379 1586055 1749911
3098 1749911 1044307 816561 1277076 1057202 1061494 1059495 1345296 1061593 678454 1365728
3088 1365728 1366280 1915752 1846545 2683321 3190993 3227790 2921917 3189198 2687360 1863371
3078 1863371 2844262 3601512 2674136 1872390 2125694 1553108 1751881 1940820 2225719 1755189
3068 1755189 1656272 1780471 2586993 2549187 2109392 2659259 3457711 3245757 3099217 2625324
3058 2625324 3456055 3359289 2885868 1813397 2831930 3230101 3089542 2881215 3079948
3049C079948j1303o0939N9629j88526K99807k55460k13M88288J40162l0599l0885
3038C489909K4654m88709K91623K09379k82496o593Q37970J8841m83558P7454
3028C688474j68362Q50841J77672M5556r57792K8076o83797R88077K6087L3333
3018D028165k72575l19702O82369J0491m81722P64823M17392q02668j79456J91353
3008D038470R21718R70234j232678k63079L25679J36187j22192J6307j06205n36442
2998D147999Q8334L49407K75838M0581p815j28665M44189M29096j83110R0396
2988E546250K10903o98039P3154P190j31313l73112k49219J42303J232317Q77134
2978F637568P36084N14544j252627r26811Q01626j33607m69815m37421N10358
$$ plain form
3049 3079948 3068645 3007706 3067335 2878809 3178616 2923156 2922943 3411231 3551393 3520794 3489909
3038 3489909 3514563 3025854 3317477 3526856 3244360 3237767 4075737 4094578 3611020 3688474
3028 3688474 3520112 4370953 4548625 4594181 3636389 3664465 2980668 3968745 3994832 4028165
3018 4028165 3755590 3435888 4118257 4128748 3647026 4411849 4829241 4026573 3847117 4038470
3008 4038470 4960188 5930422 4697744 4434665 4760344 4896531 4774339 4790646 4684441 4147999
2998 4147999 4236333 4585740 4861578 4902159 4894344 4765679 5209868 5638964 5455854 5546250
2988 5546250 5757153 5059114 5132268 5139458 5008145 4635033 4385814 4528117 5760434 6637568
2978 6637568 7373652 7888196 6635569 5708758 6510384 6376777 5906962 5469541 5979899
2969E979899L3986n96139L61559p81719K79548j6821K5864j64801k81405N92929
2959E432900k50281m20869j76339k6026M89203K49838p46034m45726P91930P38069
2949E636665l34399k55301p24194K66234L81351k57775J67482l16825n36976r0164
2939C936098N18315P3441j51441r04074l47420L83874m95916Q3349N82242m3396
2929C635072k18021o68471P77181Q1912r07712K38977j25557j326200J71403Q25438
2919B484022N25299m54697p15755Q82487K77349n44489O48114r37266j26095p02388
2909A336581o08059J014410k87873M45336L45095p27751K16389N19673M2892N303
2899B301996j16468M5600j532915K10189N34942N11673j412595l84129Q43867
$$ plain form
2969 5979899 6013885 5417746 5779305 4997586 5277134 5260313 5286177 5121376 4839971 5432900
2959 5432900 5182619 4761750 4585411 4559385 5048588 5298426 4552392 4106666 4898596 5636665
2949 5636665 5302266 5046965 4322771 4589005 4970356 4712581 4880063 4563238 4026262 3936098
2939 3936098 4454413 4527854 4376413 3472339 3124919 3508793 3012877 3096226 3678468 3635072
2929 3635072 3417051 2748580 3525761 3607673 2699961 2938938 2813381 1487181 1658584 2484022
2919 2484022 3009321 2554624 1838869 2721356 2998705 2454216 3102330 2165064 2038969 1336581
2909 1336581 728522 1742932 1455059 1900395 2245490 1517739 1734128 2253801 2296693 2301996
2899 2301996 2185528 2231128 698213 908402 1443344 1955017 542422 158293 1002160
2890A002160L60986l26713q02194Q74344n4240l6856M64311n76034O89210O62210
2880B257184K06594p40235r05112J20558J05305J198940j52114q59298k98700
2871I33122r38900P92292Q848L93576N58515m54740n14920M35109n2549p98483
2861C61870J0710L60012l14605L98618M20459J14128q90p06829m49189K78541
2851D72825J89499K50972m41846R12191K85816m76769N488J61743Q9828q36673
2841F13074L37509p76257j50824l26167o2507O17407p1106l52784m12952K60276
2831c24331o80258K53667R44572m29621J82934J69535K23252o05534O98353n0913
2821C81656J49008n46669J72174J59555j75578O32593L05402o96166j61301J58564
$$ plain form
2890 1002160 1363146 1036433 234239 1108583 1054343 1017487 1481798 905764 1594974 2257184
2880 2257184 2463778 1723543 818431 938989 1044294 2243234 2091120 1231822 933122
2871 933122 -5778 786514 795362 1188938 1747453 1292713 777793 1212902 1160353 361870
2861 361870 372580 732592 417987 816605 1237064 1351192 1350302 643473 194284 472825
2851 472825 662324 913296 471450 1383641 1669457 1192688 1198176 1359919 1449747 613074
2841 613074 950583 174326 23502 -302665 -365172 252235 181129 -171655 -584607 -324331
2831 -324331 -1004589 -750922 193650 -235971 -53037 116498 339750 -265784 432569 381656
2821 381656 530664 -16005 156169 315724 140146 772739 1078141 381975 220674 379238
2811C79238J055238l47196r20942J82766L25726O5010o49727L05313l78194m34908
2801d17676O90409M44364L09792q33876j58863Q33369n47518J45851L57900p33651
2791I0101q02300L47835k06910Q714j97335P90388N21503k03452o07856o7276
2781c26588N18602M62273K25598j02129k66163q64091l7692j10145J06045J39912
2771b54378O0355O7833j916j195J07284j177873o1538J092032P9156l9744k24208
2760c54192O30848J20709n06857J82694n73681k50430L61625J30283N53292J022591
2750A316882o23467m17203K66138j13424L66275m42460n74845j78793L75128q08986
2740h34755L3974Q66738J17591r78427n58137J280278K85586k05719N9921Q2625
$$ plain form
2811 379238 1434476 1087280 166338 349104 674830 739840 90113 395426 17232 -417676
2801 -417676 272733 717097 1026889 193013 34150 867519 320001 465852 823752 90101
2791 90101 -712199 -364364 -571274 -562560 -759895 30493 551996 348544 -259312 -326588
2781 -326588 192014 654287 879885 777756 511593 -352498 -390190 -500335 -394290 -254378
2771 -254378 -194023 -126190 -128106 -129301 -22017 -1199890 -1261428 -169396 -90240 -129984 -354192
2760 -354192 276656 397365 -109492 73202 -500479 -750909 -389284 -259001 294291 1316882
2750 1316882 693415 276212 542350 428926 795201 352741 -222104 -400897 -25769 -834755
2740 -834755 -800781 65957 183548 -794879 -1353016 -72738 212848 7129 67050 149675
2730A49675j22607j26426M10741n45094m48681k42633j54488M29068k73371N74173
2720c49643J292769q7180j54831p83805o90600J174910m0977J84305l62472p24683
2710e42207j47833n53642j37836M27593P86698o9690N41684M32045k30682p85043
2700b78913o18321K34626l8115m7503J22805j23843N43888R03749m96160l66957
2690a64744J62323l00169L77866l1300R81247R682r37289K58055j67711k64635
2680g6675J27438n46439O86002L81391N2864j87081o0741k89803L67812j74143
2670B80625m19348O89462k61005o12933J55273o4060j07881O5361O54181K73136
2660F52811p20963k06753K86753M01630K15759l93274O03330m09512M29176K92479
$$ plain form
2730 149675 27068 -99358 311383 -233711 -682392 -925025 -1079513 -650445 -923816 -349643
2720 -349643 943126 855946 701115 -82690 -773290 401620 360643 544948 182476 -542207
2710 -542207 -690040 -1243682 -1381518 -953925 -167227 -236917 304767 736812 506130 -278913
2700 -278913 -897234 -662608 -700723 -748226 -625421 -749264 -205376 698373 202213 -164744
2690 -164744 -2421 -302590 75276 43976 1025223 1034905 97616 355671 187960 -76675
2680 -76675 50763 -495676 190326 571717 624581 437500 376759 86956 454768 280625
2670 280625 -138723 550739 289734 -323199 -167926 -231986 -339867 -274506 379675 652811
2660 652811 -68152 -274905 11848 413478 629237 235963 839293 429781 858957 1151436
2650A151436p90826k5611j039104K16047L82658M37536k98694J63145m69701J57155
2640a15959K45997k90403K3791J088751k44637q61727k46905P7172m91199J54277
2630f60842M40465j70360J53025L82266L20315j32374o93612L84875j73035K65176
2620A15899O09579j461902K04129O94996m81640r8853P69180k81406j1979K05602
2610B63605n20315K98654M41534N6769l40543r09621M67402M41269l6891j430027
2600a268164K93397M22157l50746M49959p7811j33911l47368M60200M61987m42690
2590e32990j18556K12850k41443N19130j27470J40322J45690n843K50967L91872
2580F34529k67783N9952k99906o55148k73144O11947l07667R1282Q77076j27631
$$ plain form
2650 1151436 360610 334999 -704105 -488058 -105400 332136 33442 196587 -273114 -115959
2640 -115959 130038 -160365 -136574 952177 707540 -154187 -401092 -323920 -815119 -660842
2630 -660842 -220377 -390737 -237712 144554 464869 332495 -361117 23758 -149277 115899
2620 115899 725478 -736424 -532295 162701 -318939 -417792 351388 69982 58003 263605
2610 263605 -256710 41944 483478 540247 199704 -709917 -242515 198754 161863 -1268164
2600 -1268164 -974767 -552610 -903356 -453397 -531208 -665119 -1012487 -552287 -90300 -532990
2590 -532990 -651546 -438696 -680139 -161009 -288479 -148157 -2467 -8310 242657 634529
2580 634529 366746 426698 126792 -528356 -801500 -189553 -497220 -405938 471138 343507
2570C43507P5818K57690j48188p75348m64737j09778k71596O86669n69997k33089
2560a209049m1068J25797J27312M65363J293207m23504k75376J73251P2634J92003
2550E00570r3033R39786n93690m93619K65892k34124q9916L78532l4687n20332
2540B5379O7125m38056J2962P45891m64917o12558M6477j77824L78729J77343
2530b39449O43305n63008Q5210K53314n82281r1891J492147J58249k024682J51673
2520g17413J52060k72126J440808m24469M44638j79110J25403n92580P72803K54961
2510A004975k06369l07591K16979J56897n92986p34461m21447N97257k9091j82636
2500d98473n93512L21046L88293L53205k2677m15425M06N23691k15564k61127
$$ plain form
2570 343507 419325 677015 528827 -246521 -711258 -821036 -1092632 -405963 -975960 -1209049
2560 -1209049 -1250117 -1124320 -997008 -531645 761562 338058 62682 235933 308567 500570
2550 500570 407537 1347323 753633 260014 525906 291782 201866 580398 545711 25379
2540 25379 92504 -345552 -332590 413301 -51616 -664174 -617697 -795521 -416792 -239449
2530 -239449 403856 -159152 -73942 179372 -402909 -494800 997347 1155596 -869086 -717413
2520 -717413 -565353 -837479 603329 178860 623498 444388 569791 -22789 750014 1004975
2510 1004975 798606 491015 707994 864891 271905 -462556 -884003 -286746 -315837 -498473
2500 -498473 -1091985 -770939 -382646 -29441 -52118 -467543 -467137 56554 -159010 -420137
2490d20137k14359K40120N98834k35055p93236L96188R0158L92972K46002J76582
2480D78069n81783n93407Q91141O31833k14659K85218o01221r20237P31508k74080
2470a67618l24044Q6295J12941Q7206j52104M9278J80459m24279M53463K31797
2460A33394r67015j205070R34559N63538Q89356K33949q17910O23919P11452k46576
2450H53596n62826K76049k12168L62511k18422J12105M11024K53402p70653J79996
2440F84614K46576m90219l17944j26760R01916k62762J22765J80925p94694n20296
2430c75879k63605K65852O2624K70298O65533K15083k83990L91876o89250L98112
2420F56654l1264n31422J49825k33753L06134J99408M8576k09474M65864o04308
$$ plain form
2490 -420137 -634496 -394376 204458 -30597 -823833 -427645 -337487 55485 301487 478069
2480 478069 -103714 -697121 194020 825853 611194 896412 295191 -625046 106462 -167618
2470 -167618 -491662 -405367 -292426 -205220 -357324 -308046 -127587 -551866 -98403 133394
2460 133394 -833621 -2038691 -1104132 -540594 348762 582711 -235199 388720 1100172 853596
2450 853596 290770 566819 354651 717162 498740 610845 1021869 1275271 504618 684614
2440 684614 931190 440971 123027 -3733 898183 635421 758186 939111 144417 -375879
2430 -375879 -639484 -373632 -311008 -40710 624823 839906 555916 947792 258542 656654
2420 656654 625390 93968 243793 10040 316174 515582 564158 354684 820548 216240
2410B16240K30908j45039j10942L80555o51908o1438n50974k95357M33706N21130
2400c3119l71593L26759j55616L10137q58179P94670J286314r32836l56255k13888
2390b03606K57364N17757j38078j015814J68352J026674j38260K00600o6017o9893
2380E39079J03293k11384O847L61770n65255n29308O0975Q25588J34855q2556
2370F43904k29445j94611J28325L35297o88815n00927N75967J67160m38659o13224
2360h15028N7453N52462M13342j028383N42176Q94177j53170j6192P1651m62272
2350E6216K50485L74616L77344k95628n03724J50357K37380N46464o07949o6388
2340E19173K43602p25522N20176l63265O2454K36604n12378j200394Q84054M51300
$$ plain form
2410 216240 447148 302109 191167 571722 -80186 -141624 -692598 -987955 -554249 -33119
2400 -33119 -404712 -77953 -233569 76568 -781611 13059 1299373 366537 10282 -203606
2390 -203606 53758 571515 433437 -582377 -414025 612649 474389 674989 608972 539079
2380 539079 642372 430988 437835 799605 234350 -294958 -233983 591605 726460 643904
2370 643904 414459 219848 348173 683470 -5345 -506272 69695 236855 -201804 -815028
2360 -815028 -757575 -205113 208229 -820154 -277978 616199 463029 446837 518488 56216
2350 56216 306701 681317 1058661 763033 259309 409666 647046 1193510 585561 519173
2340 519173 762775 37253 557429 194164 256618 493222 -19156 -1219550 -335496 115804
2330A15804N29418p79702m26655M25556k42873J69118L56441L12756k34557R2948
2320C18254M80993N1234o16876N51335J28298m48690P60238l76604n6257M8546
2310H40471J62788m79671R5583p4041n16781o34741L64717R26855n23501q62884
2300g01205K20885k02173O16559R06507Q2047R75599j055766l1282K65946P59337
2290A836454n89283j87702N9531l29999j48193R1901K69004N20583j083477L75672
2280H14491K96786k95283M00904k11784L52221L76196k04341j90158N91787o383
2270A924436o96256l79904M13438m56601n61095q4899n8217N68520K67170k86801
2260F49791L04126O49395j58502n10471J132658j06244o49069M65421j20114K20705
$$ plain form
2330 115804 645222 -134480 -561135 -135579 -378452 -209334 147107 459863 225306 318254
2320 318254 799247 850481 233605 784940 913238 464548 1224786 848182 791925 840471
2310 840471 1003259 523588 619171 545130 28349 -606392 -241675 685180 161679 -701205
2300 -701205 -480320 -682493 -65934 840573 922620 1898219 842453 811171 1077117 1836454
2290 1836454 1247171 1059469 1119000 789001 640808 732709 1001713 1522296 438819 814491
2280 814491 1111277 815994 1216898 1005114 1357335 1733531 1529190 1339032 1930819 1924436
2270 1924436 1228180 848276 1261714 805113 244018 159119 100902 669422 936592 649791
2260 649791 953917 1603312 1444810 934339 2066997 1960753 1311684 1777105 1656991 1877696
2250A877696j27740Q8788K99282k21097n34015J07662O86028N4665K71411M14550
2240B917230N75600k75998m91302k50567J18161k14515n30842K29347m80359O78979
2230B275734R40208N6882L1621j95813L23426J48434L94546O29839J94976q04794
2220C995059K78603L56966m60022Q74112n40155J24933N34178M42685r27121j78073
2210D501165J002882M681q2213J08065O2129q0273N94047j84285M11979J007791
2200G345968K02952N78608O37895N90217O24171J295509N00506Q90764J752986
2191A4419576J537789J149117K559479J860296J654377L453738L434472N117118
2183C5185962M140454N842613P079876Q155149J0583764J2159669J2630221J1954617
$$ plain form
2250 1877696 1749956 1838744 2138026 1916929 1382914 1490576 2176604 2231269 2502680 2917230
2240 2917230 3492830 3216832 2725530 2474963 2593124 2378609 1847767 2077114 1596755 2275734
2230 2275734 3215942 3272824 3304445 3108632 3432058 3580492 3975038 4604877 4799853 3995059
2220 3995059 4273662 4630628 4170606 5044718 4504563 4629496 5163674 5606359 4679238 4501165
2210 4501165 5504047 5508728 5426515 5534580 5596709 5516436 6110483 5926198 6338177 7345968
2200 7345968 7548920 8127528 8765423 9355640 9979811 11275320 11775826 12666590 14419576
2191 14419576 15957365 17106482 19665961 21526257 23180634 26634372 30068844 35185962
2183 35185962 39326416 45169029 52248905 60404054 70987818 83147487 95777708 107732325
2175A07732325j1319846k3036975j3986963j0400306o646039n933395m888047
2168C1520754l626547k970594k873279k036649k158541j641437j332429q20801
2160A4060477j437344j155445j818609j665709o62392j197689l84515P5172Q6364
2151E900310j126291r84503q8414j61796N52044L04404l99591J59091K85906K63353
2141D704513J85440n32816j083738P5728J367935j27429m07494o53196O49391
2132D178334j057830p26020K60530l38488n53691J05615J055738J1268p96077
2123B139379l35848j9575l20312n20977P05085k69134n43191P3116N7424j76065
2113G89902L55785J72628L89700j057555j77522R19484n47605L22745Q75419J051757
$$ plain form
2175 107732325 96412479 73375504 59388541 48988235 42342196 36408801 31520754
2168 31520754 27894207 24923613 22050334 20013685 17855144 16213707 14881278 14060477
2160 14060477 12623133 11467688 9649079 7983370 7320978 6123289 5738774 5813946 5900310
2151 5900310 4774019 3789516 3701102 3539306 4091350 4395754 3996163 4155254 4441160 4704513
2141 4704513 4889953 4357137 3273399 3349127 4717062 4589633 4182139 3528943 4178334
2132 4178334 3120504 2394484 2655014 2316526 1762835 1868450 2924188 2935456 2139379
2123 2139379 1803531 1783956 1463644 942667 1647752 1378618 835427 908543 965967 789902
2113 789902 1145687 1318315 1708015 650460 472938 1392422 844817 1167562 2042981 3094738
2103C094738p47606l88878r45969l6207L91547q7280J81830j21438k24627K79484
2093A395594K13610m07097L41649j73729J25623l14055L02036M20006q88918o75939
2083C38780m02789M61313j10965N20951m31741L78485o01403J40827K24658k27749
2073B90367O6804j05160N89973P13584q94608k96781L93822n80872J20596P420
2063C05145j16313M64641K73787k81215l39343m72676k05022L94185k92077O24649
2053C55761K66042K31478m7150l43181k60514K27475j27656Q57761j62105k81703
2043G16208M60680J43607m75870r5140k39595k25018N15269J48286j09927q95005
2033e6505N03002n75221m2590L46909M50687k34680M8208Q63064k08508m36244
$$ plain form
2103 3094738 2347132 1958254 1012285 976078 1367625 1280345 1462175 1340737 1116110 1395594
2093 1395594 1609204 1202107 1543756 1370027 1495650 1181595 1483631 1903637 1014719 338780
2083 338780 -64009 397304 286339 807290 375549 754034 152631 293458 518116 290367
2073 290367 357171 252011 841984 1555568 660960 364179 758001 177129 297725 305145
2063 305145 188832 653473 927260 646045 306702 -165974 -370996 23189 -268888 355761
2053 355761 621803 853281 806131 462950 202436 429911 302255 1160016 997911 716208
2043 716208 1176888 1320495 844625 749485 509890 284872 800141 948427 838500 -56505
2033 -56505 446497 -128724 -171314 175595 626282 391602 439810 1302874 1094366 658122
2023F58122r82428m84034O70459q7876P08720j34759L48065n85680k41146N70680
2013D40123N24212r65997k57812L78258l30288L18260M94411p45133o79303L18430
2003e04839Q44449n33294K06886O89048k48849M8076Q13927O7232j123740j35951
1993A22945p0982l09915j52047J353792k00733m60198l96005j87475O98135r6292
1983C01225o8978J42366k98306l46940K58011n88305Q27368k12692n1924O55460
$$ plain form
2023 658122 -324306 -808340 -137881 -225757 482963 348204 696269 110589 -130557 440123
2013 440123 964335 -1662 -259474 118784 -211504 106756 601167 -143966 -823269 -504839
2003 -504839 339610 -193684 13202 702250 453401 501477 1315404 1382636 258896 122945
1993 122945 51963 -257952 -409999 943793 743060 282862 -113143 -300618 397517 301225
1983 301225 232247 374613 76307 -270633 -12622 -600927 226441 13749 -38175 617285
$$ [...]
##END NTUPLES=NMR SPECTRUM
##END=
