##TITLE=1H_CG-1200-1
 CDCl3
 8 sc, 
 4.4.2024
##JCAMPDX= 6.0         $$ Bruker NMR JCAMP-DX V2.0
##DATA TYPE= NMR SPECTRUM
##DATA CLASS= NTUPLES
##ORIGIN= UXNMR, Bruker Analytische Messtechnik GmbH
##OWNER= root
$$ XWIN-NMR		Version 3.5
$$ Thu Apr  4 14:23:45 2024 Russian Standard Time (UT+4h)  she@DPX200
##.OBSERVE FREQUENCY= 200.1309
##.OBSERVE NUCLEUS= ^1H
##.ACQUISITION MODE= SIMULTANEOUS
##.ACQUISITION SCHEME= undefined
##.AVERAGES= 8
##.DIGITISER RES= 18
##SPECTROMETER/DATA SYSTEM= spect
##.PULSE SEQUENCE= zg30
##.SOLVENT NAME= MeOD
##.SHIFT REFERENCE= (INTERNAL, MeOD, 0, 15.6907)
##AUDIT TRAIL= $$ (NUMBER, WHEN, WHO, WHERE, WHAT)
$$ ##TITLE= Audit trail, XWIN-NMR		Version 3.5
$$ ##JCAMPDX= 5.01
$$ ##ORIGIN= Bruker BioSpin GmbH
$$ ##OWNER= she
$$ F:/spectra/data/she/nmr/H-F/1/pdata/1/auditp.txt
$$ ##AUDIT TRAIL=  $$ (NUMBER, WHEN, WHO, WHERE, WHAT)
(   1,<2024-04-04 14:21:53.84 +0400>,<she>,<DPX200>,
      <created by zg, POWCHK disabled, PULCHK disabled
       configuration hash MD5:
       00 E9 B6 7A A2 85 ED C7 34 08 36 98 17 FE 4E 26
       data hash MD5: 16K
       AF D2 8A A5 78 B6 DE CC 53 2D B0 54 68 6A 3D 57>)
(   2,<2024-04-04 14:22:41.25 +0400>,<she>,<DPX200>,
      <Start of raw data processing
       efp BC_mod = 2 LB = 0.24 FT_mod = 6 PKNL = 1 PHC0 = -25301.51 PHC1 = 13.58731 SI = 16K 
       data hash MD5: 16K
       EE FF 65 0B D8 DF D7 D9 76 35 1F A5 09 3F 32 65>)
(   3,<2024-04-04 14:22:58.18 +0400>,<she>,<DPX200>,
      <pk PHC0 = 2.097631 PHC1 = -2.4 
       data hash MD5: 16K
       41 B5 76 FD 6B EA FD 47 F3 6B DA C6 AA E6 1B DA>)
(   4,<2024-04-04 14:23:01.62 +0400>,<she>,<DPX200>,
      <abs ABSG = 5 
       data hash MD5: 16K
       58 74 C0 4F EA 5C 04 2E D9 3A AF 14 55 43 7D AC>)
$$ ##END=
$$ 
$$ hash MD5
$$ AD 25 84 60 FC 5C C1 4B C4 A9 52 56 BE F5 FE 7E
##$RELAX= 
##$RELAX= 
##$RELAX= 
##$RELAX= 
##$RELAX= 
##$RELAX= 
$$ Bruker specific parameters
$$ --------------------------
##$DU= <F:/spectra>
##$EXPNO= 1
##$NAME= <H-F>
##$PROCNO= 1
##$TYPE= <nmr>
##$USER= <she>
##$AMP= (0..31)
100 100 100 100 100 100 100 100 100 100 100 100 100 100 100 100 100 100 
100 100 100 100 100 100 100 100 100 100 100 100 100 100 
##$AQSEQ= 0
##$AQ_mod= 1
##$AUNM= <au_zg>
##$AUTOPOS= <>
##$BF1= 200.13
##$BF2= 200.13
##$BF3= 200.13
##$BF4= 200.13
##$BF5= 200.13
##$BF6= 200.13
##$BF7= 200.13
##$BF8= 200.13
##$BYTORDA= 1
##$CFDGTYP= 0
##$CFRGTYP= 5
##$CHEMSTR= <none>
##$CNST= (0..31)
1 1 145 1 1 1 1 1 1 1 1 1 1 1 1 1 1 1 1 1 1 1 1 1 1 1 1 1 1 1 1 1 
##$CPDPRG= <>
##$CPDPRG1= <>
##$CPDPRG2= <>
##$CPDPRG3= <>
##$CPDPRG4= <mlev>
##$CPDPRG5= <mlev>
##$CPDPRG6= <mlev>
##$CPDPRG7= <mlev>
##$CPDPRG8= <mlev>
##$CPDPRGB= <>
##$CPDPRGT= <>
##$D= (0..31)
0 1.2 0 0 0 0 0 0 0 0.06 0 0.03 0 0 0 0 0.0002 0 0 0 0 0 0 0 0 0 0 0 0 
0 0 0 
##$DATE= 1712226113
##$DBL= (0..7)
120 120 120 120 120 120 120 120 
##$DBP= (0..7)
150 150 150 150 150 150 150 150 
##$DBP07= 0
##$DBPNAM0= <>
##$DBPNAM1= <>
##$DBPNAM2= <>
##$DBPNAM3= <>
##$DBPNAM4= <>
##$DBPNAM5= <>
$$ [...]
##$SUBNAM3= <"">
##$SUBNAM4= <"">
##$SUBNAM5= <"">
##$SUBNAM6= <"">
##$SUBNAM7= <"">
##$SUBNAM8= <"">
##$SUBNAM9= <"">
##$SW= 18.0517689322627
##$SWIBOX= (0..15)
0 0 2 0 0 0 0 0 0 0 0 0 0 0 0 0 
##$SW_h= 3612.71676300578
##$TD= 16384
##$TD0= 1
##$TE= 0
##$TE2= 300
##$TE3= 300
##$TEG= 300
##$TL= (0..7)
0 120 120 120 120 120 120 120 
##$TP= (0..7)
150 150 150 150 150 150 150 150 
##$TP07= 0
##$TPNAME0= <>
##$TPNAME1= <>
##$TPNAME2= <>
##$TPNAME3= <>
##$TPNAME4= <>
##$TPNAME5= <>
##$TPNAME6= <>
##$TPNAME7= <>
##$TPOAL= (0..7)
0.5 0.5 0.5 0.5 0.5 0.5 0.5 0.5 
##$TPOFFS= (0..7)
0 0 0 0 0 0 0 0 
##$TUNHIN= 0
##$TUNHOUT= 0
##$TUNXOUT= 0
##$USERA1= <user>
##$USERA2= <user>
##$USERA3= <user>
##$USERA4= <user>
##$USERA5= <user>
##$V9= 5
##$VALIST= <valist>
##$VCLIST= <CCCCCCCCCCCCCCC>
##$VD= 0
##$VDLIST= <DDDDDDDDDDDDDDD>
##$VPLIST= <PPPPPPPPPPPPPPP>
##$VTLIST= <TTTTTTTTTTTTTTT>
##$WBST= 1024
##$WBSW= 4
##$XGAIN= (0..3)
0 0 0 0 
##$XL= 0
##$YL= 0
##$YMAX_a= 476597
##$YMIN_a= -718845
##$ZGOPTNS= <>
##$ZL1= 120
##$ZL2= 120
##$ZL3= 120
##$ZL4= 120
##$ABSF1= 15.7337
##$ABSF2= -2.31819
##$ABSG= 5
##$ABSL= 3
##$ALPHA= 0
##$AQORDER= 0
##$ASSFAC= 0
##$ASSFACI= 0
##$ASSFACX= 0
##$ASSWID= 0
##$AUNMP= <proc_1d>
##$AZFE= 0.1
##$AZFW= 0.1
##$BCFW= 0
##$BC_mod= 2
##$BYTORDP= 0
##$COROFFS= 0
##$CY= -3
##$DATMOD= 1
##$DC= 0
##$DFILT= <>
##$DTYPP= 0
##$F1P= 0
##$F2P= 0
##$FCOR= 1
##$FTSIZE= 16384
##$FT_mod= 6
##$GAMMA= 0
##$GB= 0
##$INTBC= 1
##$INTSCL= 3.70164e-10
##$ISEN= 128
##$LB= 0.24
##$LEV0= 0
##$LPBIN= 0
##$MAXI= 10000
##$MC2= 0
##$MEAN= 0
##$ME_mod= 0
##$MI= 1.114404
##$NCOEF= 0
##$NC_proc= -5
##$NLEV= 6
##$NOISF1= 3.799351
##$NOISF2= 2.8
##$NSP= 0
##$NTH_PI= 0
##$NZP= 0
##$OFFSET= 15.69073
##$PC= 1
##$PHC0= -25299.41
##$PHC1= 11.18731
##$PH_mod= 1
##$PKNL= yes
##$PPARMOD= 0
##$PSCAL= 0
##$PSIGN= 0
##$REVERSE= no
##$SF= 200.129566179136
##$SI= 16384
##$SIGF1= 3
##$SIGF2= 2
##$SINO= 5.538805
##$SIOLD= 16384
##$SREGLST= <1H.CDCl3>
##$SSB= 0
##$STSI= 16384
##$STSR= 0
##$SW_p= 3612.71676300577
##$SYMM= 0
##$S_DEV= 0
##$TDeff= 16384
##$TDoff= 0
##$TI= <>
##$TILT= no
##$TM1= 0
##$TM2= 0
##$TOPLEV= 0
##$USERP1= <user>
##$USERP2= <user>
##$USERP3= <user>
##$USERP4= <user>
##$USERP5= <user>
##$WDW= 1
##$XDIM= 16384
##$YMAX_p= 319109021
##$YMIN_p= -201789
$$ End of Bruker specific parameters
$$ ---------------------------------
##NTUPLES= NMR SPECTRUM
##VAR_NAME=  FREQUENCY,     SPECTRUM/REAL,   SPECTRUM/IMAG
##SYMBOL=    X,             R,               I
##VAR_TYPE=  INDEPENDENT,   DEPENDENT,       DEPENDENT
##VAR_FORM=  AFFN,          ASDF,            ASDF
##VAR_DIM=   16384,         16384,           16384
##UNITS=     HZ,            ARBITRARY UNITS, ARBITRARY UNITS
##FACTOR=    0.220516191357247, 1,           1
##FIRST=     3140.17900692819, 0,            0
##LAST=      -472.537756077585, 0,           0
##MIN=       -472.537756077585, -201789,     0
##MAX=       3140.17900692819, 319109021,    0
$$ Real data points
##PAGE= N=1
##DATA TABLE= (X++(R..R)), XYDATA
$$ [...]
$$ plain form
7751 -100094 -78287 -28709 -12207 -46427 -19970 14180 -123 -41493 -40242 -28391 -58406 -96932
7739 -96932 -53142 -53131 -33741 -48334 -72243 -109851 -68191 -25875 -9283 -49351 -82805 -97210
7727 -97210 -85535 -14331 -51476 -46206 -66121 -73730 -51166 8551 -45542 14914 44485 -10308
7715 -10308 -68493 -93079 -85370 -48410 -31937 14733 -3660 -31745 -38424 -68679 -79049 -51382
7703 -51382 15801 -31742 29480 -4682 -37383 -33349 -16669 -60227 -89818 -14427 4126 -25357
7691 -25357 -271 -35637 -54327 -3495 51452 105764 112696 69559 56704 92450 154849 148190
7679 148190 162545 192704 118990 139875 119707 150239 217038 256304 256844 257494 250842 259673 262186
7666 262186 260878 267774 263166 334576 293912 293602 282082 249850 234047 263185 334647 301805 223394
$$ packed form
7751a00094K1807M9578J6502l4220K6457L4150j4303m1370J251J1851l0015l8526
7739i6932M3790J1J9390j4593k3909l7608M1660M2316J6592m0068l3454j4405
7727i7210J1675P1204l7145N270j9915p609K2564N9717n4093O0456K9571n4793
7715a0308n8185k4586P709L6960J6473M6670j8393k8085o679l0255j0370K7667
7703e1382O7183m7543O1222l4162l2701M034J6680m3558k9591P5391J8553k9483
7691b5357K5086l5366j8690N0832N4947N4312O932m3137j2855L5746O2399o659
7679A48190J4355L0159p3714K0885k0168L0532O6799L9266N40O50o652Q831K513
7666B62186j308O896m608P1410m0664l10j1520l2232j5803K9138P1462l2842p8411
$$ plain form
7653 223394 199429 174564 113875 138482 199626 180425 171815 171000 119131 74287 75319 96874
7641 96874 128760 147031 175504 111989 121207 129230 89643 131126 171517 199914 128547 181523
7629 181523 206812 171865 224625 265858 295749 267576 279788 243895 242330 270951 261418 276295
7617 276295 275058 291247 298493 272118 255014 253828 229806 229008 233247 239397 190889 146652 67274
7604 67274 38483 5533 63731 75135 69821 57036 937 -56106 -16808 9585 -16326 -31603
7592 -31603 -17307 -35783 -44992 -28915 -26205 -22199 18269 6394 3244 -52581 -98637 -40535 -49839
7579 -49839 -11452 40239 23305 -2996 15853 -84684 -64655 -6765 -3805 35175 30311 10865
7567 10865 -9295 -6873 -1857 -11718 26586 68910 44882 47983 -957 1520 31621 65330 149797
$$ packed form
7653B23394k3965k4865o0689K4607O1144j9201q610q15n1869m4844J032K1555
7641I6874L1886J8271K8473o3515R218Q023l9587M1483M0391K8397p1367N2976
7629A81523K5289l4947N2760M1233K9891k8173J2212l5893j565K8621r533J4877
7617B76295j237J6189P246k6375j7104j186k4022p98M239O150m8508m4237p9378
7604F7274k8791l2950N8198J1404n314j2785n6099n7043L9298K6393k5911j5277
7592c1603J4296j8476r209J6077K710M006M0468j1875l150n5825m6056N8102r304
7579d9839L8387N1691j6934k6301J8849j00537K0029N7890K960L8980m864j9446
7567A0865k0160K422N016r861L8304M2324k4028L101m8940K477L0101L3709Q4467
$$ plain form
7554 149797 133237 77539 26629 -21382 -2945 12433 36841 88230 82592 4793 49897 65620
7542 65620 90362 142711 129427 121525 104722 66799 535 451 17146 59164 75510 78151 83529
7529 83529 1469 -76233 -3899 24379 64423 63112 60198 29169 -29225 -34835 12755 12940 54448
7516 54448 64146 99754 58156 17235 -18258 19376 33598 55638 74147 82923 72917 23126
7504 23126 109878 128826 135348 125292 95694 85396 42943 37115 18702 58584 85035 102667
7492 102667 89966 76899 55610 45406 71342 98763 105945 105229 60196 -17909 -4677 -32340
7480 -32340 -37057 -5003 27394 1453 11251 -32922 -31669 -34680 -7146 29868 68793 44976 -23110
7467 -23110 -1489 -8850 8053 37094 61136 32420 49054 54859 16110 15289 13628 75825 98255
$$ packed form
7554A49797j6560n5698n0910m8011J8437J5378K4408N1389n638p7799M5104J5723
7542F5620K4742N2349j3284p902j6803l7923o6264q4J6695M2018J6346K641N378
7529H3529q2060p7702P2334K8278M0044j311k914l1029n8394n610M7590J85M1508
7516E4448R698L5608m1598m0921l5493L7634J4222K2040J8509Q776j0006m9791
7504B3126Q6752J8948O522j0056k9598j0298m2453n828j8413L9882K6451J7632
7492A02667j2701j3067k1289j0204K5936K7421P182p16m5033p8105J3232k7663
7480c2340m717L2054L2397k5941R798m4173J253l011K7534L7014L8925k3817o8086
7467b3110K1621p361J6903K9041K4042k8716J6634N805l8749q21j661O2197K2430
$$ plain form
7454 98255 9775 1647 -4559 -60218 -38878 -29687 -11821 10584 -36362 -54151 -14072 -37530
7442 -37530 -16322 -2365 -20903 33541 16238 2554 -17562 -26738 -27387 21354 62087 46389
7430 46389 72579 26409 -12092 -27018 -25187 -12384 16200 49431 45824 -22339 -95896 -94923 -38599
7417 -38599 -93587 -52139 -6972 5769 -61253 -93068 -70611 745 -3372 4718 36832 11995
7405 11995 -53041 -63411 -80316 -41671 -15219 -28095 -37797 -71919 -84806 -97160 -101727 -80047
7393 -80047 -49622 -60875 -72295 -89980 -113285 -125666 -91183 -78761 -77299 -102032 -68088 -62902
7381 -62902 -109695 -101450 -71763 -98259 -44012 -43949 -78458 -78890 -77288 -45877 -19820 8932 -20138
7368 -20138 -51315 -27567 -48790 -86140 -5999 -25679 -49464 -71088 -131555 -131391 -159298 -102737
$$ packed form
7454I8255q8480q128o206n5659K1340R191J7866K2405m6946j7789M0079k3458
7442c7530K1208J3957j8538N4444j7303j3684k0116r176o49M8741M0733j5698
7430D6389K6190m6170l8501j4926J831J2803K8584L3231l607o8163p3557R73N6324
7417c8599n4988M1448M5167J2741o7022l1815K2457P1356m117Q090L2114k4837
7405A1995o5036j0370j6905L8645K6452j2876r702l4122j2887j2354m567K1680
7393h0047L0425j1253j1420j7685k3305j2381L4483J2422J462k4733L3944N186
7381f2902m6793Q245K9687k6496N4247O3l4509m32J602L1411K6057K8752k9070
7368b0138l1177K3748k1223l7350Q0141j9680k3785k1624o0467J64k7907N6561
$$ plain form
7356 -102737 -95621 -11107 -10490 -58258 -82998 -103694 -133156 -110470 -91127 -18031 -8748 -50600
7344 -50600 -46356 -61406 -49547 -43093 -21676 477 -59046 -83878 -92743 -103707 -132430 -111897
7332 -111897 -102970 -127008 -143822 -128447 -138434 -94538 -45561 -1819 20478 27194 -18646 -55427
7320 -55427 -45266 -42178 20261 3346 -20300 -38048 -27401 -52318 -95259 -81332 -50296 -47640
7308 -47640 -29613 542 -29888 -58372 -51807 -86725 -81974 -14983 26981 -21427 -17047 -110959
7296 -110959 -105128 -30702 -26752 -12028 45560 13140 -5352 -49759 -92329 -115509 -20551 17700
7284 17700 30220 -4537 -52928 -56445 -92944 -53268 38372 88459 37969 245 -58035 -34379
7272 -34379 -18729 35100 101090 137074 109805 39507 -7403 21343 26501 79986 136713 160633
$$ packed form
7356a02737P116Q4514O17m7768k4740k0696k9462K2686J9343P3096R283m1852
7344e0600M244j5050J1859O454K1417K2153n9523k4832q865j0964k8723K0533
7332a11897Q927k4038j6814J5375r987M3896M8977M3742K2297O716m5840l6781
7320e5427J0161L088O2439j6915k3646j7748J0647k4917m2941J3927L1036K656
7308d7640J8027L0155l0430k8484O565l4918M751O6991M1964m8408M380r3912
7296a10959N831P4426L950J4724N7588l2420j8492m4407m2570k3180R4958L8251
7284A7700J2520l4757m8391l517l6499L9676R1640N0087n0490l7724n8280K3656
7272c4379J5650N3829O5990L5984k7269p0298m6910K8746N158N3485N6727K3920
$$ plain form
7260 160633 98007 81151 101068 93457 118542 174336 163406 177383 151979 103431 139555 172305
7248 172305 165109 195476 183958 117054 94960 105745 155593 190130 209329 240746 217708 174864
7236 174864 180753 146520 181527 242286 216478 201381 201111 167908 179043 177003 255310 292261
7224 292261 269945 234539 202180 184192 203246 228411 215773 199253 245966 244650 250843 240050
7212 240050 193894 219092 219019 206899 174217 148938 136458 89519 169561 234554 265718 276527
7200 276527 230639 187082 147589 185575 199168 148669 151679 140772 168943 182266 157868 136780
7188 136780 162782 169001 198340 204678 149876 116605 48789 70218 138581 107717 109352 94995
7176 94995 50419 83873 83374 126618 87050 106682 128174 85730 78776 72710 25572 18022 79416
$$ packed form
7260A60633o2626j6856J9917p611K5085N5794j0930J3977k5404m8548L6124L2750
7248A72305p196L0367j1518o6904k2094J0785M9848L4537J9199L1417k3038m2844
7236A74864N889l4233L5007O0759k5808j5097k70l3203J1135k040P8307L6951
7224B92261k2316l5406l2359j7988J9054K5165j2638j6520M6713j316O193j0793
7212B40050m6156K5198p3j2120l2682k5279j2480m6939Q0042O4993L1164J0809
7200B76527m5888m3557l9493L7986J3593n0499L010j0907K8171J3323k4398k1088
7188A36780K6002O219K9339O338n4802l3271o7816K1429O8363l0864J635j4357
7176I4995m4576L3454m99M3244l9568J9632K1492m2444o954o066m7138p550O1394
$$ plain form
7163 79416 79922 17767 4533 -58254 -46377 -13439 -23675 48903 -18020 16941 -29604 -66668
7151 -66668 -15383 -7187 38262 -8423 -51051 -48120 -21875 -37138 -1409 -21277 -49389 -13519
7139 -13519 -5759 -34325 -62654 -77912 -84215 -44418 -16843 -4937 9445 -70128 -85960 -119426
7127 -119426 -96872 -90575 -100657 -65985 -77033 -121751 -104939 -91104 -117984 -117523 -81702 -54552
7115 -54552 -100943 -107456 -166460 -104772 -38833 -49190 -78615 -97123 -100559 -132739 -132000 -126359 -66205
7102 -66205 -15382 -4699 -67453 -119191 -136420 -123640 -123205 -138820 -96064 -81331 -163709 -134766
7090 -134766 -98197 -89344 -93670 -100959 -105154 -103958 -106664 -147048 -166577 -85978 -46677 -72342 -49538
7077 -49538 -96476 -140281 -177580 -157460 -121571 -75643 -69435 -87979 -161309 -201789 -176443 -138680
$$ packed form
7163G9416N06o2155j3234o2787J1877L2938j0236P2578o6923L4961m6545l7064
7151f6668N1285Q196M5449m6685m2628K931K6245j5263L5729j9868k8112L5870
7139a3519P760k8566k8329j5258o303L9797K7575J1906J4382p9573j5832l3466
7127a19426K2554O297j0082L4672j1048m4718J6812J3835k6880M61L5821K7150
7115e4552m6391o513n9004O1688O5939j0357k9425j8508l436l2180P39N641O0154
7102f6205N0823J0683o2754n1738j7229J2780M35j5615M2756J4733q2378K8943
7090a34766L6569Q853m326p289m195J196k706m0384j9529Q0599L9301k5665K2804
7077d9538m6938m3805l7299K0120L5889M5928O208j8544p3330m0480K5346L7763
$$ plain form
7065 -138680 -112799 -79241 -74754 -85207 -118314 -162463 -118535 -61777 -61104 -116577 -83379 -96388
7053 -96388 -80835 -101852 -131879 -79407 -58363 -49287 -32407 -81797 -125651 -108793 -71036 -38058
7041 -38058 -41266 -57890 -114237 -192725 -186124 -108971 -90294 -21429 -64112 -59917 -106234 -142779
7029 -142779 -116641 -109166 -120484 -84234 -64951 -37506 -93617 -109953 -67627 -54686 -40807 -48165
7017 -48165 -59121 -119935 -151839 -161559 -162343 -78793 -15337 -41215 -55581 -82373 -127120 -145331
7005 -145331 -106842 -39678 -48410 -103161 -140591 -137091 -145387 -123420 -76961 -18949 -53897 -102343
6993 -102343 -110635 -141623 -139554 -82109 -19368 -12914 -30558 -79512 -107518 -134638 -145716 -74859
6981 -74859 -11498 -50435 -53411 -90474 -126823 -166513 -122112 -60102 -44596 -102090 -118914 -179511
$$ packed form
7065a38680K5881L3558M487j0453l3107m4149M3928N6758O73n5473L3198j3009
7053i6388J5553k1017l0027N2472K1044R076J6880m9390m3854J6858L7757L2978
7041c8058l208j6624n6347p8488O601P7153J8677O8865m2683M195m6317l6545
7029a42779K6138P475j1318L6250J9283K7445n6111j6336M2326J2941J3879p358
7017d8165j0956o0814l1904r720p84Q3550O3456k5878j4366k6792m4747j8211
7005a45331L8489O7164q732n4751l7430L500q296K1967M6459N8012l4948m8446
6993a02343q292l0988K069N7445O2741O454j7644m8954k8006k7120j1078P0857
6981g4859O3361l8937k976l7063l6349l9690M4401O2010J5506n7494j6824o0597
$$ plain form
6969 -179511 -173152 -147725 -160123 -129951 -85151 -117820 -165106 -89070 -97950 -110423 -48989 -7266
6957 -7266 -35455 -68756 -117805 -144526 -174454 -122882 -35818 -70966 -85622 -134688 -147966 -143080
6945 -143080 -85079 -105502 -82998 -16909 -46608 -98611 -109353 -59268 -38767 -23544 -24397 -48226
6933 -48226 -55949 -101305 -117081 -158810 -148173 -70914 -62631 -76448 -68931 -46903 -50256 -53104 -23488
6920 -23488 -4066 -25742 -110620 -179680 -141744 -92519 -86172 -54390 -25708 -40262 -99626 -135241
6908 -135241 -113367 -128775 -72510 -60524 -29758 -45631 -107912 -155613 -171299 -98216 -83103 -74439
6896 -74439 -25968 -49769 -56559 -79563 -53364 -31650 -3538 -54894 -95835 -97684 -92479 -104160
6884 -104160 -101676 -10330 29078 41898 -31916 -101886 -155846 -106752 -91176 -48284 -33793 -66192
$$ packed form
6969a79511O359K5427j2398L0172M4800l2669m7286P6036q880j2473O1434M1723
6957g266k8189l3301m9049k6721k9928N1572Q7064l5148j4656m9066j3278M886
6945a43080N8001k0423K2504O6089k9699n2003j0742N0085K0501J5223q53k3829
6933d8226p723m5356j5776m1729J0637P7259Q283j3817P517K2028l353k848K9616
6920b3488J9422k1676q4878o9060L7936M9225O347L1782K8682j4554n9364l5615
6908a35241K1874j5408N6265J1986L0766j5873o2281m7701j5686P3083J5113Q664
6896g4439M8471k3801o790k3004K6199K1714K8112n1356m0941j849N205j1681
6884a04160K484R1346L9408J2820p3814o9970n3960M9094J5576M2892J4491l2399
$$ plain form
6872 -66192 -133872 -155428 -129806 -78108 -52490 -54480 -71210 -84637 -70275 -91765 -109192 -86136
6860 -86136 -35116 1829 35278 -23832 -79520 -105461 -107507 -71340 -91575 -138440 -89589 -137392
6848 -137392 -152024 -156270 -88667 -50569 -46895 -52365 -102601 -106378 -137853 -150737 -96892 -91638 -90371
6835 -90371 -47292 -106623 -119728 -57982 -56625 -50361 -94829 -105268 -143826 -166856 -137386 -72044
6823 -72044 3165 -28339 -27681 -36116 -60648 -107451 -112438 -71455 -65528 -69835 -65686 -81177 -144923
6810 -144923 -108898 -91077 -99232 -76090 -20982 -22472 -43752 -85461 -115690 -116622 -117194 -38520 39388
6797 39388 -16742 -72825 -94700 -84098 -8990 21911 36123 -2360 -34083 -98325 -92896 -85900
6785 -85900 -63349 -23506 80943 52814 -41773 -48019 -58563 -3298 18677 19593 14533 -27452
$$ packed form
6872f6192o7680k1556K5622N1698K5618j990j6730j3427J4362k1490j7427K3056
6860h6136N1020L6945L3449n9110n5688k5941k046L6167k0235m6865M8851m7803
6848a37392j4632m246O7603L8098L674n470n0236l777l1475j2884N3845N254J267
6835i0371M3079n9331j3105O1746J357O264m4468j0439l8558k3030K9470O5342
6823g2044P5209l1504O58q435k4532m6803m987M0983N927m307M149j5491o3746
6810a44923L6025J7821q155K3142N5108j490k1280m1709l0229r32n72P8674P7908
6797C9388n6130n6083k1875J0602P5108L0901J4212l8483l1723o4242N429O996
6785h5900K2551L9843J04449k8129r4587o246j0544N5265K1975R16n060m1985
$$ plain form
6773 -27452 -85828 -92507 -21231 -9836 -3260 9671 -22257 -52347 -85432 -129783 -65931 -44409
6761 -44409 -19756 -6 -97896 -161796 -111646 -93184 -70911 -24367 -31185 -52463 -117716 -172920
6749 -172920 -123318 -71516 -24782 9548 -39889 -67829 -116718 -144678 -103196 -33819 12898 -10419
6737 -10419 -48173 -97254 -51481 -111342 -81962 32673 -42235 -107342 -123926 -130127 -119259 -80326
6725 -80326 -70521 -42444 -38886 -57590 -134580 -112850 -132826 -151809 -86716 -47494 -990 -32824
6713 -32824 -97801 -94758 -120281 -65206 -15485 31482 3501 -4705 -20471 -113209 -117567 -76757
6701 -76757 -54334 -42410 -22569 -88499 -112781 -112561 -65917 -5815 -67549 -78989 -46069 -134897
6689 -134897 -194307 -121153 -58961 7043 -11639 -82323 -7836 -58080 -96157 -84177 -43443 -26851
$$ packed form
6773b7452n8376o679P1276J1395O576J2931l1928l0090l3085m4351O3852K1522
6761d4409K4653J9750r7890o3900N0150J8462K2273M6544o818k1278o5253n5204
6749a72920M9602N1802M6734L4330m9437k7940m8889k7960M1482O9377M6717k3317
6737a0419l7754m9081M5773n9861K9380J14635p4908o5107j6584o201J0868L8933
6725h0326R805K8077L558j8704p6990K1730j9976j8983O5093L9222M6504l1834
6713c2824o4977L043k5523N5075M9721M6967k7981q206j5766r2738m358M0810
6701g6757K2423J1924J9841o5930k4282K20M6644O0102o1734j1440L2920q8828
6689a34897n9410P3154O2192O6004j8682p0684P4487n0244l8077J1980M0734J6592
$$ plain form
6677 -26851 -32713 -62538 -63043 -58241 -25817 -20276 21115 -2027 -66681 -157926 -170937 -121736 -124713
6664 -124713 -66013 -40381 -82630 -91156 -95741 -122033 -94429 -33041 -9433 -80271 -108573 -124328
6652 -124328 -75425 -43104 -37779 -52861 -8419 -34708 -61672 -76787 -102951 -50089 -29104 5385
6640 5385 -5226 -64097 -68237 -57217 -57263 -51240 -39937 -26592 -57880 -78428 -103897 -138427 -67739
6627 -67739 -32734 8079 -1811 -57088 -75845 -99056 -79641 -3400 -24806 -40220 -75489 -91783
6615 -91783 -114274 -104562 -51515 -44870 -42424 7267 -16909 -99409 -112805 -113114 -39282 -18245 -21359
6602 -21359 -45184 -44515 -19520 -50112 -73824 -78431 -32389 -26575 -86947 -161862 -134456 -119861 -61641
6589 -61641 -16133 44067 15010 -59155 -92807 -138310 -79203 -63640 -8003 45225 -30728 -65537
$$ packed form
6677b6851n862k9825n05M802L2424N541M1391k3142o4654r1245j3011M9201k977
6664a24713N8700K5632m2249q526m585k6292K7604O1388K3608p0838k8302j5755
6652a24328M8903L2321N325j5082M4442k6289k6964j5115k6164N2862K0985L4489
6640E385j0611n8871m140J1020m6O023J1303J3345l1288k0548k5469l4530P0688
6627f7739L5005M0813r890n5277j8757k3211J9415P6241k1406j5414l5269j6294
6615i1783k2491R712N3047O645K446M9691k4176q2500j3396l09P3832K1037l114
6602b1359k3825O69K4995l0592k3712m607M6042N814o0372p4915K7406J4595N8220
6589f1641M5508O0200k9057p4165l3652m5503N9107J5563N5637N3228p5953l4809
$$ plain form
6577 -65537 -57729 -43605 33787 29723 56103 48157 -56704 -114835 -93628 -38428 3861 69985
6565 69985 28616 -48542 -55304 -83380 -64153 -31301 -14997 1741 -28651 -91154 -90387 -89577 -32195
6552 -32195 -17233 10560 20707 -50169 -85266 -56867 -12658 6793 14006 -7695 -13314 756
6540 756 -26391 -17071 -27799 -29516 -3396 6689 11336 -54076 -66683 -44038 -33168 21055 45538
6527 45538 18658 -43286 -47040 -77545 -19701 94564 121188 104706 80443 -9212 -25225 -11489
6515 -11489 50601 72467 57328 38169 12938 6709 29614 87259 89389 129685 82560 -594
6503 -594 -41599 9148 61866 68453 56880 67604 41980 -24016 -52458 -28265 73338 114851
6491 114851 66004 22425 -40895 -52774 -2894 52865 31140 82389 86401 29641 -1032 -30484
$$ packed form
6577f5537P808J4124P7392m064K6380p946j04861n8131K1207N5200M2289O6124
6565F9985m1369p7158o762k8076J9227L2852J6304J6738l0392o2503P67Q10N7382
6552c2195J4962K7793J0147p0876l5097K8399M4209J9451P213k1701n619J4070
6540G56k7147R320j0728j717K6120J0085M647o5412j2607K2645J0870N4223K4483
6527D5538k6880o1944l754l0505N7844J14265K6624j6482k4263q9655j6013J3736
6515a1489O2090K1866j5139j9159k5231o229K2905N7645K130M0296m7125q3154
6503e94m1005N0747N2718O587j1573J0724k5624o5996k8442K4193J01603M1513
6491A14851m8847m3579o3320j1879M9880N5759k1725N1249M012n6760l0673k9452
$$ plain form
6479 -30484 -9050 6880 47269 24690 8764 -40327 -53896 -35781 27886 16383 22524 -18544
6467 -18544 -40889 -44696 -13848 36057 2252 30253 23218 -1810 -52994 -51554 28274 32033 2791
6454 2791 44202 -7390 -2300 6867 -11221 -3513 73133 144046 90737 3587 -11200 8354 322
6441 322 -22040 19139 69317 26673 -14051 30012 -11709 -1995 51593 41720 13675 26961 -55876
6428 -55876 -54267 11208 38384 31288 52458 27411 -15576 -12265 49802 49372 104927 118255 68641
6415 68641 41522 17803 82892 46509 74726 103333 90367 57866 13892 31974 34654 22434
6403 22434 101746 91604 53902 23197 68550 57665 40828 55452 81962 112990 34581 -9030
6391 -9030 28997 71590 87265 86237 137734 132238 118282 74581 25449 35371 75718 134153 149155
$$ packed form
6479c0484K1434J5930M0389k2579j5926m9091j3569J8115O3667j1503O141m1068
6467a8544k2345l807L0848M9905l3805K8001p035k5028n1184J440P9828L759k9242
6454B791M1411n1592N090R167j8088P708P6646P0913n3309q7150j4787J9554q032
6441C22k2362M1179N0178m2644m0724M4063m1721R714N3588r873k8045J3286q2837
6428e5876J609O5475K7176p096K1170k5047m2987L311O2067m30N5555J3328m9614
6415F8641k7119k3719O5089l6383K8217K8607j2966l2501m3974J8082K680j2220
6403B2434P9312j0142l7702l0705M5353j0885j6837J4624K6510L1028p8409m3611
6391i030L8027M2593J5675j028N1497n496j3956m3701m9132R922M0347N8435J5002
$$ plain form
6378 149155 148482 122409 55437 46196 23158 115156 175648 146023 113260 90840 131095 144650
6366 144650 164204 134523 141950 135010 157916 91115 79278 166822 194817 154615 119183 68627
6354 68627 56155 69126 98896 160309 237447 217996 100647 106988 129883 163272 166885 258573
6342 258573 283206 248585 221902 207417 206991 193439 227655 273138 255966 225301 196634 209069
6330 209069 288769 294775 275690 274083 249175 214591 248150 248257 245490 316969 376866 322224 266804
6317 266804 216281 252193 331769 372044 394140 411076 337928 308129 307973 368776 447283 478677
6305 478677 498984 407898 389949 378799 436383 502524 613911 664695 622626 611766 563856
6294 563856 581109 656397 675776 658016 610597 596418 601130 587869 621650 707923 722713 735793
$$ packed form
6378A49155o73k6073o6972r241k3038R1998O0492k9625l2763k2420M0255J3555
6366A44650J9554k9681P427o940K2906o6801j1837Q7544K7995m0202l5432n0556
6354F8627j2472J2971K9770O1413P7138j9451j17349O341K2895L3389L613R1688
6342B58573K4633l4621k6683j4485m26j3552L4216M5483j7172l0665k8667J2435
6330B09069P9700O006j9085j607k4908l4584L3559J07k767P1479N9897n4642n5420
6317B66804n0523L5912P9576M0275K2096J6936p3148k9799j56O0803P8507L1394
6305D78677K0307r1086j7949j1150N7584O6141J11387N0784m2069j0860m7910
6294E63856J7253P5288J9379j7760m7419j4179M712j3261L3781Q6273J4790J3080
$$ plain form
6282 735793 736494 707432 719892 728912 753494 824776 840761 838476 797744 718132 764849 777227
6270 777227 782343 785328 778250 760819 758922 774219 776321 809065 802924 790604 831138 813926 805523
6257 805523 803799 795935 818884 870844 863958 762723 717011 715523 724389 701041 703798 764258 762192
6244 762192 728491 725771 711014 738231 796066 954059 895312 802948 755990 806985 782611 817779
6232 817779 873380 838269 808946 756439 762686 837172 905448 911554 872386 870002 867134 846849
6220 846849 867585 868824 984998 1040002 1067574 1054814 1044016 1037757 1109875 1129947 1158975 1182258
6208 1182258 1145708 1099841 1062136 1041644 1050370 1095273 1101989 1054714 987310 921113 976148 1018151
6196 1018151 1124887 1143685 1154775 1100165 1006275 1040961 1103336 1222928 1339924 1378323 1330673
$$ packed form
6282G35793P01k9062J2460R020K4582P1282J5985k285m0732p9612M6717J2378
6270G77227N116K985p078j7431j897J5297K102L2744o141j2320M0534j7212q403
6257H05523j724p864K2949N1960o886j01235m5712j488Q866k3348K757O0460k066
6244G62192l3701k720j4757K7217N7835J57993n8747r2364m6958N0995k4374L5168
6232H17779N5601l5111k9323n2507O247P4486O8276O106l9168k384k868k0285
6220H46849K0736J239J16174N5004K7572j2760j0798o259P2118K0072K9028K3283
6208A182258l6550m5867l7705k0492Q726M4903O716m7275o7404o6197N5035M2003
6196A018151J06736J8798J1090n4610r3890L4686O2375J19592J16996L8399m7650
$$ plain form
6185 1330673 1327399 1320353 1327104 1339811 1364077 1400655 1412418 1349640 1291092 1273337 1267892 1323895
6173 1323895 1338629 1318637 1291787 1226157 1160482 1204956 1294907 1403136 1430347 1403985 1385564
6162 1385564 1362251 1423710 1492169 1570688 1648380 1632561 1609395 1602405 1575845 1587332 1617677 1593300
6150 1593300 1624957 1581683 1516178 1557009 1638258 1708328 1743252 1705570 1689586 1671102 1672394 1718000
6138 1718000 1732664 1763525 1844651 1883349 1862836 1896763 1864711 1905961 1992939 2022410 2040165
6127 2040165 2060927 1963684 1936340 2017817 2058576 2071261 2101477 2059566 1993231 2038857 2115852
6116 2115852 2144953 2194035 2198809 2197038 2148008 2116304 2177999 2274158 2384674 2382659 2402609 2396773
6104 2396773 2379411 2420387 2454710 2527256 2590611 2615939 2609597 2685628 2710259 2800703 2906530
$$ packed form
6185A330673l274p046O751J2707K4266L6578J1763o2778n8548j7755n445N6003
6173A323895J4734j9992k6850o5630o5675M4474Q9951J08229K7211k6362j8421
6162A385564k3313O1459O8459P8519P7692j5819k3166o990k6560J1487L0345k4377
6150A593300L1657m3274o5505M0831Q1249P0070L4924l7682j5984j8484J292M5606
6138A718000J4664L0861Q1126L8698k0513L3927l2052M1250Q6978K9471J7755
6127B040165K0762r7243k7344Q1477M0759J2685L0216m1911o6335M5626P6995
6116B115852K9101M9082M774j771m9030l1704O1695R6159J10516k015J9950n836
6104B396773j7362M0976L4323P2546O3355K5328o342P6031K4631R0444J05827
$$ plain form
6093 2906530 2930205 2952838 2935920 2849091 2828503 2910548 2946161 2996898 3077706 3140197 3159859
6082 3159859 3160081 3184049 3224278 3336884 3396144 3450975 3466359 3455605 3498859 3545604 3592369 3597906
6070 3597906 3640580 3661281 3647014 3708914 3768363 3863994 3931782 3937765 3947236 3893877 3913691 3977159
6058 3977159 4174577 4382246 4470677 4588089 4646672 4683694 4631151 4677019 4797113 4846461 4921508
6047 4921508 4973632 5021086 5016857 5102712 5244052 5411627 5552242 5593408 5648018 5705474 5859420
6036 5859420 6013529 6230902 6457357 6594825 6685143 6817977 6942096 7101396 7307653 7563368
6026 7563368 7746700 7831588 7961422 8072038 8316591 8617261 8844959 9068569 9209285 9286784
6016 9286784 9555268 9874231 10118351 10406404 10669233 10874829 11158250 11447983 11708095 12022792
$$ packed form
6093B906530K3675K2633j6918q6829k0588Q2045L5613N0737Q0808O2491J9662
6082C159859K22K3968M0229J12606N9260N4831J5384j0754M3254M6745M6765N537
6070C597906M2674K0701j4267O1900N9449R5631O7788N983R471n3359J9814O3468
6058C977159J97418K07669Q8431J17412N8583L7022n2543M5868J20094M9348P5047
6047D921508N2124M7454m229Q5855J41340J67575J40615M1166N4610N7456J53946
6036E859420J54109K17373K26455J37468R0318J32834J24119J59300K06257K55715
6026G563368J83332Q4888J29834J10616K44553L00670K27698K23610J40716P7499
6016I286784K68484L18963K44120K88053K62829K05596K83421K89733K60112L14697
$$ plain form
6006 12022792 12379543 12697167 12962347 13269399 13600775 13914113 14221005 14573335 14956580
5997 14956580 15295008 15690541 16041653 16395479 16790819 17207230 17629312 17980871 18270882
5988 18270882 18588794 19035423 19536485 20108126 20728948 21285270 21971203 22610455 23310341
5979 23310341 24029180 24857002 25724737 26655307 27631818 28710275 29886445 31239451 32751509
5970 32751509 34472757 36467388 38678483 41200506 44070852 47389252 51296045 55847551
5962 55847551 60856715 65762735 69809528 72118046 72273999 70636510 68128202 65834457
5954 65834457 64364703 63860684 64376085 65948017 68389482 71486190 74822531 77713369
5946 77713369 79711617 80964635 82204090 84158995 87056775 90425072 93188452 94647283
$$ packed form
6006A2022792L56751L17624K65180L07052L31376L13338L06892L52330L83245
5997A4956580L38428L95533L51112L53826L95340M16411M22082L51559K90011
5988A8270882L17912M46629N01062N71641O20822N56322O85933O39252O99886
5979B3310341P18839Q27822Q67735R30570R76511J078457J176170J353006J512058
5970C2751509J721248J994631K211095K522023K870346L318400L906793M551506
5962E5847551N009164M906020M046793K308518J55953j637489k508308k293745
5954F5834457j469754n04019N15401J571932K441465L096708L336341K890838
5946G7713369J998248J253018J239455J954905K897780L368297K763380J458831
$$ plain form
5938 94647283 94594378 93409875 92106924 91602520 92511764 94800976 97840433 100873029 102878979
5929 102878979 103206070 102114234 99976143 97528053 95324929 93704514 93264246 93892189
5921 93892189 95152800 96165240 95880265 93404466 89153865 83917717 79067329 75428462
5913 75428462 73210999 72318538 72581220 73796671 76072244 79356346 83588159 88600348
5905 88600348 93734198 98078550 100481584 99949968 96261227 89986442 82220740 74411780
5897 74411780 67274858 61229222 56224156 52122491 48813827 46247401 44382066 43034996
5889 43034996 42299107 41999227 42147336 42786211 43844239 45368998 47399167 49870125 52646047
5880 52646047 55401383 57701791 58982814 58697345 56656785 53078892 48567289 43831801
$$ packed form
5938I4647283n2905j184503j302951n04404R09244K289212L039457L032596K005950
5929A02878979L27091j091836k138091k448090k203124j620415m40268O27943
5921I3892189J260611J012440k84975k475799m250601n236148m850388l638867
5913G5428462k217463q92461K62682J215451K275573L284102M231813N012189
5905H8600348N133850M344352K403034n31616l688741o274785p765702p808960
5897G4411780p136922o045636n005066m101665l308664k566426j865335j347070
5889D3034996p35889k99880J48109O38875J058028J524759K030169K470958K775922
5880E2646047K755336K300408J281023k85469k040560l577893m511603m735488
$$ plain form
5872 43831801 39259063 35324696 31973679 29122406 26556349 24363561 22544727 20878085
5864 20878085 19559376 18373882 17404305 16578418 15812185 15125693 14532853 13998341 13578569
5855 13578569 13231614 12953987 12660842 12322920 11942665 11646877 11385631 11127738 10892210
5846 10892210 10640573 10416253 10167713 9923002 9759585 9624652 9565204 9501209 9404101 9307041
5836 9307041 9212490 9147757 9054517 9001873 8995099 9008644 8880606 8749797 8705300 8689417 8824915
5825 8824915 8882104 8909744 8928089 8959055 8995304 9031982 9190246 9439115 9653692 9930199 10189225
5814 10189225 10464694 10785698 11247484 11834124 12417513 12977529 13495588 13841728 14087527
5805 14087527 14117007 14011599 13710990 13287212 12777121 12279014 11920898 11683327 11567060 11492641
$$ packed form
5872D3831801m572738l934367l351017k851273k566057k192788j818834j666642
5864B0878085j318709j185494r69577q25887p66233o86492n92840n34512m19772
5855A3578569l46955k77627k93145l37922l80255k95788k61246k57893k35528
5846A0892210k51637k24320k48540k44711j63417j34933n9448o3995r7108r7060
5836I307041r4551o4733r3240n2644o774J3545j28038j30809m4497j5883J35498
5825H824915N7189K7640J8345L0966L6249L6678J58264K48869K14577K76507K59026
5814A0189225K75469L21004M61786N86640N83389N60016N18059L46140K45799
5805A4087527K9480j05408l00609m23778n10091m98107l58116k37571j16267p4419
$$ plain form
5795 11492641 11492383 11495868 11610356 11820329 12168145 12619818 13162156 13778104 14529053 15356081
5785 15356081 16352372 17499491 18754742 20088975 21107662 21703909 21771082 21131673 19979605
5776 19979605 18551198 17098326 15638551 14273233 13186375 12317073 11627122 11024268 10611515
5767 10611515 10319838 10034270 9965605 9903374 9963547 10137156 10451523 10805227 11176513 11561307
5757 11561307 12003916 12445466 12814484 13044107 12994820 12563968 11898085 10991575 10020741 9132451
5747 9132451 8419754 7800823 7203794 6631658 6118791 5719676 5360736 5103236 4889952 4703237
5737 4703237 4517286 4289277 3981479 3893216 3820358 3809685 3771867 3659102 3459833 3366917
5727 3366917 3298348 3264136 3178926 3159357 3124860 2986511 2968592 2926189 2945899 2874821 2830551
$$ packed form
5795A1492641k58L485J14488K09973L47816M51673N42338O15948P50949Q27028
5785A5356081R96291J147119J255251J334233J018687N96247O7173o39409j152068
5776A9979605j428407j452872j459775j365318j086858q69302o89951o02854m12753
5767A0611515k91677k85568o8665o2231O0173J73609L14367L53704L71286L84794
5757A1561307M42609M41550L69018K29623m9287m30852o65883r06510r70834q88290
5747I132451p12697o18931n97029n72136n12867l99115l58940k57500k13284j86715
5737D703237j85951k28009l07798q8263p2858j0673l7818j12765j99269r2916
5727C366917o8569l4212q5210j9569l4497j38349j7919m2403J9710p1078m4270
$$ plain form
5716 2830551 2834342 2718385 2682905 2620741 2596176 2633888 2647064 2630696 2590498 2547429 2523474
5705 2523474 2554521 2557836 2611477 2664288 2696194 2696375 2671459 2645014 2730064 2783634 2804744 2772321
5693 2772321 2687933 2638108 2601733 2636271 2689515 2734103 2733429 2700618 2628892 2639621 2700062 2698939
5681 2698939 2739217 2772194 2735204 2678508 2737079 2817543 2860074 2891991 2892732 2894578 2865012 2782914
5669 2782914 2802789 2853930 2830087 2803266 2727218 2692219 2678043 2716498 2850893 2923881 2921916
5658 2921916 2912231 2879265 2874236 2994133 3037917 3078067 3051164 3042987 2952522 2864948 2838271 2903419
5646 2903419 2955293 2945573 2960928 2959259 2919103 2866046 2940334 3023930 3090795 3135209 3122096 3127110
5634 3127110 3125711 3210522 3404482 3481343 3467401 3427919 3416188 3461621 3575903 3700283 3740206
$$ packed form
5716B830551L791j15957l5480o2164k4565L7712J3176j6368m0198m3069k3955
5705B523474L1047L315N3641N2811L1906J81k4916k6445Q5050N3570K1110l2423
5693B772321q4388m9825l6375L4538N3244M4588o74l2811p1726J0729O0441j123
5681B698939M0278L2977l6990n6696N8571Q0464M2531L1917P41J846k9566q2098
5669B782914J9875N1141k3843k6821p6048l4999j4176L8455J34395P2988j965
5658B921916r685l2966n029J19897M3784M0150k6903q177r0465q7574k6677O5148
5646B903419N1874r720J5355j669m0156n3057P4288Q3596O6865M4414j3113N014
5634C127110j399Q4811J93960P6861j3942l9482j1731M5433J14282J24380L9923
$$ plain form
5623 3740206 3682074 3712440 3677562 3749150 3900687 4040904 4106868 4142491 4205638 4234826 4285024
5612 4285024 4400092 4537887 4622870 4645223 4654792 4774928 4870360 4931627 5040791 5149853 5230534
5601 5230534 5243318 5299095 5333394 5442182 5661110 5765768 5849699 5946881 6085103 6200301
5591 6200301 6368180 6578342 6769096 6892302 7009714 7098974 7243693 7394515 7520472 7674223
5581 7674223 7774554 7856712 7907728 7981149 8113992 8244185 8442176 8576778 8645268 8813096
5571 8813096 8955045 9146877 9440478 9677707 9949437 10170791 10288241 10544412 10765042 10976199
5561 10976199 11220632 11434191 11579460 11768542 12033780 12287657 12553151 12803903 13058518
5552 13058518 13295508 13480457 13794929 14111194 14472197 14849558 15283027 15683892 16084221
$$ packed form
5623C740206n8132L0366l4878P1588J51537J40217O5964L5623O3147K9188N0198
5612D285024J15068J37795Q4983K2353R569J20136R5432O1267J09164J09062Q0681
5601E230534J2784N5777L4299J08788K18928J04658Q3931R7182J38222J15198
5591F200301J67879K10162J90754J23206J17412Q9260J44719J50822J25957J53751
5581G674223J00331Q2158N1016P3421J32843J30193J97991J34602O8490J67828
5571H813096J41949J91832K93601K37229K71730K21354J17450K56171K20630K11157
5561A0976199K44433K13559J45269J89082K65238K53877K65494K50752K54615
5552A3058518K36990J84949L14472L16265L61003L77361M33469M00865M00329
$$ plain form
5543 16084221 16491181 17036608 17661232 18284307 18926174 19524268 20202524 21007957 21917525
5534 21917525 23050297 24353272 25745808 27304127 28975777 30913691 33205401 35818822
5526 35818822 38690969 41957223 45550653 49535651 53667899 57606049 60632162 62043459
5518 62043459 61438500 59064881 55614284 51942140 48628182 45940092 43910206 42361547
5510 42361547 41375638 40832245 40849008 41497305 42707284 44415453 46588435 49313536 52603552
5501 52603552 56580229 61331922 66934040 73415619 80447129 87147349 92116096 94014516
5493 94014516 92072331 86640391 79051884 70927384 63343609 56775971 51251621 46694609
5485 46694609 43024837 40111450 37832855 36126164 34944586 34213507 33930628 34097765 34622265
$$ packed form
5543A6084221M06960N45427O24624O23075O41867N98094O78256Q05433R09568
5534B1917525J132772J302975J392536J558319J671650J937914K291710K613421
5526C5818822K872147L266254L593430L984998M132248L938150L026113J411297
5518F2043459o04959k373619l450597l672144l313958k688090k029886j548659
5510D2361547r85909n43393J6763O48297J209979J708169K172982K725101L290016
5501E2603552L976677M751693N602118O481579P031510O700220M968747J898420
5493I4014516j942185n431940p588507q124500p583775o567638n524350m557012
5485D6694609l669772k913387k278595j706691j181578p31079k82879J67137N24500
$$ plain form
5476 34622265 35498069 36714236 38275086 40259572 42498861 44741605 46600962 47513804
5468 47513804 47021956 45084176 41949432 38241123 34632715 31353124 28468071 25965718
5460 25965718 23758489 21916920 20396507 19181453 18176441 17252841 16417608 15657533 15020734
5451 15020734 14532653 14130275 13905423 13643061 13361019 13172304 13035722 13024564 13099692 13163444
5441 13163444 13299004 13417589 13479182 13513138 13507341 13515479 13469392 13374710 13172157 12936892 12787839
5430 12787839 12655707 12589913 12626115 12662732 12690312 12749848 12822059 12948216 13093033 13338415
5420 13338415 13672152 13845169 14044973 14236042 14490196 14850964 15154226 15447125 15645040
5411 15645040 15759853 15901142 16000682 16157889 16357907 16470824 16572927 16676645 16826538 17066323
$$ packed form
5476C4622265Q75804J216167J560850J984486K239289K242744J859357R12842
5468D7513804m91848j937780l134744l708309l608408l279591k885053k502353
5460B5965718k207229j841569j520413j215054j005012r23600q35233p60075o36799
5451A5020734m88081m02378k24852k62362k82042j88715j36582j1158P5128O3752
5441A3163444J35560J18585O1593L3956n797Q138m6087r4682k02553k35265j49053
5430A2787839j32132o5794L6202L6617K7580N9536P2211J26157J44817K45382
5420A3338415L33737J73017J99804J91069K54154L60768L03262K92899J97915
5411A5645040J14813J41289R9540J57207K00018J12917J02103J03718J49893K39785
$$ plain form
5401 17066323 17400885 17797068 18138863 18540912 18936025 19345901 19882011 20467029 21077047
5392 21077047 21723201 22380616 23016851 23704054 24586513 25530560 26529525 27675095 28990944
5383 28990944 30501576 32227212 34209413 36532764 39276503 42430316 45938489 49955373
5375 49955373 54738646 60054500 65347130 69632867 71955561 71796082 69616598 66409687
5367 66409687 63380360 61312050 60251962 60349746 61501747 63388634 65654338 67706097
5359 67706097 69027826 69462268 69438875 69797859 71088292 73590220 76768237 79749316 81736408
5350 81736408 82060358 80832272 78708906 76716505 75276860 74369107 73417600 71677790 68832526
5341 68832526 65270795 61647121 58727957 56948511 56221990 56489847 57702791 59677470
$$ packed form
5401A7066323L34562L96183L41795M02049L95113M09876N36110N85018O10018
5392B1077047O46154O57415O36235O87203Q82459R44047R98965J145570J315849
5383B8990944J510632J725636J982201K323351K743739L153813L508173M016884
5375D9955373M783273N315854N292630M285737K322694j59479k179484l206911
5367F6409687l029327k068310j060088R7784J152001J886887K265704K051759
5359F7706097J321729M34442k3393L58984J290433K501928L178017K981079J987092
5350H1736408L23950j228086k123366j992401j439645r07753r51507j739810k845264
5341F8832526l561731l623674k919164j779446p26521K67857J212944J974679
$$ plain form
5333 59677470 61825327 63496044 63800820 62107811 58580809 54029420 49450402 45635001
5325 45635001 42708249 40684336 39303445 38366340 37779508 37213251 36390538 34982227 32950142
5316 32950142 30565870 28006008 25621514 23475185 21776550 20401817 19167680 18148667
5308 18148667 17248517 16493315 15845108 15418957 15142684 14919726 14728274 14504283 14388016
5299 14388016 14396752 14540736 14765465 15035539 15194828 15246640 15164235 14860936 14385029 13684899
5289 13684899 12818761 11909393 10996552 10177712 9505936 8935827 8501568 8082533 7688044
5280 7688044 7316348 6985724 6749037 6549687 6388827 6217854 6003934 5815049 5633548 5548152
5270 5548152 5469169 5430338 5397999 5250286 5101013 4967815 4923552 4936970 4972075 4896422 4845989
$$ packed form
5333E9677470K147857J670717L04776j693009l527002m551389m579018l815401
5325D5635001k926752k023913j380891r37105n86832n66257q22713j408311k032085
5316C2950142k384272k559862k384494k146329j698635j374733j234137j019013
5308A8148667r00150p55202o48207m26151k76273k22958j91452k23991j16267
5299A4388016Q736J43984K24729K70074J59289N1812q2405l03299m75907p00130
5289A3684899q66138r09368r12841q18840o71776n70109m34259m19035l94489
5280G688044l71696l30624k36687j99350j60860j70973k13920j88885j81501q5396
5270E548152p8983l8831l2339j47713j49273j33198m4263J3418L5105p5653n0433
$$ plain form
5259 4845989 4812024 4739069 4793370 4882222 4951008 4985551 5046112 5056299 5155865 5384399 5658398
5248 5658398 5941089 6156798 6362768 6579029 6784955 7039315 7325261 7479653 7431100 7130196
5238 7130196 6747661 6353196 5989440 5610282 5199392 4788852 4413095 4115667 3891008 3779385
5228 3779385 3574048 3469079 3268755 3089070 2960081 2915464 2841809 2814826 2787531 2626668
5218 2626668 2509543 2360073 2368394 2422351 2378806 2355790 2308287 2239578 2199970 2247770 2268027
5207 2268027 2264541 2237991 2130309 2048527 2119195 2199776 2292635 2394965 2466075 2439850 2417477
5196 2417477 2408161 2409293 2309168 2251801 2201175 2016853 1915325 1870846 1876846 1857899 1829833
5185 1829833 1779595 1690196 1598154 1616118 1663072 1761743 1787042 1695244 1640750 1625762 1650763
$$ packed form
5259D845989l3965p2955N4301Q8852O8786L4543O0561J0187R9566K28534K73999
5248E658398K82691K15709K05970K16261K05926K54360K85946J54392m8553l00904
5238G130196l82535l94465l63756l79158m10890m10540l75757k97428k24659j11623
5228C779385k05337j04969k00324j79685j28989m4617p3655k6983k7295j60863
5218B626668j17125j49470Q321N3957m3545k3016m7503o8709l9608M7800K0257
5207B268027l486k6550j07682q1782P0668Q0581R2859J02330P1110k6225k2373
5196B417477r316J132j00125n7367n0626j84322j01528m4479O000j8947k8066
5185A829833n0238q9399r2042J7964M6954R8671K5299r1798n4494j4988K5001
$$ plain form
5174 1650763 1747675 1811446 1811819 1733122 1679327 1650062 1658079 1721181 1724192 1594780 1439353 1400081
5162 1400081 1434116 1378297 1440246 1389951 1320934 1272991 1280973 1302365 1422135 1480609 1437667
5151 1437667 1341603 1277649 1249708 1325133 1447660 1477099 1454483 1381163 1263252 1260105 1363294
5140 1363294 1387354 1365500 1338825 1246612 1195331 1268672 1366159 1444574 1424467 1369202 1205841
5129 1205841 1170599 1186613 1208503 1215800 1131505 1054749 998574 978394 1058268 1131421 1143331 1105039
5117 1105039 1060785 1061089 1050032 1070982 1142138 1199583 1209241 1148955 1145068 1223444 1333926 1420233
5105 1420233 1449970 1487198 1570319 1635829 1780752 1912537 1945446 1832928 1652626 1497108
5095 1497108 1388333 1377000 1396332 1388806 1197396 1097319 1090837 1124612 1186929 1175041 1186137
$$ packed form
5174A650763R6912O3771L73p8697n3795k9265Q017O3102L011j29412j55427l9272
5162A400081L4035n5819O1949n0295o9017m7943P982K1392J19770N8474m2942
5151A437667r6064o3954k7941P5425J22527K9439k2616p3320j17911l147J03189
5140A363294K4060k1854k6675r2213n1281P3341R7487P8415k0107n5265j63361
5129A205841l5242J6014K1890P297q4295p6756n6175k0180P9874P3153J1910l8292
5117A105039m4254L04j1057K0950P1156N7445R658o0286l887P8376J10482Q6307
5105A420233K9737L7228Q3121O5510J44923J31785L2909j12518j80302j55518
5095A497108j08775j1333J9332p526j91410j00077o482L3775O2317j1888J1096
$$ plain form
5084 1186137 1091811 1018621 1011711 1086989 1200487 1301874 1256082 1182438 1162467 1254482 1393667
5073 1393667 1562183 1702234 1748499 1770975 1813368 1894888 1970545 1928230 1817297 1639752 1425153
5062 1425153 1320662 1302118 1337042 1309465 1195976 1114916 1048440 1038401 1085957 1149854 1180498
5051 1180498 1164197 1155465 1125465 1134726 1258152 1352181 1304918 1285655 1194322 1140459 1206770 1362189
5039 1362189 1423085 1418475 1441413 1391006 1445024 1533181 1539187 1471915 1391230 1274050 1291778 1344132
5027 1344132 1410585 1475632 1401458 1282983 1145076 1155525 1224978 1297027 1309555 1195543 1119492
5016 1119492 1109817 1138152 1189931 1229675 1176307 1059684 1004317 978218 1066973 1222220 1277235
5005 1277235 1218836 1149463 1076999 1073870 1173624 1241183 1255461 1228282 1133849 1125922 1176750 1266910
$$ packed form
5084A186137r4326p3190o910P5278J13498J01387m5792p3644j9971R2015J39185
5073A393667J68516J40051M6265K2476M2393Q1520P5657m2315j10933j77545k14599
5062A425153j04491j8544L4924k7577j13489q1060o6476j0039M7556O3897L0644
5051A180498j6301q732l0000R261J23426R4029m7263j9263r1333n3863O6311J55419
5039A362189O0896m610K2938n0407N4018Q8157O006o7272q0685j17180J7728N2354
5027A344132O6453O5047p4174j18475j37907J0449O9453P2049J2528j14012p6051
5016A119492r675K8335N1779L9744n3368j16623n5367k6099Q8755J55247N5015
5005A277235n8399o9373p2464l129R9754O7559J4278k7179r4433p927N0828R0160
$$ plain form
4993 1266910 1331062 1258548 1163930 1104783 1101435 1201909 1261491 1282933 1181902 1092068 1138088
4982 1138088 1162519 1264269 1337161 1284116 1224790 1176536 1173349 1246493 1403005 1472948 1436142
4971 1436142 1427918 1446958 1563098 1696528 1873631 1997726 1969245 2041812 2252208 2576381
4961 2576381 2819063 2851041 2692216 2439772 2138473 1969293 1914154 1884380 1752224 1519139
4951 1519139 1438655 1460431 1484445 1503234 1514305 1452183 1349587 1266153 1326970 1408824 1470357
4940 1470357 1416525 1329994 1283615 1301722 1392842 1488047 1518647 1425248 1320107 1336935 1450131
4929 1450131 1537974 1608908 1638268 1601776 1491472 1475670 1582879 1681844 1650908 1543188 1530601
4918 1530601 1525559 1635090 1799075 1844383 1812311 1766939 1746417 1802025 1953816 2086593 2105553
$$ packed form
4993A266910O4152p2514r4618n9147l348J00474N9582K1442j01031q9834M6020
4982A138088K4431J01750P2892n3045n9326m8254l187P3144J56512O9943l6806
4971A436142q224J9040J16140J33430J77103J24095k8481P2567K10396L24173
4961B576381K42682L1978j58825k52444l01299j69180n5139k9774j32156k33085
4951A519139q0484K1776K4014J8789J1071o2122j02596q3434O0817Q1854O1533
4940A470357n3832q6531m6379J8107R1120R5205L0600r3399j05141J6828J13196
4929A450131Q7843P0934K9360l6492j10304j5802J07209R8965l0936j07720j2587
4918A530601n042J09531J63985M5308l2072m5372k0522N5608J51791J32777J8960
$$ plain form
4907 2105553 2080760 2135906 2239085 2377348 2580246 2700544 2743127 2817604 2969817 3224749
4897 3224749 3662167 4042108 4358125 4601544 4733266 4632155 4321001 4005856 3696453 3375624
4887 3375624 3094092 2967208 2974752 3020431 2958803 2876384 2742932 2709597 2804939 2930846 3091676
4876 3091676 3184542 3234321 3295254 3363392 3472852 3508711 3367942 3178107 2985125 2835348
4866 2835348 2796628 2798118 2766956 2644430 2582369 2513508 2554327 2698227 2767546 2726792 2634181
4855 2634181 2567800 2596364 2705623 2802080 2887851 2819519 2670180 2708752 2835741 2942969 3042071
4844 3042071 3043498 2955692 2914902 2977983 3086506 3185523 3133307 3079868 3043262 3136376 3241928
4833 3241928 3264865 3283769 3249786 3245025 3265067 3432805 3520109 3608554 3610007 3516704 3554360 3649917
$$ packed form
4907B105553k4793N5146J03179J38263K02898J20298M2583P4477J52213K54932
4897C224749M37418L79941L16017K43419J31722j01111l11154l15145l09403l20829
4887C375624k81532j26884P544M5679o1628q2419j33452l3335R5342J25907J60830
4876C091676R2866M9779O0933O8138J09460L5859j40769j89835j92982j49777
4866B835348l8720J490l1162j22526o2061o8861M0819J43900O9319m0754r2611
4855B634181o6381K8564J09259R6457Q5771o8332j49339L8572J26989J07228R9102
4844C042071J427q7806m0790O3081J08523R9017n2216n3439l6606R3114J05552
4833C241928K2937J8904l3983m761K0042J67738Q7304Q8445J453r3303L7656R5557
$$ plain form
4821 3649917 3766499 3858079 3801676 3760751 3753918 3815198 4001956 4149544 4167900 4136410 4098818
4810 4098818 4196883 4366981 4452711 4469559 4416398 4384749 4460938 4684923 4819554 4887372 4833189
4799 4833189 4789663 4895819 5134920 5340723 5509860 5615358 5610503 5644201 5926572 6165836
4789 6165836 6277493 6318785 6330747 6463753 6777458 7249306 7654219 8016202 8389766 8762650
4779 8762650 9110920 9354777 9243241 8788738 8204204 7698197 7502692 7411318 7253514 7042740
4769 7042740 6868909 6645090 6641668 6775430 6856365 6774553 6661151 6593692 6711688 6918919
4759 6918919 7057248 7045504 6913753 6927752 7030848 7137224 7302819 7361467 7342791 7383572
4749 7383572 7649628 8036067 8362223 8590919 8753927 8994250 9360932 9768861 10134675 10416318
$$ packed form
4821C649917J16582R1580n6403m0925o833O1280J86758J47588J8356l1490l7592
4810D098818R8065J70098Q5730J6848n3161l1649P6189K23985J34631O7818n4183
4799D833189m3526J06156K39101K05803J69137J05498m855L3698K82371K39264
4789F165836J11657M1292J1962J33006L13705M71848M04913L61983L73564L72884
4779H762650L48270K43857j11536m54503n84534n06007j95505r1374j57804k10774
4769G042740j73831k23819l422J33762Q0935q1812j13402o7459J17996K07231
4759F918919J38329j1744j31751J3999J03096J06376J65595N8648j8676M0781
4749G383572K66056L86439L26156K28696J63008K40323L66682M07929L65814K81643
$$ plain form
4739 10416318 10639525 10917478 11211764 11680633 12040844 12333951 12470228 12730429 13123094
4730 13123094 13667915 14235543 14694516 15143795 15484974 15802068 16050641 16018812 15721337 15337309
4720 15337309 15163821 15173105 15365881 15421103 15429439 15434046 15736011 16115607 16533958 16845269 16991535
4709 16991535 17157520 17419707 17906159 18357403 18563410 18740848 19005523 19426599 19979722
4700 19979722 20429296 20715572 20942775 21319666 21931501 22558564 22990150 23307271 23705202
4691 23705202 24318143 25026671 25657590 26135144 26489156 27025193 27864192 28850046 29692596
4682 29692596 30362951 31073501 31975643 33072442 34107647 34888823 35578168 36603527 38078770
4673 38078770 39696240 41267767 42871319 44693780 46928251 49395032 51659125 53537277
$$ packed form
4739A0416318K23207K77953K94286M68869L60211K93107J36277K60201L92665
4730A3123094N44821N67628M58973M49279L41179L17094K48573l1829k97475l84028
4720A5337309j73488R284J92776N5222Q336M607L01965L79596M18351L11311J46266
4709A6991535J65985K62187M86452M51244K06007J77438K64675M21076N53123
4700A9979722M49574K86276K27203L76891O11835O27063M31586L17121L97931
4691B3705202O12941P08528O30919M77554L54012N36037Q38999R85854Q42550
4682B9692596O70355P10550R02142J096799J035205P81176O89345J025359J475243
4673C8078770J617470J571527J603552J822461K234471K466781K264093J878152
$$ plain form
4665 53537277 55544761 58233290 61647739 65492844 69595997 74460332 80869965 88799765
4657 88799765 97752123 107306055 118339470 132344762 149719871 169736915 193410059
4650 193410059 224097936 261248026 296006028 319109021 316370094 284941885 239924712
4643 239924712 197481100 164692866 140845094 122703711 107600981 94881992 84488531
4636 84488531 76457838 70082613 65085510 61063587 57964445 55491391 53634227 52301136
4628 52301136 51433789 50924145 50718446 50777850 51113520 51602966 52283558 53045231 53961369 54897057
4618 54897057 55944269 56989233 57975766 58786180 59584350 60164002 60610423 60946378 61140879
4609 61140879 61263307 61333187 61290447 61220975 61145275 61165928 61313000 61683784 62230003 63001894
$$ packed form
4665E3537277K007484K688529L414449L845105M103153M864335O409633P929800
4657H8799765Q952358R553932J1033415J4005292J7375109K0017044K3673144
4650A93410059L0687877L7150090L4758002K3102993k738927l1428209m5017173
4643B39924712m2443612l2788234k3847772j8141383j5102730j2718989j0393461
4636H4488531q030693o375225m997103m021923l099142k473054j857164j333091
4628E2301136q67347n09644k05699N9404L35670M89446O80592P61673R16138R35688
4618E4897057J047212J044964R86533Q10414P98170N79652M46421L35955J94501
4609F1140879J22428O9880m2740o9472p5700K0653J47072L70784N46219P71891
$$ plain form
4599 63001894 64161726 65567777 67190907 69129611 71202519 73381308 75618855 77890624
4591 77890624 80039535 81948292 83663881 84946772 85509929 85418870 84695164 83431227 81816727
4582 81816727 80021851 78076872 75974329 73774848 71577184 69531747 67820188 66463799
4574 66463799 65526688 65019317 64995266 65412879 66195297 67343016 68859647 70620980 72608017
4565 72608017 74827417 77151811 79415631 81507686 83347237 84766834 85653915 86033808
4557 86033808 85777170 84797825 83391375 81582576 79470687 77300960 75261425 73374887
4549 73374887 71790294 70542522 69689801 69164961 68975482 69155377 69707955 70580147 71732796
4540 71732796 73229486 75046137 77031763 79106515 81216865 83137642 84882771 86337892
$$ packed form
4599F3001894J159832J406051J623130J938704K072908K178789K237547K271769
4591G7890624K148911J908757J715589J282891N63157r1059p23706j263937j614500
4582H1816727j794876j944979k102543k199481k197664k045437j711559j356389
4574F6463799r37111n07371k4051M17613P82418J147719J516631J761333J987037
4565G2608017K219400K324394K263820K092055J839551J419597Q87081L79893
4557H6033808k56638r79345j406450j808799k111889k169727k039535j886538
4549G3374887j584593j247772q52721n24840j89479J79895N52578Q72192J152649
4540G1732796J496690J816651J985626K074752K110350J920777J745129J455121
$$ plain form
4532 86337892 87531112 88380357 88815666 88631712 87840797 86452401 84490329 82330029 80069867
4523 80069867 77956425 75977939 74093225 72403934 70878551 69560480 68425538 67495934
4515 67495934 66779484 66154976 65650416 65140811 64700625 64253138 63767424 63161979 62373044
4506 62373044 61512155 60534047 59306702 57887504 56261195 54476805 52377484 50254459
4498 50254459 48099231 46032532 44182157 42460554 40746676 39188421 37744109 36410624
4490 36410624 35186249 33982719 32831099 31789039 30817825 29877905 28975552 28063472 27238635
4481 27238635 26428227 25759665 25177947 24572180 24094333 23663902 23285402 22968801 22655627
4472 22655627 22397943 22173552 22017006 21916477 21948881 22053008 22208044 22281997 22385622 22527807
$$ packed form
4532H6337892J193220Q49245M35309j83954p90915j388396j962072k160300k260162
4523H0069867k113442j978486j884714j689291j525383j318071j134942r29604
4515F7495934p16450o24508n04560n09605m40186m47487m85714o05445p88935
4506F2373044q60889r78108j227345j419198j626309j784390k099321k123025
4498E0254459k155228k066699j850375j721603j713878j558255j444312j333485
4490C6410624j224375j203530j151620j042060r71214r39920r02353r12080q24837
4481B7238635q10408o68562n81718o05767m77847m30431l78500l16601l13174
4472B2655627k57684k24391j56546j00529L2404J04127J55036P3953J03625J42185
$$ plain form
4462 22527807 22589782 22579036 22501104 22237516 21890724 21407700 20854303 20260305 19634058 18976238
4452 18976238 18290577 17640535 16958119 16336516 15735692 15247897 14799070 14326101 14018108
4443 14018108 13760625 13458273 13214549 13122345 13017103 12898952 12804319 12674137 12483519 12317031
4433 12317031 12137831 11937749 11600947 11204414 10840124 10401262 10009745 9637195 9223331
4424 9223331 8816499 8432147 7976832 7611384 7247565 6839772 6550458 6332859 6073828 5830366
4414 5830366 5617869 5411410 5242091 5080851 4953971 4791571 4618975 4514780 4444515 4342157
4404 4342157 4266856 4160861 4072399 3992049 3851652 3802196 3720433 3613676 3530485 3502894 3442768
4393 3442768 3396744 3311234 3194038 3151536 3100881 3030725 3039975 3000295 2934476 2891970 2863447
$$ packed form
4462B2527807O1975j0746p7932k63588l46792m83024n53397n93998o26247o57820
4452A8976238o85661o50042o82416o21603o00824m87795m48827m72969l07993
4443A4018108k57483l02352k43724r2204j05242j18151r4633j30182j90618j66488
4433A2317031j79200k00082l36802l96533l64290m38862l91517l72550m13864
4424I223331m06832l84352m55315l65448l63819m07793k89314k17599k59031k43462
4414E830366k12497k06459j69319j61240j26880j62400j72596j04195p0265j02358
4404D342157p5301j05995q8462q0350j40397m9456q1763j06757q3191k7591o0126
4393C442768m6024q5510j17196m2502n0655p0156R250l9680o5819m2506k8523
$$ plain form
4382 2863447 2853291 2781633 2732181 2751007 2701714 2670960 2611923 2545547 2490230 2488297 2480635 2443701
4370 2443701 2388667 2374188 2354484 2261647 2282715 2272616 2304016 2265756 2254096 2243156 2208414
4359 2208414 2143681 2154542 2132362 2091813 2075803 2090901 2107794 2072014 2038477 2053673 2033034
4348 2033034 2035501 2029303 2018592 2017466 2028123 2028158 2098248 2124267 2170998 2221849 2228170 2242076 2302976
4335 2302976 2386895 2508256 2645930 2842438 3015050 3098198 3144984 3008741 2791958 2576213
4325 2576213 2344841 2228082 2132007 2048564 1947407 1820535 1750011 1736123 1738093 1674092 1690926
4314 1690926 1645774 1619598 1591389 1532573 1552597 1549373 1501283 1504070 1518330 1560678 1613862 1578251
4302 1578251 1566067 1626785 1612994 1588583 1572148 1596846 1536479 1510590 1539774 1555502 1513761
$$ packed form
4382B863447j0156p1658m9452J8826m9293l0754n9037o6376n5317j933p662l6934
4370B443701n5034j4479j9704r2837K1068j0099L1400l8260j1660j0940l4742
4359B208414o4733J0861k2180m0549j6010J5098J6893l5780l3537J5196k0639
4348B033034K467o198j0711j126J0657L5P0090K6019M6731N0851O321J3906O0900
4335B302976Q3919J21361J37674J96508J72612Q3148M6786j36243k16783k15745
4325B576213k31372j16759r6075q3443j01157j26872p0524j3888J970o4001J6834
4314A690926m5152k6176k8209n8816K0024l224m8090K787J4260M2348N3184l5611
4302A578251j2184O0718j3791k4411j6435K4698o0367k5889K9184J5728m1741
$$ plain form
4291 1513761 1547988 1512615 1497186 1468503 1426689 1394297 1443701 1472456 1367614 1366787 1378324 1392148
4279 1392148 1403804 1379911 1368739 1390892 1429679 1422259 1464481 1464722 1454844 1426723 1433110 1435910 1467476
4266 1467476 1461531 1485313 1503760 1541361 1541421 1516632 1521946 1542877 1483307 1390290 1399625 1420597 1460693
4253 1460693 1425778 1463517 1547946 1586340 1571652 1567451 1588179 1581696 1571736 1622843 1583041 1585853
4241 1585853 1667615 1679074 1635241 1642290 1603375 1626225 1629572 1624343 1630979 1657306 1644020 1586084
4229 1586084 1608615 1574501 1625139 1674357 1646909 1656611 1636056 1698411 1663838 1660113 1692984 1688519
4217 1688519 1656099 1626975 1671670 1717723 1706243 1653775 1630295 1638156 1663504 1663896 1707265 1734470
4205 1734470 1693530 1696395 1726217 1775943 1776597 1721336 1773243 1785172 1818310 1853844 1859638 1833804
$$ packed form
4291A513761L4227l5373j5429k8683m1814l2392M9404K8755j04842q27J1537J3824
4279A392148J1656k3893j1172K2153L8787p420M2222K41r878k8121O387K800L1566
4266A467476n945K3782J8447L7601O0k4789N314K0931n9570r3017R335K0972M0096
4253A460693l4915L7739Q4429L8394j4688m201K0728o483r960N1107l9802K812
4241A585853Q1762J1459m3833P049l8915K2850L347n229O636K6327j3286n7936
4229A586084K2531l4114N0638M9218k7448R702k0555O2355l4573l725L2871m465
4217A688519l2420k9124M4695M6053j1480n2468k3480P861K5348L92M3369K7205
4205A734470m0940K865K9822M9726O54n5261N1907J1929L3138L5534N794k5834
$$ plain form
4193 1833804 1897737 1961992 1943957 1960237 1946704 1954222 1961509 2000480 2046155 2060895 2070177 2176649
4181 2176649 2242355 2328723 2357886 2374163 2305141 2237840 2175801 2111013 2069358 2070536 2062992 2112579
4169 2112579 2143342 2090164 2061579 2056614 2031069 2049445 2031204 2012688 2051108 2028242 2024797 2058969
4157 2058969 2088794 2115788 2123441 2043395 2084845 2096346 2102488 2110129 2174271 2158220 2223052 2296477
4145 2296477 2255184 2249444 2226093 2314547 2307933 2344508 2342294 2305859 2355664 2322095 2341765 2295186
4133 2295186 2291008 2296538 2308328 2298200 2315717 2266397 2245351 2236407 2238280 2185338 2201429 2239425
4121 2239425 2295284 2336968 2349727 2390417 2398079 2377496 2345858 2358485 2384379 2341970 2337950 2333337
4109 2333337 2314106 2308716 2292285 2288460 2294030 2284334 2283688 2343518 2323097 2331041 2299650 2331148 2317771
$$ packed form
4193A833804O3933O4255j8035J6280j3533P518P287L8971M5675J4740R282J06472
4181B176649O5706Q6368K9163J6277o9022o7301o2039o4788m1655J178p544M9587
4169B112579L0763n3178k8585m965k5545J8376j8241j8516L8420k2866l445L4172
4157B058969K9825K6994P653q0046M1450J1501O142P641O4142j6051O4832P3425
4145B296477m1293n740k3351Q8454o614L6575k214l6435M9805l3569J9670m6579
4133B295186m178N530J1790j0128J7517m9320k1046q944J873n2942J6091L7996
4121B239425N5859M1684J2759M0690P662k0583l1638J2627K5894m2409m020m613
4109B333337j9231n390j6431l825N570r696o46N9830k0421P944l1391L1498j3377
$$ plain form
4096 2317771 2328079 2321067 2335554 2336411 2362057 2387621 2389677 2355365 2401776 2424495 2424436 2422308 2397501
4083 2397501 2428081 2430763 2427461 2440156 2426776 2428767 2446645 2468993 2419987 2477049 2469288 2440127
4071 2440127 2488204 2488403 2520527 2549108 2542462 2602992 2658847 2624747 2542184 2518372 2523094 2542058
4059 2542058 2563510 2602906 2623362 2599086 2653316 2679896 2667588 2686505 2749505 2746398 2750095 2709299
4047 2709299 2724026 2750470 2807529 2834097 2858256 2877345 2911657 2889645 2894676 2946639 3004091 3020187
4035 3020187 3029982 3059100 3128433 3177543 3202751 3210577 3273597 3273767 3268858 3286079 3323996 3352274
4023 3352274 3400263 3394460 3448056 3556293 3544519 3610106 3670031 3721607 3827417 3846491 3894905
4012 3894905 3920981 3943127 4008521 4032773 4117782 4176793 4198560 4251893 4336594 4389556 4451540
$$ packed form
4096B317771J0308p012J4487Q57K5646K5564K056l4312M6411K2719n9k128k4807
4083B397501L0580K682l302J2695j3380J991J7878K2348m9006N7062p761k9161
4071B440127M8077J99L2124K8581o646O0530N5855l4100q2563k3812M722J8964
4059B542058K1452L9396K0456k4276N4230K6580j2308J8917O3000l107L697m0796
4047B709299J4727K6444N7059K6568K4159J9089L4312k2012N031N1963N7452J6096
4035C020187R795K9118O9333M9110K5208P826O3020J70m909J7221L7917K8278
4023C352274M7989n803N3596J08237j1774O5587N9925N1576J05810J9074M8414
4012C894905K6076K2146O5394K4252Q5009N9011K1767N3333Q4701N2962O1984
$$ plain form
4001 4451540 4560444 4612921 4674337 4746885 4791888 4817182 4875745 5004016 5095915 5155112 5228208
3990 5228208 5322393 5419422 5537614 5630004 5708067 5752628 5866073 5973305 6084924 6208860
3980 6208860 6337273 6395047 6528941 6671034 6793379 6954311 7048155 7138777 7241421 7356271
3970 7356271 7508639 7623643 7795938 7960675 8106709 8270932 8437984 8610218 8790378 8956847
3960 8956847 9094495 9282486 9517597 9711240 9914394 10159593 10413628 10679547 10998479 11276803
3950 11276803 11635641 11965279 12328521 12721000 13137733 13580088 14057743 14573523 15085351
3941 15085351 15698862 16252515 16798284 17329587 17901192 18425309 18947284 19371857 19675033
3932 19675033 20085497 20500899 20975138 21413567 21851915 22439492 23038414 23790871 24571575
$$ packed form
4001D451540J08904N2477O1416P2548M5003K5294N8563J28271R1899N9197P3096
3990E228208R4185R7029J18192R2390P8063M4561J13445J07232J11619J23936
3980F208860J28413N7774J33894J42093J22345J60932R3844R0622J02644J14850
3970G356271J52368J15004J72295J64737J46034J64223J67052J72234J80160J66469
3960H956847J37648J87991K35111J93643K03154K45199K54035K65919L18932K78324
3950A1276803L58838L29638L63242L92479M16733M42355M77655N15780N11828
3941A5085351O13511N53653N45769N31303N71605N24117N21975M24573L03176
3932A9675033M10464M15402M74239M38429M38348N87577N98922P52457P80704
$$ plain form
3923 24571575 25384488 26250788 26964403 27729678 28405723 28943285 29526594 30124507 30702061
3914 30702061 31343405 32025793 32688069 33358880 34024866 34664544 35346067 36023345 36675262
3905 36675262 37337501 37949657 38557052 39169313 39799342 40531917 41490636 42602400 43895105
3896 43895105 45306652 46804845 48191698 49225603 49962902 50437154 50707123 50880438 51055279
3887 51055279 51394163 51789252 52166597 52514435 52826809 53251348 53707011 54198360 54775171
3878 54775171 55337308 55856839 56266424 56652600 57044792 57392116 57981244 58795421 59955775
3869 59955775 61427799 63044391 64825876 66649393 68373878 69789035 70895970 71834368
3861 71834368 72716614 73575010 74376178 75040810 75514633 75872568 76219733 76505754 76728164
$$ packed form
3923B4571575Q12913Q66300P13615P65275O76045N37562N83309N97913N77554
3914C0702061O41344O82388O62276O70811O65986O39678O81523O77278O51917
3905C6675262O62239O12156O07395O12261O30029P32575R58719J111764J292705
3896D3895105J411547J498193J386853J033905P37299M74252K69969J73315J74841
3887E1055279L38884L95089L77345L47838L12374M24539M55663M91349N76811
3878E4775171N62137N19531M09585L86176L92192L47324N89128Q14177J160354
3869E9955775J472024J616592J781485J823517J724485J415157J106935R38398
3861G1834368Q82246Q58396Q01168O64632M73823L57935L47165K86021K22410
$$ plain form
3852 76728164 76887726 76941458 76925406 76936982 77013581 77155599 77428984 77845460 78339636 78968602
3842 78968602 79619017 80259761 80689837 80895355 80798075 80494490 80078302 79642184 79330453 79223687
3832 79223687 79223286 79349700 79500399 79610907 79661707 79660834 79560883 79354359 79162185 78974851 78739984
3821 78739984 78418507 78067123 77602383 76984890 76393964 75825442 75233376 74501769 73544274
3812 73544274 72318811 71040852 69826961 68803214 68058570 67503838 67172200 66895259 66768217
3803 66768217 66536122 66203802 65732111 65149810 64502042 63839345 63122064 62468858 61773691
3794 61773691 61073128 60467702 59841150 59319585 58985923 58809191 58650604 58349576 57766726
3785 57766726 56813594 55497852 53965978 52423515 50951956 49584632 48328866 47155652
$$ packed form
3852G6728164J59562N3732j6052J1576P6599J42018K73385M16476M94176O28966
3842G8968602O50415O40744M30076K05518r7280l03585m16188m36118l11731j06766
3832G9223687m01J26414J50699J10508N0800q73r9951k06524j92174j87334k34867
3821G8739984l21477l51384m64740o17493n90926n68522n92066p31607r57495
3812G3544274j225463j277959j213891j023747p44644n54732l31638k76941j27042
3803F6768217k32095l32320m71691n82301o47768o62697p17281o53206o95167
3794F1773691p00563o05426o26552n21565l33662j76732j58587l01028n82850
3785E7766726r53132j315742j531874j542463j471559j367324j255766j173214
$$ plain form
3777 47155652 45986793 44827323 43533095 42199646 40925593 39611630 38345377 37212457
3769 37212457 36167071 35144388 34183858 33330125 32574442 31848525 31164554 30525285 29865709
3760 29865709 29192795 28461951 27630389 26778130 25810749 24927134 24166358 23425179 22745549
3751 22745549 22129866 21536650 20915590 20316146 19612760 19051284 18500031 17947180 17411922
3742 17411922 16871822 16283379 15734290 15189546 14556096 14008146 13427170 12881515 12424916
3733 12424916 11983224 11575483 11196668 10843058 10523445 10238914 9968497 9710849 9493111
3724 9493111 9279528 9023921 8753749 8534690 8313229 8051691 7842693 7662186 7455210 7223874
3714 7223874 7070525 6939360 6762276 6596417 6435561 6275134 6140021 6053927 5937869 5790653
$$ packed form
3777D7155652j168859j159470j294228j333449j274053j313963j266253j132920
3769C7212457j045386j022683r60530q53733p55683p25917o83971o39269o59576
3760B9865709o72914p30844q31562q52259r67381q83615p60776p41179o79630
3751B2745549o15683n93216o21060n99444p03386n61476n51253n52851n35258
3742A7411922n40100n88443n49089n44744o33450n47950n80976n45655m56599
3733A2424916m41692m07741l78815l53610l19613k84531k70417k57648k17738
3724I493111k13583k55607k70172k19059k21461k61538k08998j80507k06976k31336
3714G223874j53349j31165j77084j65859j60856j60427j35113q6094j16058j47216
$$ plain form
3704 5790653 5692447 5610720 5452467 5325238 5208370 5093819 4975978 4882226 4829312 4741803
3694 4741803 4629482 4602201 4569885 4486922 4386873 4367450 4341539 4274473 4267272 4289171 4271626
3683 4271626 4280266 4300614 4240051 4251697 4348423 4412107 4418977 4451541 4517577 4574540 4717877 4819448
3671 4819448 4969550 5115375 5334420 5506548 5761970 6017952 6302159 6569180 6758540 6885853
3661 6885853 6970013 7135993 7259092 7393208 7433518 7418050 7363739 7385247 7312108 6970804 6445921
3650 6445921 5834192 5310847 4899209 4577926 4284775 4095949 3952784 3760384 3592035 3501053
3640 3501053 3406479 3220262 3068274 2990278 2932368 2877340 2765726 2671603 2668820 2586849 2559053
3629 2559053 2547453 2462687 2418967 2389764 2301655 2269055 2247262 2212923 2219556 2208406 2166393 2090589
$$ packed form
3704E790653r8206q1727j58253j27229j16868j14551j17841r3752n2914q7509
3694D741803j12321k7281l2316q2963j00049j9423k5911o7066p201K1899j7545
3683D271626Q640K0348o0563J1646R6726O3684O870L2564O6036N6963J43337J01571
3671D819448J50102J45825K19045J72128K55422K55982K84207K67021J89360J27313
3661F885853Q4160J65980J23099J34116M0310j5468n4311K1508p3139l41304n24883
3650F445921o11729n23345m11638l21283k93151j88826j43165j92400j68349r0982
3640C501053r4574j86217j51988p7996n7910n5028j11614r4123k783q1971k7796
3629B559053j1600q4766m3720k9203q8109l2600k1793l4339O633j1150m2013p5804
$$ plain form
3617 2090589 2098936 2102314 2061933 2030600 2090279 2125650 2034246 1996406 1992454 1956029 1977835 1997400
3605 1997400 1982218 2008603 1968374 1941792 1904780 1931120 1942250 1925135 1915859 1947394 1951685 1889134
3593 1889134 1816871 1813771 1810022 1842219 1856039 1888013 1861223 1811198 1807830 1794894 1773092 1784234
3581 1784234 1778028 1780690 1752567 1720652 1689085 1652804 1626683 1621008 1595544 1618644 1638551 1646826
3569 1646826 1610458 1613788 1701799 1685553 1627849 1644937 1612075 1609926 1623224 1592533 1581932 1563615
3557 1563615 1560664 1538237 1580631 1582109 1601258 1512049 1480595 1443437 1499346 1469263 1460669 1441308
3545 1441308 1417355 1426955 1464312 1468753 1447261 1408738 1452133 1460083 1455389 1481661 1459724 1400039
3533 1400039 1376531 1348309 1384897 1423847 1350614 1332943 1374124 1394069 1301558 1297824 1292851 1302542
$$ packed form
3617B090589Q347L378m0381l1333N9679L5371r1404l7840l952l6425K1806J9565
3605A997400j5182K6385m0229k6582l7012K6340J1130j7115r276L1535M291o2551
3593A889134p2263l100l749L2197J3820L1974k6790n0025l368j2936k1802J1142
3581A784234o206K662k8123l1915l1567l6281k6121n675k5464K3100J9907Q275
3569A646826l6368L330Q8011j6246n7704J7088l2862k149J3298l0691j0601j8317
3557A563615k951k2427M2394J478J9149q9209l1454l7158N5909l0083q594j9361
3545A441308k3953R600L7357M441k1492l8523M3395P950m694K6272k1937n9685
3533A400039k3508k8222L6588L8950p3233j7671M1181J9945r2511l734m973R691
$$ plain form
3521 1302542 1331909 1275582 1270230 1283995 1268787 1282612 1284512 1301361 1256187 1216241 1219911 1253348
3509 1253348 1259777 1264889 1195004 1246554 1256900 1208383 1146430 1117936 1146386 1196602 1172338 1167797
3497 1167797 1133168 1108106 1102068 1098245 1119485 1086593 1073897 975645 992895 1056369 998068 1023218
3485 1023218 984573 995407 1013658 1032047 1033861 1016620 1022940 921780 932225 945545 932562 931282
3473 931282 931902 915456 925743 912678 916001 925120 925778 902386 923511 863996 846392 872330 924263
3460 924263 886162 886156 887415 821539 839514 877865 857166 843000 807909 770999 753854 738874 812451
3447 812451 825301 828376 844102 848964 852826 830813 806565 811935 799505 860637 879511 832206
3435 832206 835859 848001 860809 842102 817136 861888 817678 819878 779920 801805 807726 757062
$$ packed form
3521A302542K9367n6327n352J3765j5208J3825J900J6849m5174l9946L670L3437
3509A253348O429N112o9885N1550J0346m8517o1953k8494K8450N0216k4264m541
3497A167797l4629k5062o038l823K1240l2892j2696r8252J7250O3474n8301K5150
3485A023218l8645J0834J8251J8389J814j7241O320j01160J0445J3320j2983j280
3473I31282O20j6446J0287j3065L323R119O58k3392K1125n9515j7604K5938N1933
3460I24263l8101oJ259o5876J7975L8351k0699j4166l5091l6910j7145j4980P3577
3447H12451J2850L075J5726M862L862k2013k4248N370j2430O1132J8874m7305
3435H32206L653J2142J2808j8707k4966M4752m4210K200l9958K1885N921n0664
$$ plain form
3423 757062 789804 833087 802806 846090 890301 854819 838752 846932 863760 849794 872697 845256
3411 845256 871629 882448 901590 902514 923601 870182 892448 917845 899272 943199 973572 981596
3399 981596 938405 941517 945893 920037 955377 983281 960419 930367 968496 930171 979215 1075747
3387 1075747 1040822 1056107 1031988 1050014 1056804 1007449 1014156 1035531 1069900 1088276 1108955 1108755
3375 1108755 1142324 1168449 1166940 1186408 1176015 1205337 1218389 1272622 1295284 1309600 1302850 1282289
3363 1282289 1307648 1300899 1256564 1279515 1310072 1378991 1333408 1329968 1386288 1417706 1422485 1425139
3351 1425139 1495553 1521888 1532855 1532229 1579008 1605009 1546667 1558128 1578138 1610507 1666071 1731715
3339 1731715 1782907 1842807 1850006 1869750 1900897 1932539 1967451 1958084 1976313 1967418 2007821 2013460
$$ packed form
3423G57062L2742M3283l0281M3284M4211l5482j6067Q180J6828j3966K2903k7441
3411H45256K6373J0819J9142R24K1087n3419K2266K5397j8573M3927L0373Q024
3399I81596m3191L112M376k5856L5340K7904k2862l0052L8129l8325M9044R6532
3387A075747l4925J5285k4119J8026O790m9355O707K1375L4369J8376K0679k00
3375A108755L3569K6125j509J9468j0393K9322J3052N4233K2662J4316o750k0561
3363A282289K5359o749m4335K2951L0557O8919m5583l440N6320L1418M779K654
3351A425139P0414K6335J0967o26M6779K6001n8342J1461K0010L2369N5564O5644
3339A731715N1192N9900P199J9744L1147L1642L4912r367J8229q895M0403N639
$$ plain form
3327 2013460 1986146 2035716 2060598 2063936 2043254 2079324 2102711 2111647 2246787 2316342 2326813 2378429
3315 2378429 2400377 2398126 2451848 2526739 2588162 2643447 2803474 2823185 2882058 2973005 3101210
3304 3101210 3199131 3316573 3489129 3600229 3703385 3799740 3898897 3984217 4153298 4291496
3294 4291496 4407437 4601389 4855581 4989093 5120140 5272405 5451892 5609912 5684403 5827222
3284 5827222 5916763 5930201 5778162 5604899 5374327 5164018 4943514 4738327 4483543 4267954
3274 4267954 4096497 3920194 3786890 3669673 3584765 3502869 3408972 3321772 3285318 3194776 3129511
3263 3129511 3068768 3031707 2993406 2985849 2973675 2941767 2990208 3077888 3114575 3191983 3289185 3351418
3251 3351418 3349758 3270052 3078656 2837967 2695320 2571895 2498925 2392574 2307018 2274035 2168709
$$ packed form
3327B013460k7314M9570K4882L338k0682L6070K3387Q936J35140O9555J0471N1616
3315B378429K1948k251N3722P4891O1423N5285J60027J9711N8873R0947J28205
3304C101210R7921J17442J72556J11100J03156R6355R9157Q5320J69081J38198
3294D291496J15941J93952K54192J33512J31047J52265J79487J58020P4491J42819
3284E827222Q9541J3438j52039j73263k30572k10309k20504k05187k54784k15589
3274D267954j71457j76303j33304j17217q4908q1896r3897q7200l6454r0542o5265
3263C129511o0743l7061l8301p557j2174l1908M8441Q7680L6687P7408R7202O2233
3251C351418j660p9706j91396k40689j42647j23425p2970j06351q5556l2983j05326
$$ plain form
3240 2168709 2092560 2046577 2050958 2020680 2006945 1996269 1987682 1977259 2022123 2066465 2125161 2163649
3228 2163649 2183561 2278938 2346956 2441843 2573100 2692350 2891619 3108767 3314493 3379931
3218 3379931 3282507 3082630 2763503 2468734 2288746 2116093 1925618 1847608 1731275 1629231
3208 1629231 1582702 1487489 1438890 1416613 1357746 1352071 1344756 1344332 1346239 1337451 1290270 1349622 1414964
3195 1414964 1341308 1364222 1382651 1463484 1558272 1643520 1692518 1787114 1841768 1825062 1710417
3184 1710417 1576063 1419748 1293611 1210494 1127978 1125668 1086200 997645 974760 904449 878174
3173 878174 861549 854960 817614 743607 749747 761787 770412 749132 775909 776296 765666 733248 680828
3160 680828 668574 704108 677842 681947 645991 682059 670973 670417 692315 656915 635334 665963
$$ packed form
3240B168709p6149m5983M381l0278j3735j0676q587j0423M4864M4342N8696L8488
3228B163649J9912R5377O8018R4887J31257J19250J99269K17148K05726O5438
3218C379931r7424j99877l19127k94769j79988j72653j90475p8010j16333j02044
3208A629231m6529r5213m8599k2277n8867n675p315m24J907q788m7181N9352O5342
3195A414964p3656K2914J8429Q0833R4788Q5248M8998R4596N4654j6706j14645
3184A710417j34354j56315j26137q3117q2516k310l9468q8555k2885p0311k6275
3173H78174j6625o589l7346p4007O140J2040Q625k1280K6777L87j0630l2418n2420
3160F80828j2254L5534k6266M105l5956L6068j1086n56K1898l5400k1581L0629
$$ plain form
3148 665963 648426 621927 619246 597629 627056 639809 623451 573483 588851 596791 596813 615229 612319
3135 612319 615610 611658 620049 598384 616245 590519 581038 597361 610931 593190 552425 519157
3123 519157 484761 518742 513802 516634 539534 525237 537111 513193 538898 552403 588317 535585
3111 535585 517721 554659 554274 588931 564773 551741 557272 613964 611845 562082 543751 559411
3099 559411 531820 525809 538736 473535 468308 525482 545146 536289 509174 521728 501633 439975
3087 439975 366042 404611 418792 416047 406596 450629 558512 538300 475874 481260 481493 429784
3075 429784 461262 463626 500294 495015 473305 500557 444154 423507 451212 451043 398262 416129
3063 416129 448338 427063 417031 389946 435594 447152 445561 436400 449263 467212 459827 449450
$$ packed form
3148F65963j7537k6499k681k1617K9427J2753j6358m9968J5368P940K2J8416k910
3135F12319L291l952Q391k1665J7861k5726r481J6323J3570j7741m0765l3268
3123E19157l4396L3981m940K832K2900j4297J1874k3918K5705J3505L5914n2732
3111E35585j7864L6938l85L4657k4158j3032N531N6692k119m9763j8331J5660
3099E59411k7591o011J2927o5201n227N7174J9664q857k7115J2554k0095o1658
3087D39975p3933L8569J4181k745r451M4033J07883k0212o2426N386K33n1709
3075D29784L1478K364L6668n279k1710K7252n6403k0647K7705j69n2781J7867
3063D16129L2209k1275j0032k7085M5648J1558j591r161J2863J7949p385j0377
$$ plain form
3051 449450 422112 465489 451836 502815 522500 510973 464988 406433 487738 505072 511668 531333
3039 531333 489439 519283 534142 535038 554012 595028 628584 611574 609670 644833 616634 614751
3027 614751 637086 658311 680137 706195 677013 727213 786247 719837 755972 817655 811755 825343
3015 825343 812811 792634 795629 754901 765396 801729 809272 815236 804640 827550 836515 882379
3003 882379 910704 890011 927848 881515 846757 849138 844392 894812 947215 976326 1012528 1051074
2991 1051074 1108816 1157173 1220426 1261919 1264267 1167139 1148759 1186133 1206573 1239773 1222053 1222075
2979 1222075 1257753 1294101 1320310 1402852 1449355 1445654 1430458 1435475 1459192 1453266 1473385 1453527
2967 1453527 1453394 1475856 1426001 1395858 1421002 1410997 1454869 1430371 1491691 1544302 1570569 1604638
$$ packed form
3051D49450k7338M3377j3653N0979J9685j1527m5985n8555Q1305J7334O596J9665
3039E31333m1894K9844J4859Q96J8974M1016L3556j7010j904L5163k8199j883
3027F14751K2335K1225K1826K6058k9182N0200N9034o6410L6135O1683n900J3588
3015H25343j2532k0177K995m0728J0495L6333P543N964j0596K2910Q965M5864
3003H82379K8325k0693L7837m6333l4758K381m746N0420N2403K9111L6202L8546
2991A051074N7742M8357O3253M1493K348r7128j8380L7374K0440L3200j7720K2
2979A222075L5678L6348K6209Q2542M6503l701j5196N017K3717n926K0119j9858
2967A453527j33K2462m9855l0143K5144j0005M3872k4498O1320N2611K6267L4069
$$ plain form
2955 1604638 1628839 1683535 1683999 1730872 1788223 1784103 1818745 1906471 1928146 2002861 2031867 2055579
2943 2055579 2068910 2108159 2057964 2014918 1949964 1875117 1825314 1818808 1762770 1698023 1667234 1665037
2931 1665037 1657861 1628174 1643687 1708439 1730087 1722756 1742219 1742080 1740173 1681733 1723398 1811027
2919 1811027 1812971 1832161 1857039 1839128 1818267 1759960 1699930 1664697 1643706 1592189 1563762 1486434
2907 1486434 1425433 1365386 1322539 1301977 1295605 1276263 1252786 1197494 1199922 1238639 1245665 1181923
2895 1181923 1110504 1110234 1130925 1093347 1049968 991623 948279 920484 919694 902839 838567 787803
2883 787803 741927 678464 676025 714686 679596 671378 630967 592984 561066 505438 509843 520964
2871 520964 473418 467777 424733 416059 440666 466090 446545 386273 348154 403556 395664 374416
$$ packed form
2955A604638K4201N4696M64M6873N7351m120L4642Q7726K1675P4715K9006K3712
2943B055579J3331L9249n0195m3046o4954p4847m9803o506n6038o4747l0789k197
2931A665037p176k9687J5513O4752K1648p331J9463j39j907n8440M1665Q7629
2919A811027J944J9190K4878j7911k0861n8307o0030l5233k0991n1517k8427p7328
2907A486434o1001o0047m2847k0562o372j9342k3477n5292K428L8717P026o3742
2895A181923p1419k70K0691l7578m3379n8345m3344k7795p90j6855o4272n0764
2883G87803m5876o3463k439L8661l5090q218m0411l7983l1918n5628M405J1121
2871E20964m7546n641m3044q674K4607K5424j9545o0272l8119N5402p892k1248
$$ plain form
2859 374416 392068 402780 401188 370341 365019 365070 310434 262893 300860 272486 297310 290762 284492
2846 284492 285465 227143 249051 228612 217203 234488 241544 222833 198839 232026 248977 248535 244576
2833 244576 245988 201079 191384 248188 246052 194068 179033 164255 156624 160792 144752 164289 162490
2820 162490 197407 165421 148484 170449 125660 165489 132149 133300 146732 112441 73825 97339
2808 97339 119310 99200 100842 120825 114916 110531 138826 150750 169366 104836 65241 16097
2796 16097 29184 40261 63922 67871 76969 38084 -4186 45896 74183 38221 68781 52080
2784 52080 21413 36737 71205 96299 74643 55865 42648 34737 51657 84958 37578 13553
2772 13553 2325 23899 27227 77894 116384 87774 79955 65064 12325 27925 62019 76249
$$ packed form
2859C74416J7652J0712j592l0847n322N1n4636m7541L7967k8374K4824o548o270
2846B84492R73n8322K1908k0439j1409J7285P056j8711k3994L3187J6951m42l959
2833B44576J412m4909r695N6804k136n1984j5035j4778p631M168j6040J9537j799
2820A62490L4917l1986j6937K1965m4789L9829l3340J151J3432l4291l8616K3514
2808I7339K1971k0110J642J9983n909m385K8295J1924J8616o4530l9595m9144
2796A6097J3087J1077K3661L949R098l8885m2270N0082K8287l5962L0560j6701
2784E2080l0667J5324L4468K5094k1656j8778j3217p911J6920L3301m7380k4025
2772A3553j1228K1574L328N0667L8490k8610p819j4891n2739J5600L4094J4230
$$ plain form
2760 76249 57574 49777 26893 72149 50880 -11683 857 8209 24795 22350 -20325 -22403 33222
2747 33222 13515 32098 75172 42745 9426 -25606 -33064 -32260 11242 -11764 -65148 -51402
2735 -51402 -11976 -11268 -29722 22251 29050 16634 18426 36792 7756 -47919 -44838 5599 20021
2722 20021 -19322 -21570 -64160 -55710 -23571 22592 -13846 -32465 49325 31020 33155 33327 -4848
2709 -4848 -56531 -5238 -640 -22086 -30208 -17040 -12193 -12043 18672 2948 -17943 -7454 -31274
2696 -31274 18284 -19788 -20321 -9473 19368 23179 2375 43503 12371 -1780 -10280 20011 7006
2683 7006 3281 42008 29828 -12297 -39708 -8440 36632 35112 30948 -7736 -62273 -79337 -53865
2670 -53865 2269 -23652 -42007 -26729 -40812 -63777 -38448 -20497 -44699 -20888 -20039 -10915
$$ packed form
2760G6249j8675p797k2884M5256k1269o2563J2540P352J6586k445m2675k078N5625
2747C3222j9707J8583M3074l2427l3319l5032p458Q04M3502k3006n3384J3746
2735e1402L9426P08j8454N1973O799j2416J792J8366k9036n5675L081N0437J4422
2722B0021l9343k248m2590Q450L2139M6163l6438j8619Q1790j8305K135J72l8175
2709d848n1683N1293M598k1446q122J3168M847J50L0715j5724k0891J0489k3820
2696c1274M9558l8072n33J0848K8841L811k0804M1128l1132j4151q500L0291j3005
2683G006l725L8727j2180m2125k7411L1268M5072j520m164l8684n4537j7064K5472
2670e3865N6134k5921j8355J5278j4083k2965K5329J7951k4202K3811Q49R124
$$ plain form
2658 -10915 -39544 -6334 -66671 -91368 -79726 -67884 -58270 -4025 -4302 -18564 -44313 -64222
2646 -64222 -42627 -41371 -39653 -77730 -49866 -38998 -38383 -49073 -42200 29487 29142 5847 -69249
2633 -69249 -120557 -71051 -47895 -13132 -5012 -14046 -29210 -66778 -36911 -4159 34399 27215
2621 27215 -1801 38721 514 -17995 -29359 7442 -17737 -30320 -31122 -34829 -71164 -31425
2609 -31425 -1469 -36590 -13974 1775 893 -521 -17489 -11883 -49280 -70981 -39207 -69104 -11909
2596 -11909 14202 -59177 -43832 -58343 -40893 -45746 -39726 1304 -7680 32272 -53915 -69793
2584 -69793 -23642 8500 -41028 -23497 -28546 -1096 -50409 -70545 -17265 -346 -36410 -21834
2572 -21834 33746 -19048 -58702 -56845 -22942 8835 1039 -57979 -70257 -42284 -23395 7341
$$ packed form
2658a0915k8629L3210o0337k4697J1642J1842R614N4245k77j4262k5749j9909
2646f4222K1595J256J718l8077K7864J0868O15j0690O873P1687l45k3295p5096
2633f9249n1308M9506K3156L4763Q120r034j5164l7568K9867L2752L8558p184
2621B7215k9016M0522l8207j8509j1364L6801k5179j2583q02l707l6335L9739
2609c1425K9956l5121K2616J5749q82j414j6968N606l7397k1701L1774k9897N7195
2596a1909K6111p3379J5345j4511J7450m853O020M1030q984L9952q6187j5878
2584f9793M6151L2142m9528J7531n049K7450m9313k0136N3280J6919l6064J4576
2572b1834N5580n2794l9654J857L3903L1777p796n9018j2278K7973J8889L0736
$$ plain form
2560 7341 26827 -29287 -27812 -61420 -76035 -72504 -17670 2553 -31075 -50255 -52128 -20725 -17789
2547 -17789 -41335 3981 -12981 -57121 -47570 -34993 -45573 -76089 -61071 -2685 -37266 -16132
2535 -16132 14716 25610 22272 19850 -29648 -36736 -54671 -41027 19918 -9332 -41073 -27840
2523 -27840 -40494 -54285 -88446 -83207 -4284 -22 -3514 -50857 -81385 -48308 -80307 -116201
2511 -116201 -57247 -72297 -69164 -3347 -12508 -43082 -38890 -53038 -21796 -48629 -39709 -45459 -19209
2498 -19209 -28834 -6869 15510 37361 -993 -36098 -52994 -71596 -93164 -48256 -46514 -64968
2486 -64968 -25257 -26641 -39154 -44196 -49602 -31144 -42639 -80910 -85187 -41279 -18540 -52952 -40888
2473 -40888 2527 10081 -40482 -51371 -46346 -52241 -52984 -41973 -68120 -47244 -41089 -1656 11325
$$ packed form
2560G341J9486n6114J475l3608j4615L531N4834K0223l3628j9180j873L1403K936
2547a7789k3546M5316j6962m4140R551J2577j0580l0516J5018N8386l4581K1134
2535a6132L0848J0894l338k422m9498p088j7935J3644O0945k9250l1741J3233
2523b7840j2654j3791l4161N239P8923M262l492m7343l0528L3077l1999l5894
2511a16201N8954j5050L133O5817r161l0574M192j4148L1242k6833Q920n750K6250
2498a9209r625K1965K2379K1851l8354l5105j6896j8602k1568M4908J742j8454
2486f4968L9711j384j2513n042n406J8458j1495l8271m277M3908K2739l4412J2064
2473d0888M3415P554n0563j0889N025n895p43J1011k6147K0876O155L9433J2981
$$ plain form
2460 11325 -7681 -65484 -79166 -24595 20344 -26016 -45932 -106873 -107159 -74988 -48103 -91868
2448 -91868 -97525 -56123 -28733 -54734 -30271 6173 3893 10708 10620 -862 -9677 -1535 33585
2435 33585 81418 -17808 -30485 43158 34801 20362 -22776 -58762 -68131 -59847 2013 -1505 -1908
2422 -1908 -26018 8995 30796 31986 -23332 -7612 18919 3044 -57655 6660 35391 7886
2410 7886 32707 32966 41318 -3109 -25427 -63877 -45666 -19777 -9730 -49879 -56218 -22538 -17622
2397 -17622 10497 -19365 -46054 41577 38927 24704 21180 28997 64620 39009 7681 -44283
2385 -44283 -60244 -44298 -69600 -60410 -61634 -107090 -50116 11381 -9297 -87848 -58130 -94767
2373 -94767 -76637 -63185 -57123 -59847 -89105 -83089 -77852 -67911 -92551 -47545 -28366 1162 -6284
$$ packed form
2460A1325j9006n7803j3682N4571M4939m6360j9916o0941k86L2171K6885m3765
2448i1868n657M1402K7390k6001K4463L6444k280O815q8j1482q815Q142L5120
2435C3585M7833r9226j2677P3643q357j4439m3138l5986r369Q284O1860l518m03
2422a908k4110L5013K1801J190n5318J5720K6531j5875o0699O4315K8731k7505
2410G886K4821K59Q352m4427k2318l8450J8211K5889J0047m0149o339L3680M916
2397a7622K8119k9862k6689Q7631k650j4223l524P817L5623k5611l1328n1964
2385d4283j5961J5946k5302R190j224m5456N6974O1497k0678p8551K9718l6637
2373i4767J8130J3452O062k724k9258O016N237R941k4640M5006J9179K9528p446
$$ plain form
2360 -6284 2684 -5019 4038 50716 18766 -50305 -55343 -36275 -55688 -71365 -91101 -62196 5167
2347 5167 4119 -17374 -74670 -69386 -56114 -127427 -63564 -70157 -34454 -36519 9775 26413 555
2334 555 -43918 -54388 -11921 -5197 -40648 -79310 -20499 30092 -21429 -9286 -12861 -60054 -38331
2321 -38331 -23210 -39328 -6405 8682 -81689 -34626 29478 -14380 -61211 6736 -47283 -3186
2309 -3186 14209 -5359 -45264 -11739 -37892 20051 15231 -31425 -48027 2300 -19206 -33373
2297 -33373 23280 24753 646 -20617 -15382 -43940 -33958 -14912 -23128 -26401 13770 36261 7809
2284 7809 53204 51794 29167 69558 32815 20964 27761 -4232 14801 27728 27592 18352 4071
2271 4071 46980 33781 42844 42007 -1910 -8992 15302 -42898 -48770 -14639 32900 64059 55634
$$ packed form
2360f284Q968p703R057M6678l1950o9071n038J9068j9413j5677j9736K8905O7363
2347E167j048k1493n7296N284J3272p1313O3863o593L5703k065M6294J6638k5858
2334E55m4473j0470M2467O724l5451l8662N8811N0591n1521J2143l575m7193K1723
2321c8331J5121j6118L2923J5087r0371M7063O4104m3858m6831O7947n4019M4097
2309c186J7395j9568l9905L3525k6153N7943m820m6656j6602N0327k1506j4167
2297c3373N6653J473k4107k1263N235k8558R982J9046q216l273M0171K2491k8452
2284G809M5395j410k2627M0391l6743j1851O797l1993J9033J2927j36r240j4281
2271D071M2909j3199R063q37m3917p082K4294n8200n872L4131M7539L1159q425
$$ plain form
2258 55634 39420 4250 1997 48941 -14791 326 -26290 27131 102451 23561 -11786 5004
2246 5004 26404 37118 55561 90316 91673 108479 113680 157161 150339 116652 68761 71072 154711
2233 154711 134285 116660 124750 92162 118735 100509 91007 162490 129739 144408 173160 133803
2221 133803 153044 130564 150359 165100 173207 178919 176274 210333 191923 152409 160550 149831
2209 149831 202889 181633 175061 256553 266921 323877 274573 287342 299753 310630 279009 288259
2197 288259 282184 271791 303542 263818 218319 274425 348812 324887 345983 316546 340147 372752
2185 372752 360647 365480 421870 468410 491100 502955 512743 575457 613900 583166 582063 567511
2173 567511 603994 629667 673099 720475 742129 764476 812928 887202 958910 1079840 1196071
$$ packed form
2258E5634j6214l5170k253M6944o3732J5117k6616N3421P5320p8890l5347J6790
2246E004K1400J0714J8443L4755J357J6806N201M3481o822l3687m7891K311Q3639
2233A54711k0426j7625Q090l2588K6573j8226r502P1483l2751J4669K8752l9357
2221A33803J9241k2480J9795J4741Q107N712k645L4059j8410l9514Q141j0719
2209A49831N3058k1256o572Q1492J0368N6956m9304J2769J2411J0877l1621R250
2197B88259o075j0393L1751l9724m5499N6106P4387k3925K1096k9437K3601L2605
2185C72752j2105M833N6390M6540K2690J1855R788O2714L8443l0734j103j4552
2173E67511L6483K5673M3432M7376K1654K2347M8452P4274P1708J20930J16231
$$ plain form
2162 1196071 1223436 1302946 1436386 1536425 1604910 1772603 1997689 2224570 2441058 2680985
2152 2680985 3022675 3413854 3951460 4584008 5276974 5899638 6386555 6841865 6940312 5909676
2142 5909676 4731782 3791101 3052425 2601508 2268841 1912220 1675045 1539786 1329351
2133 1329351 1224156 1155062 1070334 982211 900818 778489 723860 692998 598413 574333 494455
2122 494455 473260 425580 388894 386283 407287 453437 393174 322962 277640 295800 303335 336827
2110 336827 286288 250471 206722 193508 196163 243998 210895 160021 122398 130936 133703 135025
2098 135025 112227 136216 167554 164515 154089 177185 180680 147172 142368 146516 117834 53090
2086 53090 43319 68730 44927 16728 19776 60708 105319 54100 40045 56454 51895 20170
$$ packed form
2162A196071K7365P9510J33440J00039O8485J67693K25086K26881K16488K39927
2152B680985L41690L91179N37606O32548O92966O22664M86917M55310R8447j030636
2142E909676j177894r40681p38676m50917l32667l56621k37175j35259k10435
2133A329351j05195o9094q4728q8123q1393j22329n4629l0862r4585k4080p9878
2122D94455k1195m7680l6686k611K1004M6150o0263p0212m5322J8160P535L3492
2110C36827n0539l5817m3749j3214K655M7835l3103n0874l7623Q538K767J322
2098A35025k2798K3989L1338l039j0426K3096L495l3508m804M148k8682o4744
2086E3090r771K5411k3803k8199L048M0932M4611n1219j4055J6409m559l1725
$$ plain form
2074 20170 42795 54753 12940 13203 2633 21387 53820 56294 63548 74174 83030 60796 57503
2061 57503 42091 34410 26737 9266 27578 45969 46155 61429 62773 49447 83975 94874 31748
2048 31748 44772 -25815 -31171 -7799 4605 -20816 45070 -11517 9295 8337 -35729 -23217
2036 -23217 -26466 27744 -5654 3904 -9188 9256 -26512 15650 15858 25209 32035 62617 24220
2023 24220 20011 58451 22423 23385 -7092 5872 16271 -33439 -39758 -13458 -78366 -61884 54605
2010 54605 -1448 -15769 36092 9966 -15230 -26907 -6113 10697 45961 21770 31294 -10685
1998 -10685 -51339 -47841 -65290 -11874 13221 -23602 -53773 -50043 -54282 -76736 -97003 -72572
1986 -72572 -20411 -1016 -4428 7147 -15235 -5851 -16791 -45477 -72134 -91585 -29959 -61341
$$ packed form
2074B0170K2625J1958m1813K63j0570J8754L2433K474P254J0626Q856k2234l293
2061E7503j5412p681p673j7471J8312J8391J86J5274J344j3326L4528J0899o3126
2048C1748J3024p0587n356K3372J2404k5421O5886n6587K0812r58m4066J2512
2036b3217l249N4210l3398R558j3092J8444l5768M2162K08R351O826L0582l8397
2023B4220m209L8440l6028R62l0477J2964J0399m9710o319K6300o4908J6482J16489
2010E4605n6053j4321N1861k6126k5196j1677K0794J6810L5264k4191R524m1979
1998a0685m0654L498j7449N3416K5095l6823l0171L730m239k2454k0267K4431
1986g2572N2161J9395l412J1575k2382R384j0940k8686k6657j9451O1626l1382
$$ plain form
1974 -61341 -103759 -88332 -67034 -69131 -58459 -40751 -30298 13785 -12539 -19798 -35078 -45034
1962 -45034 -3599 38775 26430 39820 -1998 -48183 -29526 -11085 -41654 -25649 -19661 -924
1950 -924 -37933 -33162 -25310 13654 -4693 -82035 -69584 -80351 -62956 -11965 -46391 -83860 -84455
1937 -84455 -69772 -60574 -27042 19568 -30560 -20766 11727 16956 2702 -43543 -73046 -53288
1925 -53288 -88515 -100302 -67503 -37000 8094 -16520 -21144 -26045 -38852 -45030 -42852 -31665 -54302
1912 -54302 -78722 -58186 -8014 7917 -22921 -45106 -93355 -89966 -32766 -19935 -25763 -45394
1900 -45394 -22679 -50254 -58450 -73185 -79666 -72620 -18797 -17781 38649 41964 14089 3668 -29113
1887 -29113 7067 12434 4480 38279 -4120 53433 33150 20961 19754 -7729 32317 39109 6438
$$ packed form
1974f1341m2418J5427K1298k097J0672J7708J0453M4083k6324p259j5280r956
1962d5034M1435M2374j2345J3390m1818m6185J8657J8441l0569J6005N988J8737
1950i24l7009M771P852L8964j8347p7342J2451j0767J7395N0991l4426l7469n95
1937h4455J4683R198L3532M6610n0128R794L2493N229j4254m6245k9503J9758
1925e3288l5227j1787L2799L0503M5094k4614m624m901j2807o178K178J1187k2637
1912e4302k4420K0536N0172J5931l0838k2185m8249L389N7200J2831n828j9631
1900d5394K2715k7575q196j4735o481P046N3823J016N6430L315k7875j0421l2781
1887b9113L6180N367p954L3799m2399N7553k0283j2189j207k7483M0046O792l2671
$$ plain form
1874 6438 -43317 -25366 -9734 -17113 -34034 -7004 -15872 -64885 -73866 -91593 -85934 -45846 -90275
1861 -90275 -75479 -72994 -80901 -54028 -28979 -43348 -51745 -21256 -5381 -35669 -40368 -9362 -13148
1848 -13148 7715 5727 -29543 -50582 17614 27079 -35699 -78720 -72416 -42295 -44467 -58410 -56132
1835 -56132 -56318 -9062 -1494 -12344 -42910 -25242 -26693 -25548 -23189 -73331 -21067 14352 -40061
1822 -40061 -28811 -161 -14760 -65632 -43619 -21365 14222 37249 6052 -36122 -32015 -24985
1810 -24985 -47631 -58032 -31384 -41634 -57081 -28249 -11005 -14271 -36008 42577 14851 -7610
1798 -7610 -15786 -45051 -83346 -63656 -32567 11350 -46164 -57839 -79219 -91201 -59169 -75217
1786 -75217 -61976 -52477 -77578 -135168 -99508 -68125 -110422 -124831 -61601 -49168 -52949 -22480
$$ packed form
1874F438m9755J7951J5632p379j6921K7030q868m9013q981j7727N659M0088m4429
1861i0275J4796K485p907K6873K5049j4369q397L0489J5875l0288m699L1006l786
1848a3148K0863j988l5270k1039O8196R465o2778m3021O304L0121k172j3943K278
1835e6132j86M7256P568j0850l0566J7668j451J145K359n0142N2264L5419n4413
1822d0061J1250K8650j4599n0872K2013K2254L5587K3027l1197m2174M107P030
1810b4985k2646j0401K6648j0250j5447K8832J7244l266k1737P8585k7726k2461
1798g610q176k9265l8295J9690L1089M3917n7514j1675k1380j1982L2032j6048
1786g5217J3241R499k5101n7590L5660L1383m2297j4409O3230J2433l781L0469
$$ plain form
1774 -22480 -25131 -1354 -8909 -8996 -31704 -14250 -40457 -7371 16304 -46217 -2527 3123 -44199
1761 -44199 -47243 -65411 -42321 -60415 2749 26477 -4935 -33049 -75225 -2841 87592 28630
1749 28630 32605 7455 -4895 8369 -19567 -41025 -53843 -33695 9830 -16355 -66792 -41189
1737 -41189 17167 -35832 -12452 28790 -4710 14975 21197 -62 -559 -17258 -12765 -51840 -52564
1724 -52564 -19010 -17966 34413 16807 -30876 -34214 -17813 -16908 -14751 11258 16357 -15380 8914
1711 8914 11247 53093 3652 -40085 -53467 -95389 -88038 -10048 -48360 -56674 -14529 -16167 -41175
1698 -41175 -34923 -72663 -9343 16874 9756 8342 -7604 -46439 -15870 -14708 -7023 -11375 33330
1685 33330 -2258 -1949 8829 -19538 -14272 -16716 -72779 -103804 -86724 -32340 -77229 -55399 -35831
$$ packed form
1774b2480k651K3777p555q7k2708J7454k6207L3086K3675o2521M3690N650m7322
1761d4199l044j8168K3090j8094O3164K3728l1412k8114m2176P2384R0433n8962
1749B8630L975k5150j2350J3264k7936k1458j2818K0148M3525k6185n0437K5603
1737d1189N8356n2999K3380M1242l3500J9685O222k1259m97j6699M493l9075p24
1724e2564L3554J044N2379j7606m7683l338J6401R05K157K6009N099l1737K4294
1711H914K333M1846m9441m3737j3382m1922P351P7990l8312q314M2145j638k5008
1698d1175O252l7740O3320K6217p118j414j5946l8835L0569J162P685m352M4705
1685C3330l5588L09J0778k8367N266k444n6063l1025J7080N4384m4889K1830J9568
$$ plain form
1672 -35831 -18915 -41483 1887 -9845 -44231 36471 25518 10615 9048 6118 -12345 -41416
1660 -41416 -41349 -17573 -81864 -58520 -59842 -656 1199 16280 61514 43493 20307 -24915 -10486
1647 -10486 -1646 -56433 -33050 -27518 -60335 -48729 10282 3466 875 16699 -9536 -16430 -25944
1634 -25944 2235 85988 49635 -31704 -24520 5242 -33953 -32853 -41329 28977 14593 -27436
1622 -27436 -62379 -8635 1791 -22143 -16588 -23224 -22417 -30649 -2245 41304 9322 -93930 -38398
1609 -38398 -35462 -3644 -1230 -99817 -83308 -69228 -95615 -46224 7042 -16175 27371 27422 34119
1596 34119 3555 41992 49992 -14570 -42685 -44649 -36361 -29537 -24936 36952 9980 34245 -20166
1583 -20166 -24820 -11355 -55300 -83807 -74105 -12082 23505 42372 -2880 -10254 -6042 -18242 -16479
$$ packed form
1672c5831J6916k2568M3370j1732l4386Q0702j0953j4903j567k930j8463k9071
1660d1416O7K3776o4291K3344j322N9186J855J5081M5234j8021k3186m5222J4429
1647a0486Q840n4787K3383N532l2817J1606N9011o816k591J5824k6235o894r514
1634b5944K8179Q3753l6353q1339P184K9762l9195J100q476P0306j4384m2029
1622b7436l4943N3744J0426k3934N555o636Q07q232K8404M3549l1982j03252N5532
1609c8398K936L1818K414r8587J6509J4080k6387M9391N3266k3217M3546N1O697
1596C4119l0564L8437Q000o4562k8115j964Q288O824M601O1888k6972K4265n4411
1583b0166m654J3465m3945k8507R702O2023L5587J8867m5252p374M212j2200J763
$$ plain form
1570 -16479 -20921 -11707 24188 24240 -20167 -17066 24031 -46520 -18924 -59649 -49354 -27439 -4463
1557 -4463 32592 20817 -26588 13471 -25069 -40183 -58532 -81539 -31897 -4375 -77662 -77662 -31988
1544 -31988 30743 8954 -21403 -1254 -17435 -1244 -2537 -7902 30505 25692 -17322 -23994 -22401
1531 -22401 -13020 -20308 -63800 -44802 10079 15852 -13963 -21678 -26139 -652 -12452 -28033 23797
1518 23797 7131 12217 -42884 -54638 -34053 14003 -15781 -15483 -6638 -6186 -2751 12286 -21222
1505 -21222 -69223 -40634 -74867 -59778 -42985 -24639 -56521 -62167 -44863 -57109 -23873 43503
1493 43503 34161 -10538 -16488 -6428 -40887 -34835 -11223 3339 -46535 -33450 -18347 -17399 -4516
1480 -4516 6693 114863 59829 3186 13329 11456 -19355 -41428 -22461 17243 -30003 -9263
$$ packed form
1570a6479m442R214L5895N2m4407L101M1097p0551K7596m0725J0295K1915K2976
1557d463L7055j1775m7405M0059l8540j5114j8349k3007M9642K7522p3287%M5674
1544c1988O2731k1789l0357K0149j6181J6191j293n365L8407m813m3014o672J593
1531b2401R381p288m3492J8998N4881N773k9815p715m461K5487j1800j5581N1830
1518B3797j6666N086n5101j1754K0585M8056k9784K98Q845M52L435J5037l3508
1505b1222m8001K8589l4233J5089J6793J8346l1882n646J7304j2246L3236O7376
1493D3503r342m4699n950J0060l4459O052K3612J4562m9874J3085J5103R48J2883
1480d516J1209J08170n5034n6643J0143j873l0811k2073J8967L9704m7246K0740
$$ plain form
1468 -9263 -19666 -10133 14889 2162 4390 90577 70202 18266 11775 2481 40516 38677 47398
1455 47398 25625 10733 20688 35709 14014 -38037 -12480 -16879 -20546 -13397 -26183 15865 -16316
1442 -16316 -37109 -53861 -30196 -12660 -47804 -48490 -35524 16271 -7162 -34076 -24459 -64882
1430 -64882 -42790 -47343 -46833 -37724 -36176 10478 44486 5563 21256 -19150 -20414 29060 -40235
1417 -40235 -22991 1176 -5076 6689 -5793 -14213 19515 22519 28867 59730 75398 12796 -509
1404 -509 10109 -6283 910 -11314 -13081 35947 67317 20260 25993 11785 -53372 -35389 -8881
1391 -8881 -64247 -70751 -41687 -22852 9508 9372 8873 -9978 -43497 -8016 12840 34241 -4535
$$ packed form
1468i263j0403R533K5022j2727K228Q6187k0375n1936o491r294L8035j839Q721
1455D7398k1773j4892R955J5021k1695n2051K5557m399l667P149j2786M2048l2181
1442a6316k0793j6752K3665J7536l5144o86J2966N1795k3433k6914R617m0423
1430f4882K2092m553N10R109J548M6654L4008l8923J5693m0406j264M9474o9295
1417d0235J7244K4167o252J1765j2482q420L3728L004O348L0863J5668o2602j3305
1404e09J0618j6392P193j2224j767M9028L1370m7057N733j4208o5157J7983K6508
1391h881n5366o504K9064J8835L2360j36m99j8851l3519L5481K0856K1401l8776
$$ [...]
##END NTUPLES=NMR SPECTRUM
##END=
