##TITLE=1H_CG-1199
 CDCl3
 8 sc, 
 4.4.2024
##JCAMPDX= 6.0         $$ Bruker NMR JCAMP-DX V2.0
##DATA TYPE= NMR SPECTRUM
##DATA CLASS= NTUPLES
##ORIGIN= UXNMR, Bruker Analytische Messtechnik GmbH
##OWNER= root
$$ XWIN-NMR		Version 3.5
$$ Thu Apr  4 14:31:21 2024 Russian Standard Time (UT+4h)  she@DPX200
##.OBSERVE FREQUENCY= 200.1309
##.OBSERVE NUCLEUS= ^1H
##.ACQUISITION MODE= SIMULTANEOUS
##.ACQUISITION SCHEME= undefined
##.AVERAGES= 8
##.DIGITISER RES= 18
##SPECTROMETER/DATA SYSTEM= spect
##.PULSE SEQUENCE= zg30
##.SOLVENT NAME= MeOD
##.SHIFT REFERENCE= (INTERNAL, MeOD, 0, 15.6885)
##AUDIT TRAIL= $$ (NUMBER, WHEN, WHO, WHERE, WHAT)
$$ ##TITLE= Audit trail, XWIN-NMR		Version 3.5
$$ ##JCAMPDX= 5.01
$$ ##ORIGIN= Bruker BioSpin GmbH
$$ ##OWNER= she
$$ F:/spectra/data/she/nmr/H-F/1/pdata/1/auditp.txt
$$ ##AUDIT TRAIL=  $$ (NUMBER, WHEN, WHO, WHERE, WHAT)
(   1,<2024-04-04 14:30:17.62 +0400>,<she>,<DPX200>,
      <created by zg, POWCHK disabled, PULCHK disabled
       configuration hash MD5:
       00 E9 B6 7A A2 85 ED C7 34 08 36 98 17 FE 4E 26
       data hash MD5: 16K
       E8 D3 49 33 CE 65 37 59 C9 E0 9E A3 B8 0B 62 4F>)
(   2,<2024-04-04 14:30:23.64 +0400>,<she>,<DPX200>,
      <Start of raw data processing
       efp BC_mod = 2 LB = 0.24 FT_mod = 6 PKNL = 1 PHC0 = -25303.42 PHC1 = 16.78731 SI = 16K 
       data hash MD5: 16K
       94 8B 8A 89 03 98 F2 1D C7 76 F5 AE 40 01 DA A9>)
(   3,<2024-04-04 14:30:39.76 +0400>,<she>,<DPX200>,
      <pk PHC0 = 5.484466 PHC1 = -9.2 
       data hash MD5: 16K
       4F C9 F6 CE 37 1B 8F B0 9D 3C B3 E2 5C 81 59 2D>)
(   4,<2024-04-04 14:30:43.20 +0400>,<she>,<DPX200>,
      <abs ABSG = 5 
       data hash MD5: 16K
       A8 85 3C 6A 32 14 C5 59 A6 4E B9 E9 81 7D DF 0C>)
$$ ##END=
$$ 
$$ hash MD5
$$ 0F 65 6C 45 9D 61 45 0B 6A A2 34 F8 65 79 E3 D4
##$RELAX= 
##$RELAX= 
##$RELAX= 
##$RELAX= 
##$RELAX= 
##$RELAX= 
$$ Bruker specific parameters
$$ --------------------------
##$DU= <F:/spectra>
##$EXPNO= 1
##$NAME= <H-F>
##$PROCNO= 1
##$TYPE= <nmr>
##$USER= <she>
##$AMP= (0..31)
100 100 100 100 100 100 100 100 100 100 100 100 100 100 100 100 100 100 
100 100 100 100 100 100 100 100 100 100 100 100 100 100 
##$AQSEQ= 0
##$AQ_mod= 1
##$AUNM= <au_zg>
##$AUTOPOS= <>
##$BF1= 200.13
##$BF2= 200.13
##$BF3= 200.13
##$BF4= 200.13
##$BF5= 200.13
##$BF6= 200.13
##$BF7= 200.13
##$BF8= 200.13
##$BYTORDA= 1
##$CFDGTYP= 0
##$CFRGTYP= 5
##$CHEMSTR= <none>
##$CNST= (0..31)
1 1 145 1 1 1 1 1 1 1 1 1 1 1 1 1 1 1 1 1 1 1 1 1 1 1 1 1 1 1 1 1 
##$CPDPRG= <>
##$CPDPRG1= <>
##$CPDPRG2= <>
##$CPDPRG3= <>
##$CPDPRG4= <mlev>
##$CPDPRG5= <mlev>
##$CPDPRG6= <mlev>
##$CPDPRG7= <mlev>
##$CPDPRG8= <mlev>
##$CPDPRGB= <>
##$CPDPRGT= <>
##$D= (0..31)
0 1.2 0 0 0 0 0 0 0 0.06 0 0.03 0 0 0 0 0.0002 0 0 0 0 0 0 0 0 0 0 0 0 
0 0 0 
##$DATE= 1712226617
##$DBL= (0..7)
120 120 120 120 120 120 120 120 
##$DBP= (0..7)
150 150 150 150 150 150 150 150 
##$DBP07= 0
##$DBPNAM0= <>
##$DBPNAM1= <>
##$DBPNAM2= <>
##$DBPNAM3= <>
##$DBPNAM4= <>
##$DBPNAM5= <>
$$ [...]
##$SUBNAM3= <"">
##$SUBNAM4= <"">
##$SUBNAM5= <"">
##$SUBNAM6= <"">
##$SUBNAM7= <"">
##$SUBNAM8= <"">
##$SUBNAM9= <"">
##$SW= 18.0517689322627
##$SWIBOX= (0..15)
0 0 2 0 0 0 0 0 0 0 0 0 0 0 0 0 
##$SW_h= 3612.71676300578
##$TD= 16384
##$TD0= 1
##$TE= 0
##$TE2= 300
##$TE3= 300
##$TEG= 300
##$TL= (0..7)
0 120 120 120 120 120 120 120 
##$TP= (0..7)
150 150 150 150 150 150 150 150 
##$TP07= 0
##$TPNAME0= <>
##$TPNAME1= <>
##$TPNAME2= <>
##$TPNAME3= <>
##$TPNAME4= <>
##$TPNAME5= <>
##$TPNAME6= <>
##$TPNAME7= <>
##$TPOAL= (0..7)
0.5 0.5 0.5 0.5 0.5 0.5 0.5 0.5 
##$TPOFFS= (0..7)
0 0 0 0 0 0 0 0 
##$TUNHIN= 0
##$TUNHOUT= 0
##$TUNXOUT= 0
##$USERA1= <user>
##$USERA2= <user>
##$USERA3= <user>
##$USERA4= <user>
##$USERA5= <user>
##$V9= 5
##$VALIST= <valist>
##$VCLIST= <CCCCCCCCCCCCCCC>
##$VD= 0
##$VDLIST= <DDDDDDDDDDDDDDD>
##$VPLIST= <PPPPPPPPPPPPPPP>
##$VTLIST= <TTTTTTTTTTTTTTT>
##$WBST= 1024
##$WBSW= 4
##$XGAIN= (0..3)
0 0 0 0 
##$XL= 0
##$YL= 0
##$YMAX_a= 571282
##$YMIN_a= -635382
##$ZGOPTNS= <>
##$ZL1= 120
##$ZL2= 120
##$ZL3= 120
##$ZL4= 120
##$ABSF1= 15.65548
##$ABSF2= -2.396409
##$ABSG= 5
##$ABSL= 3
##$ALPHA= 0
##$AQORDER= 0
##$ASSFAC= 0
##$ASSFACI= 0
##$ASSFACX= 0
##$ASSWID= 0
##$AUNMP= <proc_1d>
##$AZFE= 0.1
##$AZFW= 0.1
##$BCFW= 0
##$BC_mod= 2
##$BYTORDP= 0
##$COROFFS= 0
##$CY= -3
##$DATMOD= 1
##$DC= 0
##$DFILT= <>
##$DTYPP= 0
##$F1P= 0
##$F2P= 0
##$FCOR= 1
##$FTSIZE= 16384
##$FT_mod= 6
##$GAMMA= 0
##$GB= 0
##$INTBC= 1
##$INTSCL= 3.70164e-10
##$ISEN= 128
##$LB= 0.24
##$LEV0= 0
##$LPBIN= 0
##$MAXI= 10000
##$MC2= 0
##$MEAN= 0
##$ME_mod= 0
##$MI= 1.114404
##$NCOEF= 0
##$NC_proc= -5
##$NLEV= 6
##$NOISF1= 3.799351
##$NOISF2= 2.8
##$NSP= 0
##$NTH_PI= 0
##$NZP= 0
##$OFFSET= 15.68853
##$PC= 1
##$PHC0= -25297.94
##$PHC1= 7.58731
##$PH_mod= 1
##$PKNL= yes
##$PPARMOD= 0
##$PSCAL= 0
##$PSIGN= 0
##$REVERSE= no
##$SF= 200.129566621028
##$SI= 16384
##$SIGF1= 3
##$SIGF2= 2
##$SINO= 5.538805
##$SIOLD= 16384
##$SREGLST= <1H.CDCl3>
##$SSB= 0
##$STSI= 16384
##$STSR= 0
##$SW_p= 3612.71676300577
##$SYMM= 0
##$S_DEV= 0
##$TDeff= 16384
##$TDoff= 0
##$TI= <>
##$TILT= no
##$TM1= 0
##$TM2= 0
##$TOPLEV= 0
##$USERP1= <user>
##$USERP2= <user>
##$USERP3= <user>
##$USERP4= <user>
##$USERP5= <user>
##$WDW= 1
##$XDIM= 16384
##$YMAX_p= 460963063
##$YMIN_p= -206573
$$ End of Bruker specific parameters
$$ ---------------------------------
##NTUPLES= NMR SPECTRUM
##VAR_NAME=  FREQUENCY,     SPECTRUM/REAL,   SPECTRUM/IMAG
##SYMBOL=    X,             R,               I
##VAR_TYPE=  INDEPENDENT,   DEPENDENT,       DEPENDENT
##VAR_FORM=  AFFN,          ASDF,            ASDF
##VAR_DIM=   16384,         16384,           16384
##UNITS=     HZ,            ARBITRARY UNITS, ARBITRARY UNITS
##FACTOR=    0.220516191357247, 1,           1
##FIRST=     3139.73870346923, 0,            0
##LAST=      -472.978059536542, 0,           0
##MIN=       -472.978059536542, -206573,     0
##MAX=       3139.73870346923, 460963063,    0
$$ Real data points
##PAGE= N=1
##DATA TABLE= (X++(R..R)), XYDATA
$$ [...]
7993E5730L5410q692j0548K3485l8526J5380p866j7894N849K2286l8949K5079
$$ 55730 91140 82448 71900 95385 56859 72239 64373 46479 52328 74614 35665 60744
7981F0744k0163n4822j4572K6318j0973K1227M2181J402j6377J1761L2430n1264
$$ 60744 40581 -14241 -28813 -2495 -13468 7759 49940 51342 34965 46726 79156 27892
7969B7892L6029j2757j4546M3868L2322l034q432k7654L3759k922k8652q209k9327
$$ 27892 63921 51164 36618 80486 112808 109774 101342 73688 107447 104525 75873 67664 38337
7956C8337k8392M5848K5304k1771P529O9438m2689k0730L8547K8545L503Q430
$$ 38337 9945 55793 81097 59326 66855 136293 93604 72874 111421 139966 143469 151899
7944A51899n12K7400K179L3830R732K2071J1419k2751q0243n2878K6186j1953
$$ 151899 151387 178787 180966 214796 224528 246599 258018 235267 155024 102146 128332 116379
7932A16379j9379p127q138O8245J4179M686l2260n5122L8143M1969m1834l0980
$$ 116379 97000 89873 81735 149980 164159 168845 136585 81463 119606 161575 119741 88761
7920H8761O4881l0875n6092K0886K2570K0391N2648R687l4985J5969K2928r689
$$ 88761 153642 122767 66675 87561 110131 130522 183170 192857 157872 173841 196769 187080
7908A87080M5022l0651m7167o309K2089l933j4503K7291J4556m1915m9678k4827
$$ 187080 232102 201451 154284 147975 170064 166131 151628 178919 193475 151560 101882 77055
7896G7055k5690r203K2545J4046Q0190k9563n2739j8277O1970K1912J3874m4147
$$ 77055 51365 42162 64707 78753 158943 129380 76641 58364 120334 142246 156120 111973
7884A11973k3108K8315p004l7251K245J6730L6351K7045q11K8696k8920m5165
$$ 111973 88865 117180 110176 72925 75170 91900 128251 155296 154485 183181 154261 109096
7872A09096L346m5680p6301l6760R296J0368M3067J6721m2941L0674N7348l1216
$$ 109096 112442 66762 -9539 -46299 -37003 -26635 16432 33153 -9788 20886 78234 47018
7860D7018J834L2554m5718j3190j2167J401J8469J1168k7214l5943K1825M4822
$$ 47018 48852 81406 35688 22498 10331 11732 30201 41369 14155 -21788 37 44859
7848D4859J6847K3392j5973j3472J4109Q600k4610L8825n1975l1159j9456j903
$$ 44859 61706 85098 69125 55653 69762 78362 53752 92577 40602 9443 -10013 -11916
7836a1916p37m6897K1584l6007k853N8517P495m0058L0730P594j1684k9001M1638
$$ -11916 -12653 -59550 -37966 -73973 -76826 -18309 -10814 -50872 -20142 -12548 -24232 -53233 -11595
7823a1595J1984n5342k2386k6795l4228k6431O5324J5995J1785K486m7383K2257
$$ -11595 389 -54953 -77339 -104134 -138362 -164793 -99469 -83474 -71689 -69203 -116586 -94329
7811i4329M7909k9115k3929k0367o3455Q003K16488l2382l8038K844q689l0510
$$ -94329 -46420 -75535 -99464 -119831 -183286 -175283 41205 8823 -29215 -26371 -35060 -65570
7799f5570l2084L3362j6653q821K6929L268k5159N350m5544Q961K9522m5854K9300
$$ -65570 -97654 -64292 -80945 -89766 -62837 -59569 -84728 -79378 -124922 -115961 -86439 -132293 -102993
7786a02993k1552J5766j5603Q755j1346m1538M1053L6471L3904J3562j4934m0764
$$ -102993 -124545 -108779 -124382 -115627 -126973 -168511 -127458 -90987 -57083 -43521 -58455 -99219
7774i9219k9044j0776L297O0653j4220m2661J8117o80J8222K465M4621l694j8510
$$ -99219 -128263 -139039 -135742 -75089 -89309 -131970 -113853 -114533 -96311 -93846 -49225 -52919 -71429
7761g1429J4912k9694j1362k0594Q550K7253l8677K6860N081J0490K2242j2675
$$ -71429 -56517 -86211 -97573 -118167 -109617 -82364 -121041 -94181 -89100 -78610 -56368 -69043
7749f9043k2924K0688j3111k887l0295o3237L0796M5317k6715M231k8886M1563
$$ -69043 -91967 -71279 -84390 -87277 -117572 -180809 -150013 -104696 -131411 -127180 -156066 -114503
7737a14503l9314k3657L4676N8861j8172j7424m5797N7947n662Q216j337l0203
$$ -114503 -153817 -177474 -142798 -83937 -102109 -119533 -165330 -107383 -113045 -104829 -106166 -136369
7725a36369N635J192N353K1046K6698k3401K2653K0987o9041K2865J9186m6685
$$ -136369 -130734 -129542 -124189 -103143 -76445 -99846 -77193 -56206 -125247 -102382 -83196 -129881
7713a29881j2815m066j4081j0379k2499j2852P3270O714j0673l9661n787N2397
$$ -129881 -142696 -146762 -160843 -171222 -193721 -206573 -133303 -126589 -137262 -176923 -182710 -130313
7701a30313L7584L252J8229k4827M3959j7485j6367j9388l4927K4566L2215J5434
$$ -130313 -92729 -89477 -71248 -96075 -52116 -69601 -85968 -105356 -140283 -115717 -83502 -68068
7689f8068R070j5260k4717J4522N441j0355J5936Q436L1867K3295l4187J2700
$$ -68068 -58998 -74258 -98975 -84453 -79012 -89367 -73431 -64995 -33128 -9833 -44020 -31320
7677c1320k3246J996J3243n1589M3327M0529Q586j4205l2524o5550N2617N7245
$$ -31320 -54566 -52570 -39327 -90916 -47589 -7060 1526 -12679 -45203 -110753 -58136 -891
7665h91K9304m369l2850L3565n867m0615J0114J5522J2004J8005j3169k7229J0734
$$ -891 28413 24044 -8806 24759 18892 -21723 -11609 3913 15917 33922 20753 -6476 4258
7652D258P961J1075r161J2444J5453l2761m7454L8863J2879k5684n181p3340k7325
$$ 4258 12219 23294 14133 26577 42030 9269 -38185 678 13557 -12127 -17308 -90648 -117973
7639a17973O7410K5331k2971r839L2693l5163o3761R0351j3515l5249j043K4777
$$ -117973 -50563 -25232 -48203 -58042 -25349 -60512 -124273 -33922 -47437 -82686 -83729 -58952
7627e8952J8817m7677l5335j9769M827N5906k6956J3608L6846k7976K3855J7333
$$ -58952 -40135 -87812 -123147 -142916 -138089 -82183 -109139 -95531 -58685 -86661 -62806 -45473
7615d5473m7854k1361L4394n824M652J2409k3622J2776k817l6262Q840L0171J5836
$$ -45473 -93327 -114688 -80294 -86118 -81466 -69057 -92679 -79903 -82720 -118982 -110142 -79971 -64135
7602f4135k5817J2882J9495M6902j2640k0777j0133q818k8511N082r537j3420
$$ -64135 -89952 -77070 -57575 -10673 -23313 -44090 -54223 -63041 -91552 -86470 -96007 -109427
7590a09427K4082M6045m1640J2637L7418o3269l3000M3217n478j7914L5225l269
$$ -109427 -85345 -39300 -80940 -68303 -30885 -94154 -127154 -83937 -89415 -107329 -72104 -75373
7578g5373K5890n454J2570j4528l0362K354j6353J0310k806l3735N4456R501n0074
$$ -75373 -49483 -54937 -42367 -56895 -87257 -84903 -101256 -90946 -93752 -127487 -73031 -63530 -113604
7565a13604K2453l8490l85J0321r330m287L4599L5048K7080q0848k0577j877J9982
$$ -113604 -91151 -129641 -130026 -119705 -129035 -133322 -98723 -63675 -36595 -117443 -138020 -139897 -119915
7552a19915L3841K0954j7120n3776K6877j5945K5625j6046Q192J6667O0214Q216
$$ -119915 -86074 -65120 -82240 -136016 -109139 -125084 -99459 -115505 -107313 -90646 -30432 -22216
7540b2216J2530m7545k4234J1755N403j3346L418j3026K6832k6256M055J6936
$$ -22216 -9686 -57231 -81465 -69710 -64307 -77653 -74235 -87261 -60429 -86685 -82630 -65694
7528f5694L095j2455j8793O0497K2878n0390m6527j5526K7360K996O0581n8532
$$ -65694 -62599 -75054 -93847 -33350 -10472 -60862 -107389 -122915 -95555 -92559 -31978 -90510
7516i0510p413J0155m4228j2860L4854M6818K9103k616j1728j7369J9097L3754
$$ -90510 -97923 -87768 -131996 -144856 -110002 -63184 -34081 -36697 -48425 -65794 -46697 -12943
7504a2943k3406j8505k1404J026j3975l0858k228K3880l71J4012k7583L1276K0379
$$ -12943 -36349 -54854 -76258 -75232 -89207 -120065 -122293 -98413 -98784 -84772 -112355 -81079 -60700
7491f0700N311k487j8383K2625k3267K7662L1099k628k2312m3249K4028K5657
$$ -60700 -55389 -57876 -76259 -53634 -76901 -49239 -18140 -20768 -43080 -86329 -62301 -36644
7479c6644J3754M43L7762K086K3944l5039o8684K5954L2023o8590J056L4495M2624
$$ -36644 -22890 -22447 15315 17401 41345 6306 -62378 -36424 -4401 -72991 -71935 -37440 5184
7466E184K9009K492J3237l0240r002j3702J0098L884l6954L5368J8384j2999n417
$$ 5184 34193 36685 49922 19682 10680 -3022 7076 10960 -25994 9374 27758 14759 9342
7453I342j2981k368K2848j8634r602k9457k268N3990l582m4640k3742q615p038
$$ 9342 -3639 -6007 16841 -1793 -11395 -40852 -43120 10870 7288 -37352 -61094 -69709 -76747
7440g6747k5228M1276p950l0394M8402M4396m7314j9006k6435K2927P494j1097
$$ -76747 -101975 -60699 -68649 -99043 -50641 -6245 -53559 -72565 -99000 -76073 -68579 -79676
7428g9676l7631p205R354k4785K2701J3601j5416K5830k0864j2121M0823j6981
$$ -79676 -117307 -124512 -115158 -139943 -117242 -103641 -119057 -93227 -114091 -126212 -85389 -102370
7416a02370k9984k5942M3336L5420J3708k408j852L8373m177l4951N79L1021m3396
$$ -102370 -132354 -158296 -114960 -79540 -65832 -68240 -70092 -31719 -35896 -70847 -70268 -39247 -82643
7403h2643n8066J4194K9124k018O709j8891k6211P6378n4188Q970R598k4653M7007
$$ -82643 -140709 -126515 -97391 -99409 -92700 -111591 -137802 -61424 -115612 -106642 -97044 -121697 -74690
7390g4690q023j9705k039k6936N2988M8029k4911L0326K844N815m3104k0452K1045
$$ -74690 -82713 -102418 -104457 -131393 -78405 -30376 -55287 -24961 -22117 -16302 -59406 -79858 -58813
7377e8813n6345j8243M643K9170k778N552J2557K1156l0580m9191L1997J9260
$$ -58813 -115158 -133401 -128758 -99588 -102366 -96814 -84257 -63101 -93681 -142872 -110875 -91615
7365i1615n0520N4647J5813P78k2053q6061L2822L3742K2886K473j3796Q976K1599
$$ -91615 -142135 -87488 -71675 -70897 -92950 -179011 -146189 -112447 -89561 -87088 -100884 -91908 -70309
7352g0309L6761k6964L5551k9164k0474j2532R578m390k9690L8365J1890l262
$$ -70309 -33548 -60512 -24961 -54125 -74599 -87131 -77553 -81943 -111633 -73268 -61378 -64640
7340f4640K5274J0976M659k7467n4587J0144l632n067L1788K2315l905k2676l5633
$$ -64640 -39366 -28390 -23731 -51198 -105785 -95641 -99273 -104340 -72552 -50237 -54142 -76818 -112451
7327a12451L5926k3344p7407M3715J4501J233j730k3701L7180J792m098P996M7702
$$ -112451 -76525 -99869 -177276 -133561 -119060 -117827 -119557 -143258 -106078 -104286 -108384 -100388 -52686
7314e2686k0949K0221m7187l0439o62j6288J4140J352L1665J3692j4272j8418
$$ -52686 -73635 -53414 -100601 -131040 -131702 -147990 -133850 -132498 -100833 -87141 -101413 -119831
7302a19831J9024l1476N1224j1753j3846l75r985N6362m8548m206l034N6322N537
$$ -119831 -100807 -132283 -81059 -92812 -106658 -107033 -117018 -60656 -109204 -113410 -116444 -60122 -54585
7289e4585k0053L1953J1361J0378K9663k1012q3984n1014M6502J0722k6010j5072
$$ -54585 -74638 -42685 -31324 -20946 8717 -12295 -96279 -147293 -100791 -90069 -116079 -131151
7277a31151O6510k8653l793P2253J7867l5177m7532n5074J0954L2500J5174K2838
$$ -131151 -64641 -93294 -97087 -24834 -6967 -42144 -89676 -144750 -133796 -101296 -86122 -63284
7265f3284K4647r782n1190K5902l4138R857L7779K3114j3517l6832j5017j773
$$ -63284 -38637 -48419 -99609 -73707 -107845 -97988 -60209 -37095 -50612 -87444 -102461 -104234
7253a04234J7700M880k0632L2269m1063L3628j938j74M163l9866J2980N8864j3715
$$ -104234 -86534 -81654 -102286 -70017 -111080 -77452 -79390 -79564 -75401 -115267 -102287 -43423 -57138
7240e7138j584n297r333j962L2024r055k5138J2754J8840r656n0234m52N730j368
$$ -57138 -58722 -64019 -73352 -75314 -43290 -52345 -77483 -64729 -45889 -55545 -105779 -106231 -100501 -101869
7226a01869M0738l3530o5197M0516m634J4831K8000L1211p4580J750M5399l1830
$$ -101869 -61131 -94661 -159858 -119342 -123976 -109145 -81145 -49934 -124514 -122764 -77365 -109195
7214a09195n30j0970O2071M0255m5783L622l7827l3039P2809J8452l4840k7225
$$ -109195 -109725 -120695 -58624 -18369 -64152 -60530 -98357 -131396 -58587 -40135 -74975 -102200
7202a02200J9386j0136l2607J7070k9125R197L6439L066J1610L966j1878P66K4644
$$ -102200 -82814 -92950 -125557 -108487 -137612 -128415 -91976 -88910 -77300 -73334 -85212 -84446 -59802
7189e9802L7N4928p999o3479L1820j8449m0653p243K4890J0654L0182N0968j6960
$$ -59802 -59765 -4837 -12836 -76315 -44495 -62944 -103597 -110840 -85950 -75296 -45114 5854 -11106
7176a1106m0345K3001J1435m0263o0112N2526k479P484k1107P2171j9256m9119
$$ -11106 -51451 -28450 -17015 -57278 -117390 -64864 -67343 -59859 -80966 -8795 -28051 -77170
7164g7170N8496k3197k4237N4598J5312n5539L2674j8565L1209k5822l3181l074
$$ -77170 -18674 -41871 -66108 -11510 3802 -51737 -19063 -37628 -6419 -32241 -65422 -68496
7152f8496r216J0345K7143o0842j6531k945L625O049K6351L1808M970j3800j5489
$$ -68496 -77712 -67367 -40224 -101066 -117597 -120542 -116917 -110868 -84517 -52709 -47739 -61539 -77028
7139g7028R319l6201Q9N1007K6138o070Q178j6098m280m9546Q791K6267m350k6922
$$ -77028 -67709 -103910 -103821 -52814 -26676 -32746 -24568 -40666 -44946 -94492 -85701 -59434 -63784 -90706
7125i0706J8571O6638m7685m30j6166l2048j3952N3684J7447l0199l577k2708
$$ -90706 -72135 -5497 -53182 -53612 -69778 -101826 -115778 -62094 -44647 -74846 -78423 -101131
7113a01131k3543K6567M8074k4923J3742k0657k8526k4396J6795J6618O2017J2103
$$ -101131 -124674 -98107 -50033 -74956 -61214 -81871 -110397 -134793 -117998 -101380 -39363 -27260
7101b7260m891l7967p740K1453k0119k8733j6656M8741L425j3362j8834L6542
$$ -27260 -32151 -70118 -77858 -56405 -76524 -105257 -121913 -73172 -69747 -83109 -101943 -65401
7089f5401L6506k6369K0981k9930j2861k3316l0465j3238N297N1618N5751J9913
$$ -65401 -28895 -55264 -34283 -64213 -77074 -100390 -130855 -144093 -138796 -87178 -31427 -11514
7077a1514m4434O014L1485j7943j7664l2643J1226N0837k5417j9363n8536M7984
$$ -11514 -55948 -49934 -18449 -36392 -54056 -86699 -75473 -24636 -50053 -69416 -127952 -79968
7065g9968L1709j0470k1586n6038L6119M8900k4772N338j2321k0595M1065m1034
$$ -79968 -48259 -58729 -80315 -136353 -100234 -51334 -76106 -70768 -83089 -103684 -62619 -103653
7053a03653J0952O6746p3597j2529O6596m34l5749P2240k3192j9929J0068l6359
$$ -103653 -92701 -25955 -99552 -112081 -45485 -45919 -81668 -9428 -32620 -52549 -42481 -78840
7041g8840J0576J8718j936N188j9356o947k7110K8562k6055L0694r222p720J8442
$$ -78840 -68264 -49546 -51482 -46294 -65650 -72597 -99707 -71145 -97200 -66506 -75728 -83448 -65006
7028f5006L5458J3867p3001J6749M30o566J1016j2659k9239O2107j2837n1740
$$ -65006 -29548 -15681 -88682 -71933 -71503 -78069 -67053 -79712 -108951 -46844 -59681 -111421
7016a11421K9485N0057j8608J2260O895k6418R676M5153k4345R555l7983q512
$$ -111421 -81936 -31879 -50487 -38227 -31332 -57750 -48074 -2921 -27266 -17711 -55694 -64206
7004f4206l3925J8167J0029J4249K5022m9043L4172n0237o79K1940N120k3818
$$ -64206 -98131 -79964 -69935 -55686 -30664 -79707 -45535 -95772 -96451 -74511 -69391 -93209
6992i3209j1303Q9543l150l4513q828M1365J3305k1229j9257K8546j2261M7797
$$ -93209 -104512 -14969 -18119 -52632 -61460 -20095 -6790 -28019 -47276 -18730 -30991 16806
6980A6806l7010j9303M9378m649J4484o592J1894l7130o371k052J4812r777r114
$$ 16806 -20204 -39507 9871 5222 19706 13114 25008 -12122 -18493 -20545 -5733 -15510 -24624
6967b4624j0187K8529L5487l2234L095o0899k8446M0612K8482L2466L1644n2633
$$ -24624 -34811 -6282 29205 -3029 66 -60833 -89279 -48667 -20185 12281 43925 -8708
6955h708q0616K2105O3850m7279j55K8385J1636k3933j4806J8827l2926M1701
$$ -8708 -89324 -67219 -3369 -50648 -50803 -22418 -10782 -34715 -49521 -30694 -63620 -21919
6943b1919l997J5503K8934J0138k6001j5654k6271o070K6033K5280j5789M7625
$$ -21919 -25916 -10413 18521 28659 2658 -12996 -39267 -45337 -19304 5976 -9813 37812
6931C7812l3509m1708k1592L1576r017k4467P414m4709M1000K5487K5870J9998
$$ 37812 4303 -37405 -58997 -27421 -36438 -60905 -53491 -98200 -57200 -31713 -5843 14155
6919A4155k927l5856k1783K7128k22j428K4494l7661J953K3693k2930p341P4548
$$ 14155 11228 -24628 -46411 -19283 -19505 -20933 3561 -34100 -32147 -8454 -31384 -38725 35823
6906C5823P53m7074J8585j0455m0247L0449k005k8090J6681O8016m3460p7917
$$ 35823 36576 -10498 8087 -2368 -42615 -12166 -14171 -42261 -25580 42436 -1024 -78941
6894g8941J0528L0819j2028J7193P1042k2871N1448m5671R423N9915L9246N0512
$$ -78941 -68413 -37594 -49622 -32429 38613 15742 67190 21519 30942 90857 130103 180615
6882A80615k3121m6933J6791l144p143K9668L3882p5741l5045K2211p912j8865
$$ 180615 157494 110561 127352 124208 117065 146733 180615 104874 69829 92040 84128 65263
6870F5263l3698K5759l2475O261r250K1892M2873m0273k4137L4140j3529l0760
$$ 65263 31565 57324 24849 31110 21860 43752 86625 46352 22215 56355 42826 12066
6858A2066r398l4416J2149M5736n7565L0899k8104L7746R170l5388L1224K5916
$$ 12066 2668 -31748 -19599 26137 -31428 -529 -28633 9113 18283 -17105 14119 40035
6846D0035j3602k5634k5088K8491l2893k9448K3619K2158O863k553l5797k3035
$$ 40035 26433 799 -24289 4202 -28691 -58139 -34520 -12362 -5499 -8052 -43849 -66884
6834f6884M0144L9284j1118J4118K2213k2080m3290m6552L6889N7641j3694K6673
$$ -66884 -26740 12544 1426 15544 37757 15677 -27613 -74165 -37276 20365 6671 33344
6822C3344R117l4466M1507L5073o762j0528L2638j660K341Q392J2568j2565O4461
$$ 33344 42461 7995 49502 84575 77813 67285 99923 98263 100604 108996 121564 108999 173460
6809A73460P460J1408J728M3304P470n4810k5055k2656K1352N1728m0657j3419
$$ 173460 180920 192328 194056 237360 244830 190020 164965 142309 163661 215389 174732 161313
6797A61313m2293n1095l3897j993J7343j594m6996J9915k0625L6531n8808j380
$$ 161313 119020 67925 34028 32035 49378 47784 788 20703 78 36609 -22199 -23579
6785b3579K5653L0734j8860k4564J722N281K6063P82J1061m6239j4545k9941J9335
$$ -23579 2074 32808 13948 -10616 -8894 -3613 22450 23232 34293 -11946 -26491 -56432 -37097
6772c7097j5919J6666J9193j8881j1818N1919L1514J4456j0540J0526k2388n1223
$$ -37097 -53016 -36350 -17157 -36038 -47856 4063 35577 50033 39493 50019 27631 -23592
6760b3592l4887N2042j5695q999N9204j3231m9170Ro703K0661L9341N9360p3458
$$ -23592 -58479 -6437 -22132 -31131 28073 14842 -34328 -34319 -41022 -20361 18980 78340 4882
6747D882l659K5022n2106L9896n240o719m032j3436o578L8859K5740j0466m17
$$ 4882 1223 26245 -25861 14035 8795 2076 -1956 -15392 -21970 16889 42629 32163 31746
6734C1746j8272J4109K2626J7333K2998m7481k1171J7424m7035k096L5492l5887
$$ 31746 13474 27583 50209 67542 90540 43059 21888 39312 -7723 -9819 25673 -10214
6722a0214j2330L2518k1735l5639N6081L8617j1877K3303k3810k0112j0461O208
$$ -10214 -22544 9974 -11761 -47400 8681 47298 35421 58724 34914 14802 4341 10549
6710A0549L0691j7698k122J0952J0081r751o4497K3258m1672N019M7282L0311
$$ 10549 41240 23542 21420 32372 42453 32702 -31795 -8537 -50209 -45190 2092 32403
6698C2403J2708j5958p1158k238L8518N0304l4143j5548l039K5352n962p4423
$$ 32403 45111 29153 -42005 -44243 -5725 44579 10436 -5112 -8151 17201 11239 -63184
6686f3184p72j2369O9477J1324l8452K7129o042O876N0129k0873l0881l4411q322
$$ -63184 -63956 -76325 -6848 4476 -33976 -6847 -12889 -6013 44116 23243 -7638 -42049 -50371
6673e0371R585J9893l7369N815J6845O889l0304Q0120Q918K0030k2351l5147L1790
$$ -50371 -40786 -20893 -58262 -52447 -35602 -28713 -59017 21103 30021 50051 27700 -7447 24343
6660B4343J2331l7627o3103j38Q318m17l892O8388l620k7058n0737M9878k596
$$ 24343 36674 -953 -64056 -64194 -55876 -56293 -60185 8203 4583 -22475 -73212 -23334 -25930
6647b5930m0851M7050P4810L648j3892l3657o0609M8963k482L230K0727K1061
$$ -25930 -66781 -19731 55079 58727 44835 11178 -49431 -468 -2950 280 21007 42068
6635D2068j280q104k2946j339M9046K3935l6450m8025K3166J6878L6357j056P243
$$ 42068 40788 32684 9738 8399 57445 81380 44930 -3095 20071 36949 73306 72250 79493
6622G9493k645n7251j895J269J4248j0919l5997l3983J6495k1683M3080K5254
$$ 79493 76848 19597 17702 18971 33219 22300 -13697 -47680 -31185 -52868 -9788 15466
6610A5466j4013k9306K7360L5767l6071o018n339q13P3721N5735m4643n4963N3273
$$ 15466 1453 -27853 -493 35274 -797 -6815 -12154 -12967 60754 116489 71846 16883 70156
6597G0156L3796n6613L0075j0176q74k8123m0466K074K0351j5003J3586L2156
$$ 70156 103952 47339 77414 67238 66364 38241 -2225 -151 20200 5197 18783 50939
6585E0939O26Q30l8940M7784l0316m1079K2467R702O563J8625J6304j0571P137
$$ 50939 51565 52395 13455 61239 30923 -10156 12311 22013 28576 47201 63505 52934 60071
6572F0071J8347n289l6399J26294O198m006K2483j899K0115m3330K7959M3457
$$ 60071 78418 73129 36730 163024 169222 165216 187699 185800 205915 162585 190544 234001
6560B34001O1052M1746k1528k4332L2482k7912q3895j1236l8980o054K4202j5104
$$ 234001 295053 336799 315271 290939 323421 295509 211614 200378 161398 155344 179546 164442
6548A64442N97k1030m1900P4421n1889j1870r551j9055K3170K373n807K568O0207
$$ 164442 165039 144009 102109 176530 124641 112771 103220 84165 107335 109708 103901 106469 166676
6535A66676l1287K6108n6195l0805j9139O9907l257l5462L0401J1580L6701O0109
$$ 166676 135389 161497 105302 74497 55358 125265 122008 86546 116947 128527 165228 225337
6523B25337P0124m2496n5596O8257J8380J5955l0236j9205K0081L075J7103j3567
$$ 225337 295461 252965 197369 265626 284006 299961 269725 250520 270601 273676 290779 277212
6511B77212q3885o0043L9126l4132k4027K8766k4172m557m1099m0719j2220L9013
$$ 277212 193327 133284 172410 138278 114251 143017 118845 114288 73189 32470 20250 59263
6499E9263L9064J51m4354K058J9774p426K2535k4677j7261K1275J1741l2963l4436
$$ 59263 98327 98478 54124 56182 75956 68530 91065 66388 49127 70402 82143 49180 14744
6486A4744k5L2499k4208K7976k1988j8691j7164L7625O036L9829j8990J324K874
$$ 14744 14719 47218 23010 50986 28998 10307 -6857 30768 36804 76633 57643 58967 61841
6473F1841q28L4228m2657j4932N962J6154K100m5600r010J5250j5383l2109Q1468
$$ 61841 61013 95241 52584 37652 43614 59768 61868 16268 7258 22508 7125 -24984 56484
6460E6484O1017k3718m8641K7130l9029J4323L4897J4392n1596K0228K0893k8303
$$ 56484 117501 93783 45142 72272 33243 47566 82463 96855 45259 65487 86380 58077
6448E8077n555r283L3414l0118M68L7948J3378j08272K9032M2621M219l2346p61
$$ 58077 52522 43239 76653 46535 47003 84951 98329 -9943 19089 61710 65929 33583 32822
6435C2822L9654L3968J7319J3027k2516j8780l7855J5092j4110m6166o586L3378
$$ 32822 72476 106444 123763 136790 114274 95494 57639 72731 58621 12455 5869 39247
6423C9247L2893j3973m235M8321k1227l1367j9346J6755N2484J840l879J0137
$$ 39247 72140 58167 53932 102253 81026 49659 30313 47068 99552 101392 97513 107650
6411A07650m5483L1767L6471K0468J6080k9083l9185J8941j0701n4864K9860O4432
$$ 107650 62167 93934 130405 150873 166953 137870 98685 117626 106925 52061 81921 146353
6399A46353r98m8317j516K8124J4864q775Q121k167R182j7525R939n0712M1385
$$ 146353 145355 97038 95522 123646 138510 129735 137856 135689 144871 127346 137285 86573 127958
6386A27958k0850J6136L3134m3210j0357m75Q053L6461K9921o2481J0572j6510
$$ 127958 107108 123244 156378 113168 102811 102336 110389 146850 176771 114290 124862 108352
6374A08352R718J8830m4292J9271J4338K7230J1537j0845K8923n3795j1112l8961
$$ 108352 118070 136900 92608 111879 126217 153447 164984 154139 183062 129267 118155 79194
6362G9194J2578N3052m722j0400j0515n097J3691K7569l6333l6575K5681M4535
$$ 79194 91772 144824 140102 129702 119187 114090 127781 155350 119017 82442 108123 152658
6350A52658l0940Q210L6110K631l6702K9386k925r539l087M237M1797J2115o749
$$ 152658 121718 129928 166038 168669 131967 161353 158428 148889 145802 150039 191836 203951 197202
6337A97202k0995k1841k3369O9823k2237n7128N660P4578J4120k9130j0467M3885
$$ 197202 176207 154366 130997 200820 178583 121455 127115 201693 215813 186683 176216 220101
6325B20101k8544m0667O81O8979k4205m1436K8986M4069k3793k0999J478K6070
$$ 220101 191557 150890 151571 220550 196345 154909 183895 227964 204171 183172 184650 210720
6313B10720K848m2220M1159l678m2685q177j5938N43J0620k3496M4144K9865M0040
$$ 210720 213568 171348 212507 208829 166144 157967 142029 142572 153192 129696 173840 203705 243745
6300B43745k7009Q227J7871M1740l9198K621n146j3397R299M5494J31J7453j5675
$$ 243745 216736 224963 242834 284574 245376 247997 242851 229454 238753 284247 284378 301831 286156
6287B86156k8592j1336J2355J7791N936p417l610K2819j7043k0049L9037M973
$$ 286156 257564 246228 258583 276374 282310 274893 271283 294102 277059 257010 296047 301020
6275C01020j8184M3023R861o0048j0690M9846J4291K4423P1938k8067k5040J0655
$$ 301020 282836 325859 335720 275672 264982 314828 329119 353542 425480 397413 372373 383028
6263C83028o2345J6662k0200k1838K14l1339L5975L5699n2190k5694k784K0585
$$ 383028 320683 337345 317145 295307 295521 264182 300157 335856 283666 257972 255188 275773
6251B75773Q103J2998j264O395M6559m0649J3534R620j0604J4224l5552P086k594
$$ 275773 283876 296874 295610 302005 348564 307915 321449 331069 320465 334689 299137 306223 303629
6238C03629J2395m424M643j0914J7737M1610P94l0242l8189J741J8437j1227K1026
$$ 303629 316024 311600 316243 305329 323066 364676 365470 335228 297039 298780 317217 305990 327016
6225C27016N1940n5369M273K017p1575J940L8577L0007m0179J1716K4001M2964
$$ 327016 378956 323587 327860 329877 258302 260242 298819 328826 288647 300363 324364 367328
6213C67328j3772O1015k7734o10K4417p7670n008O9073m1938k4326J3343R185
$$ 367328 353556 414571 386837 386227 410644 332974 327966 397039 355101 330775 344118 353303
6201C53303J0885L066J5312l1026J8368l2436O0188L8604p1650N7687K0682j5941
$$ 353303 364188 367254 382566 351540 369908 337472 397660 436264 364614 422301 442983 427042
6189D27042M0617J7757p1946p531M6494L1220K3416k4698J5568J0842q3482k6501
$$ 427042 467659 485416 413470 405939 452433 483653 507069 482371 497939 508781 425299 398798
6177C98798O1757R749M8613j8096l3617J5130Q571l6262o1134n3060N6885J6200
$$ 398798 460555 470304 518917 500821 467204 482334 490905 454643 393509 340449 397334 413534
6165D13534L0948J03523j2088l7680K5424N2802L0984K046J1007q7486J5290J4336
$$ 413534 444482 548005 535917 498237 523661 576463 607447 609493 620500 533014 548304 562640
6153E62640m2207M2918O3158M724l5839k2273k1014p327J6955n957M1098K738
$$ 562640 520433 563351 626509 631233 595394 573121 552107 544780 561735 555778 596876 599614
6141E99614J171l8606L7340o122K0823p6613N2803Q557J7259Q8114K255o722j5185
$$ 599614 600785 562179 599519 593397 614220 537607 590410 598967 616226 704340 706595 699873 684688
6128F84688N668L4532k1685k6227Q0124m1975q044j029r548j9623L1804j1783
$$ 684688 690356 724888 703203 676976 757100 715125 707081 706052 696504 676881 708685 696902
6116F96902L1021J8131K3241p98L70k8499J6710Q8356K6543o3364l2220O1056
$$ 696902 727923 746054 769295 768497 768867 740368 757078 845434 871977 808613 776393 837449
6104H37449N2212L0294K9866j2723k45o3757J6987N1431L4576j9678K0305l3632
$$ 837449 889661 919955 949821 937098 936853 873096 890083 941514 976090 956412 976717 943085
6092I43085J5350M2225J1076N4935j2006j477N077M7362J7776k1217P450J9948
$$ 943085 958435 1000660 1011736 1066671 1054665 1053188 1058265 1105627 1123403 1102186 1109636 1129584
6080A129584L8062K3942l042K3446o482l8651N8440L9484N2877K5532k0925K0703
$$ 1129584 1167646 1191588 1188546 1211992 1205510 1166859 1225299 1264783 1317660 1343192 1322267 1342970
6068A342970K2826M998L1850M5478L0765M6654K1734k7844J6715l861O484J7371
$$ 1342970 1365796 1370794 1402644 1448122 1478887 1525541 1547275 1519431 1536146 1532285 1538769 1556140
6056A556140M3808P7573Q6530l3468m759N7762J5627L0257K8743Q8750Q2966J8300
$$ 1556140 1599948 1677521 1764051 1730583 1725824 1783586 1799213 1829470 1858213 1946963 2029929 2048229
6044B048229J04167R0686O8196L4722K3810M2780J07653N1663J32982P7804M6616
$$ 2048229 2152396 2243082 2311278 2346000 2369810 2412590 2520243 2571906 2704888 2782692 2829308
6033B829308J22316N7104M4771J3386M4024N928J12184O1975J3402M4051J00482
$$ 2829308 2951624 3008728 3053499 3066885 3110909 3116837 3229021 3290996 3304398 3348449 3448931
6022C448931O9352K5110R1913N6175R2871R2291Q5931J34693J15868J86720J79416
$$ 3448931 3518283 3543393 3635306 3691481 3784352 3876643 3962574 4097267 4213135 4399855 4579271
6011D579271J50685J26108J86767J53369J77335J01041L8489N5150J02161L9605
$$ 4579271 4729956 4856064 5042831 5196200 5373535 5474576 5513065 5568215 5670376 5709981
6001E709981J46103J46444J06335J68446K41038K34140L06988L07670L60414L90862
$$ 5709981 5856084 6002528 6108863 6277309 6518347 6752487 7059475 7367145 7727559 8118421
5991H118421M02794M69701N91409O89371O47781O64325P31368P07353N98445M17642
$$ 8118421 8521215 8990916 9582325 10271696 10919477 11583802 12315170 13022523 13620968 14038610
5981A4038610K82834l564j39687k93992l74248m45356l53499k74034j76045n8555
$$ 14038610 14321444 14317880 14178193 13884201 13509953 13064597 12711098 12437064 12261019 12202464
5971A2202464M8857K10175K59293L75931N08388O75333P72464R13576J072439
$$ 12202464 12251321 12461496 12720789 13096720 13605108 14280441 15052905 15966481 17038920
5962A7038920J175480J243148J248726J047147Q91165N13519M082m50468q05023
$$ 17038920 18214400 19457548 20706274 21753421 22644586 23158105 23162187 22711719 21906696
5953B1906696j162609j396227j381010j297088j175546r27026q19855o66833m38160
$$ 21906696 20744087 19347860 17966850 16669762 15494216 14567190 13747335 13080502 12642342
5944A2642342l53445j56066r2630M2039J19767K53781L64547M42349M79418M23682
$$ 12642342 12288897 12132831 12040201 12082240 12202007 12455788 12820335 13262684 13742102 14165784
5934A4165784L68593K28402J3393k29709l99920o09950o65419p39391p40641p19157
$$ 14165784 14534377 14762779 14776172 14546463 14146543 13536593 12871174 12131783 11391142 10671985
5924A0671985o34793n51295n40561n84528n29733m60790l60072l66633k26617
$$ 10671985 10037192 9485897 8945336 8360808 7831075 7370285 7010213 6643580 6416963
5915F416963k11956j99102j74377n2807j39226p7229p813k6672m8953K7240M7360
$$ 6416963 6205007 6005905 5831528 5778721 5639495 5562266 5554453 5527781 5478828 5506068 5553428
5904E553428M9089R1011O0125J38984K25305J71837K29393J45678R3902j8559
$$ 5553428 5602517 5693528 5753653 5892637 6117942 6289779 6519172 6664850 6758752 6740193
5894F740193j21985j39739k44483j31599o9973m9644l5670j9395j5826J04347
$$ 6740193 6618208 6478469 6233986 6102387 6032414 5982770 5947100 5927705 5911879 6016226
5884F016226P9109J02675J43268J68429J67795J36564J15956J16504L9953k7467
$$ 6016226 6095335 6198010 6341278 6509707 6677502 6814066 6930022 7046526 7086479 7059012
5874G059012j3155q9476k4552J3473j3589j19994r2773j34062j10946o4229n6660
$$ 7059012 7045857 6956381 6931829 6945302 6931713 6811719 6718946 6584884 6473938 6409709 6353049
5863F353049l1584L2226O0033M7473J61131J78919J69106K27899L47319L96719
$$ 6353049 6321465 6353691 6413724 6461197 6622328 6801247 6970353 7198252 7545571 7942290
5853G942290M06977L77913L50701J60215n2184k66938m43865m64142l97825l89861
$$ 7942290 8349267 8727180 9077881 9238096 9185912 8918974 8475109 8010967 7613142 7223281
5843G223281k98337k41940k66891k16969q4063o9268j40524j0948J3555k2389
$$ 7223281 6924944 6683004 6416113 6199144 6115081 6045813 5905289 5894341 5907896 5885507
5833E885507m0569q044O2904J3420J01896J12799K08425K69699J79303O1864O8068
$$ 5885507 5844938 5836894 5899798 5913218 6015114 6127913 6336338 6606037 6785340 6847204 6915272
5822F915272O071j46920k21067j92851k21157j56269j80106l9308l1617m5486
$$ 6915272 6921343 6774423 6553356 6360505 6139348 5983079 5802973 5763665 5732048 5686562
5812E686562j4843q3703q0201j11907j13498p7250o5522o7817J4637J1389M1442
$$ 5686562 5671719 5588016 5507815 5395908 5282410 5205160 5139638 5071821 5086458 5097847 5139289
5801E139289J16342O6145R5537J74962K25162K10013K53887K93206K90206K88143
$$ 5139289 5255631 5321776 5417313 5592275 5817437 6027450 6281337 6574543 6864749 7152892
5791G152892L49522K79289J49186R8147M15j07675j38422j60745j72592j41927
$$ 7152892 7502414 7781703 7930889 8029036 8029451 7921776 7783354 7622609 7450017 7308090
5781G308090j40317r2733n6864k0716L561J52569J34720J53294K78948K22812
$$ 7308090 7167773 7075040 7018176 6997460 7001021 7153590 7288310 7441604 7720552 7943364
5771G943364K86362L73572M70329N82957O42618O92705O21753N08601L55861J3910
$$ 7943364 8229726 8603298 9073627 9656584 10299202 10991907 11613660 12122261 12478122 12492032
5761A2492032k82860n30948o91997o00354m80560m38941l67674k48628k32447
$$ 12492032 12209172 11678224 10986227 10385873 9905313 9466372 9098698 8850070 8617623
5752H617623j06733k2938k4488K6101k0566J3200P6964J30843J93399K77446L12272
$$ 8617623 8510890 8487952 8463464 8489565 8468999 8482199 8559163 8690006 8883405 9160851 9473123
5741I473123L60381L59306L75317L97767K36632R7236K8292n2210l2248K7466
$$ 9473123 9833504 10192810 10568127 10965894 11202526 11299762 11328054 11275844 11243596 11271062
5731A1271062P8669J76135K76595K96518L90597M90929O04899O85581N72484M24531
$$ 11271062 11349731 11525866 11802461 12098979 12489576 12980505 13585404 14270985 14843469 15268000
5721A5268000K07101r478k49406m51856n80424n98089m85274l83738k66756j84102
$$ 15268000 15475101 15465623 15216217 14764361 14183937 13585848 13100574 12716836 12450080 12265978
5711A2265978r3070P1690J88228K71240L79557M95347N92257P38241Q60387J077914
$$ 12265978 12172908 12244598 12432826 12704066 13083623 13578970 14171227 14909468 15769855 16847769
5701A6847769J169065J345974J479664J533792J391190R95970K29240m78125j119357
$$ 16847769 18016834 19362808 20842472 22376264 23767454 24763424 24992664 24514539 23395182
5692B3395182j630667j769628j684885j493910j248100j109613q11416o74790
$$ 23395182 21764515 19994887 18310002 16816092 15567992 14458379 13646963 12972173
5684A2972173n82079l61392k28982j82517o5601K4968J75244K46650L63122M76622
$$ 12972173 12390094 12028702 11799720 11617203 11551602 11576570 11751814 11998464 12361586 12838208
5674A2838208N33854O27626N52636M28508J45217k24295o01948q53410j031140
$$ 12838208 13372062 13999688 14552324 14980832 15126049 14901754 14299806 13446396 12415256
5665A2415256j050022r53210q56972p95229o70109n49828m72999m09816l46126
$$ 12415256 11365234 10412024 9555052 8759823 8089714 7539886 7066887 6657071 6310945
5656F310945l00860k85424l21416l16335k70412k99750j97640j66376j36761j28539
$$ 6310945 6010085 5724661 5403245 5086910 4816498 4516748 4319108 4152732 4015971 3887432
5646C887432q5349j05862j11562j13225j21841o5740p6769l1130m7266R268p964
$$ 3887432 3802083 3696221 3584659 3471434 3349593 3283853 3207084 3175954 3128688 3137956 3129992
5635C129992o586j0706q3150j709J7585r992k9000q0573k3432o9336m5037r6977
$$ 3129992 3123406 3112700 3029550 3027841 3045426 3035434 3006434 2925861 2902429 2833093 2788056 2691079
5623B691079j2582Q368o1102q5313J0585n2920n4222n7046k5483l4726m9677k2893
$$ 2691079 2678497 2686865 2625763 2540450 2551035 2498115 2443893 2386847 2361364 2326638 2276961 2254068
5611B254068o8537l3756j3730k7187r7189k8136o178M0421L61m6073M1609l1133
$$ 2254068 2185531 2151775 2138045 2110858 2013669 1985533 1979355 2019776 2020137 1974064 2015673 1984540
5599A984540o7558j902L5550n3191R891L131j3780O896L900k5913K6190J3514
$$ 1984540 1916982 1915080 1950630 1897439 1907330 1910461 1896681 1903577 1907477 1881564 1907754 1921268
5587A921268J7428J7594k670j3692N186J11210l0954o4215J8450M6330N6678m2888
$$ 1921268 1938696 1956290 1953620 1939928 1945114 2056324 2025370 1961155 1979605 2025935 2082613 2039725
5575B039725K1684M4324J7902R254O4197O1929k6895P4453K3041M9717M7619j3265
$$ 2039725 2061409 2105733 2123635 2132889 2197086 2259015 2232120 2306573 2329614 2379331 2426950 2413685
5563B413685K4864m0996l0333L2592L5806L4755O580j3455l7916q182K2189n320
$$ 2413685 2438549 2397553 2367220 2399812 2435618 2470373 2476953 2463498 2425582 2417400 2439589 2434269
5551B434269J2975J510k613J0530r887N5716M1659M1870r355o6825N1506O8855
$$ 2434269 2447244 2448754 2446141 2456671 2446784 2502500 2544159 2586029 2576674 2509849 2561355 2630210
5539B630210L0927J9541n937O9461J10275J4767P670J2196N9390N9046L8333P1074
$$ 2630210 2661137 2680678 2674741 2744202 2854477 2869244 2876914 2889110 2948500 3007546 3045879 3116953
5527C116953O1232J25513J17832K6456M1200L0794P6278O6392L1276j0443j119
$$ 3116953 3178185 3303698 3421530 3447986 3489186 3519980 3596258 3662650 3693926 3683483 3682364
5516C682364J38264J19240J03668J12069J07663J24576J59024O4766J25715Q8070
$$ 3682364 3820628 3939868 4043536 4155605 4263268 4387844 4546868 4611634 4737349 4825419
5506D825419P9019J05739R6821O7136m2182J0721O3699J1059R0200J49189J10465
$$ 4825419 4904438 5010177 5106998 5174134 5131952 5142673 5206372 5217431 5307631 5456820 5567285
5495E567285R8768M7147K6777L3284n1611M1049J12369Q7585J13925J37379J32021
$$ 5567285 5666053 5713200 5739977 5773261 5721650 5762699 5875068 5962653 6076578 6213957 6345978
5484F345978J71115K44264J96036J90547K00920J75720L7906q1234n9798k6224
$$ 6345978 6517093 6761357 6957393 7147940 7348860 7524580 7562486 7481252 7421454 7395230
5474G395230K8263J6870O1406K1056J16974Q4085O9356M4475Q1123J58337J44615
$$ 7395230 7423493 7440363 7501769 7522825 7639799 7723884 7793240 7837715 7918838 8077175 8221790
5463H221790J22874J78776J72005J66908J55769J57634J71380K39473L30285L04239
$$ 8221790 8344664 8523440 8695445 8862353 9018122 9175756 9347136 9586609 9916894 10221133
5453A0221133L84775L24519K93438L56541M34747M52640M90753N33596N02632
$$ 10221133 10605908 10930427 11223865 11580406 12015153 12467793 12958546 13492142 13994774
5444A3994774L90876L62474L66045L23842M96653O34727P04980Q09027P25517
$$ 13994774 14385650 14748124 15114169 15438011 15934664 16569391 17274371 18083398 18808915
5435A8808915Q16544P83638O13262L94960M7399j90447l51374n13010m56043l65659
$$ 18808915 19625459 20409097 21022359 21417319 21464718 21274271 20922897 20409887 19953844 19588185
5425A9588185k71763L1196J76949L10196N56006O89938O89942O03288M10482M05413
$$ 19588185 19316422 19347618 19524567 19834763 20390769 21080707 21770649 22373937 22784419 23189832
5415B3189832M33543N02225P68970R71988J200973J217192J130060O21969p9606
$$ 23189832 23623375 24125600 24894570 25866558 27067531 28284723 29414783 30036752 29957146
5406B9957146q15802j373111j647423j764436j651114j457768j221537r61109
$$ 29957146 29141344 27768233 26120810 24356374 22705260 21247492 20025955 19064846
5398A9064846q30285n89450m77655k90959j11093k6601M0699N6127M2610M3149
$$ 19064846 18234561 17645111 17167456 16876497 16765404 16738803 16779502 16835629 16878239 16921388
5388A6921388J22047J70146J26910J40532R7618m6725k57800n39421p84776q47934
$$ 16921388 17043435 17213581 17340491 17481023 17578641 17531916 17274116 16734695 15949919 15101985
5378A5101985q45607q72365p72714p38939n71175m51881l93368l26038j79195
$$ 15101985 14256378 13384013 12611299 11872360 11301185 10849304 10455936 10129898 9950703
5369I950703k38977l15598k63358k16081k19246j98727j71683j93432r2732j28700
$$ 9950703 9711726 9396128 9132770 8916689 8697443 8498716 8327033 8133601 8040869 7912169
5359G912169j41834n2173l6534o1678m4191m6187N1153N8729M5866M4489M1938
$$ 7912169 7770335 7718162 7681628 7619950 7575759 7529572 7580725 7639454 7685320 7729809 7771747
5348G771747R5491Q9972J09202J18829P4720J53864K36415J13637J20030J09058
$$ 7771747 7867238 7957210 8066412 8185241 8259961 8413825 8650240 8763877 8883907 8992965
5338H992965J66163J58482K41775L23518L43932M48915M54863L64495M21733K33864
$$ 8992965 9159128 9317610 9559385 9882903 10226835 10675750 11130613 11495108 11916841 12150705
5328A2150705M7930j15614j91424k86308k12410j58150j10196J1003K1114Q0070
$$ 12150705 12198635 12083021 11891597 11605289 11392879 11234729 11124533 11135536 11156650 11236720
5318A1236720J42949K05706K50087K89835L67893N21856N13113N81864O84124
$$ 11236720 11379669 11585375 11835462 12125297 12493190 13015046 13528159 14110023 14794147
5309A4794147Q59331R97963J134255J253590J292209J271682J076873P31026M86112
$$ 14794147 15653478 16651441 17785696 19039286 20331495 21603177 22680050 23411076 23897188
5300B3897188L60839L06151K50761R1538k49167n53709q32571r37145r55356q38833
$$ 23897188 24258027 24564178 24814939 24906477 24657310 24103601 23271030 22333885 21378529 20539696
5290B0539696o97717n25753l03359j60292k2273J39309K53651M49536O43278Q06286
$$ 20539696 19841979 19316226 19012867 18852575 18830302 18969611 19223262 19672798 20316076 21122362
5280B1122362R96710J207711J297002J431335J482401J465854J435831J331834
$$ 21122362 22119072 23326783 24623785 26055120 27537521 29003375 30439206 31771040
5272C1771040R69394L07499n68601j414432j865639k020725j922622j663013j338224
$$ 31771040 32740434 33047933 32479332 31064900 29199261 27178536 25255914 23592901 22254677
5263B2254677j170631p88271o10640m95455l86051l48794j32636R3910K53666
$$ 22254677 21084046 20295775 19685135 19189680 18803629 18454835 18322199 18416109 18669775
5254A8669775L22470M97253N42682O64897Q97682R68903J074536J063673R45649
$$ 18669775 18992245 19489498 20032180 20697077 21594759 22563662 23638198 24701871 25647520
5245B5647520O52020L09232L9807j17269k99478n25608p52845r54730r62817j096102
$$ 25647520 26299540 26608772 26648579 26531310 26231832 25706224 24953379 23998649 23035832 21939730
5235B1939730j165171j316284j354266j183282j127191j157010j111888j009547
$$ 21939730 20774559 19458275 18104009 16920727 15793536 14636526 13524638 12515091
5227A2515091q88060p74837p19715n69899m94785m62191l52640k74156k45125
$$ 12515091 11627031 10852194 10132479 9562580 9067795 8605604 8252964 7978808 7733683
5218G733683k07677k34449k36315l33993k45687k04440j69284j38390j16042j81628
$$ 7733683 7526006 7291557 7055242 6721249 6475562 6271122 6101838 5963448 5847406 5665778
5208E665778r8013n3312j09682r9267j26983n2280q5347p0416L098n8624o5352
$$ 5665778 5567765 5514453 5404771 5305504 5178521 5126241 5040894 4970478 4973576 4914952 4849600
5197D849600l8910p5182J5950L0211L1433Q5389R0371Q7342J19168J37507O45
$$ 4849600 4810690 4735508 4751458 4781669 4813102 4898491 4988862 5076204 5195372 5332879 5333524
5186E333524j52670k90997l19645k88830j92469j51197j85158j32129o9032r3962
$$ 5333524 5180854 4889857 4570212 4281382 4088913 3937716 3752558 3620429 3551397 3457435
5176C457435r3523J640r1372p4332l2020l862j9265k0886k3857j9445k4656l9398
$$ 3457435 3363912 3365552 3274180 3199848 3167828 3163966 3144701 3123815 3099958 3080513 3055857 3016459
5164C016459l7825j08952r0561o4888j8739K3442j5471l1309j520j751j4709M8027
$$ 3016459 2978634 2869682 2779121 2714233 2695494 2718936 2703465 2672156 2670636 2668885 2654176 2702203
5152B702203J11781m6827k3779M6796j2715o1707o3233N6892k9510K0947J6249
$$ 2702203 2813984 2767157 2743378 2790174 2777459 2715752 2652519 2709411 2679901 2700848 2717097
5141B717097k035J9809l8061J103p422l5690k6874k8267L726j5121j4789J5316
$$ 2717097 2715062 2734871 2696810 2697913 2690491 2654801 2627927 2599660 2603386 2588265 2573476 2588792
5129B588792n1898o398j6539L3693K8889J205J4739J2678J2092L4163R2548K6854
$$ 2588792 2536894 2530496 2513957 2547650 2576539 2577744 2592483 2605161 2617253 2651416 2743964 2770818
5117B770818Q3618M4352k9816J62866J09254J12719J08259J80607K30650J86457
$$ 2770818 2854436 2898788 2868972 3031838 3141092 3253811 3362070 3542677 3773327 3959784
5107C959784K60734K56172K79178K02858K10391J27274j25409k39393k64375l58285
$$ 3959784 4220518 4476690 4755868 4958726 5169117 5296391 5170982 4931589 4667214 4308929
5097D308929l43750k77656j48048j52257j49396j03216o4336r445o5093r3646
$$ 4308929 3965179 3687523 3539475 3387218 3237822 3134606 3070270 3060825 2995732 2902086
5087B902086K6034O41J4162J8200M0832K8803K3042K2487O9623J05468L1745J12243
$$ 2902086 2928120 2928761 2942923 2961123 3001955 3030758 3053800 3076287 3145910 3251378 3283123 3395366
5075C395366P0669M1242N6433o569p2759j56285l2882o4252j09122n1593j3274
$$ 3395366 3466035 3507277 3563710 3557141 3484382 3328097 3295215 3230963 3121841 3070248 3056974
5064C056974P97j3954L1392N4116L9342K8699M2946J16533J09630R0783J16448
$$ 3056974 3057771 3043817 3075209 3129325 3168667 3197366 3240312 3356845 3466475 3557258 3673706
5053C673706J91857K35619K73952L02717J80062o5635q1665j75469k84078k25228
$$ 3673706 3865563 4101182 4375134 4677851 4857913 4792278 4710613 4535144 4251066 4025838
5043D025838j83110j58326j23345j08655r7558j02703r6511l8737m6974L1559
$$ 4025838 3842728 3684402 3561057 3452402 3354844 3252141 3155630 3116893 3069919 3101478
5033C101478n4995n7905k7906k1159M1002P655m4718J0811j3465J8872M1118k6200
$$ 3101478 3046483 2988578 2960672 2939513 2980515 2988170 2943452 2954263 2940798 2959670 3000788 2974588
5021B974588k4921J6910o5310N4293J4054L2899K453p1467j617M4171m2930O914
$$ 2974588 2949667 2966577 2901267 2955560 2969614 3002513 3004966 2933499 2931882 2976053 2933123 2940037
5009B940037J1055L6915K9252L449O3953N646n030j237M4798J4622J7830J9291
$$ 2940037 2951092 2988007 3017259 3020708 3084661 3090307 3085277 3084040 3128838 3143460 3161290 3180581
4997C180581q74L4859k1347L4724M9988k5279L7717o0051O6485N152k0520P958
$$ 3180581 3179707 3214566 3193219 3227943 3277931 3252652 3290369 3230318 3296803 3301955 3281435 3289393
4985C289393l6520K8518j296j0439N621M8813L5049L4413k2198L4175j8282j9179
$$ 3289393 3252873 3281391 3280095 3269656 3275277 3324090 3359139 3393552 3371354 3405529 3387247 3368068
4973C368068M3572J4360K0396N0764L4245O6393P5587J05204J20417L9142Q4717
$$ 3368068 3411640 3426000 3446396 3497160 3531405 3597798 3673385 3778589 3899006 3938148 4022865
4962D022865Q4771j3604O5957j5613o2566m0581j4123M2838l3014M8573J6738
$$ 4022865 4107636 4094032 4159989 4144376 4081810 4041229 4027106 4069944 4036930 4085503 4102241
4951D102241k2181K7707L7874P1947J2894J6752N0806P0248N1155R144N3314J15306
$$ 4102241 4080060 4107767 4145641 4217588 4230482 4247234 4298040 4368288 4419443 4428587 4481901 4597207
4939D597207P8428M2685J14306J03587j0264Q5903m339J0868O6788L2112P7446
$$ 4597207 4675635 4718320 4832626 4936213 4925949 5011852 5007513 5018381 5085169 5117281 5194727
4928E194727K6008o610L5112L5948j256L4630N8630R2242J9138J9253K6964M2481
$$ 5194727 5220735 5214125 5249237 5285185 5283929 5318559 5377189 5469431 5488569 5507822 5534786 5577267
4916E577267N7746P6661O1109O9001R9021J68352J14379J05469J17456O5368J11934
$$ 5577267 5635013 5711674 5772783 5841784 5940805 6109157 6223536 6329005 6446461 6511829 6623763
4905F623763R0670J23162O7331J25979J22460J16853J10346M5319J26528J38205
$$ 6623763 6714433 6837595 6904926 7030905 7153365 7270218 7380564 7425883 7552411 7690616
4895G690616J57900J23488J29255J97021K19460K01114K48227J93086K35366K25215
$$ 7690616 7848516 7972004 8101259 8298280 8517740 8718854 8967081 9160167 9395533 9620748
4885I620748L26756L06996L19257L56558M01315M13488L95089K66957K80083K92203
$$ 9620748 9947504 10254500 10573757 10930315 11331630 11745118 12140207 12407164 12687247 12979450
4875A2979450K64373K48693K62354L18551K20321K50539K62556K52540L35491
$$ 12979450 13243823 13492516 13754870 14073421 14293742 14544281 14806837 15059377 15394868
4866A5394868K70393L15111L63857M04524K89867K57814L93394M08649L79070
$$ 15394868 15665261 15980372 16344229 16748753 17038620 17296434 17689828 18098477 18477547
4857A8477547M43429M38026M94035M63285N66464O33686O86803P55073O50807
$$ 18477547 18920976 19359002 19853037 20316322 20882786 21516472 22203275 22958348 23609155
4848B3609155N82322O66779N86554N65133O06739O18678O29001O06690O00729
$$ 23609155 24191477 24858256 25444810 26009943 26616682 27235360 27864361 28471051 29071780
4839B9071780N79186O04893P23876O54422O50331P72158P78310P85874Q61878
$$ 29071780 29650966 30255859 30979735 31634157 32284488 33056646 33834956 34620830 35482708
4830C5482708R61073J023417J069213J119448J136357J232638J268824J265733
$$ 35482708 36443781 37467198 38536411 39655859 40792216 42024854 43293678 44559411
4822D4559411J413623J313068J499764J583512J627081J808306J907873K138054
$$ 44559411 45973034 47286102 48785866 50369378 51996459 53804765 55712638 57850692
4814E7850692K309822K611299K948140L230208L790716M202577M964734N707817
$$ 57850692 60160514 62771813 65719953 68950161 72740877 76943454 81908188 87616005
4806H7616005O561752P881903R159391J0456107J1653799J2915055J4676367J7010703
$$ 87616005 94177757 102059660 111219051 121675158 133328957 146244012 160920379 177931082
4798A77931082K0884674K6287917L3443165M1773387N0418888N5173926M3025182
$$ 177931082 198815756 225103673 258546838 300320225 350739113 405913039 448938221
4791D48938221J2024842j8733334m7232985o2349077n5586405m3107001l3114097
$$ 448938221 460963063 442229729 394996744 332647667 277061262 233954261 200840164
4784B00840164k6102064k0893842j6808372j3661394j1267970r319844p755187
$$ 200840164 174738100 153844258 137035886 123374492 112106522 102786678 95031491
4777I5031491o334775n241193m209423l590783k977077k493052k067673j669339
$$ 95031491 88696716 83455523 79246100 75655317 72678240 70185188 68117515 66448176
4769F6448176j333948r89931o55970m10138k05804n2198K71534N19586P15723
$$ 66448176 65114228 64124297 63468327 63058189 62852385 62800187 63071721 63591307 64307030
4760F4307030R45561J257724J618010K075000K463816K970112L547993M341288
$$ 64307030 65252591 66510315 68128325 70203325 72667141 75637253 79185246 83526534
4752H3526534N134367O281605P455554Q428665R727166J1294342J3116709J5276886
$$ 83526534 88660901 94942506 102398060 110826725 120553891 131848233 144964942 160241828
4744A60241828J8444427K3227717K9217170L5739231M2365176M7946535M2767462
$$ 160241828 178686255 201913972 231131142 266870373 309235549 357182084 399949546
4737C99949546J3384058j0427907j7466209m1594026n8431903n0179679l8250193
$$ 399949546 413333604 402905697 385439488 343845462 285413559 235233880 196983687
4730A96983687k9242561k3246615j9098233j5559733j2767138j0460581q701593
$$ 196983687 167741126 144494511 125396278 109836545 97069407 86608826 77907233
4723G7907233p467473o318260n424474m571608l905301l491667l114725k801711
$$ 77907233 70439760 64121500 58697026 54125418 50220117 46728450 43613725 40812014
4715D0812014k467861k287635k048969j825422j605706j420135j306555j223177
$$ 40812014 38344153 36056518 34007549 32182127 30576421 29156286 27849731 26626554
4707B6626554j116658j012470r59051q98914q83558p48188q00337o66781o56368
$$ 26626554 25509896 24497426 23538375 22639461 21755903 21007715 20207378 19540597 18884229
4698A8884229o38857n29363m43122m23712m21391m18978m23372l69782k80410
$$ 18884229 18245372 17716009 17272887 16849175 16427784 16008806 15585434 15215652 14935242
4689A4935242k90298k57499j70813j09776o8063J9903M5400J08621j34214n10692
$$ 14935242 14644944 14387445 14216632 14106856 14038793 14058696 14104096 14212717 14078503 13567811
4679A3567811o82084o37343n32141m73120l89846l02447l01113k98935k63697
$$ 13567811 12885727 12248384 11716243 11243123 10853277 10550830 10249717 9950782 9687085
4670I687085k14676k84999k31436k10724j96517j53918k27424j53450j52576j42966
$$ 9687085 9472409 9187410 8955974 8745250 8548733 8394815 8167391 8013941 7861365 7718399
4660G718399r4675j18367m4139k9758j50465j20375j26704j52393j21534j62279
$$ 7718399 7623724 7505357 7461218 7431460 7280995 7160620 7033916 6881523 6759989 6597710
4650F597710j78168p8000n9942n5179n9479k1751k7823K0010M9474l6435n4822
$$ 6597710 6419542 6341542 6281600 6226421 6166942 6145191 6117368 6137378 6186852 6150417 6095595
4639F095595k7030L4792j2231l4443k2870J866k9279j3298J7627J7800k9395P354
$$ 6095595 6068565 6103357 6091126 6056683 6033813 6035679 6006400 5993102 6010729 6028529 5999134 6006488
4627F006488N821J5283Q4999Q3813R605L1876J22816R1909O5950L0204Q5947O4350
$$ 6006488 6012309 6027592 6112591 6196404 6206009 6237885 6360701 6452610 6518560 6548764 6634711 6699061
4615F699061P7384O1022M9994K4457K8786Q5324R4513Q7389M6506L5316R2624
$$ 6699061 6776445 6837467 6887461 6911918 6940704 7026028 7120541 7207930 7254436 7289752 7382376
4604G382376J08993O0066J20387J23520N9351N0192O8988N6603P3638R2397Q3979
$$ 7382376 7491369 7551435 7671822 7795342 7854693 7904885 7973873 8030476 8104114 8196511 8280490
4593H280490R5640J06247J34226J98956J88209K18546K63655J79909J41103K40647
$$ 8280490 8376130 8482377 8616603 8815559 9003768 9222314 9485969 9665878 9806981 10047628
4583A0047628K56383J95073K16863K60711K34608K53285J97964K33705J14018
$$ 10047628 10304011 10499084 10715947 10976658 11211266 11464551 11662515 11896220 12010238
4574A2010238J39774R2737K1200J18484Q7104K6414O5822Q0911J52226J80832
$$ 12010238 12150012 12242749 12263949 12382433 12469537 12495951 12561773 12642684 12794910 12975742
4564A2975742K00148K44439K41525K68168K47712K93728K71540L64698M12298
$$ 12975742 13175890 13420329 13661854 13930022 14177734 14471462 14743002 15107700 15519998
4555A5519998L21221L15547K99739L34587L05261K48587K75083J89757K08018
$$ 15519998 15841219 16156766 16456505 16791092 17096353 17344940 17620023 17809780 18017798
4546A8017798J78569J50933J32011J31472J87755J64335J23720K19991K01937
$$ 18017798 18196367 18347300 18479311 18610783 18798538 18962873 19086593 19306584 19508521
4537A9508521K68807K91879K77516L49845M01739L34741K49429K78818K49620
$$ 19508521 19777328 20069207 20346723 20696568 21098307 21433048 21682477 21961295 22210915
4528B2210915K69683K98376K00940K13772K76011K84339L68487L12092L93829
$$ 22210915 22480598 22778974 22979914 23193686 23469697 23754036 24122523 24434615 24828444
4519B4828444M43926M48787M78900N09696N25906N17695N39694M93709M62099
$$ 24828444 25272370 25721157 26200057 26709753 27235659 27753354 28293048 28786757 29248856
4510B9248856M21731L58308K39110K33389P9868l0535j33114j64361j29001j96596
$$ 29248856 29670587 30028895 30268005 30501394 30581262 30550727 30417613 30253252 30124251 29927655
4500B9927655k61980j13181n9337O228O4998J17635J86808K68159L21734L68209
$$ 29927655 29665675 29552494 29493157 29499385 29564383 29682018 29868826 30136985 30458719 30826928
4490C0826928L35398K92230L44736K35977K55717K10164J92858J35184p52j39190
$$ 30826928 31162326 31454556 31799292 32035269 32290986 32501150 32694008 32829192 32828440 32689250
4480C2689250k39457k74961k84714n43855p21113q97041j007564r34660p86571
$$ 32689250 32449793 32174832 31890118 31346263 30625150 29728109 28720545 27785885 26999314
4471B6999314p68067o94751o22986n19940m23933m24461m30677m43201m46275
$$ 26999314 26231247 25536496 24913510 24393570 23969637 23545176 23114499 22671298 22225023
4462B2225023m52684m56460m39049m51125m86725m42381m84361m57660m57029
$$ 22225023 21772339 21315879 20876830 20425705 19938980 19496599 19012238 18554578 18097549
4453A8097549m16319l36947l40714l30941l43239k40463k48142l12012l07229
$$ 18097549 17681230 17344283 17003569 16672628 16329389 16088926 15840784 15528772 15221543
4444A5221543l15344l84357l99183l58888m03042l95879m22867l50329l70575
$$ 15221543 14906199 14521842 14122659 13763771 13360729 12964850 12541983 12191654 11821079
4435A1821079k96497k86250k48378j71517j91314j36880k4836j7569L1292O8059
$$ 11821079 11524582 11238332 10989954 10818437 10627123 10490243 10465407 10447838 10479130 10547189
4425A0547189J57497J30001J89241J36319p8192j47062k36042l94879m39880m05662
$$ 10547189 10704686 10834687 11023928 11160247 11082055 10934993 10698951 10304072 9864192 9458530
4415I458530l77230l01212k84236k42576k34267k68221k08941k32739k03714j59967
$$ 9458530 9081300 8780088 8495852 8253276 8019009 7750788 7541847 7309108 7105394 6945427
4405F945427j05341j29102j08071p8379j31904m4660m4414q7810l4488M3366m397
$$ 6945427 6840086 6710984 6602913 6524534 6392630 6347970 6303556 6215746 6181258 6224624 6220227
4394F220227k3605K8168J5817L8211J6306M6648Q1972O05N7178P2909Q0505J14179
$$ 6220227 6196622 6224790 6240607 6278818 6295124 6341772 6423744 6424349 6481527 6554436 6634941 6749120
4382F749120Q1280J55197J08259J02925J43637R9358K14218J40845J36714J56583
$$ 6749120 6830400 6985597 7093856 7196781 7340418 7439776 7653994 7794839 7931553 8088136
4372H088136J83657J72679K13536K73268K83682L40471L08315K84864L26690K80527
$$ 8088136 8271793 8444472 8658008 8931276 9214958 9555429 9863744 10148608 10475298 10755825
4362A0755825L71504M60578M57513M20634M48485M97593M66288M05903M42593
$$ 10755825 11127329 11587907 12045420 12466054 12914539 13412132 13878420 14284323 14726916
4353A4726916L92800K96909L73780L80422L43466K61263K35942K59159J05953
$$ 14726916 15119716 15416625 15790405 16170827 16514293 16775556 17011498 17270657 17376610
4344A7376610J98459J21704R7816J84064K80315J97867J87855K70852K19896K51381
$$ 17376610 17575069 17696773 17794589 17978653 18258968 18456835 18644690 18915542 19135438 19386819
4334A9386819K26693J51696J91781K20105J81056J15121j4437j31877j86600k66623
$$ 19386819 19613512 19765208 19956989 20177094 20358150 20473271 20458834 20326957 20140357 19873734
4324A9873734k86141l53625m45751m82999n07781n55840o21775n70873n65113
$$ 19873734 19587593 19233968 18788217 18305218 17797437 17241597 16619822 16048949 15483836
4315A5483836n77662n24158m59015l84575l33485l39665k29256k31060k48136
$$ 15483836 14906174 14382016 13923001 13538426 13204941 12865276 12636020 12404960 12156824
4306A2156824j89927j97163k11495k14210k36199k85712l08930k83353m03676
$$ 12156824 11966897 11769734 11558239 11344029 11107830 10822118 10513188 10229835 9826159
4297I826159l47340m09480l46736l67613l88434m45350l46246l45437l48830l43203
$$ 9826159 9478819 9069339 8722603 8354990 7966556 7521206 7174960 6829523 6480693 6137490
4287F137490l06965k52219k41165j96478k47471k38364j86869k06748j33755j54065
$$ 6137490 5830525 5578306 5337141 5140663 4893192 4654828 4467959 4261211 4127456 3973391
4277C973391j73216n2855j47452j39588r6701j16680j02156j24757m8162n9014
$$ 3973391 3800175 3747320 3599868 3460280 3363579 3246899 3144743 3019986 2971824 2912810
4267B912810q0840N764p1933l9021o4717j08971n0152O845M676m2145m7515n9210
$$ 2912810 2831970 2837734 2765801 2726780 2662063 2553092 2502940 2509785 2514461 2472316 2424801 2365591
4255B365591o7974k2285l1346l6391k7278m489p0698k8189j1659j747l2490J5620
$$ 2365591 2297617 2275332 2243986 2207595 2180317 2175828 2105130 2076941 2065282 2063535 2031045 2046665
4243B046665q592n0208R551k4326l1795P537m4950n1166P4850L4271p4951J6028
$$ 2046665 2038073 1987865 1997416 1973090 1941295 1948832 1903882 1852716 1927566 1961837 1886886 1902914
4231A902914L7089J4739k7888M237J9492R188J1966K3305J4695q2503K3111N2015
$$ 1902914 1940003 1954742 1926854 1931091 1950583 1959771 1971737 1995042 2009737 1927234 1950345 2002360
4219B002360l2418p967j1179j6111L2846M0437O2393L2525P465K2719M4295k9932
$$ 2002360 1969942 1961975 1950796 1934685 1967531 2007968 2070361 2102886 2110351 2133070 2177365 2147433
4207B147433K7394R962l5185o5825o3224R097n2949p6501k0685j4638p1571p096
$$ 2147433 2174827 2184789 2149604 2083779 2020555 2029652 1976703 1900202 1879517 1864879 1793308 1786212
4195A786212K8331l2467k6470k3197k0326k874j10014k3874l1445k4711j5864
$$ 1786212 1814543 1782076 1755606 1732409 1712083 1709209 1599195 1575321 1543876 1519165 1503301
4184A503301m8870K1066L1183N9066m1217m0018M818K2760l824n5766k8866K198
$$ 1503301 1454431 1475497 1506680 1565746 1524529 1484511 1489329 1512089 1508265 1452499 1423633 1425831
4172A425831J579j4012n6951L1249q812k0399o399j4880j5397k0035j4709M246
$$ 1425831 1427410 1413398 1356447 1387696 1378884 1358485 1352086 1337206 1321809 1301774 1287065 1291311
4160A291311L9498M2428N975k0003n4499J5284K1294j6270M457J149k6941k417
$$ 1291311 1330809 1373237 1379212 1359209 1304710 1319994 1341288 1325018 1329475 1330624 1303683 1301266
4148A301266O4078M5710N489l7729J4431K5933l0297k6129r415j76N7520J6424
$$ 1301266 1365344 1411054 1416543 1378814 1393245 1419178 1388881 1362752 1353337 1353161 1410681 1427105
4136A427105n9633K9377p35M557J7901J4102K6374j388P9053L1039o48M290L1657
$$ 1427105 1367472 1396849 1396114 1400671 1418572 1432674 1459048 1457660 1536713 1567752 1567104 1571394 1603051
4123A603051N6757N981n209O3454R5403J14529K9663M1717k3697K0048l6134j6462
$$ 1603051 1659808 1665789 1660580 1724034 1819437 1933966 1963629 2005346 1981649 2001697 1965563 1949101
4111A949101k271j6862n363K1739L9906K7109l4492K3818J08674M9899J35935
$$ 1949101 1946830 1929968 1924605 1946344 1986250 2013359 1978867 2002685 2111359 2161258 2297193
4100B297193O1204J53297J96662K43957K90538K42166L17053l9989l68640l00987
$$ 2297193 2358397 2511694 2708356 2952313 3242851 3485017 3802070 3762081 3393441 3092454
4090C092454k88754k40140j81781j43913n2962q7925l6460j4546l8895L5208j594
$$ 3092454 2803700 2563560 2381779 2237866 2184904 2096979 2060519 2045973 2007078 2042286 2040692
4079B040692J9261N1487J2792l0529K7330K7341J5449q5n14j07098j19875L9799
$$ 2040692 2059953 2111440 2124232 2093703 2121033 2148374 2163823 2163738 2163224 2056126 1936251 1976050
4067A976050p9351m7532k7987p7993J4774n358m3945m0109m0740n5241P472L161
$$ 1976050 1896699 1849167 1821180 1743187 1757961 1752603 1708658 1668549 1627809 1572568 1580040 1583201
4055A583201K0081k0180K1280K0363N900Q379J8113k9855l1516r957j6884k605
$$ 1583201 1603282 1583102 1604382 1624745 1630645 1639024 1657137 1627282 1595766 1585809 1568925 1566320
4043A566320M9942N2217k1654k360j0726r391J302J4931M59M1191j1096m902k9327
$$ 1566320 1616262 1668479 1646825 1644465 1633739 1624348 1625650 1640581 1641040 1682231 1671135 1666233 1636906
4030A636906N8890m221n0911N3441N7200j8482j6903j3065M7146j603P2746N1968
$$ 1636906 1695796 1691575 1640664 1694105 1751305 1732823 1715920 1702855 1750001 1748398 1821144 1873112
4018A873112k7837L6996L489n5930K4273M3202j6534N9857J8326m4382k9521k0785
$$ 1873112 1845275 1882271 1885760 1829830 1854103 1897305 1880771 1940628 1958954 1914572 1885051 1864266
4006A864266j0764M3628R066J1640n4809K2059K1850J0783J7911l4235j2204L130
$$ 1864266 1853502 1897130 1906196 1917836 1863027 1885086 1906936 1917719 1935630 1901395 1889191 1892321
3994A892321J6036J5441k8967K8896O2472j7290L7947N5874j0354j1624l6282
$$ 1892321 1908357 1923798 1894831 1923727 1986199 1968909 2006856 2062730 2052376 2040752 2004470
3983B004470K6675k9448L849J8340M7709j5144M4898q85k9612K6132K1810j4989
$$ 2004470 2031145 2001697 2005546 2023886 2071595 2056451 2101349 2100464 2070852 2096984 2118794 2103805
3971B103805P915J4118N8971J9099L0563O95N0872Q4987K6587J6699M5324N0138
$$ 2103805 2111720 2125838 2184809 2203908 2234471 2235166 2286038 2371025 2397612 2414311 2459635 2509773
3959B509773K9155L7420M6559P130K9788O3391k5941L6656o4096R072K5215J6695
$$ 2509773 2538928 2576348 2622907 2630037 2659825 2723216 2697275 2733931 2669835 2678907 2704122 2720817
3947B720817L1817K7393o025J0041l1379P3835M2115M1996N1747K2444P0357O852
$$ 2720817 2752634 2780027 2774002 2784043 2752664 2826499 2868614 2910610 2962357 2984801 3055158 3062010
3935C062010L1422N4798q748Q8649P6341N4852L6237M7467R7257L6945K9861Q3193
$$ 3062010 3093432 3148230 3139482 3228131 3304472 3359324 3395561 3443028 3540285 3577230 3607091 3690284
3923C690284N7102J03165Q3446Q0160N8570P1970O7900N9513R8648P2207O1747
$$ 3690284 3747386 3850551 3933997 4014157 4072727 4144697 4212597 4272110 4370758 4442965 4504712
3912D504712J19511J27960N9971J02651J21779Q9264P9602J45958J38703Q0522
$$ 4504712 4624223 4752183 4812154 4914805 5036584 5125848 5205450 5351408 5490111 5570633
3902E570633J20382J78978O8108P6132J64630J31409R9242J35064J56614J15854
$$ 5570633 5691015 5869993 5938101 6014233 6178863 6310272 6409514 6544578 6701192 6817046
3892F817046R5987J38632J07193J54155J76460J82713J30573J08849J33283J60923
$$ 6817046 6913033 7051665 7158858 7313013 7489473 7672186 7802759 7911608 8044891 8205814
3882H205814K06832K56086J80422J57224K01856K45278J83751J42888J37073J41345
$$ 8205814 8412646 8668732 8849154 9006378 9208234 9453512 9637263 9780151 9917224 10058569
3872A0058569J37062J33658J90881J05926J21239J17278J04380J17642J57175
$$ 10058569 10195631 10329289 10520170 10626096 10747335 10864613 10968993 11086635 11243810
3863A1243810K26923K44100K33336K07271K29039K46582J92472J84034R9973J64734
$$ 11243810 11470733 11714833 11948169 12155440 12384479 12631061 12823533 13007567 13107540 13272274
3853A3272274K55225J76461J64026K17435K14382K04414K08854K32888K58705
$$ 13272274 13527499 13703960 13867986 14085421 14299803 14504217 14713071 14945959 15204664
3844A5204664K47821K27147K54632L05262K75354K48820K36156J98644L08025
$$ 15204664 15452485 15679632 15934264 16239526 16514880 16763700 16999856 17198500 17506525
3835A7506525L07417L32045L72521L85153L35936L68290K45008K60814K11291
$$ 17506525 17813942 18145987 18518508 18903661 19239597 19607887 19852895 20113709 20325000
3826B0325000J70710K15318K08043K60010J65047J92769K03598K17063J76613
$$ 20325000 20495710 20711028 20919071 21179081 21344128 21536897 21740495 21957558 22134171
3817B2134171J74558J69071K37050K45534K34041K47918K73148K67013K84710
$$ 22134171 22308729 22477800 22714850 22960384 23194425 23442343 23715491 23982504 24267214
3808B4267214L34550L11920L79145L83022L12866L95338L96579L95342L81420
$$ 24267214 24601764 24913684 25292829 25675851 25988717 26384055 26780634 27175976 27557396
3799B7557396L11486K26714J79956J02714Q2985O8572J6813O7990M2031j8383
$$ 27557396 27868882 28095596 28275552 28378266 28461251 28529823 28546636 28614626 28656657 28638274
3789B8638274M3915J17526J77511J51235J18936J18964l513K653K461o4121N54
$$ 28638274 28682189 28799715 28977226 29128461 29247397 29366361 29362848 29365501 29367962 29303841 29304395
3778B9304395P3462J87571J84176K56357K84590K78111K30857K26182K66183J73236
$$ 29304395 29377857 29565428 29749604 30005961 30290551 30568662 30799519 31025701 31291884 31465120
3768C1465120R0900P3281O6399m5109o2561J7592N3854J51379J61323K04286K60844
$$ 31465120 31556020 31629301 31695700 31650591 31588030 31605622 31659476 31810855 31972178 32176464 32437308
3757C2437308L58451L24694K46117M01280M96199M72650O23990O64888O81862
$$ 32437308 32795759 33120453 33366570 33767850 34264049 34736699 35360689 36025577 36707439
3748C6707439O26007N21624L15256J59516Q2107K8652N8795J39756J60569Q7069
$$ 36707439 37333446 37855070 38170326 38329842 38411949 38440601 38499396 38639152 38799721 38886790
3738C8886790N6094l8994o0164r7647j32774k32800k53088l35542m16945n38879
$$ 38886790 38942884 38903890 38843726 38746079 38613305 38380505 38127417 37791875 37374930 36836051
3728C6836051n57700o31486o60925p17035p04181o70356o03584n61007n89010
$$ 36836051 36278351 35646865 34985940 34268905 33564724 32894368 32290784 31729777 31140767
3719C1140767o56678p79251r32034j022224j029493j001473r46376r03415p54060
$$ 31140767 30484089 29704838 28772804 27750580 26721087 25719614 24773238 23869823 23115763
3710B3115763p41349o83416n76734n72330n65354n44515n38522n47880m80076
$$ 23115763 22374414 21690998 21114264 20541934 19976580 19432065 18893543 18345663 17865587
3701A7865587m43915m90238m81082m72101n36745n64741n59629n49151m85221
$$ 17865587 17421672 16931434 16450352 15978251 15441506 14876765 14317136 13767985 13282764
3692A3282764m34601m16742l96366l47778l32400l45951l30178k60745k30952
$$ 13282764 12848163 12431421 12035055 11687277 11354877 11008926 10678748 10418003 10187051
3683A0187051l18376k61588k60991k17333j69367j75190r6760j18599q7659j49606
$$ 10187051 9868675 9607087 9346096 9128763 8959396 8784206 8687446 8568847 8481188 8331582
3673H331582j39296r2699j37397j16263j23346j28487j26936j39812j53753j30448
$$ 8331582 8192286 8099587 7962190 7845927 7722581 7594094 7467158 7327346 7173593 7043145
3663G043145j20478r6714j18148j66241j56770p8645j45469j04609j23757p0753
$$ 7043145 6922667 6825953 6707805 6541564 6384794 6306149 6160680 6056071 5932314 5861561
3653E861561o9479j30730m9793q7704o7307k7069r9664j12996k9779q0838j09121
$$ 5861561 5792082 5661352 5611559 5523855 5456548 5429479 5329815 5216819 5187040 5106202 4997081
3642D997081l0506o4927r8899n9660J1096l1666p7972m9816p3168K295k6958O887
$$ 4997081 4966575 4901648 4802749 4743089 4754185 4722519 4644547 4594731 4521563 4523858 4496900 4503787
3630D503787l3572J2780k4112n3322l7072k4978o6517Q239J5904p771M8691J4424
$$ 4503787 4470215 4482995 4458883 4405561 4368489 4343511 4276994 4285233 4301137 4293366 4342057 4356481
3618D356481P273R441j719o0128O6820K8313N0016K6821R645L4522M8856R4277
$$ 4356481 4363754 4373195 4371476 4311348 4378168 4406481 4456497 4483318 4492963 4527485 4576341 4670618
3606D670618J12068Q0037Q9162Q6754M8156J75952J10118P9546l2863j43124j53162
$$ 4670618 4782686 4862723 4951885 5038639 5086795 5262747 5372865 5452411 5419548 5276424 5123262
3595E123262j42486j34662j33235j50743n1090m1819j26368o9698j0206n240n9716
$$ 5123262 4980776 4846114 4712879 4562136 4511046 4469227 4342859 4273161 4262955 4257715 4197999
3584D197999q999m2594q34o2795m1564k5921j2312j0584l1914j7565J3534K6129
$$ 4197999 4189000 4146406 4145572 4082777 4041213 4015292 4002980 3992396 3960482 3942917 3956451 3982580
3572C982580r580j6030j2371K868M996j5712K4049L9604k8361l0619l6621N9183
$$ 3982580 3973000 3956970 3944599 3947467 3952463 3936751 3960800 4000404 3972043 3941424 3904803 3963986
3560C963986N1609L1667j549L5736L422M751J5890K9260k3001M4397M3918n4804
$$ 3963986 4015595 4047262 4045713 4081449 4084871 4089622 4105512 4134772 4111771 4156168 4200086 4145282
3548D145282m834R468j7048o124L7605M1791m9206j276M4938J0259J9052J2317
$$ 4145282 4140448 4149916 4132868 4126744 4164349 4206140 4156934 4155658 4200596 4210855 4229907 4242224
3536D242224l3019m0491k8393O7349N3403n5994J9428M6256J2750L5655k830J5916
$$ 4242224 4209205 4168714 4140321 4207670 4261073 4205079 4224507 4270763 4283513 4319168 4316338 4332254
3524D332254k9225r508j1516M606L4886k7147N9069K6245L8627l5141l4421L9269
$$ 4332254 4303029 4293521 4282005 4286611 4321497 4294350 4353419 4379664 4418291 4383150 4348729 4387998
3512D387998K6064r2580L8483j1564k4565p877M889o460N6096M1160J752L3293
$$ 4387998 4414062 4321482 4359965 4348401 4323836 4315959 4320848 4314388 4370484 4411644 4413396 4446689
3500D446689O244m466j6817M4917n0920L0572K9800J555L0007l5025L5301r56
$$ 4446689 4452933 4448467 4431650 4476567 4425647 4456219 4486019 4487574 4517581 4482556 4517857 4516901
3488D516901j6724n2894j508j0651j7224K7803Q0364m974l7086O5353k9683L6193
$$ 4516901 4500177 4447283 4445775 4435124 4417900 4445703 4526067 4521093 4484007 4549360 4519677 4555870
3476D555870L3308Q04m6429P24R2385M9397n0417K7143M5656N2252q421l3019
$$ 4555870 4589178 4589982 4543553 4544277 4636662 4686059 4635642 4662785 4708441 4760693 4752272 4719253
3464D719253L2130j7625K9005M9031J5119K2509K0922K2269N6732k7575N2384
$$ 4719253 4751383 4733758 4762763 4811794 4826913 4849422 4870344 4892613 4949345 4921770 4974154
3453D974154K8968j996K2183k6568N5235l519L2865L8064M3045J5544q048L9854
$$ 4974154 5003122 5001126 5023309 4996741 5051976 5048457 5081322 5119386 5162431 5177975 5169927 5209781
3441E209781O3109O0486N3714J4369N1341R9537R8390j1539M6794Q2174Q7776
$$ 5209781 5272890 5333376 5387090 5401459 5452800 5552337 5650727 5639188 5685982 5768156 5855932
3430E855932Q7876K3193J00133Q6408q917q660J1357m4458j1652M7508O7407O0230
$$ 5855932 5943808 5967001 6067134 6153542 6144625 6135965 6147322 6102864 6091212 6138720 6206127 6266357
3418F266357M3717k773L0021O1103L6573N3743O4944M4415R8380M4149L8740L2141
$$ 6266357 6310074 6307301 6337322 6398425 6434998 6488741 6553685 6598100 6696480 6740629 6779369 6811510
3406F811510N9047R848J17724J29667l534N9130O7596J13060O2885M8345O8389
$$ 6811510 6870557 6880405 6998129 7127796 7124262 7183392 7250988 7364048 7426933 7475278 7543667
3395G543667R1393P3643P8641Q4462M9432R2030O9646Q1165J10370J00208P5859
$$ 7543667 7635060 7708703 7787344 7871806 7921238 8013268 8082914 8164079 8274449 8374657 8450516
3384H450516R4911J11344J29063R9696R8490J12433Q7052J14762J63868J47731
$$ 8450516 8545427 8656771 8785834 8885530 8984020 9096453 9183505 9298267 9462135 9609866
3374I609866Q3094J70483J64584J82188K17432J32020J24930J76140J62673J25291
$$ 9609866 9692960 9863443 10028027 10210215 10427647 10559667 10684597 10860737 11023410 11148701
3364A1148701J35937K26121J88076J21515J55304P4828J66635K16890J43980J98612
$$ 11148701 11284638 11510759 11698835 11820350 11975654 12050482 12217117 12434007 12577987 12776599
3354A2776599J96167J58938J68590K43609K65462K44284K27538K53329K81167
$$ 12776599 12972766 13131704 13300294 13543903 13809365 14053649 14281187 14534516 14815683
3345A4815683K72495K54521K83065K18531K47417K80122K26550K57314K70601
$$ 14815683 15088178 15342699 15625764 15844295 16091712 16371834 16598384 16855698 17126299
3336A7126299K46583K73060L55554K84026K65732K87422L48245K45773L13344
$$ 17126299 17372882 17645942 18001496 18285522 18551254 18838676 19186921 19432694 19746038
3327A9746038L80180L11728L63129L02906L22171K96307K62071L64648L48829
$$ 19746038 20126218 20437946 20801075 21103981 21426152 21722459 21984530 22349178 22698007
3318B2698007L22691L75022M05147M06725L90851N14936N23610N75901N87688
$$ 22698007 23020698 23395720 23800867 24207592 24598443 25113379 25636989 26212890 26800578
3309B6800578N66265O53318P76076P28849Q09643R18364Q87354R68021J098140
$$ 26800578 27366843 28020161 28796237 29525086 30334729 31253093 32140447 33108468 34206608
3300C4206608J261126J322477J428505J502533J616543J766684J882164J972999
$$ 34206608 35467734 36790211 38218716 39721249 41337792 43104476 44986640 46959639
3292D6959639K101776K054810K076567K058790J997404K002049J761551J486497
$$ 46959639 49061415 51116225 53192792 55251582 57248986 59251035 61012586 62499083
3284F2499083J157130P53673K89731m22670j087391j661402k174353k433716k480215
$$ 62499083 63656213 64409886 64699617 64276947 63189556 61528154 59353801 56920085 54439870
3275E4439870k393274k243710k126834j938570j691872j494990j396296j332570
$$ 54439870 52046596 49802886 47676052 45737482 44045610 42550620 41154324 39821754
3267C9821754j132954j028788r76332q89839q06604p79413p63937o66654n79652
$$ 39821754 38688800 37660012 36683680 35793841 34987237 34207824 33443887 32777233 32197581
3258C2197581n09283n30697n68293n61390o48651p27822o91212o63621p77650
$$ 32197581 31688298 31157601 30589308 30027918 29379267 28651445 27960233 27296612 26518962
3249B6518962p76543p11491p02107p04836o59640o20408n41432n51897n64117
$$ 26518962 25742419 25030928 24328821 23623985 22964345 22343937 21802505 21250608 20686491
3240B0686491n12280n12721m48410l75992l60054l65718l39397l13198k50501
$$ 20686491 20174211 19661490 19213080 18837088 18477034 18111316 17771919 17458721 17208220
3231A7208220j96266k37849k04525j80801j62326r2704q2648n3031k3700l8348
$$ 17208220 17011954 16774105 16569580 16388779 16226453 16133749 16051101 15998070 15974370 15936022
3221A5936022r9876k6539j09916l30755m14052m73392m19464l84195l82014k60206
$$ 15936022 15836146 15809607 15699691 15368936 14954884 14481492 14062028 13677833 13295819 13035613
3211A3035613k06566k49969k18953j90338j14015k12925k28299j17000q6274r7052
$$ 13035613 12829047 12579078 12360125 12169787 12055772 11842847 11614548 11497548 11411274 11314222
3201A1314222j50446q9660j03391q5210j02183o7293r515n8858q0384k9430n6770
$$ 11314222 11163776 11074116 10970725 10885515 10783332 10716039 10706524 10647666 10567282 10537852 10481082
3190A0481082m9341J1520L8529K5073n6077j81186k49756j93802k32904j41491
$$ 10481082 10431741 10443261 10481790 10506863 10450786 10269600 10019844 9826042 9593138 9451647
3180I451647j21634j26596r6311j09205r6832p8570j03376q6251j35099j08374
$$ 9451647 9330013 9203417 9107106 8997901 8901069 8822499 8719123 8632872 8497773 8389399
3170H389399l7863p9488o602o4573q6520m6631j7385n6725l9165j08851o4428
$$ 8389399 8351536 8272048 8265446 8200873 8114353 8067722 8050337 7993612 7954447 7845596 7781168
3159G781168j5628q3085r6095o7251o1752n9505o2318k2382n5582m6263J1857
$$ 7781168 7765540 7682455 7586360 7519109 7457357 7397852 7335534 7313152 7257570 7211307 7223164
3148G223164n7074m8273l1032k9003p3392m4872j9060j3376l8031n9443l784J1576
$$ 7223164 7166090 7117817 7086785 7057782 6984390 6939518 6920458 6907082 6869051 6809608 6805824 6817400
3136F817400j4737q49K8798r8201p562Q823k7642J4904n2986l1877j057l2056
$$ 6817400 6802663 6801814 6830612 6732411 6724849 6733672 6706030 6720934 6667948 6636071 6635014 6602958
3124F602958j5272l0775k6888J2098r6322p2371p3611k3710n9572m3805m3609
$$ 6602958 6587686 6556911 6530023 6542121 6445799 6373428 6299817 6276107 6216535 6172730 6129121
3113F129121J9830m2064q2684j9158j3747l6093l6471j7136j3721l2603N481p0980
$$ 6129121 6148951 6106887 6024203 6005045 5991298 5955205 5918734 5901598 5887877 5855274 5860755 5789775
3101E789775n1061L1767p256q727n4335l5730m1808j8181o9711l520r162l8501
$$ 5789775 5738714 5770481 5763225 5754498 5700163 5664433 5622625 5604444 5534733 5531213 5522051 5483550
3089E483550m7294k43m0476j1257m8315l0408r759m622j1113r6994p5203m2368
$$ 5483550 5436256 5436013 5395537 5384280 5335965 5305557 5295798 5291176 5280063 5183069 5107866 5065498
3077E065498J5173n2192k596K3150K2741K4271O0132J1190K1355L8730J2797K0068
$$ 5065498 5080671 5028479 5025883 5049033 5071774 5096045 5156177 5167367 5188722 5227452 5240249 5260317
3065E260317J02610R3400J23755J07532O0418J02825r9812j66334r2605j21315
$$ 5260317 5362927 5456327 5580082 5687614 5748032 5850857 5751045 5584711 5492106 5370791
3055E370791j05559j9120r0986j1044j0067m3567k9592J8952K3724K1512j1721
$$ 5370791 5265232 5246112 5155126 5144082 5134015 5090448 5060856 5079808 5103532 5125044 5113323
3044E113323o631j8516j909M5449L6958K3051K6899L9749P6142J5911R1420J25810
$$ 5113323 5106692 5088176 5086267 5131716 5168674 5191725 5218624 5258373 5334515 5350426 5441846 5567656
3032E567656J756P0774M2717K7631M5031Q0490P4794P8707M3185Q9125J11422
$$ 5567656 5569412 5640186 5682903 5710534 5755565 5836055 5910849 5989556 6032741 6121866 6233288
3021F233288N6309Q7286J10029Q0678M8691Q3411R1296J04441O8909N4217Q7560
$$ 6233288 6289597 6376883 6486912 6567590 6616281 6699692 6790988 6895429 6964338 7018555 7106115
3010G106115P4769J1009O9263J42160Q3351M7841R3783J06040P8512J63121J19643
$$ 7106115 7180884 7191893 7261156 7403316 7486667 7534508 7628291 7734331 7812843 7975964 8095607
2999H095607Q7781J32073Q2581M5426J93775J87313J76282J79657J96911J45605
$$ 8095607 8183388 8315461 8398042 8443468 8637243 8824556 9000838 9180495 9377406 9523011
2989I523011J97253K51226K63267J74074K16660L62587K71941K45760K36577L04384
$$ 9523011 9720264 9971490 10234757 10408831 10625491 10988078 11260019 11505779 11742356 12046740
2979A2046740K66945K92975K81860K91988L24675K68915K69079K67632K32510
$$ 12046740 12313685 12606660 12888520 13180508 13505183 13774098 14043177 14310809 14543319
2970A4543319K06501K05438J77043J91077J47719J88107J90681J86326K23802
$$ 14543319 14749820 14955258 15132301 15323378 15471097 15659204 15849885 16036211 16260013
2961A6260013K37373K68926L30569L33019L84602M67757M96886M86396N35231
$$ 16260013 16497386 16766312 17096881 17429900 17814502 18282259 18779145 19265541 19800772
2952A9800772N17254O06312N90518O32709O44869N93983N55411N29442L99015
$$ 19800772 20318026 20924338 21514856 22147565 22792434 23386417 23941828 24471270 24870285
2943B4870285K51684R2030r4504j69111m10079n12443n63145m51944l68135k07750
$$ 24870285 25121969 25213999 25119495 24950384 24540305 24027862 23464717 23012773 22644638 22436888
2933B2436888j14231l4306J20230J43425J95544K50581K75737K82002L22977L24181
$$ 22436888 22322657 22288351 22408581 22552006 22747550 22998131 23273868 23555870 23878847 24203028
2923B4203028L25793L70691L06382K32123J47316P5928L1830j28169k64886l72033
$$ 24203028 24528821 24899512 25205894 25438017 25585333 25661261 25693091 25564922 25300036 24928003
2913B4928003n10884m63362n69759n95441o10392o12840p18513o20547m80499
$$ 24928003 24417119 23953757 23383998 22788557 22178165 21565325 20846812 20226265 19745766
2904A9745766l65035l01722k96752k41671j34276j38362j49865j58294j97613
$$ 19745766 19380731 19079009 18782257 18540586 18406310 18267948 18118083 17959789 17762176
2895A7762176j85690k16159k85043l14740l50709l68491m60735n00968n44092
$$ 17762176 17576486 17360327 17075284 16760544 16409835 16041344 15580609 15079641 14535549
2886A4535549o12109o02358n78906n80060n19013m55637m65419m13355l89420
$$ 14535549 13923440 13321082 12742176 12162116 11643103 11187466 10722047 10308692 9919272
2877I919272l41688l30508k64577k54217k48046k06365k07711k21849j60196j73839
$$ 9919272 9577584 9247076 8982499 8728282 8480236 8273871 8066160 7844311 7684115 7510276
2867G510276k22573j89750k04696j27139j92923k21642j71775j86090j32755j97971
$$ 7510276 7287703 7097953 6893257 6766118 6573195 6351553 6179778 5993688 5860933 5662962
2857E662962j18216j49233j64376j35205j51439j50473o7001j00590r4316q5744
$$ 5662962 5544746 5395513 5231137 5095932 4944493 4794020 4727019 4626429 4532113 4446369
2847D446369j20046j19191j15403j23096j38302r3210j2202l4796m8572m4669
$$ 4446369 4326323 4207132 4091729 3968633 3830331 3737121 3724919 3690123 3641551 3596882
2837C596882o1814o1107q1766r555o6325n4462l8441o4459l5050q8900l3236o8733
$$ 3596882 3535068 3473961 3392195 3382640 3316315 3261853 3223412 3158953 3123903 3035003 3001767 2933034
2825B933034m8052r8848o9299k03q769n9051j06588r4167o0265m9743j4647k1421
$$ 2933034 2884982 2786134 2716835 2716632 2707863 2648812 2542224 2448057 2387792 2338049 2323402 2301981
2813B301981q9151o8983j734p8085l9852n8078k9372L971N456m322l2011o5438
$$ 2301981 2212830 2143847 2142113 2064028 2024176 1966098 1936726 1940697 1946153 1941831 1909820 1844382
2801A844382n6573M0196n6157p272k1063k3701j0459j1437J3503j15215n6148
$$ 1844382 1787809 1828005 1771848 1764576 1743513 1719812 1709353 1697916 1711419 1596204 1540056
2790A540056l4707M77l4015p8489m781o2857K724l3592r264J6589n4651n0779
$$ 1540056 1505349 1505826 1471811 1393322 1388541 1325684 1328408 1294816 1285552 1302141 1247490 1196711
2778A196711m8776j495K6030K4445l5308p7225l7409n716K1401p9046M2312J8555
$$ 1196711 1147935 1146440 1172470 1196915 1161607 1084382 1046973 1041257 1062658 983612 1025924 1044479
2766A044479r524m7340q5201K5464O657N0433m2624j7886k6171p2151q881K1066
$$ 1044479 1034955 987615 902414 927878 934535 984968 942344 924458 898287 826136 817255 838321
2754H38321O5740n1600L4422o0135l4672o748k7767n4543L4922L0062j9341M203
$$ 838321 904061 852461 886883 826748 792076 785328 757561 703018 737940 768002 748661 752864
2742G52864o3966L7435n7803N226O916k3189O3661j4407l4911K1019K4341K1530
$$ 752864 688898 726333 668530 673756 680672 657483 721144 706737 671826 692845 717186 738716
2730G38716o9272o0962K133K7521r102m8368J6179q103k6231n006j3477J793J5449
$$ 738716 669444 608482 610615 638136 629034 580666 596845 588742 562511 557505 544028 545821 561270
2717E61270j8466l3246L9308j676J3599P52k3178j5312j2535Q312M1555n444k5710
$$ 561270 542804 509558 548866 547190 560789 561541 538363 523051 510516 518828 560383 554939 529229
2704E29229J9082k8597n0306J9691K0049L117j4009m5237j2357K158O2746k121
$$ 529229 548311 519714 469408 489099 509148 512265 498256 453019 440662 442820 505566 503445
2692E03445k1282m5888K1442K4196M1653M605l0524k0447p5382K3443P9563k7735
$$ 503445 482163 436275 457717 481913 523566 528171 497647 477200 401818 425261 504824 477089
2680D77089m0031J6322O46M055r824N4565P71n6551Q392k82L6004o1055R068L3906
$$ 477089 437058 453380 454026 458081 448257 502822 503593 447042 455434 455152 491156 430101 439169 473075
2666D73075l9870J5422L9042j4068o0379J9532k1209j78M9312N028k5379K3439
$$ 473075 433205 448627 487669 473601 413222 432754 411545 411367 460679 465707 440328 463767
2654D63767j3356k4651o027j4266k3798P917Q833K1095m32n9981l3814l0195N7706
$$ 463767 450411 425760 419733 405467 381669 389586 398419 419514 419082 359101 325287 295092 352798
2641C52798K5190j4737L5922n6778L3006l344j4035M3982n712o2796J6661K4194
$$ 352798 377988 363251 399173 342395 375401 372057 358022 402004 396292 333496 350157 374351
2629C74351J0363q651k3560k3114o6054J8575O609M826J4886k7977j0273K0697
$$ 374351 384714 376063 352503 329389 263335 281910 288519 293345 308231 280254 269981 290678
2617B90678L9715L0988p4304j0103J4220l9830L6612j7220j5670J9725n199M773
$$ 290678 330393 361381 287077 276974 291194 251364 287976 270756 255086 274811 269612 274385
2605B74385j4531L1429K1437k7969l979m1605k346K523m2594J6494p090M101p335
$$ 274385 259854 291283 312720 284751 280772 239167 236821 239344 196750 213244 206154 210255 202920
2592B02920Q900l3024j0835K0870M7520k1851n9356p760J1115J6897j0606l9935
$$ 202920 211820 178796 167961 188831 236351 214500 155144 147384 158499 175396 164790 124855
2580A24855p775L2337j5587J3825Q715M2075N442n6646k9018j372J7949J2296
$$ 124855 117080 149417 133830 147655 156370 198445 203887 147241 118223 116851 134800 147096
2568A47096r500P899m293L2313k4693j0498L1854k2298j582l8020N136L1751n3413
$$ 147096 137596 145495 141202 173515 148822 138324 170178 147880 146298 108278 113414 145165 91752
2555I1752L590L5094m6027K807P381k8647J9760N8925m5925r566j4775n1939O0273
$$ 91752 95342 130436 84409 87216 94597 65950 85710 144635 98710 89144 74369 22430 82703
2542H2703O706J6381R95l3402n6078K4389K2163j616j8868J4461K0798k8628L554
$$ 82703 89409 105790 106785 73383 17305 41694 63857 62241 43373 57834 78632 50004 53558
2529E3558K6397J6786O80k5297o527p012m2254L0998j4028J6005O272K7509l5667
$$ 53558 79955 96741 97421 72124 65597 58585 16331 47329 33301 49306 55578 83087 47420
2516D7420N8743L368l7879J8367k1960L963j0419j4053n2363k2366J3149k096
$$ 47420 106163 109531 71652 90019 68059 72022 61603 47550 -4813 -27179 -14030 -16126
2504a6126o083K6611n407N181K1626N7547o970k4766k0068K2294r659J587j3087
$$ -16126 -22209 4402 -1005 4176 25802 83349 76379 51613 31545 53839 44180 45767 32680
2491C2680m4160K5696K1137J5697m0032j8993K0585J4182L5801k5997j3866l3722
$$ 32680 -11480 14216 35353 51050 11018 -7975 12610 26792 62593 36596 22730 -10992
2479a0992J7549n2410K8781O9528j8437n323n4350M8538n2513J038L3382l2717
$$ -10992 6557 -45853 -17072 52456 34019 28696 -25654 22884 -29629 -28591 4791 -27926
2467b7926O1026k6885o020N316K9625Q037j5515l5715k3761M1229l3832m227l506
$$ -27926 33100 6215 195 5511 35136 43173 27658 -8057 -31818 9411 -24421 -28648 -32154
2454c2154o222N271Q151J0403q073K022l8738j0657M2069J2623L248k4008K441
$$ -32154 -38376 -33105 -24954 -14551 -22624 -20602 -59340 -69997 -27928 -15305 -12057 -36065 -33624
2441c3624O203j6093l6028j3100k026O2290J3483R107k4200K5592k6332J4811
$$ -33624 -27421 -43514 -79542 -92642 -94668 -32378 -18895 -9788 -33988 -8396 -34728 -19917
2429a9917k2302M8244K9592q3991m1793K1182J4684N0158J8633o3348M8571Q943
$$ -19917 -42219 6025 35617 -48374 -90167 -68985 -54301 -4143 14490 -48858 -287 8656
2417H656q339r070K1388j3135p16l2752O854N8059k6757K4556L0611j3931o1051
$$ 8656 317 -8753 12635 -500 -1216 -33968 -27114 30945 4188 28744 59355 45424 -15627
2404a5627l3111l9445k0084k8702R5228L425l3781j5781L35M0599L6079p7818
$$ -15627 -48738 -88183 -108267 -136969 -41741 -38316 -72097 -87878 -87543 -46944 -10865 -88683
2392h8683o703M5885l4636J9885j2291K2757k552L5788n2111m1880M0066P338
$$ -88683 -95386 -49501 -84137 -64252 -76543 -53786 -56338 -20550 -72661 -114541 -74475 -67137
2380f7137J1030L2842l9771m126m2534M7682j6120O892M4703J5274j166N698o0111
$$ -67137 -56107 -23265 -63036 -67162 -109696 -62014 -78134 -71242 -26539 -11265 -12431 -6733 -66844
2367f6844K972M374o528K2528j5967j8848K2694N8907J3025m4802O091K3215l0991
$$ -66844 -63872 -59498 -66026 -43498 -59465 -78313 -55619 3288 16313 -28489 -22398 817 -30174
2354c0174n3068M3130k8101l2455R506j4096L9428O833L0150J9059r367k8199
$$ -30174 -83242 -40112 -68213 -100668 -91162 -105258 -65830 -58997 -28847 -9788 -19155 -47354
2342d7354n968m3808j3806O3182p0139j458M3124j2566k147L1369j2579j3721
$$ -47354 -53322 -97130 -110936 -47754 -117893 -119351 -76227 -88793 -90940 -59571 -72150 -85871
2330h5871L2787q676J2508R901k7016j6875k573J8729P406K6488k1185j5219K1692
$$ -85871 -53084 -61760 -49252 -39351 -66367 -83242 -85815 -67086 -59680 -33192 -54377 -69596 -47904
2317d7904r628l264P0220j2672l6066p901l8735K5405L6535O995m2264J8220J9749
$$ -47904 -57532 -60796 9424 -3248 -39314 -47215 -85950 -60545 -24010 -17015 -59279 -41059 -21310
2304b1310j8062r198Q646K026j4667m5302M803N318N2128Q026m1245Q534J5751
$$ -21310 -39372 -48570 -39924 -37898 -52565 -97867 -93064 -87746 -35618 -27592 -68837 -60303 -44552
2291d4552n4161J8459L509K4961K4013N978k7849o862m5557L0262O338q374K5601
$$ -44552 -98713 -80254 -76745 -51784 -27771 -21793 -49642 -56504 -102061 -71799 -65461 -73835 -48234
2278d8234L018K5267j4002j9423M0484k0903j5139L1652l5278J5822K5889R221
$$ -48234 -45216 -19949 -33951 -53374 -12890 -33793 -48932 -17280 -52558 -36736 -10847 -1626
2266a626N239l9155j9522N9968L0717n2788m6198K2654q304J9118K9941M0751
$$ -1626 3613 -35542 -55064 4904 35621 -17167 -63365 -40711 -49015 -29897 44 40795
2254D0795J8912k5241K4207k1176L422m9274j5306N2647N364k6803j076j9874
$$ 40795 59707 34466 58673 37497 40919 -8355 -23661 28986 34350 7547 6471 -13403
2242a3403j5133O5807j3444J3858N0027O561l9193k4314N128N8414p444o8302
$$ -13403 -28536 37271 23827 37685 87712 94273 55080 30766 35894 94308 86864 18562
2230A8562O45J3469M7117K2053k5311k5401L4037K4241M520n411l1900K9154J9301
$$ 18562 19207 32676 79793 101846 76535 51134 85171 109412 113932 108521 76621 105775 125076
2217A25076k3767L8222m8543l766N2680K0368O1558K3994q0836k2667N9402j2729
$$ 125076 101309 139531 90988 87222 139902 160270 221828 245822 164986 142319 201721 188992
2205A88992O9924K131n363j3269L3392L4043K036P555O232l1737m7859k8003Q2086
$$ 188992 258916 261047 255684 242415 275807 309850 311886 319441 325673 293936 246077 218074 300160
2192C00160k8451M3054K4440n491M2181o6913N0333P4060P7646M293m6989l6206
$$ 300160 271709 314763 339203 333712 375893 308980 359313 433373 511019 515312 468323 432117
2180D32117L0885N3160j450j6693N9920P8585L7124N896O4442R350K3505L6201
$$ 432117 463002 516162 514712 498019 557939 636524 673648 679544 743986 753336 776841 813042
2168H13042L0474O6832J01745Q3958R4466J41705J26006J07035J40512J04698
$$ 813042 843516 910348 1012093 1096051 1190517 1332222 1458228 1565263 1705775 1810473
2158A810473K02891J66726K18888K64614K89216L89976N27774O77956P39533P65406
$$ 1810473 2013364 2180090 2398978 2663592 2952808 3342784 3870558 4548514 5288047 6053453
2148F053453O75466N44677L94329n74588j513484j136514p81573n91117m53352
$$ 6053453 6728919 7273596 7667925 7093337 5579853 4443339 3661766 3070649 2617297
2139B617297l67506l09038k14233j58497q5464j14647j22384j40374o4692r1115
$$ 2617297 2249791 1940753 1726520 1568023 1482559 1367912 1245528 1105154 1040462 949347
2129I49347j25001j18934n1025l5465n2255Q615p247n1274n4528m5149k2893o3760
$$ 949347 824346 705412 654387 618922 566667 575282 568035 516761 462233 417084 394191 330431
2117C30431j1595K103K9183m3693q7665L6983l7541m5924O068J0756k3700K2995
$$ 330431 318836 320939 350122 306429 218764 255747 218206 172282 178350 189106 165406 188401
2105A88401r628R476n8158k0344K9742m5686j6091o3118J4020k3396K2173K3951
$$ 188401 178773 188249 130091 109747 139489 93803 77712 14594 28614 5218 27391 51342
2093E1342K4520o377o382K6202J3782o5272K668l9511L5440L1467p6894M7463
$$ 51342 75862 69485 63103 89305 103087 37815 40483 972 36412 67879 -9015 38448
2081C8448o804p473Q230j3435O796K3470l8126k5801l392K0353K4120N235o1686
$$ 38448 31644 24171 32401 18966 25762 49232 11106 -14695 -18087 2266 26386 31621 -30065
2068c0065Q617q451P7775n7817j9829L4066M3959K0527k3711q6575K7711N3203
$$ -30065 -21448 -29899 47876 -9941 -29770 4296 48255 68782 45071 -41504 -13793 39410
2056C9410l0124m3420L2954N026l7683l1727R890L9833J3796L923k1418P452K0888
$$ 39410 9286 -34134 -1180 3846 -33837 -65564 -55674 -15841 -2045 1878 -19540 -12088 8800
2043H800l950j6937J1459m5451K8487M642k5974j6362Q819k0910Q819K2146L6731
$$ 8800 4850 -12087 -628 -46079 -17592 -12950 -38924 -55286 -46467 -67377 -58558 -36412 319
2030C19K0031j6542j1887o4735j8010k4440n612L3554L7769M5801k3966m0292
$$ 319 20350 3808 -8079 -72814 -90824 -115264 -120876 -87322 -49553 -3752 -27718 -68010
2018f8010j4220j4139K7093M8673L1140L583k4979m6854r384Q399M688K4319P071
$$ -68010 -82230 -96369 -69276 -20603 10537 14120 -10859 -57713 -67097 -58698 -54010 -29691 -22620
2005b2620n036n8710R45J06331p4857K942M1864l5372j3491j1349j9183o915l413
$$ -22620 -27656 -86366 -85421 20910 -53947 -51005 -9141 -44513 -58004 -69353 -88536 -95451 -98864
1992i8864P727K3514o499Q208M1236o877l6120l2875P883N2450l3355l7062L4978
$$ -98864 -91137 -67623 -74122 -65914 -24678 -31555 -67675 -100550 -92667 -40217 -73572 -110634 -75656
1979g5656J9339k6138j5042J9443J4254J6936j8857j2249K3771m9203J2613M858
$$ -75656 -56317 -82455 -97497 -78054 -63800 -46864 -65721 -77970 -54199 -103402 -90789 -85931
1967h5931o376K1999J2954j1582K7159J8766L8458m1514j1415n7711n925j0157
$$ -85931 -92307 -70308 -57354 -68936 -41777 -23011 15447 -26067 -37482 -95193 -101118 -111275
1955a11275O2533n6078L286L8306r223P419q330K6060J0414J5544k6656m6689
$$ -111275 -48742 -104820 -101534 -63228 -72451 -65032 -73362 -47302 -36888 -21344 -48000 -94689
1943i4689k2672J3287O3026L2793j2899L768M3517K28m4403p085L334L0729J547
$$ -94689 -117361 -104074 -41048 -8255 -21154 -17386 26131 26359 -18044 -25129 -21795 8934 10481
1930A0481l5852l7012N1781l51m5671P580N0273o1482o477J0427O3576l2249l1080
$$ 10481 -25371 -62383 -10602 -10953 -56624 -49044 1229 -60253 -66730 -56303 7273 -24976 -56056
1917e6056L3218m9265l4669L5285r230j0k389K5303K7589o327k6680L178p810
$$ -56056 -22838 -72103 -106772 -71487 -80717 -80727 -83116 -57813 -30224 -36551 -63231 -60053 -67863
1904f7863N4564L3635p1358k4806N3606k1499p277K4690m6501m3979P57J17461
$$ -67863 -13299 20336 -51022 -75828 -22222 -43721 -50998 -26308 -72809 -116788 -116031 1430
1892A430n2824n1706K5367j4265J4767P6783l5942j6453k749J3885m904J3541
$$ 1430 -51394 -103100 -77733 -91998 -77231 -448 -36390 -52843 -55592 -41707 -46611 -33070
1880c3070j9067k048N015k0410L8877M6372j6885n5617n128Q768L1733k3685O074
$$ -33070 -52137 -54185 -49170 -69580 -30703 15669 -1216 -56833 -61961 -53193 -21460 -45145 -39071
1867c9071k9791j4125L1033j4660k0501L60K7632J923l3596M1444j8799Q28L1493
$$ -39071 -68862 -82987 -51954 -66614 -87115 -86755 -59123 -57200 -90796 -49352 -68151 -67323 -35830
1854c5830K4381k1030p3090J1761N0879R841k4148R084L3657j3696q37m8687n923
$$ -35830 -11449 -32479 -105569 -93808 -42929 -33088 -57236 -48152 -14495 -28191 -29028 -77715 -83638
1841h3638M7845k521L2108k9276j4075J9098k7521n632K1601R094K1047k3550
$$ -83638 -35793 -38314 -6206 -35482 -49557 -30459 -57980 -63612 -42011 -32917 -11870 -35420
1829c5420r618J8493k5416J3490j98K699k4068O5792J2608k9764k0416L7037K0590
$$ -35420 -45038 -26545 -51961 -38471 -38669 -35970 -60038 5754 18362 -11402 -31818 5219 25809
1816B5809n8915O581j5005l4456j8558O5589L1291l7416l9278m070J6869L1584
$$ 25809 -33106 -26525 -41530 -75986 -94544 -28955 2336 -35080 -74358 -78428 -61559 -29975
1804b9975k1229K4217m1329q736M5001L8942J6401l5486P176J4015r660k3964
$$ -29975 -51204 -26987 -68316 -77052 -32051 6891 23292 -12194 -5018 8997 -663 -24627
1792b4627k7348j1185N6604L6053k7956k6470M6091P969N117l8767j4412J8561
$$ -24627 -51975 -63160 -6556 29497 1541 -24929 21162 29131 34248 -4519 -18931 -370
1780c70J6253m927p1289m885l5541K0331L233J5201J547l0582k435M1668L1137
$$ -370 15883 10956 -60333 -65218 -100759 -80428 -77195 -61994 -60447 -91029 -93464 -51796 -20659
1767b0659m4412k6177j4034l0878K7703Q2393N7827l1767m8325K9989j3806j8511
$$ -20659 -65071 -91248 -105282 -136160 -108457 -26064 31763 -4 -48329 -18340 -32146 -50657
1755e0657J9399J5128o0319r097L9649p243p160O54o903J2670J2546K2866L1079
$$ -50657 -31258 -16130 -76449 -85546 -45897 -53140 -60300 -59646 -66549 -53879 -41333 -18467 12612
1742A2612J3573j1765l805k0114K4504n7843k126J229N0551j9280n3451L9641
$$ 12612 26185 14420 10615 -9499 15005 -42838 -44964 -43735 6816 -12464 -65915 -26274
1730b6274k1400K364j8767j9794l1266K0812N0779k9503o0378O6815K3961J6816
$$ -26274 -47674 -45310 -64077 -83871 -115137 -94325 -43546 -73049 -133427 -66612 -42651 -25835
$$ [...]
##END NTUPLES=NMR SPECTRUM
##END=
