##TITLE=1H_CG-1199-b12
 CDCl3
 8 sc, 
 9.4.2024
##JCAMPDX= 6.0         $$ Bruker NMR JCAMP-DX V2.0
##DATA TYPE= NMR SPECTRUM
##DATA CLASS= NTUPLES
##ORIGIN= UXNMR, Bruker Analytische Messtechnik GmbH
##OWNER= root
$$ XWIN-NMR		Version 3.5
$$ Tue Apr  9 13:56:26 2024 Russian Standard Time (UT+4h)  she@DPX200
##.OBSERVE FREQUENCY= 200.1309
##.OBSERVE NUCLEUS= ^1H
##.ACQUISITION MODE= SIMULTANEOUS
##.ACQUISITION SCHEME= undefined
##.AVERAGES= 8
##.DIGITISER RES= 18
##SPECTROMETER/DATA SYSTEM= spect
##.PULSE SEQUENCE= zg30
##.SOLVENT NAME= CDCl3
##.SHIFT REFERENCE= (INTERNAL, CDCl3, 0, 15.6301)
##AUDIT TRAIL= $$ (NUMBER, WHEN, WHO, WHERE, WHAT)
$$ ##TITLE= Audit trail, XWIN-NMR		Version 3.5
$$ ##JCAMPDX= 5.01
$$ ##ORIGIN= Bruker BioSpin GmbH
$$ ##OWNER= she
$$ F:/spectra/data/she/nmr/H-F/1/pdata/1/auditp.txt
$$ ##AUDIT TRAIL=  $$ (NUMBER, WHEN, WHO, WHERE, WHAT)
(   1,<2024-04-09 13:55:22.06 +0400>,<she>,<DPX200>,
      <created by zg, POWCHK disabled, PULCHK disabled
       configuration hash MD5:
       00 E9 B6 7A A2 85 ED C7 34 08 36 98 17 FE 4E 26
       data hash MD5: 16K
       B4 7A 0C 68 D5 88 2B 26 70 07 70 E6 7A 43 CC 6D>)
(   2,<2024-04-09 13:55:24.39 +0400>,<she>,<DPX200>,
      <Start of raw data processing
       efp BC_mod = 2 LB = 0.24 FT_mod = 6 PKNL = 1 PHC0 = -25305.88 PHC1 = 16.78731 SI = 16K 
       data hash MD5: 16K
       96 93 24 AE AA C9 89 6A 00 25 AE 0F BA 0E AD DB>)
(   3,<2024-04-09 13:55:37.40 +0400>,<she>,<DPX200>,
      <pk PHC0 = 1.614739 PHC1 = 0 
       data hash MD5: 16K
       3E B5 EF 22 15 EF B8 2E C2 11 01 B3 BA ED DA 75>)
(   4,<2024-04-09 13:55:41.26 +0400>,<she>,<DPX200>,
      <abs ABSG = 5 
       data hash MD5: 16K
       A3 08 3D B2 D5 52 58 A0 76 36 F5 EE E7 D5 6C 65>)
$$ ##END=
$$ 
$$ hash MD5
$$ D4 CA B6 01 39 A2 B3 B2 C5 D3 94 37 4B DB 2A 46
##$RELAX= 
##$RELAX= 
##$RELAX= 
##$RELAX= 
##$RELAX= 
##$RELAX= 
$$ Bruker specific parameters
$$ --------------------------
##$DU= <F:/spectra>
##$EXPNO= 1
##$NAME= <H-F>
##$PROCNO= 1
##$TYPE= <nmr>
##$USER= <she>
##$AMP= (0..31)
100 100 100 100 100 100 100 100 100 100 100 100 100 100 100 100 100 100 
100 100 100 100 100 100 100 100 100 100 100 100 100 100 
##$AQSEQ= 0
##$AQ_mod= 1
##$AUNM= <au_zg>
##$AUTOPOS= <>
##$BF1= 200.13
##$BF2= 200.13
##$BF3= 200.13
##$BF4= 200.13
##$BF5= 200.13
##$BF6= 200.13
##$BF7= 200.13
##$BF8= 200.13
##$BYTORDA= 1
##$CFDGTYP= 0
##$CFRGTYP= 5
##$CHEMSTR= <none>
##$CNST= (0..31)
1 1 145 1 1 1 1 1 1 1 1 1 1 1 1 1 1 1 1 1 1 1 1 1 1 1 1 1 1 1 1 1 
##$CPDPRG= <>
##$CPDPRG1= <>
##$CPDPRG2= <>
##$CPDPRG3= <>
##$CPDPRG4= <mlev>
##$CPDPRG5= <mlev>
##$CPDPRG6= <mlev>
##$CPDPRG7= <mlev>
##$CPDPRG8= <mlev>
##$CPDPRGB= <>
##$CPDPRGT= <>
##$D= (0..31)
0 1.2 0 0 0 0 0 0 0 0.06 0 0.03 0 0 0 0 0.0002 0 0 0 0 0 0 0 0 0 0 0 0 
0 0 0 
##$DATE= 1712656521
##$DBL= (0..7)
120 120 120 120 120 120 120 120 
##$DBP= (0..7)
150 150 150 150 150 150 150 150 
##$DBP07= 0
##$DBPNAM0= <>
##$DBPNAM1= <>
##$DBPNAM2= <>
##$DBPNAM3= <>
##$DBPNAM4= <>
##$DBPNAM5= <>
$$ [...]
##$SUBNAM3= <"">
##$SUBNAM4= <"">
##$SUBNAM5= <"">
##$SUBNAM6= <"">
##$SUBNAM7= <"">
##$SUBNAM8= <"">
##$SUBNAM9= <"">
##$SW= 18.0517689322627
##$SWIBOX= (0..15)
0 0 2 0 0 0 0 0 0 0 0 0 0 0 0 0 
##$SW_h= 3612.71676300578
##$TD= 16384
##$TD0= 1
##$TE= 0
##$TE2= 300
##$TE3= 300
##$TEG= 300
##$TL= (0..7)
0 120 120 120 120 120 120 120 
##$TP= (0..7)
150 150 150 150 150 150 150 150 
##$TP07= 0
##$TPNAME0= <>
##$TPNAME1= <>
##$TPNAME2= <>
##$TPNAME3= <>
##$TPNAME4= <>
##$TPNAME5= <>
##$TPNAME6= <>
##$TPNAME7= <>
##$TPOAL= (0..7)
0.5 0.5 0.5 0.5 0.5 0.5 0.5 0.5 
##$TPOFFS= (0..7)
0 0 0 0 0 0 0 0 
##$TUNHIN= 0
##$TUNHOUT= 0
##$TUNXOUT= 0
##$USERA1= <user>
##$USERA2= <user>
##$USERA3= <user>
##$USERA4= <user>
##$USERA5= <user>
##$V9= 5
##$VALIST= <valist>
##$VCLIST= <CCCCCCCCCCCCCCC>
##$VD= 0
##$VDLIST= <DDDDDDDDDDDDDDD>
##$VPLIST= <PPPPPPPPPPPPPPP>
##$VTLIST= <TTTTTTTTTTTTTTT>
##$WBST= 1024
##$WBSW= 4
##$XGAIN= (0..3)
0 0 0 0 
##$XL= 0
##$YL= 0
##$YMAX_a= 432101
##$YMIN_a= -619276
##$ZGOPTNS= <>
##$ZL1= 120
##$ZL2= 120
##$ZL3= 120
##$ZL4= 120
##$ABSF1= 15.6059
##$ABSF2= -2.445988
##$ABSG= 5
##$ABSL= 3
##$ALPHA= 0
##$AQORDER= 0
##$ASSFAC= 0
##$ASSFACI= 0
##$ASSFACX= 0
##$ASSWID= 0
##$AUNMP= <proc_1d>
##$AZFE= 0.1
##$AZFW= 0.1
##$BCFW= 0
##$BC_mod= 2
##$BYTORDP= 0
##$COROFFS= 0
##$CY= -3
##$DATMOD= 1
##$DC= 0
##$DFILT= <>
##$DTYPP= 0
##$F1P= 0
##$F2P= 0
##$FCOR= 1
##$FTSIZE= 16384
##$FT_mod= 6
##$GAMMA= 0
##$GB= 0
##$INTBC= 1
##$INTSCL= 3.70164e-10
##$ISEN= 128
##$LB= 0.24
##$LEV0= 0
##$LPBIN= 0
##$MAXI= 10000
##$MC2= 0
##$MEAN= 0
##$ME_mod= 0
##$MI= 1.114404
##$NCOEF= 0
##$NC_proc= -7
##$NLEV= 6
##$NOISF1= 3.799351
##$NOISF2= 2.8
##$NSP= 0
##$NTH_PI= 0
##$NZP= 0
##$OFFSET= 15.63013
##$PC= 1
##$PHC0= -25304.27
##$PHC1= 16.78731
##$PH_mod= 1
##$PKNL= yes
##$PPARMOD= 0
##$PSCAL= 0
##$PSIGN= 0
##$REVERSE= no
##$SF= 200.129578307637
##$SI= 16384
##$SIGF1= 3
##$SIGF2= 2
##$SINO= 5.538805
##$SIOLD= 16384
##$SREGLST= <1H.CDCl3>
##$SSB= 0
##$STSI= 16384
##$STSR= 0
##$SW_p= 3612.71676300577
##$SYMM= 0
##$S_DEV= 0
##$TDeff= 16384
##$TDoff= 0
##$TI= <>
##$TILT= no
##$TM1= 0
##$TM2= 0
##$TOPLEV= 0
##$USERP1= <user>
##$USERP2= <user>
##$USERP3= <user>
##$USERP4= <user>
##$USERP5= <user>
##$WDW= 1
##$XDIM= 16384
##$YMAX_p= 311711039
##$YMIN_p= -1041778
$$ End of Bruker specific parameters
$$ ---------------------------------
##NTUPLES= NMR SPECTRUM
##VAR_NAME=  FREQUENCY,     SPECTRUM/REAL,   SPECTRUM/IMAG
##SYMBOL=    X,             R,               I
##VAR_TYPE=  INDEPENDENT,   DEPENDENT,       DEPENDENT
##VAR_FORM=  AFFN,          ASDF,            ASDF
##VAR_DIM=   16384,         16384,           16384
##UNITS=     HZ,            ARBITRARY UNITS, ARBITRARY UNITS
##FACTOR=    0.220516191357247, 1,           1
##FIRST=     3128.05128859905, 0,            0
##LAST=      -484.665474406716, 0,           0
##MIN=       -484.665474406716, -1041778,    0
##MAX=       3128.05128859905, 311711039,    0
$$ Real data points
##PAGE= N=1
##DATA TABLE= (X++(R..R)), XYDATA
$$ [...]
6519A417684k1880k39021K8712j0978k87021P7802K06329l42068j28165L54023
6509A055417J13490n9676J05211j55790K67765j53013j08718O765k9373K94440
6499A336518o1431k55603J41657j86635P1753P8073o3989K6869k6379j50215J24986
6488A035604J71422k84344j24799K58065K52568o9262R8579J59416j55928j67697
6478A173624l77698J85388J14312K02511J08060r7077j31650J068J4635J91527
6468A384700j9865j69240O7327R3353J07882o8456M72183l14941l55796K0504
6458A217651K0964K75077K32134L4669J08854K4024r4439j13678P0429k63960
6448A511725p488L36745J31461k15878m2661j6570k19413J70998L8411M666m4721
$$ plain form
6519 1417684 1395804 1156783 1185495 1174517 887496 965298 1171627 829559 701394 1055417
6509 1055417 1168907 1109231 1214442 1058652 1326417 1173404 1064686 1071451 1042078 1336518
6499 1336518 1275087 1019484 1161141 974506 1046259 1124332 1060343 1087212 1060833 910618 1035604
6488 1035604 1207026 922682 797883 1055948 1308516 1239254 1337833 1497249 1341321 1173624
6478 1173624 795926 981314 1095626 1298137 1406197 1309120 1177470 1178538 1193173 1384700
6468 1384700 1364835 1195595 1262922 1356275 1464157 1395701 1867884 1552943 1197147 1217651
6458 1217651 1238615 1513692 1745826 1780495 1889349 1913373 1818934 1705256 1775685 1511725
6448 1511725 1504237 1840982 1972443 1756565 1713904 1697334 1477921 1648919 1687330 1691996 1647275
6437A647275q2930N07025J28551j8358r918J13812k65938J85450K2331k59010
6427A968290n8146M3101l982k32393j5534M29081K67714k25782P9256m7620j21608
6416B082377j5532Q1825K58649p4004k8779j36379J27291j49287m3987K22987
6406B325161K76171L5614p4809p3859j6213K31118j58638J35957J56065j88817
6396B647750m6784J54608p9364n8581J82556J39702n16351J68702K32131l0048
6386B794321L37646J13471K16907k36675r8198m5291P2118J69768K1673o2157
6376C283583J03624k27200j67226K55032J46506Q1582J60159R9817P8425K89446
6366D103748J0839l85930L23170L54846K64142J39889K51752J42915j3620J46106
$$ plain form
6437 1647275 1564345 2071370 2199921 2181563 2171645 2285457 2019519 2204969 2227300 1968290
6427 1968290 1910144 1953245 1949263 1716870 1701336 2130417 2398131 2172349 2251605 2203985 2082377
6416 2082377 2066845 2148670 2407319 2333315 2304536 2168157 2295448 2146161 2102174 2325161
6406 2325161 2601332 2636946 2562137 2488278 2472065 2703183 2544545 2680502 2836567 2647750
6396 2647750 2600966 2755574 2676210 2617629 2800185 2939887 2423536 2592238 2824369 2794321
6386 2794321 3131967 3245438 3462345 3225670 3127472 3082181 3154299 3324067 3345740 3283583
6376 3283583 3387207 3160007 2992781 3247813 3394319 3475901 3636060 3735877 3814302 4103748
6366 4103748 4114587 3728657 4051827 4406673 4670815 4810704 5062456 5205371 5191751 5337857
6356E337857L78728j0542m04754j87133J01995N3223j00428K31060k368k4215
6346E373423m71113K03091O3265o3551L9942m589L41756M39356K15747L97593
6336F534920L48924p356K00952O61314O2613j76100M9114l66990j65509n021k11378
6325F925483k25974o4883m10571j58633k68770r9058j0681j41911j50595J39544
6315E533951K56991K23551K51942k92448R8869M42264J79369j571k5842j77164
6305F489912O3761j83396r4727m72145k12720K9366j50126L00361l55566j87669
6295E227051j66597j75511Q1551n884L568l51250J85181p5565l54957K09769J90123
6284D767479P4020K40016J03762n0294m7200R8608l04218M1135K21745j87475
$$ plain form
6356 5337857 5716585 5706043 5301289 5114156 5216151 5269374 5168946 5400006 5397638 5373423
6346 5373423 4902310 5105401 5168666 5105115 5145057 5140468 5482224 5921580 6137327 6534920
6336 6534920 6883844 6876488 7077440 7738754 7801367 7625267 7674381 7307391 7141882 7136861 6925483
6325 6925483 6699509 6634626 6224055 6065422 5796652 5697594 5686913 5545002 5394407 5533951
6315 5533951 5790942 6014493 6266435 5973987 6072856 6515120 6694489 6692918 6667076 6489912
6305 6489912 6553673 6370277 6275550 5803405 5590685 5620051 5469925 5770286 5414720 5227051
6295 5227051 5060454 4884943 4966494 4960610 4964178 4612928 4798109 4722544 4367587 4577356 4767479
6284 4767479 4841499 5081515 5185277 5134983 5087783 5186391 4882173 4923308 5145053 4957578
6274D957578J53860L07890o2301p9935n8167n9057L28556L59735k86520J86147
6264E747786K47469j40928k56380J27635j19969J91797o6020J04734J73006k15530
6254E793600j74773J86472n5536J72459J12352O413j08961O7691L18478K70239
6244F588434M75448j57995P3166K05148L4592J88388j099k32519k09856L5332
6234F999039J72620n5406r5256k96063q576p3317k33546j83814R2009Q6679k16859
6223F187510J02119M27763j529j16881j04476K31459N54264L61557l7031K74081
6213G878836O1588j81630o4677K59850j18336k04785N4452o0409J95295j68749
6203G651435o21497j11454J21865j10712R9199M0966M9595J61422N2295l09799
$$ plain form
6274 4957578 5111438 5419328 5357027 5277092 5218925 5159868 5488424 5848159 5561639 5747786
6264 5747786 5995255 5854327 5597947 5725582 5605613 5797410 5731390 5836124 6009130 5793600
6254 5793600 5618827 5805299 5749763 5922222 6034574 6040987 5932026 5999717 6318195 6588434
6244 6588434 7063882 6905887 6979053 7184201 7218793 7407181 7406082 7173563 6963707 6999039
6234 6999039 7171659 7116253 7020997 6724934 6716358 6643041 6409495 6225681 6317690 6404369 6187510
6223 6187510 6289629 6717392 6715863 6598982 6494506 6725965 7280229 7641786 7604755 7878836
6213 7878836 7940424 7758794 7694117 7953967 7835631 7630846 7685298 7624889 7820184 7651435
6203 7651435 7029938 6918484 7040349 6929637 7028836 7069802 7119397 7280819 7333114 7023315
6193G023315q6882O56004j22275M16741J34207J3680m8700J18505j38815K43164
6183H208944J56005p1280l66791P588N56932J17062J08196K5222j08763o3788
6173H569327R1998L32125j88355J59432N49979j26301q885J10915K35040J14032
6163I839307j26326P12292M40565K77416j89844J37585L89842L44211J33166K85572
6153A2243786j57596j97326R0314k40016K58927J35261j69790m3635r765q4813
6143A1825347M48509j77855L46575Q4809L96410J94945L97597J73882Q4412K85433
6133A4060064L18335N90702Q89204K66405L82688K05837J5130J31425j92330k28346
6123A6439114q95366m12465j59799k67262O7713j88177N1626j06492p6509P5520
$$ plain form
6193 7023315 6936433 7592437 7470162 7886903 8021110 8034790 7986090 8104595 7965780 8208944
6183 8208944 8364949 8293669 7926878 7934466 8491398 8608460 8716656 8741878 8633115 8569327
6173 8569327 8661325 8993450 8805095 8964527 9514506 9388205 9379320 9490235 9725275 9839307
6163 9839307 9712981 10425273 10865838 11143254 10953410 11090995 11480837 11825048 11958214 12243786
6153 12243786 12086190 11888864 11979178 11739162 11998089 12133350 11963560 11919925 11910160 11825347
6143 11825347 12273856 12096001 12442576 12527385 12923795 13118740 13516337 13690219 13774631 14060064
6133 14060064 14378399 14969101 15858305 16124710 16507398 16713235 16728365 16859790 16667460 16439114
6123 16439114 15543748 15131283 14971484 14704222 14771935 14583758 14635384 14528892 14452383 14527903
6113A4527903j8749L80448J19618K25131j1153K75106j43577k57109R7517L5780
6103A5230915O06145J95519l31537k83993k24570p1554m1900m13435k01104O1559
6093A4526045m8976j73417K2920J06045J277L99345L02595J00293m2457q7140
6083A5106530o5711J20859j47783R8670M39756j74683j2540k33149M7273L29762
6073A5508984L21280j27725Q414q1860q0398J49883L91492j55444M58603M89346
6063A6882575J01786J34411L00486L6678M51919N02030n4712L33974O56342N40875
6053A9886364L31957M11980N55903L71994N58782L47438O69323J168983R76353
6044B5279077R15599J224368J183448J426575K164316K324779J658740R05058
$$ plain form
6113 14527903 14509154 14889602 15009220 15234351 15223198 15498304 15354727 15097618 15195135 15230915
6103 15230915 15837060 16032579 15701042 15417049 15192479 15120925 15079025 14665590 14464486 14526045
6093 14526045 14477069 14303652 14326572 14432617 14433894 14833239 15135834 15236127 15193670 15106530
6083 15106530 15040819 15161678 15013895 15112565 15552321 15377638 15365098 15131949 15179222 15508984
6073 15508984 15830264 15702539 15710953 15629093 15548695 15698578 16090070 15934626 16393229 16882575
6063 16882575 16984361 17118772 17419258 17455936 17907855 18409885 18355173 18689147 19345489 19886364
6053 19886364 20218321 20630301 21186204 21558198 22116980 22464418 23133741 24302724 25279077
6044 25279077 26194676 27419044 28602492 30029067 32193383 34518162 36176902 37081960
6036C7081960O12233j76397j012709q46583m12593j58645K66673N08685Q13081
6027C6675705J299971J202021J389741J421484O59193L52067N83077J446422J259760
6018D6289441J006126O99654L64078j89346J20005p04412J86322Q86725Q82278
6009D9540871J134587J174635J091020P69201J01567N05790N27364N00290J31167
6000E5476492N89266M08964M01588j13691o96635j173250j846943j636706j489623
5991D9919462j216962j85681J32669M55388J389528J331219J717465K156388K332533
5982E8032009K648338L491001L316139K958803K108493J151128k71092j289627
5974G2145192k118853k094894k292072k338651k625688j890591j391680j440982
$$ plain form
6036 37081960 37694193 37517796 36505087 35658504 35245911 35087266 35353939 35862624 36675705
6027 36675705 37975676 39177697 40567438 41988922 42648115 43000182 43583259 45029681 46289441
6018 46289441 47295567 47995221 48359299 48169953 48289958 47585546 47771868 48658593 49540871
6009 49540871 50675458 51850093 52941113 53710314 53811881 54317671 54845035 55345325 55476492
6000 55476492 56065758 56474722 56876310 56762619 56065984 54892734 53045791 51409085 49919462
5991 49919462 48702500 48516819 48649488 49104876 50494404 51825623 53543088 55699476 58032009
5982 58032009 60680347 64171348 67487487 70446290 72554783 73705911 73434819 72145192
5974 72145192 70026339 67931445 65639373 63300722 60675034 58784443 57392763 55951781
5966E5951781j217342j014437l00144K43513Q14728P84605J088698J397353K292266
5957F0041021K707555K829305L188229K075041K499531J818706J009457O55557
5949G6824402M09494L58344K09655J40143o16535j477032k598229k756536l243030
5940F7250676l048763k594872k124625j448534r42683o73296l63235k79287L22691
5931E6098072N67957Q89950J114701J138968J119523J244207R30138R71159N34954
5922F4609629Q29741O96219M46302N60863J81322l98429o90447j237522j352589
5913F3645089j794463j053098o45235n40471k05069L61843M34210Q5149J184923
5904F1472878J217793J059352J409875K004329K101624K197450K145458J809114
$$ plain form
5966 55951781 54734439 53720002 53419858 53663371 54478099 55262704 56351402 57748755 60041021
5957 60041021 62748576 65577881 68766110 70841151 73340682 75159388 76168845 76824402
5949 76824402 77233896 77592240 77801895 77942038 77325503 75848471 73250242 70493706 67250676
5940 67250676 64201913 61607041 59482416 58033882 57091199 56417903 56054668 55775381 56098072
5931 56098072 56666029 57555979 58670680 59809648 60929171 62173378 63103516 64074675 64609629
5922 64609629 65439370 66135589 66581891 67142754 67324076 66925647 66235200 64997678 63645089
5913 63645089 61850626 60797528 60152293 59611822 59406753 59768596 60202806 60287955 61472878
5904 61472878 62690671 63750023 65159898 67164227 69265851 71463301 73608759 75417873
5896G5417873J453418R63816N87207Q09111J161687J527868K109114K728308L165709
5887H9924111L391671K978861K599845J488503J428511J145463J359827R78101
5879A05294893J342225J524789J765477J749869J426460P76075J34971n75692
5871A13439067o92226r62722r53131k15577M29259J299724K046086L279838M428771
5862A22099089N267091O737502P039377O597855N210659L370036J043627l08082
5854A57057154m56482p12805n215K01651J4362k18618j069838k565266m067379
5845A48177564o022812p462309p941296p559127o036789n170536l312117j906531
5837A02766047j427021k7307O17508J468136K134514J898530J180064M38488p84746
$$ plain form
5896 75417873 76871291 77835107 78422314 79231425 80393112 81920980 84030094 86758402 89924111
5887 89924111 93315782 96294643 98894488 100382991 101811502 102956965 104316792 105294893
5879 105294893 106637118 108161907 109927384 111677253 113103713 113879788 114014759 113439067
5871 113439067 112746841 111784119 110830988 110615411 111044670 112344394 114390480 117670318 122099089
5862 122099089 127366180 134103682 141143059 147740914 152951573 156321609 157365236 157057154
5854 157057154 156600672 155887867 155882652 156084303 156098665 155880047 154810209 152244943 148177564
5845 148177564 142154752 134692443 126751147 119192020 113155231 107984695 104672578 102766047
5837 102766047 101339026 101311719 101929227 103397363 105531877 107430407 108610471 109048959 108264213
5828A08264213j663599j699986j469053j427996j564508j635069j311750j993817
5820I5498435k707715l372695m357795n021667m817996m973768m604737m124822
5812F1517240l004306k695474k789500k210196k334187j984861j440810j805502
5804D3252404k007657j330594j302970j474062j185873o07493p03109p79967r73593
5795C2887086o99904j60536l33438j51938L32443l67632m77584n86045r80181
5786B9462271o41515l91704q08226r72741k46006q65632p04756o95610p77648
5777B3358433n52798n35310m23491l73605m29721m87221k90658m13350l16704
5768A9535575m0952J00607J69510J32666j47554l55462m42681m93836m28994l69748
$$ plain form
5828 108264213 106600614 104900628 103431575 102003579 100439071 98804002 97492252 95498435
5820 95498435 92790720 89418025 85060230 80038563 75220567 70246799 65642062 61517240
5812 61517240 58512934 55817460 53027960 50817764 48483577 46498716 45057906 43252404
5804 43252404 41244747 39914153 38611183 37137121 35951248 35343755 34640646 33860679 32887086
5795 32887086 32187182 32026646 31693208 31541270 31873713 31506081 31028497 30442452 29462271
5786 29462271 28820756 28429052 27620826 26648085 26402079 25536447 24831691 24136081 23358433
5777 23358433 22805635 22270325 21846834 21473229 21043508 20556287 20265629 19852279 19535575
5768 19535575 19494623 19595230 19764740 19897406 19749852 19394390 18951709 18457873 18028879 17659131
5758A7659131l84057m56726l58341l51673l31936o4220k303o26575l20057J03092
5748A4866335l88953j18723P4979P87j20246K51225k77306k21135J10964k28294
5738A3949633J82086R9052Q3520J67550J09379j35966N35071L7780l38652M3288
5728A4732741j06692l06974j12378K63j77061j40918l19893m7283q99l5401j15972
5717A3369533Q8932J83471n8565O612J05275J25977L62817O39374J72180k53854
5707A4741752p7875K7136J66885Q9929J78614j20868m80009m40412k42127Q1567
5697A3924592P9417j72523j4136q4599r4563n7425k87269L24370K35342P5243
5687A3928449n6283K11617k47791J09978K12598M52249o6294j04787K69819j30852
$$ plain form
5758 17659131 17275074 16818348 16460007 16108334 15776398 15712178 15709875 15083300 14763243 14866335
5748 14866335 14477382 14358659 14433638 14434425 14314179 14565404 14288098 14066963 14177927 13949633
5738 13949633 14131719 14230771 14314291 14481841 14591220 14455254 14990325 15028105 14689453 14732741
5728 14732741 14626049 14319075 14206697 14206960 14029899 13888981 13569088 13521805 13520906 13485505 13369533
5717 13369533 13458465 13641936 13583371 13589983 13695258 13821235 14184052 14823426 14995606 14741752
5707 14741752 14663877 14691013 14857898 14947827 15126441 15005573 14525564 14085152 13843025 13924592
5697 13924592 14004009 13831486 13817350 13732751 13638188 13580763 13293494 13617864 13853206 13928449
5687 13928449 13872166 14083783 13835992 13945970 14158568 14610817 14544523 14439736 14709555 14578703
5677A4578703J48508k84546k20661K92876K93997Q762k17882M1504k16170J4819
5667A4439910J13181J20953L46165L298R1891j38005q744J05881J50256O6544
5657A5291330L3166L76291J47990Q8967L99021J69884J50519K36529K6607N8047
5647A6978351M58474l47503M8043K0029J59672J25404K07426M60168L60355M37674
5637A8908093j58344o0623J68412K86579J53335J76991J92191R7053K10716L76794
5627B0351197K53427J82327K16691L80090K58779M22785K56426k12763M39836
5618B2548795M82057L95670n1192J55572M52267J23729K83432N33176K57293O41626
5608B5822425O15756M07308L37636N52942P98159J198007Q34343N79237J446300
$$ plain form
5677 14578703 14727211 14442665 14222004 14514880 14808877 14817639 14599757 14641261 14425091 14439910
5667 14439910 14553091 14674044 15020209 15023507 15115398 14977393 14968649 15074530 15224786 15291330
5657 15291330 15324496 15700787 15848777 15937744 16336765 16506649 16657168 16893697 16920304 16978351
5647 16978351 17436825 17089322 17137365 17157394 17317066 17442470 17649896 18110064 18470419 18908093
5637 18908093 18749749 18689126 18857538 19144117 19297452 19474443 19666634 19763687 19974403 20351197
5627 20351197 20604624 20786951 21003642 21383732 21642511 22065296 22321722 22108959 22548795
5618 22548795 23030852 23426522 23375330 23530902 23983169 24106898 24390330 24923506 25180799 25822425
5608 25822425 26438181 26845489 27183125 27736067 28534226 29732233 30566576 31145813 32592113
5599C2592113J372380J276293J437587J786854J891251J770646J158922L37570
5591D3623616k82201q61955r22012j053784o50222o74243m14342l68374J90451
5582C8586934O02419N60646O40130R58257J150651J290731J496949K128523K094970
5573D9510210K445018L010407L276124L451867L078320K145205N73930m94277
5565F6996804j609310k513306k923069k598847k449522j695333j190955j231683
5557E0784779j172090n06316n8433K60055N38567P67662J232674J261744J630538
5548E4739180J707362J711323J751547K094456J444846J304252J169518Q10291
5540F6732775J61929o80447r40912r80696j212291j316176n59981n48176J28627
$$ plain form
5599 32592113 33964493 35240786 36678373 38465227 40356478 42127124 43286046 43623616
5591 43623616 43341415 42479460 41557448 40503664 39853442 39179199 38764857 38396483 38586934
5582 38586934 39189353 39749999 40390129 41348386 42499037 43789768 45286717 47415240 49510210
5573 49510210 51955228 54965635 58241759 61693626 64771946 66917151 67491081 66996804
5565 66996804 65387494 62874188 59951119 57352272 54902750 53207417 52016462 50784779
5557 50784779 49612689 49106373 49047940 49307995 49846562 50614224 51846898 53108642 54739180
5548 54739180 56446542 58157865 59909412 62003868 63448714 64752966 65922484 66732775
5540 66732775 66894704 66214257 65273345 64292649 63080358 61764182 61204201 60656025 60784652
5531F0784652L27032O90714O84319N56163N3125l56663j266595j234374r59059
5522E9279314r89011q91239n12753m56259p4945p6416J06093R7734K01507j5948
5512E6668077J58010Q8050K38605L84182Q68017R78045J190061K342630K093606
5503F5009283K769927K582534J603996L05916p65105j857394k838476k428977
5495F4381704k348130j883040j799473j245064j009940p50226o79020k66401n37604
5486E3862806l01155m9624K62990M09640Q54317J236843R29391J271934J744589
5477F0221731J855863J969660K155441J547176R23719K846n05114j314567j329511
5468F5527244r07575q48776r67566k88367j12527p1558J03095K58632N96875O24240
$$ plain form
5531 60784652 61111684 61802398 62486717 63042880 63096005 62739342 61472747 60238373 59279314
5522 59279314 58290303 57399064 56886311 56430052 56355107 56278691 56384784 56482518 56684025 56668077
5512 56668077 56826087 56914137 57152742 57536924 58404941 59382986 60573047 62915677 65009283
5503 65009283 67779210 70361744 71965740 72271656 71506551 69649157 66810681 64381704
5495 64381704 62033574 60150534 58351061 57105997 56096057 55345831 54666811 54400410 53862806
5486 53862806 53561651 53512027 53775017 54184657 55038974 56275817 57205208 58477142 60221731
5477 60221731 62077594 64047254 66202695 67749871 68673590 68676436 68171322 66856755 65527244
5468 65527244 64619669 63770893 62803327 62514960 62402433 62330875 62433970 62692602 63289477 63913717
5458F3913717O85525J554564J262364J547040K168318K714469L132345L079804
5450H0058146L738052M195551L703378K988429J933058Q5043j035962j202723
5442I4462972j246259n53741Q5980R27172J693108K296583L047787K828707L076656
5433A06618965L428420L954332M350964M466106L980556L220572J581181k28297
5425A31372799j812828k273943j967466j682008k58868k39908L45945L46195K28778
5416A24058696M37870N64606J407533K441616K885578L232631L200786M169949
5408A42399265N031903N622476O220144P046879P362447O762615M937602J895318
5400A87278649j699581m887738p288007q371307q649357p767795o598845n108798
$$ plain form
5458 63913717 64599242 66153806 67416170 68963210 71131528 73845997 76978342 80058146
5450 80058146 83796198 87991749 91695127 94683556 96616614 96701657 95665695 94462972
5442 94462972 93216713 92662972 92748952 93676124 95369232 97665815 100713602 103542309 106618965
5433 106618965 110047385 114001717 118352681 122818787 126799343 130019915 131601096 131372799
5425 131372799 129559971 127286028 125318562 123636554 123377686 123137778 123483723 123829918 124058696
5416 124058696 124496566 125061172 126468705 128910321 131795899 135028530 138229316 142399265
5408 142399265 147431168 153053644 159273788 166320667 173683114 180445729 185383331 187278649
5400 187278649 185579068 180691330 173403323 165032016 156382659 148614864 142016019 136907221
5392A36907221l465994j964395p73010L22530R87188J365917R94918N14096l45743
5383A34542728o63158p84345K11593J748633L050431M308939N245668N994828
5375A53655317N948407M628984J353535k552010o303838q967299r778018r209113
5367A28775965q385390o955380n494890m170711l378959k308511j868177j199125
5359I5014822j352040j272539j105448j365706j326671o78810q94854l77404K99557
5350H6940907K09066O40994R07050K53102k68718j240348k273466k828929l418769
5341G8920889l577409k972444k311817k070606j769776j621314p03351j81780
5333F3712392m58118j4861K81370L38790O18542N81658K92064J38297L87425Q7530
$$ plain form
5392 136907221 133441227 131476832 130703822 131026352 132013540 133379457 134374375 134888471 134542728
5383 134542728 133879570 133095225 133306818 135055451 138105882 142414821 147660489 153655317
5375 153655317 159603724 164232708 165586243 163034233 156730395 147763096 137985078 128775965
5367 128775965 120390575 113435195 107940305 103769594 100390635 98082124 96213947 95014822
5359 95014822 93662782 92390243 91284795 89919089 88592418 87913608 87018754 86641350 86940907
5350 86940907 87149973 87790967 88698017 88951119 88682401 87442053 85168587 82339658 78920889
5341 78920889 75343480 72371036 70059219 67988613 66218837 64597523 63894172 63712392
5333 63712392 63254274 63239413 63520783 63859573 64478115 65059773 65351837 65490134 65877559 65965089
5323F5965089L60955L81451k821J13238J43923O91149P74874J314360K149046
5314G1891264K617355L551288M214110M943448N598050O234396P097183O936065
5306A13083159O775494N831446M098002J918426j547228n265578p204133q212944
5298A09476644q184474q326506p526601o870208o377184m981557m208076l983996
5290E9018042k718209j890996j953335j754480p81108j285529q32931j209814
5282D6591640j218093j053983r13054m2618n68556m28647k24687l05118L23676
5273D2160560j65416N6814O51575P96039J216618J005825J419994K158877L226637
5264E2527523K943171K722880J511410n76829k166364l391053l746599k998526
$$ plain form
5323 65965089 66326044 66707495 66704674 66817912 66961835 67652984 68427858 69742218 71891264
5314 71891264 74508619 78059907 82274017 87217465 92815515 99049911 106147094 113083159
5306 113083159 119858653 125690099 129788101 131706527 130159299 124893721 117689588 109476644
5298 109476644 101292170 92965664 85439063 78568855 72191671 67210114 63002038 59018042
5290 59018042 56299833 54408837 52455502 50701022 49919914 48634385 47801454 46591640
5282 46591640 45373547 44319564 43406510 43363892 42795336 42366689 42142002 41836884 42160560
5273 42160560 41995144 42051958 42703533 43499572 44716190 45722015 47142009 49300886 52527523
5264 52527523 55470694 58193574 59704984 59128155 56961791 53570738 49824139 46825613
5256D6825613k668532j905443j913565j624497j009532j102349p80034q05981
5248C5015680j277995r69213o47233o57172p25697l38984o86363k22938k27760
5239B9262325r6512q1232p0751j44850m76249l33058m56403m34316o35185j418
5229B6532351l30217n89790J51063m34215m53441l52372n19085p19530m75748
5220B2809016k59454k31642n50878j55477m47007j25999M2364l66712r7738m80788
5210B0135685l72526m1882l04548j85468o2879L81023j22122m39070m05611k82731
5200A8299871m11811l56404j88256l78192p1621m80187o2262q9429q4999o35597
5190A5541113k10511m0081P2681k29915l96936L37646l11579l15529N38437q8512
$$ plain form
5256 46825613 44157081 42251638 40338073 38713576 37704044 36601695 35821661 35015680
5248 35015680 33737685 32768472 32121239 31464067 30738370 30399386 29713023 29490085 29262325
5239 29262325 29165813 29084581 29013830 28868980 28392731 28059673 27603270 27168954 26533769 26532351
5229 26532351 26202134 25612344 25763407 25329192 24875751 24523379 24004294 23284764 22809016
5220 22809016 22549562 22317920 21767042 21611565 21164558 21038559 21080923 20714211 20616473 20135685
5210 20135685 19763159 19721277 19416729 19231261 19168382 19549405 19427283 18988213 18582602 18299871
5200 18299871 17888060 17531656 17343400 16965208 16893587 16413400 16351138 16261709 16176710 15541113
5190 15541113 15330602 15290521 15363202 15133287 14736351 15073997 14762418 14446889 14985326 14896814
5180A4896814K726K38989M60018K79438R74570J007500Q34420M04885K32884N7344
5170A9389588r13092r85666o29809p51875j096979n19240o30402o14315j59289
5161A3088921o11288j18850k25646l78993R2598l82095J46434j84874n6021j70401
5151A1199785L86588L31228J49169J06666J05624P63764Q97780L29046P69249
5142A5038899J151309J079686K60478J08975j72042j276470j304377p59448l42267
5133A3784743n56283r35022p72907l01153l98740k74537l26964k76756j99703
5124I742678l42792J66535k11663M4078K07348j01741k53640l3049N88989k85273
5114I521470K96821J30634K65423o4323K10254O51616M29080p3092m3364l67517
$$ plain form
5180 14896814 14899540 15138529 15598547 15877985 16852555 17860055 18694475 19099360 19332244 19389588
5170 19389588 18476496 17490830 16861021 16109146 15012167 14492927 13862525 13248210 13088921
5161 13088921 12477633 12358783 12133137 11754144 11846742 11464647 11611081 11426207 11370186 11199785
5151 11199785 11586373 11917601 12066770 12173436 12279060 13042824 13940604 14269650 15038899
5142 15038899 16190208 17269894 17530372 17639347 17467305 16190835 14886458 14127010 13784743
5133 13784743 13228460 12293438 11520531 11219378 10820638 10546101 10219137 9942381 9742678
5124 9742678 9399886 9566421 9354758 9398836 9606184 9504443 9250803 9217754 9806743 9521470
5114 9521470 9818291 9948925 10214348 10150025 10360279 11011895 11440975 11367883 11324519 10957002
5104A0957002o25892k50502l76614J3916l43447R0465l47125l82981L2565J90102
5094H957489K25799k34107l25724j93500m5627l12118K02842N8286m23617j29907
5084G779816k83764K50978n2570L02867m8967l24946L29636O5830q7861K09593
5074H140612k30311k34716J41336J1457J89010k59347m6180L184k1160K29117
5064G923002N83929m27857m30951K92103q5142J94474K0942m84848K5885l6386
5054G575151P7625k45237n3464l54643K1597N5712J71119K19380m14677l9250
5044G013313L41480k17191j93184j04200J40579L67107l44844J34358R6656R4715
5034G328789J9976J99682j6769Q9640J48108k11442N4975J00870o1348j48564
$$ plain form
5104 10957002 10331110 10080608 9703994 9717910 9374463 9464928 9117803 8734822 8767387 8957489
5094 8957489 9183288 8949181 8623457 8429957 8384330 8072212 8275054 8333340 7909723 7779816
5084 7779816 7496052 7747030 7694460 7997327 7948360 7623414 7953050 8018880 7931019 8140612
5074 8140612 7910301 7675585 7816921 7828378 8017388 7758041 7711861 7715045 7693885 7923002
5064 7923002 8506931 8079074 7648123 7940226 7855084 8049558 8070500 7585652 7611537 7575151
5054 7575151 7652776 7407539 7354075 6999432 7021029 7076741 7247860 7467240 7052563 7013313
5044 7013313 7354793 7137602 6944418 6840218 6980797 7347904 7003060 7137418 7234074 7328789
5034 7328789 7348765 7548447 7531678 7621318 7769426 7557984 7612959 7713829 7652481 7503917
5024G503917l04361j69566L01183j18363j69360K1100j19396k27373l25528j23104
5014F269149J81725k23124J22766K68491n2294l0371r8918q0216J24544q9407
5004F392345l2258P0261J46778j99904l90554J96664R69L06911P9123k25951K70813
4993F615197J36151J06145l10684l12732L82840K88572j09513j96488J88348l09501
4983F478335l77088m9193M53335L98202K40084j61286j98591k47678q9566J95103
4973F641657O7142J20083M15973K94843m35900j64289j72200J35999N07498k78347
4963G132459J10772J91721K58155j85313Q2283K00541m2751J57319K1795Q162
4953G935143m3898n3370K10784n4508n6313Q0807K77908q2452J2803j1938L34931
$$ plain form
5024 7503917 7199556 7029990 7331173 7212810 7043450 7064550 6945154 6717781 6392253 6269149
5014 6269149 6450874 6227750 6350516 6619007 6566713 6536342 6437424 6357208 6481752 6392345
5004 6392345 6360087 6430348 6577126 6377222 5986668 6183332 6184301 6491212 6570335 6344384 6615197
4993 6615197 6751348 6857493 6546809 6234077 6616917 6905489 6795976 6599488 6787836 6478335
4983 6478335 6101247 6052054 6505389 6903591 7143675 6982389 6783798 6536120 6446554 6641657
4973 6641657 6708799 6828882 7244855 7539698 7103798 6939509 6767309 6903308 7410806 7132459
4963 7132459 7243231 7434952 7693107 7507794 7590077 7790618 7747867 7905186 7926981 7935143
4953 7935143 7891245 7837875 8048659 7994151 7937838 8018645 8296553 8214101 8226904 8214966 8549897
4942H549897M6520j40228L32175j3434j84433N9205K56856K16986j73136K58368
4932I208776J9622Q018K19813J08189N37969M80616J83965j12845L64729L95566
4922A1414418K7023K25650M42504K17016L02970P5648J1336j15607K07409M87813
4912A3296180L11644J76112K00421J04975J27732N9058K16246q864J19568K61796
4902A4864868j72491m9648N49202o6747k2207J69965M0952j29388K83302m0225
4892A5427583j5309L85268n0127r4226J76783K32137K69398J08272K57963o3134
4882A6634608J04609q378j08922k32036l0484J63579k98008j8439Q7998N7794
4872A6352321R4503k24936K43373j40087J26035N79401J749K83869M34038K36941
$$ plain form
4942 8549897 8596417 8456189 8788364 8774930 8590497 8649702 8906558 9123544 8950408 9208776
4932 9208776 9228398 9236416 9456229 9564418 10102387 10583003 10766968 10654123 11018852 11414418
4922 11414418 11441441 11667091 12109595 12326611 12629581 12705229 12716565 12600958 12808367 13296180
4912 13296180 13607824 13783936 13984357 14089332 14217064 14276122 14492368 14483504 14603072 14864868
4902 14864868 14692377 14642729 15191931 15125184 15102977 15272942 15313894 15184506 15467808 15427583
4892 15427583 15412274 15797542 15747415 15653189 15829972 16062109 16331507 16439779 16697742 16634608
4882 16634608 16739217 16730839 16621917 16389881 16359397 16522976 16224968 16206529 16294527 16352321
4872 16352321 16446824 16221888 16465261 16325174 16451209 17030610 17032359 17316228 17750266 17987207
4862A7987207L24059K67341N21842N45926L94738L18113M17491N43064J20393
4853B1440174l6500L88893L36320L67989j74553l41330r9524n39475J56941q68054
4843B0630881m20066O038J47608l94455P1134j11314k47236L5086j21111k17246
4833A9379319k6355k43669k5698J20199P908P214k56245K94507m2942l58189k16643
4822A8639406j37258k72620j77444K6497K06235j08577K4086J44680R9824K70043
4812A8714872L68990j35871p1539Q8349K3017M6203J77217M50141J45202J07639
4802A9914220R5893l90841J23887M31146L38039J10677J01983M74535L01295L74720
4792B1875554P6818O6274L65159K50431L55146N63095L63031o1259K08211J47000
$$ plain form
4862 17987207 18311266 18578607 19100449 19646375 20041113 20359226 20776717 21319781 21440174
4853 21440174 21403674 21792567 22128887 22496876 22322323 21980993 21881469 21341994 21498935 20630881
4843 20630881 20210815 20216853 20364461 19970006 20041140 19929826 19682590 19717676 19596565 19379319
4833 19379319 19352964 19109295 19083597 19203796 19211704 19218918 18962673 19257180 19214238 18856049 18639406
4822 18639406 18502148 18229528 18052084 18078581 18284816 18176239 18200325 18345005 18444829 18714872
4812 18714872 19083862 18947991 18876452 18964801 18987818 19034021 19211238 19661379 19806581 19914220
4802 19914220 20010113 19619272 19743159 20174305 20512344 20623021 20725004 21199539 21500834 21875554
4792 21875554 21952372 22018646 22383805 22634236 22989382 23552477 23915508 23854249 24062460 24209460
4782B4209460L45718L15962P42755M27257L07140O34078M63320M87652K43077
4773B8176419N29075Q46812j39275M79422M40267K56310O45260K25174N84581
4764C2044045J64436L3044j29994J18271J21928K98124N12812k69116M46401Q23037
4754C4162988J185719K57743M83974J069324O05341J094751J304307J788031J841562
4745D3793740K628283K679237L021009J744523Q78367r64786k179994k337717
4737D9262662j660070o61481m39937m443P70174O97894Q40247J397344J981999
4728E2184389K130558K771996L335980M037440M908770O362062Q019637R422911
4720I3173743R216832M487711K042113k934733q810078r605173p081698n154828
$$ plain form
4782 24209460 24555178 24871140 25613895 26041152 26348292 26982370 27445690 27933342 28176419
4773 28176419 28705494 29552306 29413031 29892453 30332720 30589030 31234290 31459464 32044045
4764 32044045 32208481 32241525 32111531 32229802 32351730 32649854 33162666 32893550 33339951 34162988
4754 34162988 35348707 35606450 36090424 37159748 37765089 38859840 40164147 41952178 43793740
4745 43793740 46422023 49101260 52122269 53866792 54745159 53780373 51600379 49262662
4737 49262662 47602592 46941111 46501174 46496731 47266905 47964799 48805046 50202390 52184389
4728 52184389 54314947 57086943 60422923 64460363 69369133 75731195 83750832 93173743
4720 93173743 102390575 106878286 108920399 105985666 97175588 87570415 80488717 75333889
4712G5333889m120237l284345j956564j546256j446265j257302o63309r42348
4704F0117263j301277n58255q6874p8743m5276L16922N5135k15319o07003o10653
4694E6985920m46408l9195L40390L17084J49739M06316N34396N94412P85798Q24872
4684F0453324R28640J003681Q00366J169129Q36574P00136Q70521J561717P82547
4675F9106635Q43355J016385J054342J021491J103279J142340J429027J561402
4667G8278256J423092J449219J469260J708126J934855K029822K299510K220021
4659I2812161K187143K313785K085095K432812K312841K510707K289410K473169
4651A11417123K003572K143220K269427J914948J993334K162885K523390K241781
$$ plain form
4712 75333889 71213652 67929307 65972743 64426487 62980222 61722920 61059611 60117263
4704 60117263 58815986 58257731 58170857 58092114 58046838 58363760 58418895 58203576 57596573 56985920
4694 56985920 56539512 56500317 56840707 57157791 57307530 57713846 58248242 58842654 59628452 60453324
4684 60453324 61381964 62385645 63186011 64355140 65191714 65891850 66762371 68324088 69106635
4675 69106635 69949990 70966375 72020717 73042208 74145487 75287827 76716854 78278256
4667 78278256 79701348 81150567 82619827 84327953 86262808 88292630 90592140 92812161
4659 92812161 94999304 97313089 99398184 101830996 104143837 106654544 108943954 111417123
4651 111417123 113420695 115563915 117833342 119748290 121741624 123904509 126427899 128669680
4643A28669680K419037K476271K343177K759049L132632L088695L102487L109608
4635A51100636L284773K989668K392871K644610K566914K299284K341760K561233
4627A72181749K663996K736574K740753L182750L245247L259300L461402L977316
4619A97449087M177319M352290M305290M815279M935998M941767M702026M367876
4611B34046932L598171L489752K796545J807789J275736Q72871q7937m59886n14504
4602B46825469l34495n80218m48188j60529J93363R15203J457772K155938K352038
4593B52376353K462585K943733L103256L025847K733618K884440K422313K061754
4585B74013899J219821j58748r77936k221551l267896l711055l982973m707046
$$ plain form
4643 128669680 131088717 133564988 135908165 138667214 141799846 144888541 147991028 151100636
4635 151100636 154385409 157375077 159767948 162412558 164979472 167278756 169620516 172181749
4627 172181749 174845745 177582319 180323072 183505822 186751069 190010369 193471771 197449087
4619 197449087 201626406 205978696 210283986 215099265 220035263 224977030 229679056 234046932
4611 234046932 237645103 241134855 243931400 245739189 247014925 247887796 247799859 247339973 246825469
4602 246825469 246490974 245910756 245462568 245302039 245495402 246410605 247868377 250024315 252376353
4593 252376353 254838938 257782671 260885927 263911774 266645392 269529832 271952145 274013899
4585 274013899 275233720 275074972 274097036 271875485 268607589 264896534 260913561 256206515
4577B56206515m170078m251921l669371l688387k892860k414953j912492j394337
4569B31812116q76604o93777q12079n58893o20890o04763p94304p44533r62074
4560B25144199j248266j612150j358814j241330j970034k208913k298638k402183
4552B10803871k347372k266556j733259j777178j885388j278017r80637j112010
4544A97423454j121696q14206r17246o05649p94048j133085q90378j095529j273808
4535A88777809j478507j696257j488145j093481j349369j066264p36154j332045
4527A78537587j088171j312914j552793j925857k120306k576155k835635l154348
4519A61971408k963907l325536l645969l238478l156896l218284k971252k732093
$$ plain form
4577 256206515 252036437 247784516 244115145 240426758 237533898 235118945 233206453 231812116
4569 231812116 230935512 230241735 229429656 228870763 228249873 227645110 226850806 226106273 225144199
4560 225144199 223895933 222283783 220924969 219683639 217713605 215504692 213206054 210803871
4552 210803871 208456499 206189943 204456684 202679506 200794118 199516101 198535464 197423454
4544 197423454 196301758 195487552 194570306 193964657 193170609 192037524 191147146 190051617 188777809
4535 188777809 187299302 185603045 184114900 183021419 181672050 180605786 179869632 178537587
4527 178537587 177449416 176136502 174583709 172657852 170537546 167961391 165125756 161971408
4519 161971408 159007501 155681965 152035996 148797518 145640622 142422338 139451086 136718993
4511A36718993k325770k579663k467341k272887j691484j135827j264252q39036
4503A22142733j003581n20326n03971j91332O0855k03393J01701R0372k13264
4494A19759794j422501k305903k450551l534857l930430m377240m596246m492465
4486I2649601l545992k686150k458886k368236k146795j671158j486742j319942
4478G4965700j474775j245128j056823r35653m65361o57516q11225m96277m61144
4469F7361798K37741J6572j32673l0207k8921j19141l00270J31175M45675r7107
4459F7484642Q6217j81360j40581m208J75456K5775l05695k6700o6411K6882M88364
4448F7562381k8643j03388J34849J2707N93988O90646N99417M11818J252353O35081
$$ plain form
4511 136718993 134393223 131813560 129346219 127073332 125381848 124246021 122981769 122142733
4503 122142733 121139152 120618826 120114855 119923523 119984378 119780985 119882686 119973058 119759794
4494 119759794 118337293 116031390 113580839 110045982 106115552 101738312 97142066 92649601
4486 92649601 89103609 86417459 83958573 81590337 79443542 77772384 76285642 74965700
4478 74965700 73490925 72245797 71188974 70253321 69787960 69130444 68319219 67822942 67361798
4469 67361798 67599539 67616111 67483438 67453231 67424310 67305169 67004899 67136074 67581749 67484642
4459 67484642 67570859 67389499 67248918 67244710 67420166 67445941 67140246 67113546 67047135 67074017 67562381
4448 67562381 67533738 67430350 67565199 67577906 68171894 68862540 69461957 69873775 71126128 71761209
4438G1761209J114149J614619J813393J146504J272074J476601K000037K285383
4430H4483969K364910K482794K229757K384479K493349K246040K398741K102530
4422A03186569K609481K940352L979934N043926N951855P251506Q236183R605994
4414A48805800J1839969J4655173J7023677J9916981K2692772K3508516K1549073
4407B79991961J6730475R632064R66726p259434j4099025j8966460k1098561k0325368
4399B25572378j7822891j5021142j2258668j0243221j0044668j0031269r936897
4392A40213622j0660224j0159783r514092q587903p845955o700176n859725n075119
4384G5810645m766978l518111k895687l003587k328701k118559j944401j685508
$$ plain form
4438 71761209 72875358 74489977 76303370 77449874 78721948 80198549 82198586 84483969
4430 84483969 86848879 89331673 91561430 93945909 96439258 98685298 101084039 103186569
4422 103186569 105796050 108736402 112716336 117760262 123712117 130963623 139199806 148805800
4414 148805800 160645769 175300942 192324619 212241600 234934372 258442888 279991961
4407 279991961 296722436 306354500 307321226 300061792 285962767 266996307 245897746 225572378
4399 225572378 207749487 192728345 180469677 170226456 160181788 150150519 140213622
4392 140213622 129553398 119393615 109879523 101291620 93445665 86745489 80885764 75810645
4384 75810645 71043667 67525556 64629869 61626282 59297581 57179022 55234621 53549113
4376E3549113j485615j636282j595587j610262j389585r48688r16346p17799j018932
4367D2230017j100051r66805n52762p14019p54330p38425q17414m76934j66868
4358C5942409n69255n20884l38281n07885m21015k59106l61979k54939n16594
4349C2192471m20548k33202r2516k60515m11529l22521k6021l06980k85363l49215
4339B9484061j29320j21968j92159o08168m73538j67382q1507j8248j63051j22972
4329B7405748N1633j99728J03504L91537J13477K81106K19784j7066J8989O77160
4319B9046144M92410j83310K17160O7945p04292k43145m70518n06030n84677n23139
4309B6608548o80466o24763l63278j2135j85185q0204l96644k41294K14558k26948
$$ plain form
4376 53549113 52063498 50427216 48831629 47221367 45831782 44883094 43966748 43248949 42230017
4367 42230017 41129966 40163161 39610399 38896380 38142050 37403625 36586211 36109277 35942409
4358 35942409 35373154 34852270 34513989 34006104 33585089 33325983 32964004 32709065 32192471
4349 32192471 31771923 31538721 31446205 31185690 30774161 30451640 30425619 30118639 29833276 29484061
4339 29484061 29354741 29232773 29040614 28432446 27958908 27791526 27710019 27691771 27528720 27405748
4329 27405748 27457381 27257653 27361157 27752694 27866171 28147277 28367061 28349995 28368984 29046144
4319 29046144 29538554 29355244 29572404 29640349 28936057 28692912 28222394 27716364 27131687 26608548
4309 26608548 25928082 25303319 24940041 24927906 24742721 24662517 24265873 24024579 24239137 24012189
4299B4012189K69548m00065Q8955P2937l06496O7652l49044l64000J4871K60668
4289B3367215k13287N4793K8223r4007j37247K11646M6337n128m33596J44396
4279B2969345J64530P9510K02464j90276O8657j5936J896L22846M48333P26537
4269B4777906M43658K95213Q6933L16542p505P2615L67742K20826k54795l67746
4259B5951389n4374J7527J85343K7527N61369M54037M25429L25137L38875P83583
4249B9015842L61634P43262J016818J004829J013197J699981J745430J655139
4241C8256132K271064J943133J499320P76815L69709J3818j156694j669648j700574
4232D0603075k084741k130744j873859j609495j048573j062778n25504q08221
$$ plain form
4299 24012189 24281737 23881672 23970627 24043564 23737068 23804720 23455676 23091676 23106547 23367215
4289 23367215 23153928 23208721 23236944 23142937 23005690 23217336 23263673 23258545 22824949 22969345
4279 22969345 23133875 23213385 23415849 23225573 23294230 23278294 23280190 23603036 24051369 24777906
4269 24777906 25221564 25516777 25603710 25920252 25912747 25985362 26353104 26573930 26319135 25951389
4259 25951389 25897015 25914542 26099885 26127412 26688781 27142818 27568247 27893384 28232259 29015842
4249 29015842 29377476 30120738 31137556 32142385 33155582 34855563 36600993 38256132
4241 38256132 40527196 42470329 43969649 44746464 45116173 45129991 43973297 42303649 40603075
4232 40603075 38518334 36387590 34513731 32904236 31855663 30792885 30267381 29459160
4224B9459160p80492m72165m30872m18742l72564j64563m92582R6026k10636O0257
4214B6272827n55474N6185j26746J19377J16883J9846l8487k09450N62636J29021
4204B6346618N7986k4159l41242K26440N6169j00202k39874j66555M07150l87930
4194B5834401k07299K50032n5496l3619R8123L0054J34610K0902m11806J60965
4184B5820867j5544J6566N7648k956J87574J81799L97155J48463q8822K16513
4174B6919263k2158j6374J08677J16296M0125m52007o2119J19384P319k25350
4164B6533056J8913K08815J30090l11295j41744K39285m1452N1239K17767J53241
4154B7057915j07056K5297l5194l4555j18197k41688M9665j54567J12527J84019
$$ plain form
4224 29459160 28678668 28206503 27775631 27356889 26984325 26819762 26327180 26423206 26212570 26272827
4214 26272827 25717353 25773538 25646792 25766169 25883052 25902898 25864411 25654961 26217597 26346618
4204 26346618 26404604 26380445 26039203 26265643 26321812 26221610 25981736 25815181 26222331 25834401
4194 25834401 25627102 25877134 25821638 25788019 25886142 25916196 26050806 26071708 25659902 25820867
4184 25820867 25805323 25821889 25879537 25876581 26064155 26245954 26643109 26791572 26702750 26919263
4174 26919263 26897105 26880731 26989408 27105704 27145829 26693822 26631703 26751087 26758406 26533056
4164 26533056 26551969 26760784 26890874 26579579 26437835 26677120 26635668 26686907 26904674 27057915
4154 27057915 26950859 26976156 26940962 26906407 26788210 26546522 26596187 26441620 26554147 26738166
4144B6738166Q4525K11599m51626k49070M4693j01436k06718k40173m23230o81121
4134B4725609J65238n3837k51636j95593m57593L43280L7388k24758N7413J22223
4124B4267734m9384K13442J6211k2273l97190m7106j76719K36146k53402k34855
4114B3552604j75113J38845K10656l24575N0993l12501j59746m2166J20916k14178
4104B2845735j64938K287M4440m00839j14861L4385m3532n2995m6584k22344L36599
4093B2217353L1912j4527O4197Q6675J8106o9459K40859k16741l01950j72442
4083B1883983k98009M6133K15625N38734l41007K6496J92044K94411n1452J32489
4073B2639447M9888j34399j38880Q5910J41357M40130L12625J33666K1665o4423
$$ plain form
4144 26738166 26822691 27034290 26582664 26333594 26378287 26276851 26070133 25829960 25406730 24725609
4134 24725609 24890847 24837010 24585374 24389781 23932188 24275468 24312856 24088098 24145511 24267734
4124 24267734 24218350 24431792 24448003 24425730 24028540 23981434 23804715 24040861 23787459 23552604
4114 23552604 23377491 23516336 23726992 23402417 23453410 23140909 22981163 22938997 23059913 22845735
4104 22845735 22680797 22683084 22727524 22326685 22211824 22246209 22202677 22149682 22103098 21880754 22217353
4093 22217353 22249265 22234738 22298935 22385610 22403716 22334257 22575116 22358375 22056425 21883983
4083 21883983 21585974 21632107 21847732 22386466 22045459 22071955 22263999 22558410 22506958 22639447
4073 22639447 22689335 22554936 22416056 22501966 22643323 23083453 23396078 23529744 23551409 23486986
4063B3486986k19387K9353r8184L24999N8773K91160L62793j82719M29627o5992
4053B4417409j98365K51675r0472P5116J73655K02063K83276R4233J38706O2918
4043B5410214J51618q0805K45383L49345M75206M84732l3113j89124L77902J34267
4033B7325625J43967R9223N18602J61478L55683J87375k7083L17990M22600K09725
4023B9715185M38992k3207J97934P1203j4512j6033J63816M80800M73821J69482
4013C1657481N4604K55259O37723N18187L96469M49898K61380J81113Q29197R47629
4003C6188940N43505N54765P44191M48349K21168P18913P96423L93740P30783
3994D1340777M90927n2222P43595Q42692O32119R44146M98421R71336N22549O69810
$$ plain form
4063 23486986 23267599 23296952 23198768 23523767 23582540 23873700 24236493 24053774 24483401 24417409
4053 24417409 24219044 24470719 24380247 24455363 24629018 24831081 25114357 25208590 25347296 25410214
4043 25410214 25561832 25481027 25726410 26075755 26550961 27035693 27002580 26813456 27191358 27325625
4033 27325625 27469592 27568815 28087417 28248895 28604578 28791953 28764870 29082860 29505460 29715185
4023 29715185 30154177 30130970 30328904 30400107 30385595 30369562 30533378 31014178 31487999 31657481
4013 31657481 31712085 31967344 32605067 33123254 33519723 33969621 34231001 34412114 35241311 36188940
4003 36188940 36732445 37287210 38031401 38479750 38700918 39419831 40216254 40609994 41340777
3994 41340777 41831704 41779482 42523077 43365769 43997888 44942034 45440455 46411791 46934340 47604150
3984D7604150R78406J311005J115334Q82675J030933J111625J225860J191357
3976E6451345R83097J238526R41619R68879J078024J321790R30683J220137J478711
3967F6612811J177996J197809R64165J647012J115299J679796J809082K061463
3959G8265433K266290K115525J928693K186755J728949J675950J620717K309266
3951I4097578J789009J456060J673757J827345K205482J803910K024540K021164
3943A08898845K101645J991685K334919K767382J997462K205764K492445K285105
3935A27075252K135000K379637K279981K568718K704338K919567K763825K515301
3927A47341619K320590K277329K002614K062676K429570K001093J840107K374867
$$ plain form
3984 47604150 48582556 49893561 51008895 51891570 52922503 54034128 55259988 56451345
3976 56451345 57434442 58672968 59614587 60583466 61661490 62983280 63913963 65134100 66612811
3967 66612811 67790807 68988616 69952781 71599793 72715092 74394888 76203970 78265433
3959 78265433 80531723 82647248 84575941 86762696 88491645 90167595 91788312 94097578
3951 94097578 95886587 97342647 99016404 100843749 103049231 104853141 106877681 108898845
3943 108898845 111000490 112992175 115327094 118094476 120091938 122297702 124790147 127075252
3935 127075252 129210252 131589889 133869870 136438588 139142926 142062493 144826318 147341619
3927 147341619 149662209 151939538 153942152 156004828 158434398 160435491 162275598 164650465
3919A64650465K308134K227839K312465K095965K208960K668975K512787K948704
3911A83934294K768003K102797K849163K489482K703728L432112L226533L354412
3903B06860524L475027L624382L586216K947988L156874K915299K535168J800758
3895B30902236J891805K243547K250437K012372K105640K381669K406492L084285
3887B49278483L111912L382030L277653L484184L712981L742567L205041L022373
3879B76217224L073393L090895L075848L305074L893336L530404L173306L121163
3871C02480643K796563K059199J644365J452718R01460L76091j04565j93582q43828
3862C10569064j365652j960249k016717j939001j800958j413090j767947j452929
$$ plain form
3919 164650465 166958599 169186438 171498903 173594868 175803828 178472803 180985590 183934294
3911 183934294 186702297 188805094 191654257 194143739 196847467 200279579 203506112 206860524
3903 206860524 210335551 213959933 217546149 220494137 223651011 226566310 229101478 230902236
3895 230902236 232794041 235037588 237288025 239300397 241406037 243787706 246194198 249278483
3887 249278483 252390395 255772425 259050078 262534262 266247243 269989810 273194851 276217224
3879 276217224 279290617 282381512 285457360 288762434 292655770 296186174 299359480 302480643
3871 302480643 305277206 307336405 308980770 310433488 311334948 311711039 311606474 311412892 310569064
3862 310569064 309203412 307243163 305226446 303287445 301486487 300073397 298305450 296852521
3854B96852521j302389j724312j535201j461667j499046j354550j488976j357162
3846B85129218j752287k106810k634729l245722l548188l758972m179193m455463
3838B59447854m622141m998522n147256n203722n154177m939333n272601m920140
3830B19189962m438592m174460l816716m001743l914990l412108l181779k898481
3822A89351093l124220k460986l124378k800031k321889k684873l313656l357226
3814A66163834l466149l256551l349807l157308k747145k911854k703549k415954
3806A42155517k882111l419652l268054l534375l406958l039219k842066k888547
3798A16874535k416342k643189k121617j979917k399503k406835k274604j639341
$$ plain form
3854 296852521 295550132 293825820 292290619 290828952 289329906 287975356 286486380 285129218
3846 285129218 283376931 281270121 278635392 275389670 271841482 268082510 263903317 259447854
3838 259447854 254825713 249827191 244679935 239476213 234322036 229382703 224110102 219189962
3830 219189962 214751370 210576910 206760194 202758451 198843461 195431353 192249574 189351093
3822 189351093 186226873 183765887 180641509 177841478 175519589 172834716 169521060 166163834
3814 166163834 162697685 159441134 156091327 152934019 150186874 147275020 144571471 142155517
3806 142155517 139273406 135853754 132585700 129051325 125644367 122605148 119763082 116874535
3798 116874535 114458193 111815004 109693387 107713470 105313967 102907132 100632528 98993187
3790I8993187j759122k221256j921310k065495j445951j888306j423125j851361
3782H4417261j695218j435340j840953j759723j720892j623410j900856j576650
3774G0864219j370780j377306j071978q85250j210901j742323j641048r06164
3766F0658469q13997j237337j261207j043846j209031p76694p84047r30530p15813
3757E1885967o12743r80520o75368q80917p85291q49761o73707j010786r34681
3748D4482193m37405p72364p35885n24179m91964n86863l54792l81924o79960
3739C9516857n44892l42816j43328n58595o62788n44694l16772o43725k87157
3730C5472090q8053l71400r5383o24592l94854n10805m17484j96469o32729l89184
$$ plain form
3790 98993187 97234065 95012809 93091499 91026004 89580053 87691747 86268622 84417261
3782 84417261 82722043 81286703 79445750 77686027 75965135 74341725 72440869 70864219
3774 70864219 69493439 68116133 67044155 66158905 64948004 63205681 61564633 60658469
3766 60658469 59844472 58607135 57345928 56302082 55093051 54316357 53532310 52601780 51885967
3757 51885967 51273224 50292704 49617336 48736419 47951128 47101367 46427660 45416874 44482193
3748 44482193 44044788 43272424 42536539 42012360 41520396 40933533 40578741 40196817 39516857
3739 39516857 38971965 38629149 38485821 37927226 37264438 36719744 36402972 35759247 35472090
3730 35472090 35384037 35012637 34917254 34292662 33897808 33387003 32969519 32773050 32140321 31751137
3720C1751137m427P4058j33192l66563n15672o34853j42433j08529k85715m72279
3710B9161532r859k57301k45163j87764p07352l84723j06600m50256n40364m36225
3700B5835925n93805l06803n48804k66306k71644l09968K5653l1422k39326n23954
3690B2769546n2675P2668m53222l67035j25234m10962k48736j79401j85119j02276
3680B0717554J9869l84038j84981n6800k99175j46104J02217r1477k04973r390
3670A9462702O8984m9200l82359L53611m6921l38144L13343M9328k93682j64757
3660A8972905J5850K1746l0961o1947k60258j3014q1078J64531K88590j66481
3650A8849883k15340n7435J59582J35102J69079K7431j85818l01829k51654l72644
$$ plain form
3720 31751137 31746710 31820768 31687576 31321013 30805341 30170488 30028055 29919526 29633811 29161532
3710 29161532 29151673 28894372 28649209 28461445 27754093 27369370 27262770 26812514 26272150 25835925
3700 25835925 25242120 24935317 24386513 24120207 23848563 23538595 23564248 23532826 23293500 22769546
3690 22769546 22716871 22789539 22336317 21969282 21844048 21433086 21184350 21004949 20819830 20717554
3680 20717554 20737423 20353385 20168404 20111604 19812429 19666325 19768542 19677065 19472092 19462702
3670 19462702 19531686 19482486 19100127 19453738 19406817 19068673 19382016 19431344 19137662 18972905
3660 18972905 18988755 19010501 18979540 18917593 18657335 18644321 18563243 18727774 19016364 18849883
3650 18849883 18634543 18577108 18736690 18871792 19040871 19068302 18882484 18580655 18329001 17956357
3640A7956357J83541K67367O3566m82298k09548l83814m4644o1792m04131k2481
3630A6862123K52574j55825j65873k51067j7184n394l4400P4087k85857J766K72599
3619A6547549K6899K50875J25750L51165L68074J40446r940k98750j07618J68945
3609A7563395q5631o06747j13116k39319j04980J4780J73298k76175k20410J20248
3599A6225343O5665j689j91107o6262j63679K2050j1215l7494Q1059l95324j32901
3588A5394446L35954J72766j80531L4746l04059N1702K36023j04037P1008O3005
3578A5771023n57305j38067j11600K07018J40514l87458k43574j32872k34518
3569A4313161l71413P5862K38447O8681o6432N3281J26140j37643J99636k16998
$$ plain form
3640 17956357 18139898 18407265 18470831 17988533 17778985 17395171 17350527 17288735 16884604 16862123
3630 16862123 17114697 16958872 16792999 16541932 16524748 16519354 16484954 16559041 16273184 16274950 16547549
3619 16547549 16574448 16825323 16951073 17302238 17670312 17810758 17800818 17502068 17394450 17563395
3609 17563395 17477764 16871017 16757901 16518582 16413602 16428382 16601680 16325505 16105095 16225343
3599 16225343 16291008 16289319 16098212 16031950 15868271 15890321 15879106 15841612 15922671 15527347 15394446
3588 15394446 15730400 15903166 15722635 15757381 15453322 15505024 15741047 15637010 15708018 15771023
3578 15771023 15213718 15075651 14964051 15171069 15311583 14924125 14680551 14547679 14313161
3569 14313161 13941748 14017610 14256057 14324738 14258306 14311587 14437727 14300084 14499720 14282722
3559A4282722N5276j24778j60723l47649j46733k9203n1269R7676J4972l8968
3549A3551323k85043j38416q056j74011j29895j52205K35631Q0709P230L7982
3539A3025249l21714O4237o5719N2397Q3613j59693j7471j20887K04384K20516
3529A2964912j70497m2018l44051l3102N2158J0087j81968J46446J15084l12636
3519A2204415M5213R7586l48093K94040q6020j5749n0821l9186P383N65220k79917
3508A2394071j40856K94868J43030J14935k32256n7926j3053n6820m06188k85469
3498A1754336O2560M0604l0060j51853k63260K85996P1695J30877l8244l5605
3488A1827046O965M2239J27413K25442k77514k65439k7057N05435P5445k70068
$$ plain form
3559 14282722 14337998 14213220 14052497 13704848 13558115 13528912 13477643 13575319 13590291 13551323
3549 13551323 13266280 13127864 13119808 12945797 12815902 12663697 12899328 12980037 12987267 13025249
3539 13025249 12703535 12767772 12702053 12754450 12838063 12678370 12660899 12540012 12744396 12964912
3529 12964912 12794415 12752397 12408346 12375244 12427402 12437489 12255521 12401967 12517051 12204415
3519 12204415 12249628 12347214 11999121 12293161 12207141 12191392 12140571 12101385 12108768 12673988 12394071
3508 12394071 12253215 12548083 12691113 12806048 12573792 12515866 12502813 12445993 12039805 11754336
3498 11754336 11816896 11857500 11827440 11675587 11412327 11698323 11770018 11900895 11862651 11827046
3488 11827046 11834011 11876250 12003663 12229105 11951591 11686152 11659095 12164530 12239975 11969907
3478A1969907L26616J59959J3403K81246l89941l42172q714M7831K77877Q9169
3468A2425181j98896J29442L11269L1266Q023L3375K38245l5019j42028K31220
3458A3032078m3336J59367O01275n6263K63932J16575J94783l16385K4093L13129
3448A4289248P5172n5588L68682L0724j44462J65568J37951K36120K91714L10183
3438A5705312k92881K67078J2287M19344P65093J12411J11144K20163N46030m9301
3428A7816680j382N83840M21637O1138K81025n1034N20047L00535N1826K73333
3418B0257645N20758J13519N0244M46398K32960J23568K06203L42091K45730M20463
3408B2959579N80381K1889N54111Q40852j18528K71505O17978Q54276K87040R98330
$$ plain form
3478 11969907 12296523 12456482 12469885 12751131 12361190 12019018 12010304 12058135 12336012 12425181
3468 12425181 12226285 12355727 12666996 12698262 12706285 12739660 12977905 12942886 12800858 13032078
3458 13032078 12988742 13148109 13749384 13693121 13957053 14073628 14268411 13952026 13976119 14289248
3448 14289248 14364420 14308832 14677514 14708238 14563776 14729344 14867295 15103415 15395129 15705312
3438 15705312 15412431 15679509 15691796 16111140 16876233 16988644 17099788 17319951 17865981 17816680
3428 17816680 17815298 18399138 18820775 18881913 19162938 19111904 19631951 19932486 19984312 20257645
3418 20257645 20778403 20891922 20942166 21388564 21621524 21745092 21951295 22293386 22539116 22959579
3408 22959579 23539960 23561849 24115960 24956812 24838284 25109789 25727767 26582043 26869083 27867413
3398B7867413N41454K25358O20594Q87443O32087N87988P53595Q12617O45737
3389C3574286O61936O73812N00178R25674L85077K1426P56311N83701M42911K92711
3379C8818023P28642N37471O55540M86147M81800J152358O79719Q70610J019019
3370D5429329R80745J332180J516388J376722J465603R21399J088059J555454
3362E5665879J706181J480490J199182J560338J731478J714443K406203K286921
3354F9751115K699737L280505L942164L520083L595023L994253M041315L653219
3346I8477414L194783K981030K341903J737623R63754M79175n2088j1912q13336
3337A09298346j660140j615902k227936l090812k978873l707198l963398l720126
$$ plain form
3398 27867413 28408867 28634225 29254819 30142262 30774349 31362337 32115932 32928549 33574286
3389 33574286 34236222 34910034 35410212 36335886 36720963 36742389 37498700 38082401 38525312 38818023
3379 38818023 39546665 40084136 40739676 41225823 41707623 42859981 43539700 44410310 45429329
3370 45429329 46410074 47742254 49258642 50635364 52100967 53022366 54110425 55665879
3362 55665879 57372060 58852550 60051732 61612070 63343548 65057991 67464194 69751115
3354 69751115 72450852 75731357 79673521 83193604 86788627 90782880 94824195 98477414
3346 98477414 101672197 104653227 106995130 108732753 109696507 110175682 110123594 110111682 109298346
3337 109298346 107638206 106022304 103794368 100703556 97724683 94017485 90054087 86333961
3329H6333961l494341l492380l354597k862872k566170k379111k288491j772475
3321F4123524j391489r02170j347837j152825p89104j882239k138658j855413
3313E2663789j707663j744657j386444j420093j240409j311600j347271o38689
3305D1866963j105945j104214p12816q98659n14281p36498o24112p45786l26129
3296C5098523l42659l86690k03393l75236K02787K03414O12263J107488J455672
3287C7372169J936597J193210M94079m27755j323499k190440k445494k386614
3279C2222253j542965j752369j380098j505789j207219o07288p36178n96835o47315
3270B2246197l59186l14992l21480n48907j82172m45307n5768k7514l45950k75073
$$ plain form
3329 86333961 82839620 79347240 75992643 73129771 70563601 68184490 65895999 64123524
3321 64123524 62732035 61829865 60482028 59329203 58540099 56657860 54519202 52663789
3313 52663789 50956126 49211469 47825025 46404932 45164523 43852923 42505652 41866963
3305 41866963 40761018 39656804 38943988 38045329 37531048 36794550 36170438 35424652 35098523
3296 35098523 34755864 34369174 34165781 33790545 33993332 34196746 34809009 35916497 37372169
3287 37372169 39308766 40501976 40996055 40568300 39244801 37054361 34608867 32222253
3279 32222253 30679288 28926919 27546821 26041032 24833813 24226525 23490347 22893512 22246197
3270 22246197 21887011 21572019 21250539 20701632 20519460 20074153 20018385 19990871 19644921 19369848
3260A9369848j14089K64174K84190L34360O75746P28360Q96190P68502Q6864r72262
3250B2321883r57070r54370j176152j092289o69063n06008l12936r06174n52849
3241A5194972k28197o42266l36464j78311n29357m16294m83135q0641p0377n68561
3231A1661369l71016j08731m75477R1941j65801l3154J18918r06k26829k84391
3221A0205923j58617m9291J48397j23892j62052l90645q5172J37080j4518k33978
3211I273235k97921L6397M770k60902j13171K64133K05236j33814k00874M1449
3201H818538K44111J5401j91522k93374j39239M41838j07367n54143q0114J1186
3191H165315m17166k179Q8439j30018J98534J1909n0647k51642j19358k76099
$$ plain form
3260 19369848 19255759 19519933 19804123 20138483 20814229 21542589 22438779 23207281 23294145 22321883
3250 22321883 21364813 20410443 19234291 18142002 17472939 16966931 16653995 15747821 15194972
3241 15194972 14966775 14324509 13988045 13809734 13280377 12864083 12380948 12300307 12229930 11661369
3231 11661369 11290353 11181622 10706145 10798086 10632285 10599131 10718049 10717143 10490314 10205923
3221 10205923 10047306 9998015 10146412 10022520 9860468 9469823 9384651 9521731 9507213 9273235
3211 9273235 8975314 9011711 9016481 8755579 8642408 8906541 9111777 8977963 8777089 8818538
3201 8818538 9062649 9078050 8886528 8593154 8453915 8895753 8788386 8234243 8154129 8165315
3191 8165315 7748149 7745970 7834409 7704391 7902925 7914834 7864187 7612545 7493187 7217088
3181G217088J47556O828k86935j43543j24512K59607k2697L62546J85300k79788
3171G321450M2792k6190l969K8213r4883j52844M4223L14938j1607k62193L5792
3160G235722o2895M4882M835j98510n91900L09449K06679j56362J55204O2081
3150G009185j92843J42659k47566l66953l3787K14251M7909M6480j07872J95285
3140F706748o6816k68899J68702n5178K41116J52932m52540k3331M13869K8157
3130F844760j51306k9346k37623q8276k4295M03503K73038j06259k98474r6894
3120F488828j2342j04910l2850L11354M72495k64722J06442l97087j99052J27693
3110F495849K74129P9443m5819Q3939K15104J5356p3680o4800K89003m1489K44024
$$ plain form
3181 7217088 7364644 7371472 7084537 6940994 6816482 7076089 7053392 7415938 7601238 7321450
3171 7321450 7364242 7338052 7334083 7362296 7267413 7114569 7158792 7473730 7462123 7199930 7235722
3160 7235722 7172827 7217709 7222544 7024034 6432134 6741583 6948262 6791900 6947104 7009185
3150 7009185 6816342 6959001 6711435 6344482 6310695 6524946 6572855 6619335 6511463 6706748
3140 6706748 6639932 6371033 6539735 6484557 6725673 6878605 6426065 6402734 6816603 6844760
3130 6844760 6693454 6664108 6426485 6338209 6313914 6717417 6990455 6884196 6585722 6488828
3120 6488828 6476486 6371576 6338726 6650080 7122575 6857853 6964295 6567208 6368156 6495849
3110 6495849 6769978 6849421 6803602 6887541 7102645 7118001 7044321 6979521 7268524 7227035 7471059
3099G471059K46443l19083O3355M48066J19640q4140K90242j137N0K4939O96539
3088H955973O942L1813K44951K09693j06564J58498J67371M12571J36245l3545
3078A0183948q7512J86066L93520q5709J70186N1356L25405K68131J92019j65152
3068A1432258K69755J33810L32710j0940J70685K60899j43364r6325j2770L09183
3058A2645901N66040K68144O69591M49046k10756K51383N51068J23939K57988
3049A5572344P60178N30446N99021Q02841N38833J12038M49759L16527N83358
3040B0265345N86814P62184Q74533O99887Q25765R25895J203225P91569J306411
3031B8241628J144019J170293Q82402P14587J209007O75566Q31116N92712m5087
$$ plain form
3099 7471059 7717502 7398419 7461774 7909840 8029480 7945340 8235582 8234445 8234495 8259434 8955973
3088 8955973 8962915 8994728 9239679 9449372 9342808 9501306 9668677 10081248 10217493 10183948
3078 10183948 10096436 10282502 10676022 10590313 10760499 10811855 11137260 11405391 11597410 11432258
3068 11432258 11702013 11835823 12168533 12157593 12328278 12589177 12445813 12349488 12336718 12645901
3058 12645901 13211941 13480085 14149676 14598722 14387966 14639349 15190417 15314356 15572344
3049 15572344 16332522 16862968 17461989 18264830 18803663 18915701 19365460 19681987 20265345
3040 20265345 20852159 21614343 22488876 23188763 24014528 24940423 26143648 26935217 28241628
3031 28241628 29385647 30555940 31438342 32152929 33361936 34037502 34868618 35461330 35416243
3022C5416243L64686M75637J21853l5414j25746L56550K38074M6506L12404j7125
3012C7153668M53864P37771O59488R37111N59260J145099J028577J094178J383912
3003D5152928J851449K569391K608163K948753K992218L298178K806533J74365
2995F4401978k252566l249330l942898l989383l151071k690848k533424k152413
2987D0440045j619977j036250j024511o15617j106918k45643J0072m26271J74550
2978C4549480p5183j48585M83170M7068N92311O62946N48066L78366P31558K35037
2968C8004234K44071K3800o46088q30916j502310j532760j354154j789853j381061
2959B9234963j648112j519232j013294j402529n75994q23880o60778n60972j14090
$$ plain form
3022 35416243 35780929 36256566 36378419 36343005 36217259 36573809 36811883 36858389 37170793 37153668
3012 37153668 37607532 38345303 39004791 39941902 40501162 41646261 42674838 43769016 45152928
3003 45152928 47004377 49573768 52181931 55130684 58122902 61421080 64227613 64401978
2995 64401978 62149412 58900082 54957184 50967801 47816730 45125882 42592458 40440045
2987 40440045 38820068 37783818 36759307 36143690 35036772 34791129 34801201 34374930 34549480
2978 34549480 34474297 34325712 34808882 34855950 35448261 36111207 36659273 37037639 37769197 38004234
2968 38004234 38248305 38272105 37626017 36795101 35292791 33760031 32405877 30616024 29234963
2959 29234963 27586851 26067619 25054325 23651796 23075802 22251922 21591144 21030172 20916082
2950B0916082l93691l42573l84782m95898l37121m32603n43590k91879n26920
2941A7167025p32509r04452j89967p63492n24559m86135n49869o93395o82306
2932A1640341k12483k02409n23819m76913m2694m78367j05500m85408j10924l41889
2922H659935l33216j68051m76906N818m97089K21197O41543p34751k73556j83034
2912F861890k56996J29797k86714N7303k34659k15128l53795K459J15257l86942
2902E432472j4212l29401q497M19107l325j62094k20192q7487q78145J7174J13525
2891D278925K61447k86911J54617k31850j26925J42991j71148j61670P0354J17187
2881D047017j83555j60571j77770l5329r561K99584k97910K61239k84148k9830
$$ plain form
2950 20916082 20522391 20179818 19795036 19299138 18962017 18529414 17985824 17693945 17167025
2941 17167025 16434516 15530064 15340097 14576605 14052046 13565911 13016042 12322647 11640341
2932 11640341 11427858 11225449 10701630 10224717 10182023 9703656 9598156 9112748 9001824 8659935
2922 8659935 8326719 8158668 7681762 7687580 7190491 7411688 8053231 7318480 7044924 6861890
2912 6861890 6604894 6734691 6447977 6505280 6270621 6055493 5701698 5704157 5819414 5432472
2902 5432472 5418260 5088859 5080362 5499469 5496144 5334050 5113858 5026371 4148226 4165400 4278925
2891 4278925 4540372 4253461 4408078 4176228 4049303 4192294 4021146 3859476 3929830 4047017
2881 4047017 3863462 3702891 3525121 3489792 3480231 3779815 3481905 3743144 3458996 3429166
2871C429166j6246J44983n7623m0167m0899m04230k70156j02151l6802M01941
2861C007816J18290j77253r1775j97907J11846R730q7867l20268k03727k3026
2851B145859J52588J88697J6497M1435Q7638o6242k31514l65113J88578K1475
2841B179898j13482J97061j70090j07213l87893K21956j2557J35388K5114N402
2831A973584N4010j4301M9184J15787q6295L2748l34404M4329k7470K00690L5009
2820B042871k55181l11759r9530J66083J45352Q6890P3813n6919j76426m40152
2810A175042K94259L95273r1515m37527J48351J04212P081m5274k76646j61403
2800A111853j89688L83334K95413N7996j50461L2915j37592k24676L7889q9968
$$ plain form
2871 3429166 3412920 3557903 3500280 3460113 3419214 3014984 2744828 2642677 2605875 3007816
2861 3007816 3126106 2948853 2857078 2659171 2771017 2780747 2692880 2372612 2168885 2145859
2851 2145859 2298447 2487144 2503641 2545076 2632714 2566472 2334958 1969845 2158423 2179898
2841 2179898 2066416 2263477 2093387 1986174 1598281 1820237 1807680 1943068 1968182 1973584
2831 1973584 2027594 2013293 2062477 2178264 2091969 2124717 1790313 1834642 1807172 2007862 2042871
2820 2042871 1787690 1475931 1376401 1542484 1687836 1774726 1848539 1791620 1615194 1175042
2810 1175042 1469301 1864574 1773059 1335532 1483883 1588095 1595176 1549902 1273256 1111853
2800 1111853 922165 1305499 1600912 1658908 1508447 1541362 1403770 1179094 1216983 1127015
2790A127015m41741K88015k6366K58841m4574o7709k37415K95085N6037k04770
2780A002418K365R9899M304k57713K94120J8472j46382J7774J06235j21367k5763
2769I94362J56309j09971J8721j21308m1829L78716L80548j12860L575m99649
2759A046614M0589p0362j61219r1678L74929J06810o3718j08074p9075k07358
2749G87458J30085Q4524K20212O6512p9897k01728k75607J86708M4609J6071L5535
2738A014482k27123k38614N20606Q085l1364j20046K12854O3054k15582l14729
2728F71623O0583L92293r3480J60742j59648m0101j4033J07725R3719K1177O0777
2717A261377l47441k22611M2840J69999Q4202J16046k60318O9335Q7107J3979
$$ plain form
2790 1127015 685274 973289 946923 1205764 1161190 1093481 856066 1151151 1207188 1002418
2780 1002418 1004783 1104682 1108986 851273 1145393 1163865 1017483 1035257 1141492 1020125 994362
2769 994362 1150671 1040700 1059421 938113 896284 1275000 1655548 1542688 1546263 1046614
2759 1046614 1087203 1016841 855622 763944 1138873 1245683 1181965 1073891 994816 787458
2749 787458 917543 1002067 1222279 1288791 1208894 1007166 731559 918267 962876 978947 1014482
2738 1014482 787359 548745 1069351 1077436 1046072 926026 1138880 1201934 986352 671623
2728 671623 732206 1124499 1031019 1191761 1032113 992012 977979 1085704 1179423 1200600 1261377
2717 1261377 913936 691325 734165 904164 988366 1104412 844094 913429 1000536 1014515
2707A014515k43587k0407K31604J05704k24193k08115o1424r6633j16013L69776
2697G51227n6542K07935K6156l18922J33589K11849P6662K7457J35225j89645
2687A004991j02550j30936O0879K67913j60121k64772J32654N7073Q095j83677
2677F89549m12914J30978M11533K93483l94842r4850L2443L6112k24623j0003
2667D56866Q3064K65248j52208j39270J29347n76J58668k72488q6843J08331p8380
2656D71759m997k10027J41024r2578K74709j89078K1669Q5124r6021L25516k23049
2645E04051j37128r68L04654j1924l77573L66004J71529l29473K47911j26385
2635F10698k35296Q3143J23288n6072J75148k52307K4250o354k71359r4090M61672
$$ plain form
2707 1014515 770928 750521 982125 1087829 863636 655521 594097 497464 381451 751227
2697 751227 694685 902620 928776 609854 743443 955292 1031954 1059411 1194636 1004991
2687 1004991 902441 771505 832384 1100297 940176 675404 808058 865131 873226 689549
2677 689549 276635 407613 819146 1112629 717787 622937 655380 691492 466869 456866
2667 456866 539930 805178 652970 513700 643047 642471 801139 528651 441808 550139 471759
2656 471759 466762 256735 397759 305181 579890 390812 412481 497605 401584 727100 504051
2645 504051 366923 365955 670609 658685 281112 647116 818645 489172 737083 610698
2635 610698 375402 458545 581833 525761 700909 448602 472852 466498 195139 101049 562721
2624E62721k87402J30034p266m28818P0918M22064q0792j53682q8415L25671J23624
2613E88657k12701j11634k22052L28687J74654k00243N717k63183J42306K28141
2603D58349J34320N0328j59906j57439k4058N9948M4382n3520K60039j32597R9258
2592E79104p1973l38201j66678k3370O29845L5672k3264L2576j91311k3768j11592
2581C27040j4188J72393l05528k9129J84981J88398L6714q4230l03684j49127
2571B3640l11628K01874K41687J25394O8153l6198L0433k04741p9074K0826J44342
2560B24708J10154M7502j91688J71059J02606j26121j16995j50894L46353j94576
2550B22108l29315M61128P3431n80486J06936j05539O3936o9720K79035o5713
$$ plain form
2624 562721 275319 405353 398087 -30731 40187 462251 381459 227777 139362 465033 588657
2613 588657 375956 264322 42270 370957 545611 345368 351085 87902 230208 458349
2603 458349 592669 642997 483091 325652 301594 361542 405924 352404 612443 479846 579104
2592 579104 507131 168930 2252 -21118 608727 644399 621135 653711 462400 438632 327040
2581 327040 312852 485245 179717 150588 335569 523967 560681 476451 172767 23640
2571 23640 -287988 -86114 155573 280967 349120 312922 343355 138614 59540 80366 224708
2560 224708 334862 382364 190676 361735 464341 338220 221225 70331 416684 222108
2550 222108 -107207 353921 427352 -153134 -46198 -151737 -87801 -157521 121514 55801
2540E5801r2940K33396J36419J44250o5218j70844k840j01540l22800k04095L39555
2529e0856K48477k78k21109j60185L74283r5710K40128O4021k87344k12716J87584
2518H6295J15616j90113K65464m3222m75629O6656L22807M3805l72820K17899
2508C6758J20920p4913r8574j62416L04938q9163K90263J71021j26540m37623
2498f5329n4532L11353L166k66275J5582j69953K90713M45401K2389j59101p3459
2487B99955J72454l30409k4871J00015K32048j83183j44864R1803J80236k17212
2477A75972K84051K42738k12902r9116l1309l0725M5697K29141J7071j22791J56045
2466F53872j93520o9433n5721N8846J64332r2983K03377j8731l6193O8726P458
$$ plain form
2540 55801 -37139 196257 332676 476926 411708 240864 238024 136484 -186316 -390411 -50856
2529 -50856 197621 197343 -23766 -183951 190332 94622 334750 398771 111427 -101289 86295
2518 86295 201911 11798 277262 234040 -241589 -174933 147874 191679 -181141 36758
2508 36758 157678 82765 -15809 -178225 126713 37550 327813 498834 372294 -65329
2498 -65329 -119861 191492 194658 -71617 -56035 -225988 64725 510126 532515 373414 299955
2487 299955 472409 142000 117129 217144 449192 266009 121145 212948 393184 175972
2477 175972 460023 702761 489859 390743 359434 328709 374406 603547 620618 497827 653872
2466 653872 460352 390919 335198 394044 558376 465393 668770 650039 613846 682572 690030
2455F90030j76758j71333j76410j37792J69039J04206j11170k27874K18958L8665
2445B19561J8371n142j50052L02792j9814j2039K8634O3795k09563J84958K17885
2434F39386l83137l7020k04219L0891j07756L16643J87036K00759j38105k60177
2424B44301L15302k11860J06016n0884r1517m0077J3400j64316J89575k13606
2414I6334m8391K18178J31627k6128k38013O156Q6895K21071k89109L1579j90365
2403a66J23566J57111L35059K2476j31496Q7410q9389q1003m9797J05821j34627
2392C44965j56590j99598K20184K94465j90505k4590J08890J40448j51235k78023
2382A08411K53993k17676J04396P6234q9698r0996j18361r5392O3733L22021Q1828
$$ plain form
2455 690030 513272 341939 165529 27737 196776 300982 189812 -38062 180896 219561
2445 219561 237932 232790 82738 385530 365716 353677 382311 446106 236543 421501 639386
2434 639386 256249 219229 15010 45901 -61855 254788 441824 642583 504478 244301
2424 244301 559603 347743 453759 402875 311358 271281 284681 120365 309940 96334
2414 96334 47943 266121 397748 371620 133607 139763 226658 447729 158620 190199 -166
2403 -166 123400 280511 615570 638046 506550 593960 504571 423568 373771 479592 344965
2392 344965 188375 -11223 208961 503426 312921 288331 397221 537669 386434 108411
2382 108411 362404 144728 249124 325358 235660 144664 26303 -69089 -5356 316665 398493
2371C98493j06540j67159J68496k67440J93494L15891j78485j63257L00702l6092
2361D58103m25809K33743J63334j06799K69612R1670j97846J58496J866J94710
2351H41080m11019j71516L33021J10060k08708j43897n9679j69347K03377R8657
2341D22029m4972l57564J44094L22353m10344k9001K04578J91518l84395j306
2331E6990K25056K60260j19239k66693k23617j19285J76208R2831J76471k991
2321B55991R5239J0260r1153o779l8806K32496p4105K7376K30544n4186k4924
2310E61953o9940K22834P4238k52733j51744o2631Q3977j31409L50612K0632k15442
2299D30347k21657K2484K26833j87469k12880N2313L55646j32081L57157L13782
$$ plain form
2371 398493 291953 124794 293290 25850 219344 535235 356750 193493 494195 458103
2361 458103 32294 266037 429371 322572 592184 683854 486008 644504 646370 841080
2351 841080 430061 258545 591566 701626 492918 349021 289342 119995 323372 422029
2341 422029 377057 19493 163587 485940 75596 46595 251173 442691 58296 56990
2331 56990 282046 542306 423067 156374 -67243 -186528 -10320 82511 258982 255991
2321 255991 351230 361490 270337 263558 224752 457248 383143 410519 641063 586877 561953
2310 561953 492013 714847 789085 536352 384608 321977 405954 274545 625157 645789 430347
2299 430347 208690 231174 458007 270538 57658 109971 465617 333536 690693 1004475
2289A004475K47773l63454M457K4768N17170K4303k47136j37008j83781J64009
2279A055576J36458K22175k1590O5002k1605j43395j05384j90917K22117K39292
2269A457729K462n5286j03909K27027J69544L3172l3100m04932K24597K98436
2259A815740J45238K25819r5780p8247m1957J32235q9394J21259J16464l1943
2249B219434J53388M13063k17435p9595P0195K32293J33798o6882r3128K19846
2239B984977M48203j33956r7015p3876K14389J28291O4404J56043J87961j46170
2229C733251J40882K90650K61739L62056P6856m1358K34533M07921J91242L18174
2219E975946K73570O82486L67148K63078P11812K50370Q31316R36017L72227P34532
$$ plain form
2289 1004475 1252248 888794 893251 918019 1435189 1459492 1212356 1075348 891567 1055576
2279 1055576 1192034 1414209 1392619 1457621 1436016 1292621 1187237 996320 1218437 1457729
2269 1457729 1460191 1404905 1300996 1528023 1697567 1730739 1697639 1292707 1517304 1815740
2259 1815740 1960978 2186797 2091017 2012770 1970813 2103048 2013654 2134913 2251377 2219434
2249 2219434 2372822 2785885 2568450 2488855 2559050 2791343 2925141 2858259 2765131 2984977
2239 2984977 3433180 3299224 3202209 3128333 3342722 3471013 3535417 3691460 3879421 3733251
2229 3733251 3874133 4164783 4426522 4788578 4865434 4824076 5058609 5466530 5657772 5975946
2219 5975946 6249516 6932002 7299150 7562228 8274040 8524410 9355726 10291743 10663970 11398502
2209A1398502L78847J347113J463697J876946K273491K457653K584423L579066
2201B7359738M985843O181588P240068Q478768N842229k527108q070277r031721
2193D0459128p316967n514075l980361l300342k849952k507387j838961j317843
2185A1833240j227728r32425o41418k90110j96093o63211n33602q74296p21666
2176E752691j18986o21512j69517m38381j35948k64746m11205j37816l58581k8530
2166C067469k81375j55228k92958q4053K13698J0060n6404L7278m73932k79980
2156A704575K13218k41079L4970J12220k31185J22994M5499k07081l43594J91905
2146A402442J36845J04714p6583n10110J93268J31359K0600K7351j70932k91807
$$ plain form
2209 11398502 11777349 13124462 14588159 16465105 18738596 21196249 23780672 27359738
2201 27359738 32345581 38527169 45767237 54246005 60088234 57561126 49490849 40459128
2193 40459128 33142161 27628086 23647725 20347383 17497431 14990044 13151083 11833240
2185 11833240 10605512 9673087 9031669 8741559 8545466 7882255 7348653 6474357 5752691
2176 5752691 5633705 5012193 4842676 4404295 4268347 4003601 3592396 3454580 3095999 3067469
2166 3067469 2786094 2630866 2337908 2253855 2467553 2477613 2421209 2458487 1984555 1704575
2156 1704575 1917793 1676714 1711684 1823904 1592719 1715713 1761212 1554131 1210537 1402442
2146 1402442 1539287 1644001 1567418 1057308 1250576 1381935 1402535 1429886 1258954 967147
2136I67147R1174L09677k19927l42837J61747J14301l4545l1968j28755O2266
2126I48280j58932J57459j91723N6046J61519R0300J71367m28690l1543j2014
2116G62069j86821J0218O7182N6825k10048j0206r2824j41061q3833q0124K52837
2105C44214J71672P5526j28331P1080q7609M5439n60j07043j53494l2467N5353
2094B53780l4140q9733J93908K29234N3905j61880J76154n41374k64061N10450
2084C26243L22037j28190m8459j92231M21474J92626m4471p7917l60770J35943
2074E46285j50985k36608r8694o6707J92786L13047l74403R8407q4857o9896Q5584
2063A53959K66209j4157j49156r5651J58638k37392J56147j13560m469l6908J96556
$$ plain form
2136 967147 1058321 1367998 1148071 805234 966981 1081282 1046737 1014769 886014 948280
2126 948280 789348 946807 755084 811130 972649 1062949 1234316 805626 774083 762069
2116 762069 575248 585466 652648 709473 499425 489219 396395 255334 171501 91377 344214
2105 344214 515886 591412 463081 534161 446552 491991 491431 384388 230894 198427 253780
2094 253780 219640 129907 323815 553049 606954 445074 621228 79854 -184207 326243
2084 326243 648280 520090 471631 279400 700874 893500 849029 771112 410342 546285
2074 546285 395300 158692 59998 -6709 186077 499124 124721 223128 138271 68375 153959
2063 153959 420168 406011 256855 161204 319842 82450 238597 125037 120568 83660 280216
2052B80216m9269j75566m342k33762K21464j06956K3456R6019j00188K91168M6864
2041B89104l86204j12362K32101J72921k92191j7067K68559p0059k05929J74787
2031E3660r8933J34461l98868r2506J28370K75303K83301k08929q1635k22751
2021b28527K18175N3789J09141q2946O3605l1753k28571J73640K4736K6303J65546
2010B63138j77356l36785j9581K93775K76557m5402K84052j91682j28304j14225
2000A04187P408L46054l13796k60617J04205j24094J24057O5681N7644k00775
1990i0046L97762J11542k98433p3093K04839K24166l94335l7126k67299J63350
1980e8673k28676J68487K46281j05257K76145l6695q5563j07130K8151o0792K42941
$$ plain form
2052 280216 230947 55381 51039 -182723 38741 -68215 -44759 51260 -48928 242240 289104
2041 289104 -97100 -209462 22639 195560 -96631 -113698 154861 84802 -121127 53660
2031 53660 -45273 89188 -309680 -402186 -273816 1487 284788 75859 -5776 -228527
2021 -228527 -10352 43437 152578 69632 133237 101484 -127087 46553 71289 97592 263138
2010 263138 85782 -251003 -270584 23191 299748 254346 538398 346716 218412 104187
2000 104187 111595 457649 143853 -116764 -12559 -136653 -12596 53085 110729 -90046
1990 -90046 307716 419258 120825 47732 252571 476737 82402 45276 -222023 -58673
1980 -58673 -287349 -118862 127419 22162 298307 261612 176049 68919 97070 36278 279219
1969B79219j04535p4527N2374o20j33849k14949j52477L63971J35552M3299k2457
1958A71001k03559K84688Q19k28723L0054M3595l31100R6624n0481J42335M3819
1947i28j20834p8468J07837K9232O9700j39437P3215K63537J04983k69626o4808
1936b5597N0692j46701J38243j59082J58144L9586J77410J21995j76209J34378
1926C12859Q4379j32426j43846l51172J80135k39058L5699K46396J95050j7035
1916A70981k43455L14313l1121m13741K46863K79348j44136q1508j55980N0717
1906g719j34143L16341p8120K50760M2382M475n2674k3892K29268r8123l68983
1895G9572j4498P724j56537J62876j04508n2287m1139J42461J6329j44844n0830
$$ plain form
1969 279219 174684 100157 152531 151911 18062 -196887 -349364 14607 150159 193458 171001
1958 171001 -32558 252130 252949 24226 54280 97875 -233225 -136601 -187082 -44747 -928
1947 -928 -121762 -200230 -92393 -63161 6539 -132898 -59683 203854 308837 39211 -25597
1936 -25597 25095 -121606 16637 -142445 15699 55285 232695 354690 178481 312859
1926 312859 397238 264812 120966 -230206 -50071 -289129 -253430 -7034 188016 170981
1916 170981 -72474 241839 210718 -203023 43840 323188 179052 97544 -58436 -7719
1906 -7719 -141862 174479 96359 347119 389501 393976 341302 317410 546678 448555 79572
1895 79572 65074 72798 -83739 79137 -25371 -77658 -118797 23664 39993 -104851 -155681
1884a55681O9054M55519J40926m89726m0021k21800K91771k1126j88019R9269
1874e9834n7651J31264k484j2761J1301j4806k7122n1025J01746l05551L43403
1863E6480n1236k69217K84560j1906p8709J42716J4688m924j43043j50013M78265
1852B67661m03406k23304J06572Q7631J74974J52474r7400K3103Q2666m47786
1842b76815J5002P2064r9869K72893p3152J25461r3052J71454l3102j19097q2251
1831a20464L1871n2127K4521k06714J66930L98029j68484j66543L44696m5292
1821B06423j24525N0268Q169J0119J78280p3162l55205n951O254j83285N2989
1810b29626K23948o5054L10398J1524M2038j42907k76229M4770K63987K82259
$$ plain form
1884 -155681 -86627 368892 509818 20092 -19929 -241729 50042 28916 -159103 -59834
1874 -59834 -117485 13779 11295 -1466 9835 -4971 -32093 -83118 18628 -286923 56480
1863 56480 5244 -263973 20587 8681 -70028 72688 87376 82452 -60591 -210604 267661
1852 267661 -135745 -359049 -252477 -164846 10128 162602 65202 88305 170971 -276815
1842 -276815 -261813 -189749 -289618 -16725 -89877 35584 -57468 113986 80884 -38213 -120464
1831 -120464 -88593 -140720 -116199 -322913 -155983 242046 73562 -92981 251715 206423
1821 206423 81898 132166 140335 150454 328734 255572 -99633 -105584 -99330 -282615 -229626
1810 -229626 -5678 -70732 239666 251190 293228 150321 -125908 -81138 182849 465108
1800D65108M1385j27494j60504k04275j86530j5627J50656k7067n5086k58721
1790c78155J65298l45954J38361K85931J9167o0974k6329J39535R942l6703q7174
1779a77055J30175J25144Q5889L3463p6595r656k30350O8793L7049J03814k32579
1768a41908K65820M9422j19292j57240R3713J5531r0178K7524L35720L739l66774
1757h3923L33617L1735j05622k78932J8715p8539J7105K93718j27916j02893K77724
1746A94789j06498N231k08126J38974n3006K10256l02699o6380J04044r4877Q7393
1735i0899j17q9071N0053K07532O1415R4057j76100m00749K21685K47347J49249
1724B74402n2797l33120j13041K61563K53654m44985o0985K74205K81145l26021
$$ plain form
1800 465108 506493 378999 218495 14220 -172310 -187937 -37281 -64348 -119434 -378155
1790 -378155 -212857 -558811 -420450 -134519 -115352 -176326 -202655 -63120 -53178 -89881 -177055
1779 -177055 -46880 78264 164153 197616 121021 111365 -118985 -50192 -13143 90671 -141908
1768 -141908 123912 173334 54042 -103198 -9485 6046 -84132 -56608 279112 282851 -83923
1757 -83923 249694 281429 175807 -103125 -84410 -162949 -145844 147874 19958 -82935 194789
1746 194789 88291 93522 -114604 24370 -28636 181620 -121079 -187459 -83415 -178292 -90899
1735 -90899 -91016 -180087 -130034 77498 138913 232970 56870 -343879 -122194 125153 274402
1724 274402 221605 -111515 -224556 37007 290661 -154324 -215309 58896 340041 14020
1714A4020n654k58361l5654K36437L60126j25516j21652Q2341j11738K61582k61070
1703C4861J2248k3785j28970J44949M114K62711k24620k19383j6927K23641P3507
1692A42346j34712J47850j91748J98678M79756j84508k99257l13051j44866K96567
1682b945j11188n7814o6557o7750J8217M22313P197L052l57405L76096N74534
1671G37750r340k42860k42127j57356j93050J42117J38398k71502R6395o4274
1661f5849l56022J32656K75759L7880k65522j39771q6586K44287L40525l65086
1651b47729r7035J87449q0832J96366L4351j45030J46626L26398j70754J82935
1641C32745J01868l47286j08754j84847k38029K62236N6480j3119m4831q4410
$$ plain form
1714 14020 8366 -249995 -285649 -49212 310914 185398 63746 146087 34349 295931 34861
1703 34861 47109 23324 -105646 39303 43417 306128 81508 -137875 -154802 68839 142346
1692 142346 7634 155484 -36264 162414 642170 457662 158405 -154646 -299512 -2945
1682 -2945 -114133 -171947 -238504 -306254 -288037 134276 141473 144525 -212880 163216 737750
1671 737750 728410 485550 243423 86067 -106983 35134 173532 -97970 -1575 -65849
1661 -65849 -421871 -289215 -13456 24424 -241098 -380869 -467455 -223168 117357 -247729
1651 -247729 -344764 -157315 -238147 -41781 -7430 -152460 -5834 320564 149810 332745
1641 332745 434613 87327 -21427 -206274 -444303 -182067 -125587 -138706 -183537 -267947
1631b67947K36925J62276J76470p8590N7673K9753j18405N4320P758m86378j23015
1620c49160K23641K42511J37498n02415j45395M15090J14321k40704J38060k71111
1610b37664j84805J84720j33526k98417o4219L74552L21502n2113J43002l5578
1600A7454L1574K6827j16223L9540P2983j80769J0261J6338k88942m4401J8810
1589c96548R3177J72591K8588J64489K63272k57268p4978J62330J05333m8309
1579B12677j05118K4388L01342l11515j00143N4195j86333l6726r612j66930l11787
1568f35562r8581J19654L26508m8157K10163k8584o5128l5263Q8538O4385K90549
1557A88522q884j77811k53355K55440R1425j12941j37684r9009o5502K53066R5769
$$ plain form
1631 -267947 -31022 131254 307724 229134 286807 316560 198155 252475 260233 -226145 -349160
1620 -349160 -125519 116992 254490 -247925 -393320 21770 136091 -104613 33447 -237664
1610 -237664 -422469 -237749 -371275 -669692 -733911 -359359 -37857 -89970 53032 17454
1600 17454 49028 75855 -40368 -828 72155 -108614 -98353 -82015 -370957 -415358 -396548
1589 -396548 -303371 -130780 -102192 62297 325569 68301 -6677 155653 260986 212677
1579 212677 107559 131947 433289 121774 21631 75826 -110507 -147233 -156845 -323775 -635562
1568 -635562 -734143 -614489 -287981 -336138 -125975 -154559 -219687 -254950 -166412 -102027 188522
1557 188522 179638 1827 -251528 3912 95337 -17604 -155288 -254297 -319799 -66733 29036
1546B9036M5971o3829m89234M6902Q5374P9464M6577Q4313M11854N5975l03146
1535B9257J05735j03691J05719j7492J16258j78990j92394N4955J89943j00432
1525H868l00152R4139J24015J19884j49347k72430N05697L34109j14986j24508
1515B25289m3419j42152j96095R5970k38809J34051K83583l54299o1964m7229
1505c45074K76416j47604J59312J60858k94904J75915l36463m453P9260J76391
1495a00346j04571M16890L85601l97111l11160N1931j38736j93680J51028L1782
1485b08372J72560M1312M41955j39006m06432J37040K12516k09606J41803K87178
1475D70948k55517o2507O9294j39291j08298M6507O4827j34203L5054j31141L3470
$$ plain form
1546 29036 75007 11178 -478056 -431154 -345780 -266316 -219739 -135426 276428 332403 29257
1535 29257 134992 31301 137020 119528 235786 56796 -135598 -80643 109300 8868
1525 8868 -291284 -197145 -73130 46754 -102593 -375023 130674 464783 349797 225289
1515 225289 181870 39718 -156377 -60407 -299216 -165165 118418 -235881 -297845 -345074
1505 -345074 -68658 -216262 -56950 103908 -190996 -15081 -351544 -355997 -276737 -100346
1495 -100346 -204917 211973 597574 200463 -110697 -58766 -197502 -391182 -240154 -208372
1485 -208372 -35812 5500 447455 308449 -97983 39057 251573 41967 183770 470948
1475 470948 215431 152924 222218 82927 -25371 21136 85963 -48240 -13186 -144327 -110857
1464a10857k061p5797J76057O2715k28877P1063R8308k83358J04595N00679K6387
1453C38854m47022P9123k30954n6388J07608l3528j26940L9268j46066r9332M71752
1442a03625K4936k70617P1215K03090K52248K53085R3908j96062n5373m78593
1432b05788j8483J78876k02190K02892L78187j93318j57824M4700J08071M5103
1422A80226k58110K17105J40836j70826k19236K78711K09482n0589l16887p6318
1412f5606J79851m27494O9128K54510O4394k22051r0030K64728l98122J277J08911
1401b60504J73067j59702j5988J35279J90276P9277j32264j49085K5655l8497
1391a52486K80972R2576k13771j40937j4596K15887J67319q703l28656j02704
$$ plain form
1464 -110857 -112918 -188715 -12658 50057 -178820 -107757 -9449 -292807 -188212 312467 338854
1453 338854 -108168 -29045 -259999 -316387 -208779 -242307 -369247 -329979 -476045 -575377 -103625
1442 -103625 -78689 -349306 -278091 -75001 177247 430332 524240 328178 272805 -205788
1432 -205788 -224271 -45395 -247585 -44693 333494 140176 -17648 27052 135123 180226
1422 180226 -77884 139221 280057 109231 -110005 168706 378188 327599 10712 -65606
1412 -65606 114245 -313249 -244121 10389 74783 -147268 -237298 27430 -370692 -369415 -260504
1401 -260504 -87437 -247139 -263127 -127848 62428 141705 9441 -139644 -113989 -152486
1391 -152486 128486 221062 7291 -133646 -148242 67645 234964 226261 -102395 -205099
1381b05099k5012l4742j54176J7554n3914j82091l5127L77200J70203J084J40407
1370A6287k20091l19224j49236K21875r719L74607P3152M1614J61298k16780R4937
1359F8720j15664J39769o0604k79137j39765L35276p8004O37O2452J71494K4370
1348A29544j59871K2011j16474K15540r73j03469j32172J56255J94749l17588
1338a12448l42987K23268L88610j21149k29711K40667K54376j20273l8024j25228
1328A7101k98455J14031K24920j09656Q7212K60201j01069k32303J47384l69861
1318b60495Q3491J44593L30451j7682j34839K4532k50540q3819L34252Q688r0337
1307H8295K58065k06784k26358N7542Q7070p4932j98133R5820m286L31495Q9102
$$ plain form
1381 -205099 -230111 -264853 -419029 -401475 -455389 -637480 -672607 -295407 -125204 -124120 16287
1370 16287 -203804 -523028 -672264 -450389 -460108 -85501 -12349 29265 190563 -26217 68720
1359 68720 -46944 92825 32221 -246916 -386681 -51405 -129409 -128772 -66320 105174 129544
1348 129544 -30327 -8316 -124790 90750 89777 -13692 -145864 10391 205140 -112448
1338 -112448 -455435 -232167 156443 35294 -194417 46250 300626 180353 142329 17101
1328 17101 -281354 -167323 57597 -52059 35153 295354 194285 -38018 109366 -260495
1318 -260495 -177004 -32411 298040 280358 145519 170051 -80489 -164308 169944 178632 88295
1307 88295 346360 139576 -86782 -29240 57830 -17102 -215235 -119415 -123701 207794 296896
1296B96896n06260k52936L55470P2567M7483k13583k52023q7250J5523J29800
1286c94313J29503K24300J68109P0910m07776l17575N1771L89932j94893j60542
1276d40574P8237K37004p0304L60124J30757K14865j97967l54709p8731j47333
1266b68631l63941m2149M89231J97562J48955N7541J74073r4781J21564k67494
1256A51930k54624J06228M1297J26549j00291J23340k21109K9571R275k44048
1246b31882K09025j79453m785K10323r5365J48176M3136k46633k88303K03802
1236b31959J59853M4517n7618J32958j10651k12965J46355J85312j88779J06482
1226b6495K52817k72216j76883Q0065r9048P1912l1112J54288J06081j51503R5564
$$ plain form
1296 296896 -209364 -462300 -106830 -34263 13220 -200363 -452386 -539636 -524113 -394313
1286 -394313 -264810 -40510 127599 198509 -209267 -526842 -475071 -85139 -280032 -440574
1276 -440574 -362337 -125333 -195637 164487 295244 510109 312142 -42567 -121298 -268631
1266 -268631 -632572 -674721 -185490 12072 161027 218568 392641 297860 419424 151930
1256 151930 -102694 3534 44831 171380 71089 194429 -26680 2891 12166 -231882
1246 -231882 -22857 -202310 -207095 3228 -92137 56039 99175 -147458 -435761 -231959
1236 -231959 -72106 -27589 -85207 47751 -62900 -275865 -129510 55802 -132977 -26495
1226 -26495 226322 -45894 -222777 -142712 -241760 -169848 -200960 -46672 59409 -92094 3470
1215C470q1036J55449Q0670l67550J44188J87981j54528m0349K51059j20884o5115
1204f645n30865K64433K06145j58710J60340J40095q377q9319P1166o594K80215
1193C21884J7563l69470m21791J0628J06862K81094q3581L31789r6131j55537
1183e6690J0607P8857K25300k70220l20024j14512J41889L91010N2868K15456
1173C54541j96326l40163L34760o7022k11582K9251k41104J47055P5946j53054
1163b67698l2994K82236P7349j59979o8691K13743M282L111k44830P102R6683
1152h9686n5940m1875O098L64588j28505J25521j3108l8556O0547k40441o3809
1141a15166j01384K22091K7245l01105K33738j57849Q6893R8865O8176j57980
$$ plain form
1215 3470 -77566 77883 158553 -208997 -64809 123172 -31356 -71705 179354 58470 -6645
1204 -6645 -537510 -273077 -66932 -225642 -65302 74793 66416 -22903 48263 41669 321884
1193 321884 339447 -30023 -451814 -441186 -334324 -53230 -136811 194978 98847 -56690
1183 -56690 -46083 32774 258074 -12146 -332170 -446682 -304793 86217 139085 354541
1173 354541 158215 -181948 152812 85790 -125792 -96541 -337645 -190590 -114644 -267698
1163 -267698 -300692 -18456 58893 -101086 -169777 43966 48248 51359 -193471 -186369 -89686
1152 -89686 -145626 -187501 -181403 183185 54680 180201 167093 128537 189084 -51357 -115166
1141 -115166 -216550 5541 32786 -268319 -34581 -192430 -105537 -6672 61504 -96476
1131i6476r9047K9126l81419M3074K35235J12952Q4210J5148J18255m3057k82185
1120b64184q0789k57438J68444M45857J67711m83448P1732J90546n5170r3384
1110a90123K91170j01457J61639j49459l71440J22058j4207N0179Q1489O4503
1100e5648j4715J80008O462L3866o7291O7733j90104J3000M90374k57794l06230
1089a00339j313K2375m7057l4734J20651J24625l6323N2077p9738K1435k11834
1078a70175O3655j49103m3336L8201j10363K07404j47761J81047J29590J15470
1068A14629j70875P9219j44070J19684L0652P7667j70401j40076o6916J59354
1058a11133n5859P7N8029k2358K63440M8022l73062K36359q380j79768K15632
$$ plain form
1131 -96476 -195523 -166397 -547816 -504742 -269507 -156555 -72345 -57197 61058 18001 -264184
1120 -264184 -344973 -602411 -433967 11890 179601 -303847 -232115 -41569 -96739 -190123
1110 -190123 101047 -410 161229 11770 -359670 -237612 -251819 -201640 -120151 -55648
1100 -55648 -70363 109645 116107 149973 82682 150415 -39689 -26689 463685 205891 -100339
1089 -100339 -101652 -79277 -126334 -161068 -40417 84208 47885 99962 20224 41659 -170175
1078 -170175 -106520 -255623 -298959 -260758 -371121 -163717 -311478 -130431 -841 114629
1068 114629 -56246 22973 -121097 -1413 29239 106906 -63495 -203571 -270487 -111133
1058 -111133 -166992 -166915 -108886 -131244 132196 180218 -192844 43515 35135 -144633 70999
1047G0999k57012j58535M04044k96028j10008J30821J38172L2807Q2616j17983
1037h0107K78962k55517l44526K62449J29269O4176J39074J43746Q2136k11651
1027B08011k76688J84751l28434J72206j64524j21363l13992J83275K80134O1237
1017a15387n486p673j96247J59251R9080K8797j02465K37612Q3457r0041m5540
1006D5358m5471j13979j59668K02662J13150J35753n913n9668j79501j16767Q444
995a75600j35895k0539J41434P3495n58038l66635O00547K45393k17345L84314
985b8869k80699j07109L38050m0628K82521j50499k78021J52148n3185Q1258M1000
974d4033l3345L37326k59190R7331j7944L321o6060J83917l85061q4812P1401
$$ plain form
1047 70999 -186013 -344548 59496 -236532 -346540 -215719 -77547 -44740 37876 -80107
1037 -80107 198855 -56662 -401188 -138739 -9470 54706 193780 337526 419662 208011
1027 208011 -68677 116074 -212360 -40154 -204678 -326041 -640033 -456758 -176624 -115387
1017 -115387 -120873 -128546 -324793 -165542 -66462 -37665 -140130 97482 180939 90898 45358
1006 45358 -113 -114092 -273760 -71098 42052 177805 171892 112224 -67277 -184044 -175600
995 -175600 -311495 -332034 -190600 -117105 -675143 -1041778 -441231 -195838 -413183 -28869
985 -28869 -309568 -416677 -78627 -119255 163266 12767 -265254 -113106 -166291 -85033 -44033
974 -44033 -77378 259948 758 98089 80145 83466 17406 201323 -183738 -268550 -197149
$$ [...]
##END NTUPLES=NMR SPECTRUM
##END=
