##TITLE=1H_CG-1199-30
 CDCl3
 8 sc, 
 9.4.2024
##JCAMPDX= 6.0         $$ Bruker NMR JCAMP-DX V2.0
##DATA TYPE= NMR SPECTRUM
##DATA CLASS= NTUPLES
##ORIGIN= UXNMR, Bruker Analytische Messtechnik GmbH
##OWNER= root
$$ XWIN-NMR		Version 3.5
$$ Tue Apr  9 13:52:09 2024 Russian Standard Time (UT+4h)  she@DPX200
##.OBSERVE FREQUENCY= 200.1309
##.OBSERVE NUCLEUS= ^1H
##.ACQUISITION MODE= SIMULTANEOUS
##.ACQUISITION SCHEME= undefined
##.AVERAGES= 8
##.DIGITISER RES= 18
##SPECTROMETER/DATA SYSTEM= spect
##.PULSE SEQUENCE= zg30
##.SOLVENT NAME= CDCl3
##.SHIFT REFERENCE= (INTERNAL, CDCl3, 0, 15.6059)
##AUDIT TRAIL= $$ (NUMBER, WHEN, WHO, WHERE, WHAT)
$$ ##TITLE= Audit trail, XWIN-NMR		Version 3.5
$$ ##JCAMPDX= 5.01
$$ ##ORIGIN= Bruker BioSpin GmbH
$$ ##OWNER= she
$$ F:/spectra/data/she/nmr/H-F/1/pdata/1/auditp.txt
$$ ##AUDIT TRAIL=  $$ (NUMBER, WHEN, WHO, WHERE, WHAT)
(   1,<2024-04-09 13:51:00.12 +0400>,<she>,<DPX200>,
      <created by zg, POWCHK disabled, PULCHK disabled
       configuration hash MD5:
       00 E9 B6 7A A2 85 ED C7 34 08 36 98 17 FE 4E 26
       data hash MD5: 16K
       FC 6D AD BB 13 45 EC 31 CC C4 8A 32 97 A0 9B 5E>)
(   2,<2024-04-09 13:51:07.62 +0400>,<she>,<DPX200>,
      <Start of raw data processing
       efp BC_mod = 2 LB = 0.24 FT_mod = 6 PKNL = 1 PHC0 = -25379.38 PHC1 = 7.387311 SI = 16K 
       data hash MD5: 16K
       38 12 D6 9A C9 31 72 0B 3F 79 7C 99 5D D1 CF 23>)
(   3,<2024-04-09 13:51:25.29 +0400>,<she>,<DPX200>,
      <pk PHC0 = 73.50678 PHC1 = 9.4 
       data hash MD5: 16K
       B9 25 C5 D8 92 DA 0A F6 F3 7A 61 73 A9 43 15 BD>)
(   4,<2024-04-09 13:51:28.90 +0400>,<she>,<DPX200>,
      <abs ABSG = 5 
       data hash MD5: 16K
       ED 77 55 99 2D 98 11 BD F3 AB F4 38 1A 6A 68 0F>)
$$ ##END=
$$ 
$$ hash MD5
$$ 07 AA 2C 7F 5B EA DC BA F7 80 2B 5F 91 70 E9 03
##$RELAX= 
##$RELAX= 
##$RELAX= 
##$RELAX= 
##$RELAX= 
##$RELAX= 
$$ Bruker specific parameters
$$ --------------------------
##$DU= <F:/spectra>
##$EXPNO= 1
##$NAME= <H-F>
##$PROCNO= 1
##$TYPE= <nmr>
##$USER= <she>
##$AMP= (0..31)
100 100 100 100 100 100 100 100 100 100 100 100 100 100 100 100 100 100 
100 100 100 100 100 100 100 100 100 100 100 100 100 100 
##$AQSEQ= 0
##$AQ_mod= 1
##$AUNM= <au_zg>
##$AUTOPOS= <>
##$BF1= 200.13
##$BF2= 200.13
##$BF3= 200.13
##$BF4= 200.13
##$BF5= 200.13
##$BF6= 200.13
##$BF7= 200.13
##$BF8= 200.13
##$BYTORDA= 1
##$CFDGTYP= 0
##$CFRGTYP= 5
##$CHEMSTR= <none>
##$CNST= (0..31)
1 1 145 1 1 1 1 1 1 1 1 1 1 1 1 1 1 1 1 1 1 1 1 1 1 1 1 1 1 1 1 1 
##$CPDPRG= <>
##$CPDPRG1= <>
##$CPDPRG2= <>
##$CPDPRG3= <>
##$CPDPRG4= <mlev>
##$CPDPRG5= <mlev>
##$CPDPRG6= <mlev>
##$CPDPRG7= <mlev>
##$CPDPRG8= <mlev>
##$CPDPRGB= <>
##$CPDPRGT= <>
##$D= (0..31)
0 1.2 0 0 0 0 0 0 0 0.06 0 0.03 0 0 0 0 0.0002 0 0 0 0 0 0 0 0 0 0 0 0 
0 0 0 
##$DATE= 1712656259
##$DBL= (0..7)
120 120 120 120 120 120 120 120 
##$DBP= (0..7)
150 150 150 150 150 150 150 150 
##$DBP07= 0
##$DBPNAM0= <>
##$DBPNAM1= <>
##$DBPNAM2= <>
##$DBPNAM3= <>
##$DBPNAM4= <>
$$ [...]
##$SUBNAM3= <"">
##$SUBNAM4= <"">
##$SUBNAM5= <"">
##$SUBNAM6= <"">
##$SUBNAM7= <"">
##$SUBNAM8= <"">
##$SUBNAM9= <"">
##$SW= 18.0517689322627
##$SWIBOX= (0..15)
0 0 2 0 0 0 0 0 0 0 0 0 0 0 0 0 
##$SW_h= 3612.71676300578
##$TD= 16384
##$TD0= 1
##$TE= 0
##$TE2= 300
##$TE3= 300
##$TEG= 300
##$TL= (0..7)
0 120 120 120 120 120 120 120 
##$TP= (0..7)
150 150 150 150 150 150 150 150 
##$TP07= 0
##$TPNAME0= <>
##$TPNAME1= <>
##$TPNAME2= <>
##$TPNAME3= <>
##$TPNAME4= <>
##$TPNAME5= <>
##$TPNAME6= <>
##$TPNAME7= <>
##$TPOAL= (0..7)
0.5 0.5 0.5 0.5 0.5 0.5 0.5 0.5 
##$TPOFFS= (0..7)
0 0 0 0 0 0 0 0 
##$TUNHIN= 0
##$TUNHOUT= 0
##$TUNXOUT= 0
##$USERA1= <user>
##$USERA2= <user>
##$USERA3= <user>
##$USERA4= <user>
##$USERA5= <user>
##$V9= 5
##$VALIST= <valist>
##$VCLIST= <CCCCCCCCCCCCCCC>
##$VD= 0
##$VDLIST= <DDDDDDDDDDDDDDD>
##$VPLIST= <PPPPPPPPPPPPPPP>
##$VTLIST= <TTTTTTTTTTTTTTT>
##$WBST= 1024
##$WBSW= 4
##$XGAIN= (0..3)
0 0 0 0 
##$XL= 0
##$YL= 0
##$YMAX_a= 38919
##$YMIN_a= -48241
##$ZGOPTNS= <>
##$ZL1= 120
##$ZL2= 120
##$ZL3= 120
##$ZL4= 120
##$ABSF1= 15.68302
##$ABSF2= -2.36887
##$ABSG= 5
##$ABSL= 3
##$ALPHA= 0
##$AQORDER= 0
##$ASSFAC= 0
##$ASSFACI= 0
##$ASSFACX= 0
##$ASSWID= 0
##$AUNMP= <proc_1d>
##$AZFE= 0.1
##$AZFW= 0.1
##$BCFW= 0
##$BC_mod= 2
##$BYTORDP= 0
##$COROFFS= 0
##$CY= -3
##$DATMOD= 1
##$DC= 0
##$DFILT= <>
##$DTYPP= 0
##$F1P= 0
##$F2P= 0
##$FCOR= 1
##$FTSIZE= 16384
##$FT_mod= 6
##$GAMMA= 0
##$GB= 0
##$INTBC= 1
##$INTSCL= 3.70164e-10
##$ISEN= 128
##$LB= 0.24
##$LEV0= 0
##$LPBIN= 0
##$MAXI= 10000
##$MC2= 0
##$MEAN= 0
##$ME_mod= 0
##$MI= 1.114404
##$NCOEF= 0
##$NC_proc= -9
##$NLEV= 6
##$NOISF1= 3.799351
##$NOISF2= 2.8
##$NSP= 0
##$NTH_PI= 0
##$NZP= 0
##$OFFSET= 15.60589
##$PC= 1
##$PHC0= -25305.88
##$PHC1= 16.78731
##$PH_mod= 1
##$PKNL= yes
##$PPARMOD= 0
##$PSCAL= 0
##$PSIGN= 0
##$REVERSE= no
##$SF= 200.129583157171
##$SI= 16384
##$SIGF1= 3
##$SIGF2= 2
##$SINO= 5.538805
##$SIOLD= 16384
##$SREGLST= <1H.CDCl3>
##$SSB= 0
##$STSI= 16384
##$STSR= 0
##$SW_p= 3612.71676300577
##$SYMM= 0
##$S_DEV= 0
##$TDeff= 16384
##$TDoff= 0
##$TI= <>
##$TILT= no
##$TM1= 0
##$TM2= 0
##$TOPLEV= 0
##$USERP1= <user>
##$USERP2= <user>
##$USERP3= <user>
##$USERP4= <user>
##$USERP5= <user>
##$WDW= 1
##$XDIM= 16384
##$YMAX_p= 411446952
##$YMIN_p= -4085764
$$ End of Bruker specific parameters
$$ ---------------------------------
##NTUPLES= NMR SPECTRUM
##VAR_NAME=  FREQUENCY,     SPECTRUM/REAL,   SPECTRUM/IMAG
##SYMBOL=    X,             R,               I
##VAR_TYPE=  INDEPENDENT,   DEPENDENT,       DEPENDENT
##VAR_FORM=  AFFN,          ASDF,            ASDF
##VAR_DIM=   16384,         16384,           16384
##UNITS=     HZ,            ARBITRARY UNITS, ARBITRARY UNITS
##FACTOR=    0.220516191357247, 1,           1
##FIRST=     3123.20031534175, 0,            0
##LAST=      -489.516447664025, 0,           0
##MIN=       -489.516447664025, -4085764,    0
##MAX=       3123.20031534175, 411446952,    0
$$ Real data points
##PAGE= N=1
##DATA TABLE= (X++(R..R)), XYDATA
$$ [...]
11655c35235K35527P34291r77481J33867q28370M04109N33698j5315k88236J349260
11645I46115L10854l69335n89561j373581l71868J680901P85470j052635J40234
11636A06594j088467R04954O50465j265417L28558l78343k09972J248239j74N73997
11626H70434K74083q33639n50676K088302j103862l99381o20392k069193K036411
11617c07913R64470j016336N81509P03160k97810l9031N68606j84622j074544
11608a02511M17823K66101k26353J688134q31614o10071J51475K12083l48253
11599F16814r23928j545023j33153k04891J740245J657707r55577k85286j026183
11590a059275o92867k0798J613311l12508J30360R02922j50471P42142l03026
$$ plain form
11655 -335235 -99708 634583 -342898 -209031 -1037401 -633292 -99594 -114909 -403145 946115
11645 946115 1256969 887634 298073 -1075508 -1447376 233525 1018995 -33640 106594
11636 106594 -981873 -76919 573546 -691871 -363313 -741656 -951628 296611 296437 870434
11626 870434 1144517 310878 -239798 1848504 744642 345261 -275131 -2344324 -307913
11617 -307913 656557 -359779 221730 924890 627080 588049 1156655 972033 -102511
11608 -102511 315312 581413 355060 2043194 1211580 601509 752984 965067 616814
11599 616814 -307114 -1852137 -1985290 -2190181 -449936 1207771 252194 -33092 -1059275
11590 -1059275 -1752142 -1772940 -159629 -472137 -341777 561145 410674 1152816 849790
11581H49790o29118p78434l43013P62461l01337M77938O15550r68762J171474
11572H56549m69285l84941J324892r9345p39147O37688q7062j516230M78953j85614
11562a83542J650745q64648j157315L03834J177850n26651j94275J5340j395797
11553a174459k93199K66548p8192K36578J238267o32163o79557N32415Q4115J372979
11543H73332l399k57494n51825o36625N86661J053l07344P20661P31154p40753
11533D15421N3305j42075m32445L57194n01715j9723m64573j27458M47059n17565
11523i32575m21318j93831J123623K17708n09551j278560J199064k53912K46416
11514h02936m19407P16008M63547N41448L17297o13196J90544J837004j390361
$$ plain form
11581 849790 220672 -557762 -900775 -138314 -439651 38287 653837 -314925 856549
11572 856549 387264 2323 1327215 1227870 488723 1126411 1039349 -476881 2072 -183542
11562 -183542 1467203 602555 -554760 -250926 926924 400273 205998 221338 -1174459
11553 -1174459 -1467658 -1201110 -1279302 -1042724 195543 -436620 -1116177 -583762 -499647 873332
11543 873332 869933 612439 60614 -576011 10650 11703 -295641 425020 1156174 415421
11533 415421 468726 326651 -105794 251400 -250315 -270038 -734611 -862069 -415010 -932575
11523 -932575 -1353893 -1547724 -424101 -206393 -715944 -1994504 -795440 -1049352 -802936
11514 -802936 -1222343 -506335 -42788 498660 815957 202761 393305 2230309 839948
11505H39948J48428N70922j01006n19469p43739K30014J403r97300j2939J167558
11495E83820j023381L47469M21559o49871P13496M0875O93770J85609q76861r11738
11485d75253q61585J038418R97286L8703j071559n24506q4104J415865P04407
11476A177672j460240N313j51045J16801N72386n47818l44653j95321J282779
11467D55874L73988l89523r40924Q03870J16602m71965K85299N6942k4762l72239
11457a06838n40252o45896P58808p3783o94583J551596Q27296r50485j095518
11448i69655M56780Q82810p81597j23636R38095L93925l17204l50052l3107O82980
11438G79339j35849j107189J351110l74527p38324K40422m24874m32500O27346
$$ plain form
11505 839948 988376 1559298 1458292 938823 195084 425098 426501 -570799 -583738 583820
11495 583820 -439561 -92092 329467 -320404 393092 433967 1127737 1313346 436485 -475253
11485 -475253 -1336838 -298420 698866 737569 -333990 -858496 -942600 473265 1177672
11476 1177672 -282568 -277255 -428300 -311499 260887 -286931 -631584 -826905 455874
11467 455874 829862 440339 -500585 303285 419887 -52078 233221 290163 265401 -106838
11457 -106838 -647090 -1292986 -534178 -607961 -1302544 249052 1076348 125863 -969655
11448 -969655 -512875 369935 -411662 -535298 402797 796722 479518 129466 96359 779339
11438 779339 643490 -463699 887411 512884 -225440 14982 -409892 -842392 -215046
11429b15046q77620r7835q27028p07423N40900K011937k28881J048127J91887
11420H39018L39660m52977J5740N23020R05897j064844l42347J52804j424868
11411e08897Q4816j61362K3794k0341Q70393m25084P18397j119187m33223J349733
11401C79039J23046p29720P19794J6870j034322O57232J48349J266325O04728
11392B151341k94686J306614q94280j487355q59795J092081m96316O97141L00413
11383A515158J42797l30915o70720r06202R41357O58163j910238O40227L62043
11374D41670N08396J680M39135j221506Q56158J050899n96328m85782m51321J423365
11364A966366r1277j096332q23843M95235k44075l06846J46564M82837P21930
$$ plain form
11429 -215046 -1092666 -1190501 -2017529 -2724952 -2184052 -172115 -400996 647131 839018
11420 839018 1178678 725701 741441 1264461 2170358 1105514 763167 915971 -508897
11411 -508897 -424081 -585443 -561649 -581990 288403 -136681 581716 -537471 -970694 379039
11401 379039 502085 -227635 492159 509029 -525293 131939 280288 1546613 2151341
11392 2151341 1856655 3163269 2268989 781634 -78161 1013920 517604 1214745 1515158
11383 1515158 1657955 1327040 656320 -249882 691475 1349638 -560600 79627 441670
11374 441670 950066 951746 1390881 169375 1025533 2076432 1480104 994322 543001 1966366
11364 1966366 1875089 778757 -45086 450149 206074 -100772 45792 528629 1250559
11355A250559j457317l98652n1523J34340J298282j348185o19114j71649J288698
11346g4561J022094J343138j82625m60243m98680r0027r40290j086280M31950
11337e35524J72985J492107j539040q13280M79061Q3397Q83517L92796L4230j21467
11327E28782j216065m22338P87781k76967l7259P05669J410627j86463n35683
11318G58084O22354k17265q56364M62372o2610l22154M30820k94932k03760K79660
11308E96205M53327j31228L06071q09611n99379L44469N79677R34132n6254r20807
11298F96602Q5596j143874Q21482L15401q70137l82466J131884J254763n57239
11289A352012N19366p15780j384238o182J451542N76445j081508k95001R09212
$$ plain form
11355 1250559 -206758 -605410 -656933 -522593 775689 -572496 -1191610 -1363259 -74561
11346 -74561 947533 2290671 2108046 1647803 1149123 1059096 118806 -967474 -535524
11337 -535524 -362539 1129568 -409472 -1222752 -743691 -660294 223223 616019 650249 528782
11327 528782 -687283 -1109621 -321840 -598807 -636066 69603 1480230 1293767 758084
11318 758084 1380438 1163173 306809 769181 706571 384417 815237 520305 316545 596205
11308 596205 1049532 918304 1224375 414764 -184615 159854 739531 1673663 1617409 696602
11298 696602 782198 -361676 459806 775207 -94930 -477396 654488 1909251 1352012
11289 1352012 1871378 1155598 -228640 -234822 1216720 1793165 711657 416656 1325868
11280A325868j37423j697646L46785L23184J17375L64648m70965n5182p25314
11271f08670k5756m83037N14975K06735J083045L98469M21903l26009n47682M84614
11261A118587L46726j983632p66353J042612j60835J15954j039169N4523J460078
11252A88491m17647J77811L67825o06480l78376j05786K73116j30516N21085j30720
11242b41197p76904k49083m11515J109583K65152L32794J303494j1299o9515M35725
11232A687235l70211q34306j548733l01760J65241P87916J593748j484111L53043
11223D8062P12249o66847K71328M11953q36031K23195J23908Q3737O4360l09281
11213A26633k90141p0962k07763M40148J208727l52682q67800M6369Q40508L24648
$$ plain form
11280 1325868 1188445 -509201 -162416 160768 278143 642791 171826 116644 -608670
11271 -608670 -634426 -1117463 -602488 -395753 687292 1085761 1507664 1181655 633973 1118587
11261 1118587 1465313 -518319 -1284672 -242060 -402895 -286941 -1326110 -1271587 188491
11252 188491 -229156 -51345 316480 -290000 -668376 -774162 -501046 -631562 -110477 -241197
11242 -241197 -1018101 -1267184 -1678699 -569116 -303964 28830 1332324 1321025 1251510 1687235
11232 1687235 1317024 482718 -1066015 -1367775 -1202534 -414618 1179130 -304981 48062
11223 48062 760311 93464 364792 776745 -59286 163909 287817 371554 435914 126633
11213 126633 -163508 -234470 -442233 -2085 1206642 853960 -13840 32529 873037 1197685
11203A197685o94890R80606k70921o71291m36063L35795m70505p92415p83334
11194a605333Q67477l3957m59640M74867J133125M45127K97311j308447k09033
11185c98503O26385m1178J207978P76446q21780j937543M51383J291329k25588
11176I28929n10324q41589q12549P67388O72305j002288n71681J205596N57048
11167C92835R48893r9551J22180Q483k83072m58847j300218k01502J195959l37884
11157a2724m42803j63898K049659Q6002k599411K00538J513839k33776J5980Q9452
11147E02858n47351M13384J869565j217186K58289N6118j040732m91814k13465
11138d10334K9770P37568o9324j813445K47736J059139O57071j257026l19725
$$ plain form
11203 1197685 502795 1483401 1212480 541189 105126 440921 -29584 -821999 -1605333
11194 -1605333 -737856 -771813 -1231453 -756586 376539 821666 1118977 -189470 -398503
11185 -398503 227882 186704 1394682 2171128 1349348 -588195 -136812 1154517 928929
11176 928929 418605 -422984 -1235533 -468145 204160 -798128 -1369809 -164213 392835
11167 392835 1341728 1242177 1364357 1372840 1089768 630921 -669297 -870799 325160 -12724
11157 -12724 -455527 -619425 1430234 1516236 -1083175 -882637 631202 397426 413406 502858
11147 502858 -44493 368891 2238456 1021270 1279559 1335677 294945 -196869 -410334
11138 -410334 -380564 357004 287680 -1525765 -1278029 -218890 438181 -818845 -1138570
11129a138570O80296R36406R68884k44574r68560J35789j278804J536987M85596
11120A113450j113649R98674Q54321n68960j212384l00856o44720l31281R17176
11111b88229l37877J23897P03632K82385q43941l79051l18945p7071M74206K78163
11101c82831k04130K19548R93926P89265j5318j267168q52449k84978K15447N65309
11091b23379J238147m86649p82904j618827O25826L60832N17724P50048L87140
11082G67958Q71906o56961n35229J393203o59994j89130m89801k33133P4953q26511
11072d82739q7762J243978N32564k03832j300071R1849q6165l75942J914092j110281
11062A35691p1966o07354R09135N15456m82442r72860J320383R91610j244672
$$ plain form
11129 -1138570 -458274 478132 1447016 1202442 233882 369671 -909133 627854 1113450
11120 1113450 -199 998475 1852796 1283836 71452 -229404 -874124 -1205405 -288229
11111 -288229 -626106 -502209 201423 483808 -360133 -739184 -1058129 -1135200 -660994 -382831
11101 -382831 -586961 -367413 626513 1415778 1400460 133292 -719157 -1004135 -788688 -223379
11091 -223379 1014768 528119 -254785 -1873612 -1247786 -886954 -369230 380818 767958
11082 767958 1639864 982903 447674 1840877 1180883 991753 501952 268819 343772 -482739
11072 -482739 -570501 673477 1206041 1002209 -297862 -206013 -292178 -668120 1245972 135691
11062 135691 63725 -543629 365506 880962 398520 -574340 746043 1737653 492981
11053D92981o49460M59381M28006j437239r1779j0865N02929l99777j742417J869297
11043e78943J890375j052365P31883m3232J93296N02653k196652P277R57988q69985
11033d57705p6267q15885Q74883J098558j595290O49399O41857k00145O42464
11024G61869n78041n71243q6907p39275J237554J802664j207217K06525k69171
11015E56758l14572O37081k78876k10504L92538M18634j601392Q14501J407421
11006A821589j658912q19592J152901J55304r73910R6095J314686R51999j140680
10997H99480j717158j11098J488253M17143j10452J34416j081006n05015M60855
10988a24582O83866J86073j78042j344077J483881J623576m54842l78059L54372
$$ plain form
11053 492981 -156479 302902 730908 -706331 -798110 -808975 -306046 -705823 -2448240 -578943
11043 -578943 1311432 259067 990950 947718 1141014 1643667 -552985 -545708 412280 -457705
11033 -457705 -533972 -1349857 -474974 623584 -971706 -322307 319550 119405 761869
11024 761869 183828 -387415 -474322 -1213597 23957 1826621 619404 825929 556758
11015 556758 242186 879267 600391 389887 782425 1201059 -400333 414168 1821589
11006 1821589 162677 -656915 495986 651290 -322620 -226525 1088161 2040160 899480
10997 899480 -817678 -928776 559477 976620 866168 1000584 -80422 -585437 -124582
10988 -124582 559284 745357 567315 -776762 707119 2330695 1875853 1497794 1852166
10979A852166J06569p45611j082248q24112R19457N6998n22761O68269P25068
10970A153795n18341q72811o88642m89066M99982J441814j02348m50950j261999
10961a288566O30696J226353j074924j53475J215059L28397O09611j77490j204340
10952A11321n5729M42931R80150r50949K72473J572683j099884j047509j91046
10943C4441j794002N4975J254540L31929o18941J56415K019591p15642j403509
10934f80203n24098o99546L89504J292904j0436L2099O20474j146738R89783k85381
10924b1638P9828L53274k43472j41637J96923r0039m13507M03200J76770r52761
10914f53059R97979N69969L39621o8610q09711j242466M22080Q14945p67157P01441
$$ plain form
10979 1852166 1958735 1213124 130876 -693236 226221 283219 -239542 428727 1153795
10970 1153795 635454 -237357 -925999 -1415065 -915083 526731 424383 -26567 -1288566
10961 -1288566 -657870 568483 -506441 -659916 555143 883540 1493151 1315661 111321
10952 111321 55592 498523 1478673 527724 800197 2372880 1272996 225487 34441
10943 34441 -1759561 -1704586 -450046 -118117 -737058 -580643 1438948 723306 -680203
10934 -680203 -1204301 -1903847 -1514343 -221439 -231875 -199776 420698 -726040 263743 -21638
10924 -21638 58190 411464 167992 26355 223278 133239 -280268 122932 299702 -653059
10914 -653059 344920 914889 1254510 1185900 376189 -866277 -444197 370748 -396409 305032
10904C05032M5664j06883r64347O84169R17011j68502K72906J860052p783p77484
10894B059835o10517q04467k45686l47635K23113L47799Q56451l3005q73499M12434
10884I84823m52899l49463K53760n17090M28327l02650K41877J176827p10743
10875G52769q66480K141617J05062j480036k15503j90789P85662q29065o58685
10866d55448J95438l41523J003484Q51849k55956M22622j089246q6756j19641
10857A24823l93666K21241O78847l17388L46554k71607k68904K17308Q17858Q59185
10847B014251j031570q54p82521n45310q4582n09907Q78570L5606O11566j518266
10837i33017M47184J707133q61859j108622O43121M38787J039920J36321j061963
$$ plain form
10904 305032 350696 243813 -720534 -36365 880646 712144 985050 2845102 2837319 2059835
10894 2059835 1449318 644851 399165 51530 274643 622442 1478893 1445888 572389 984823
10884 984823 531924 182461 436221 -80869 347458 44808 286685 1463512 752769
10875 752769 -113711 2027906 2132968 652932 437429 246640 1032302 203237 -455448
10866 -455448 -260010 -601533 401951 1253800 997844 1420466 331220 244464 124823
10857 124823 -268843 -47602 631245 313857 660411 388804 119900 337208 1155066 2014251
10847 2014251 982681 981827 199306 -346004 -430586 -940493 -61923 -26317 585249 -933017
10837 -933017 -485833 1221300 359441 -749181 -106060 332727 1372647 1508968 447005
10828D47005L95801n88107j177587P66346J368450n25011O95502l45103Q0116
10819A117412R40564K55269j245044p31771q70306M92323p3781l2294j29097J779899
10809A503174K7500j044731j80267j032655L47585M78612j90130J19309J238704
10800A267101m86800L83951j011107P25558j63564n38441K038903m17237j497041
10791C01323J151425m53701J192195P87277j030049r60228q58689J112026q93101
10782C48478p565j93213k6191O71649R68084o99842n4521K05214L85320o64912
10772I32501k312817j48031J041600k80250J049599O33082N21399r24998k53611
10763B58474O67105n57710l90827n05115K42473j085447J222576j2812K50916
$$ plain form
10828 447005 842806 254699 -922888 -156542 1211908 686897 1382399 1037296 1117412
10819 1117412 2057976 2313245 1068201 336430 -533876 -41553 -115334 -147628 -276725 1503174
10809 1503174 1530674 485943 305676 -726979 -379394 99218 -90912 28397 1267101
10800 1267101 780301 1164252 153145 878703 715139 176698 2215601 1798364 301323
10791 301323 1452748 999047 2191242 2978519 1948470 988242 129553 1241579 348478
10782 348478 340913 147700 121509 793158 1761242 1061400 1006879 1212093 1597413 932501
10772 932501 -1380316 -1528347 -486747 -766997 282602 915684 1437083 512085 258474
10763 258474 925579 367869 -22958 -528073 -285600 -1371047 -148471 -161283 89633
10754H9633M87027m99893J4118j078363J498843J706685j50595j91784j145923
10745G29748K13038L36642n97142k39493K48821N87502k49125j485407M69814
10736A4398m64762Q45899Q87218m33512J6409l1805m42565O09494J681638q37664
10726A844748j61990j070398K71256q47911L37737J173515K35436m28453O00389
10717A954329J47020p83140k091213n10502J091506N94740j166668j11078J601378
10708G26372q90701J009655J824852j186155k080160J22287J117146q35436n6621
10699b48761J020184o56983L0760J892220k88056j92844n88196j665898J134155
10690D36581m33357p04952j11211J053337K45929m5616K74779j58500j282165
$$ plain form
10754 89633 576660 76767 90885 -987478 511365 2218050 2067455 1875671 729748
10745 729748 942786 1279428 682286 442793 691614 1279116 1029991 -455416 14398
10736 14398 -450364 395535 1282753 849241 865650 833845 391280 1000774 2682412 1844748
10726 1844748 1682758 612360 883616 35705 373442 1546957 1782393 1353940 1954329
10717 1954329 2101349 1318209 -773004 -1283506 -192000 402740 -763928 -875006 726372
10708 726372 -164329 845326 2670178 1484023 -596137 -473850 643296 -192140 -248761
10699 -248761 771423 114440 145200 2037420 1749364 1556520 968324 -697574 436581
10690 436581 3224 -701728 -812939 240398 486327 440711 715490 556990 -725175
10681g25175k04351o478O53164n22605J543410Q16975n59184j15525j90949J62177
10671H51459o122q81410O73142L26516j368389q4695R37995N61065o04865O22048
10661A026744j083633J23156L33656J049558j055338P30876m47878p17504N59825
10652E19462q60986J069932l91727P39565Q01739m52666N08934j131878j6792
10643G85583m09657l4180J12406K24399k58096L56511O68952j554383m42810O82196
10633A30921Q79214p84779Q05303l17105j048499J102067M38858p25954R58442
10624A438468k29596j382120P04667L97113K07283o46010N43528O93626K16140
10615A943099l94250j086639l19347M75524k3068m17116l59206J04328O58796
$$ plain form
10681 -725175 -929526 -936004 -282840 -805445 737965 1554940 995756 880231 689282 851459
10671 851459 845337 -36073 637069 963585 -404804 -489499 448496 1009561 404696 1026744
10661 1026744 -56889 66267 399923 1449481 394143 1125019 677141 -40363 519462
10652 519462 -341524 728408 336681 1076246 1877985 1425319 1934253 802375 785583
10643 785583 375926 341746 454152 678551 420455 776966 1445918 -108465 -551275 130921
10633 130921 1010135 225356 1030659 713554 -334945 767122 1205980 480026 1438468
10624 1438468 1208872 -173248 531419 928532 1135815 489805 1033333 1726959 1943099
10615 1943099 1548849 462210 142863 618387 595319 178203 -181003 -76675 582121
10606E82121j207663L56152R50529K71751l98696R42406Q4654J140132j359878
10597A361508j076975k21738p64237l76074R79087O56079J085303j009580j157456
10588e24083O89541J19857J44244P5876L86301j556420R95240n13743J025343
10579H42156j08910J545480p76770j853063M0759j146323J733752J416812n70988
10570A122905q29293J084267k51396K70305q91568j159289R86809R90035k25265
10561A097510J57407J37492m50331M44885P35265j251548k12890O27935p75870
10552E09855j163319k4930P49790K43311j4582M44929L21255L28093j123979N0429
10542C20852Q6312m5408Q63791q12044m02313N43229k40588l04985R56512n69783
$$ plain form
10606 582121 -625542 -269390 681139 952890 554194 1496600 1581254 2721386 1361508
10597 1361508 284533 62795 -701442 -1077516 -98429 557650 1642953 633373 -524083
10588 -524083 165458 285315 429559 505435 891736 -664684 330556 -183187 842156
10579 842156 733246 2278726 1501956 -351107 -310348 -1456671 277081 1693893 1122905
10570 1122905 293612 1377879 1126483 1396788 505220 -654069 332740 1322775 1097510
10561 1097510 1254917 1392409 942078 1386963 2122228 870680 657790 1285725 509855
10552 509855 -653464 -678394 71396 314707 300125 745054 1066309 1394402 270423 320852
10542 320852 407164 361756 1225547 413503 11190 554419 313831 8846 965358 395575
10532C95575K031432O74664j625077Q45778n63951q25667J04684j09186r97126
10523f8874k80194J186852p88107j23264K31476M89545m00282J105475J458993
10514B811620p55707n97184M10182j049456K39098p21423p02911M66641k77203
10505a76343l16298P09944O3895J024346K67305j954555j103626J899034j89138
10496B24564r19597R69135Q2326j6658l84376J45574P59064l52277r4523J506608
10486A919840J82336j34640q6709j003434p33189j181350K87335j76335P67901
10477a58245R93215p32676L03701n23351Q43294M02598r36958j02486N89857L7773
10467G16722K87851k61677K16963j304778M85340R902m63230K84176O62231j43597
$$ plain form
10532 395575 2427007 3101671 1476594 2322372 1758421 932754 1037438 928252 -68874
10523 -68874 -349068 837784 49677 -73587 157889 647434 247152 1352627 2811620
10514 2811620 2055913 1458729 1868911 819455 1058553 337130 -365781 100860 -176343
10505 -176343 -492641 217303 281198 1305544 1572849 -381706 -1485332 413702 224564
10496 224564 -695033 274102 356428 339770 -44606 100968 860032 507755 413232 1919840
10486 1919840 2102176 1967536 1880827 877393 144204 -1037146 -749811 -926146 -158245
10477 -158245 834970 102294 405995 -117356 725938 1128536 191578 89092 678949 716722
10467 716722 1004573 742896 959859 -344919 140421 150323 -312907 -28731 633500 489903
10457D89903L53963M66120l27945l68617o19845l53281J318784O94330N29291
10448B182703J63986j064539j560712o64910J29614L22874J727553P87546K35497
10439B259612o96066r48604p00995J799200J213247r51910m31314l28409r80334
10430B34427q3805J431900o27823n50721J57303r85386J480425P35785M33781
10421B225886j473141p10772J209950J170706j823214q10600J806537M43950j384307
10412F54995r22211O73817N33583N44774j102009m7673n86277k31716Q26083P59235
10402A102601l04410k85077O916q1984j1204k65055n14602L95944p40875O85318
10392a2428O30399n13846M5515J139887j3461L49659l35500j012997J16383J56336
$$ plain form
10457 489903 843866 1309986 982041 613424 -6421 -359702 959082 1653412 2182703
10448 2182703 2346689 1282150 -278562 -943472 -813858 -490984 1236569 2024115 2259612
10439 2259612 1563546 614942 -86053 1713147 2926394 1974484 1543170 1214761 234427
10430 234427 150622 1582522 954699 403978 561281 -424105 1056320 1792105 2225886
10421 2225886 752745 41973 1251923 2422629 599415 -211185 1595352 2039302 654995
10412 654995 -267216 406601 940184 1484958 382949 335276 -251001 -482717 343366 1102601
10402 1102601 798191 513114 520030 438046 426842 161787 -352815 43129 -697746 -12428
10392 -12428 617971 104125 149640 1289527 1276066 1625725 1290225 277228 393611 549947
10382E49947j08586o97823O37262K84844r53433M53407J276065j112291K08041
10373E37433Q22828K64084L7362n60185m83353q28476J58232J261914q79021j330534
10363i99716k18988M35412J456243k98117q11787J989593j92347p30340l70876
10354B59077K34953P63544j120754J070348J095291q13283L94882k1543j216415
10345F46100p87740k64698o16470O92179O08828J52250n79295K86726P40945Q19361
10335A698186J23881l94298L85263j378893R64117K92764p1703j65965Q15595
10326B268947m70885K35654j95537p54698P97007o70603l66291o37093j546188
10317a339687O84260m24202J136301L60008q96233L84520L57685M58347n51260
$$ plain form
10382 549947 441361 -256462 380800 665644 -287789 165618 1441683 329392 537433
10373 537433 1360261 1624345 1661707 1101522 618169 -210307 -52075 1209839 330818 -999716
10363 -999716 -1218704 -783292 672951 374834 -436953 1552640 1360293 629953 259077
10354 259077 494030 1257574 136820 1207168 2302459 1489176 1884058 1862515 646100
10345 646100 -141640 -406338 -1022808 -330629 278199 430449 -148846 137880 878825 1698186
10335 1698186 1822067 1427769 1813032 434139 1398256 1691020 1619317 1453352 2268947
10326 2268947 1798062 2033716 1838179 1083481 1880488 1209885 843594 206501 -1339687
10317 -1339687 -655427 -1079629 56672 416680 -479553 -95033 262652 720999 169739
10308A69739P67264L04218m78725m93920Q06214p54254R56890Q74012j823049
10299C28389r69843K382827m72037o25584r30111O08919K95122K2031O50903o8322
10289A222294p13168p13137J90461Q18034O8562l7630p07002n68109J128114n9964
10279F28455J161153K10240j41175j073160o90647Q80758N13822o31298n4188
10270H03960L11270j234873j60774J472336q06402j3904k43174r6084Q39499L13910
10260A185764j169065j593095J222963J382765j039231M70377J779021Q1124o65263
10251A655360n89075k55680j42649Q74024j54286j488904J413912K6444j383480
10242d4334m66401n77038L58048J137405P3078J08308M84085j403215Q04427N31701
$$ plain form
10308 169739 937003 1241221 762496 268576 1074790 320536 1277426 2151438 328389
10299 328389 -641454 1741373 1269336 643752 -286359 322560 617682 639713 1290616 1222294
10289 1222294 509126 -204011 -13550 804484 873046 835416 128414 -439695 688419 628455
10279 628455 1789608 1999848 1858673 785513 94866 975624 1489446 858148 803960
10270 803960 1115230 -119643 -280417 1191919 385517 371613 128439 32355 871854 1185764
10260 1185764 16699 -1576396 -353433 1029332 -9899 460478 2239499 2320623 1655360
10251 1655360 1066285 810605 667956 1541980 1387694 -101210 1312702 1339146 -44334
10242 -44334 -510735 -1087773 -729725 407680 480758 589066 1073151 -330064 474363 1006064
10232A006064J41854L03943o14988O1007P8539J53155Q71496r65964M8122k76195
10222H07033M71568k56188j20360j327623L62527R78327j181097J851342O19477
10213B205006l36390n19641j155795r69441R73536m97446R00995o17710L49756
10204C32870M90004M20908R6606J773447j43156k739880Q78488L92646M12484
10195A914417j25106j108431l85946L52547L25471N04727l6694J91191p71541
10186H60635j93589n0927j44565J185865L57499j120239j314687l35506J043770
10177B88256J503763l18207r30896r75310J176583K309374q04102j598146o45497
10168E818p41865J243711Q45391M54253N02791j093675J67841p91978J199303
$$ plain form
10232 1006064 1147918 1451861 836873 897880 976419 1129574 2001070 1035106 1083228 807033
10222 807033 1278601 1022413 902053 -425570 -63043 915284 -265813 1585529 2205006
10213 2205006 1868616 1348975 193180 -776261 197275 -300171 600824 -16886 332870
10204 332870 822874 1243782 1340388 3113835 2970679 230799 1109287 1501933 1914417
10195 1914417 1789311 680880 294934 647481 972952 1477679 1440985 1632176 860635
10186 860635 667046 616119 471554 1657419 2014918 894679 -420008 -755514 288256
10177 288256 1792019 1473812 542916 -432394 744189 3053563 2249461 651315 5818
10168 5818 -736047 507664 1353055 1807308 2310099 1216424 1384265 592287 1791590
10159A791590p58086j358738M52314J344782Q70512j691928N43795J16812r70354
10150C40699n51125N74268j49481l50644J043961n26547j57844N07531j205595
10141d74777j0385M78294r36089Q49466O99105J240046J32567m78592n56474O27352
10131A570513n26976j7406r74701J339837R29768j766369N93064P99216j240939
10122G06007Q27875J194182j533689o85692m85461J059520J518193J047901j761665
10113A887171r38006l54130K698207N16807k200593M21007O0165r9920L38323
10104B329031k191N89076q59354p40411k50145K27442j9657L95691j039752N56318
10094A186048J023942q49869j12377M93031k61125N0137o27479l02545K1720J7789
$$ plain form
10159 1791590 1033504 -325234 127080 1471862 2342374 650446 1194241 1311053 340699
10150 340699 -210426 363842 214361 -136283 907678 381131 223287 730818 -474777
10141 -474777 -485162 -6868 -942957 -93491 605614 1845660 1978227 1499635 943161 1570513
10131 1570513 1043537 1026131 51430 1391267 2321035 554666 1147730 1946946 706007
10122 706007 1533882 2728064 1194375 508683 23222 1082742 2600935 3648836 1887171
10113 1887171 949165 595035 3293242 3810049 1609456 2030463 2090628 1990708 2329031
10104 2329031 2326840 2915916 2056562 1316151 1066006 1293448 1273791 1669482 629730 1186048
10094 1186048 2209990 1360121 1247744 1740775 1479650 1529787 902308 599763 621483 639272
10084F39272o07651R50936Q41655j5072l88786o98737J139373O59207n62990j219478
10074G37729p72131K1366P79314Q87814O36909j306700q99976P85790q5860R24852
10064A709107R98979j716482K94887O02899l14705r62106K1238K090506O56887
10055C381210j669787m01697K049574j516371q562N10515M2552l93036N02236
10046B496634M92718j776914j90765p2693J450732k3960K90991n85964n6218L5697
10036B060258J49063o34251j134698J377076j27232j551244L22038m96637R58469
10027I22842j080626m3546O62189k7618L07081M42180L07769k04226j79093N5248
10017A162200j88818j583115J024692M15709J101858k28034O92854N53752j655531
$$ plain form
10084 639272 31621 982557 1824212 1809140 1420354 721617 1860990 2520197 1957207 737729
10074 737729 -34402 -13036 766278 1654092 2291001 984301 84325 870115 784255 1709107
10064 1709107 2708086 991604 1286491 1889390 1574685 612579 633817 2724323 3381210
10055 3381210 1711423 1309726 3359300 1842929 1834367 2344882 2387434 1994398 2496634
10046 2496634 2989352 1212438 1021673 948980 2399712 2375752 2666743 2080779 2024561 2060258
10036 2060258 2209321 1575070 440372 1817448 1690216 138972 461010 -35627 922842
10027 922842 -157784 -201330 460859 433241 740322 1182502 1490271 1286045 1106952 1162200
10017 1162200 973382 -609733 414959 830668 1932526 1704492 2397346 2951098 1295567
10008A295567m12465j309645R58758J69165K2514J025392j82158L33675j30866
9999A769937Q20308o65053r5638M1494j253940M07802l22155M50080r33043M12586
9989F32378J107709P09823K17637m78731m97935O22007l19780M3083N88342m37951
9979B186582M55494n30095q90167N89707J102870K38030j438187p37599R12876
9970A889511M10512o74811o80804M25550k85314R4125J215829m62279M29598k95208
9960B066709l88038m96149J597884N08981p45758j445235k83809R32969P9929
9951A827483k69040l82557j31057M62730P81686o24791R51905o56362Q10255o09509
9941B160743o54949p88046J033126O4392p31434M547N32419m25011k93468P22435
$$ plain form
10008 1295567 883102 -426543 532215 701380 723894 1749286 1567128 1900803 1769937
9999 1769937 2590245 1925192 1829554 1871048 617108 1024910 702755 1152835 219792 632378
9989 632378 1740087 2449910 2667547 2188816 1690881 2312888 1993108 2036191 2624533 2186582
9979 2186582 2642076 2111981 1221814 1811521 2914391 3152421 1714234 976635 1889511
9970 1889511 2300023 1625212 944408 1369958 1084644 1178769 2394598 1932319 2361917 2066709
9960 2066709 1678671 1182522 2780406 3289387 2543629 1098394 814585 1747554 1827483
9951 1827483 1558443 1175886 1044829 1507559 2289245 1664454 2616359 1959997 2770252 2160743
9941 2160743 1505794 717748 1750874 1815266 1083832 1088379 1620798 1195787 902319 1624754
9931A624754l90517P06359n34865o721Q67637L08462O82565q99851j596397M28937
9921A190363L25976r99398N01040O22253O69406r56985l52803J086611J017154
9912C103617k581060J043903J644391o76456q30880m62155K84243L45045j62806
9903A707842o44249N58225P20710m41806J25960M5313k40975n09930J68367j54903
9893A334554j75690r66407J40664J532561M74981l312n1755j07696n19281N95205
9883B253824J5206M48979Q62975q48611r11570j73371J024114l35315m64614R56918
9873B828535k25969K48219J768350j256930p51194P91100k58934q63294j347246
9864I32637J346324K49619q20177M33153R22519l76377N60068K96016J28618l8765
$$ plain form
9931 1624754 1234237 1940596 1405731 1399010 2266647 2575109 3257674 2357823 761426 1190363
9921 1190363 1516339 516941 1017981 1640234 2309640 1352655 999852 2086463 3103617
9912 3103617 522557 1566460 3210851 2534395 1703515 1241360 1525603 1870648 1707842
9903 1707842 1063593 1621818 2342528 1900722 2026682 2071995 1831020 1321090 1489457 1334554
9893 1334554 1158864 192457 333121 1865682 2340663 2337351 2285596 2177900 1658619 2253824
9883 2253824 2269030 2718009 3580984 2732373 1820803 1647432 2671546 2336231 1871617 2828535
9873 2828535 2602566 2850785 4619135 3362205 2611011 3402111 3143177 2279883 932637
9864 932637 2278961 2528580 1708403 2141556 3064075 2687698 3247766 3543782 3672400 3633635
9854C633635J15558j71973N07511J80841o81017j026317P45620M75927m8185n84292
9844C147308N55661O27907M91945J48773J44978O48691n13936j544517J073790
9835D780600L38673R13493o13207n13397R40166n39017K7343K62416Q71985L65086
9825F834141J63592j732515j212700J100372q67541j594262j32705J600184O60329
9816D818895M4841K92162N04685l0389P75363p46290Q61781j347636k045841N19630
9806C647201N03062N78647l57483J26160n11692J496367j348471j723488N12656
9797B922959M3930L16960O15726j12009l77047M16890L70816L57950j73885m32203
9787C950087K9093L52654n38415n99464Q64682K98619m26585k02135L27340L07817
$$ plain form
9854 3633635 3749193 3577220 4084731 4265572 3584555 2558238 3303858 3779785 3731600 3147308
9844 3147308 3702969 4330876 4822821 4971594 5116572 5765263 5251327 3706810 4780600
9835 4780600 5119273 6032766 5419559 4906162 5846328 5307311 5334654 5597070 6469055 6834141
9825 6834141 6997733 5265218 4052518 5152890 4285349 2691087 2558382 4158566 4818895
9816 4818895 4863736 5155898 5660583 5630194 6405557 5659267 6521048 5173412 3127571 3647201
9806 3647201 4150263 4728910 4371427 4497587 3985895 5482262 4133791 2410303 2922959
9797 2922959 2966889 3283849 3899575 3787566 3410519 3827409 4198225 4556175 4382290 3950087
9787 3950087 3979180 4331834 3793419 3193955 4058637 4357256 3930671 3728536 4055876 4363693
9777D363693k66110K05667m6082M2552j118362q71201R31083J336042j31073q56412
9767C589797J64548n92659J383432k43392r24505j26282P14745Q22942o92792
9758D095834J092558r678m1386L26937p83447O61456j2052o86970O6890J029860
9748E740002l55840p51790M08348J03675O5888k30677L45608n41218L15418M86611
9738E586025R8034K66073r01187O78105p18392L75173n08760j007372R39891Q56098
9728E663688J082198k02743j043312J769147O06574j686678m84068J43042j385719
9719D462129R79852J860573J104640j329814o69802N60758n83565R85711j121830
9710F248652J38605J174720M75357N46366j473369L4689J769829r22200k133483
$$ plain form
9777 4363693 4097583 4303250 4257168 4299720 3181358 2310157 3241240 4577282 4446209 3589797
9767 3589797 3754345 3161686 4545118 4301726 3377221 3250939 3965684 4788626 4095834
9758 4095834 5188392 5178714 5137328 5464265 4680818 5342274 5330222 4643252 4710142 5740002
9748 5740002 5384162 4632372 5040720 5144395 5210283 4979606 5325214 4783996 5099414 5586025
9738 5586025 5684059 5950132 5048945 5727050 5008658 5383831 4875071 3867699 4807590 5663688
9728 5663688 6745886 6543143 5499831 7268978 7875552 6188874 5704806 5847848 4462129
9719 4462129 5441981 7302554 8407194 7077380 6407578 6968336 6384771 7370482 6248652
9710 6248652 6387257 7561977 8037334 8583700 7110331 7145020 8914849 7992649 5859166
9701E859166K96241o8075J128270L69116j05397m26865K95302J287282k64845
9692H370195r16245J492918K48184N88334M67907j763627N48312m97679l60942
9683H177357M98067P16991O53894p0876N6187j108827k01473m9369O98697L99388
9673I770036j84485O67495Q71229R8274p35501J406399j48261M34404N72074j157464
9663A1594200J119463J12127j799807p48368O15971K90195m95702L11513J088877
9654A2088469J597675o35171K09321k51529P13142O84095K29612N41233O32652
9645A5809499n56417p05534J56560q3677R30631Q19641N45383J9007j117869l62340
9635A5454884J014205O57863n21790j38049J668840J190180o05855j72066J797542
$$ plain form
9701 5859166 6155407 6087332 7215602 7584718 7479321 7052456 7347758 8635040 8370195
9692 8370195 7453950 8946868 9195052 9783386 10251293 8487666 9035978 8538299 8177357
9683 8177357 8675424 9392415 10046309 9975433 10031620 8922793 8721320 8671951 9370648 9770036
9673 9770036 9585551 10253046 11124275 11222549 10487048 11893447 11745186 12179590 12751664 11594200
9663 11594200 12713663 12825790 11025983 10277615 10893586 11183781 10688079 10999592 12088469
9654 12088469 13686144 13050973 13260294 13008765 13721907 14406002 14635614 15176847 15809499
9645 15809499 15253082 14547548 14704108 14620431 15551062 16370703 16916086 16935093 15817224 15454884
9635 15454884 16469089 17126952 16605162 16467113 18135953 19326133 18720278 18548212 20345754
9626B0345754J471951j247551Q28162M90386P676M07367P28862M18786J105393
9617B4556786j28144q77832J115292J143166O50365n15762P42910J289884P73437
9608B8750102J111147n19069p41176J176095L24128M62324q96074K161785K983390
9599C4812652r21407P95764P74895J0073R66792K74068O08855R19781J314484
9590C9555957P6302p08111K427309K058419O54386J41422R62621m24412J175784
9581D5919677J660561J837898J970374N58422M29710J432455J302429P8664j70867
9572E5019323j03295J452726J479181P01273k3978o03975j028584L88428J868492
9563E9149591N39594O4580o6314l3166k602727n10695J860386l14998j264668
$$ plain form
9626 20345754 21817705 20570154 21398316 21888702 21896378 22303745 23032607 23451393 24556786
9617 24556786 24428642 23550810 24666102 25809268 26459633 25943871 26686781 27976665 28750102
9608 28750102 29861249 29342180 28601004 29777099 30101227 30563551 29667477 31829262 34812652
9599 34812652 33891245 34687009 35461904 35471977 36438769 36712837 37321692 38241473 39555957
9590 39555957 39632259 38924148 41351457 43409876 44064262 44205684 45168305 44743893 45919677
9581 45919677 47580238 49418136 51388510 51946932 52376642 53809097 55111526 55190190 55019323
9572 55019323 54916028 56368754 57847935 58549208 58525230 57921255 56892671 57281099 59149591
9563 59149591 59689185 59753765 59687451 59654285 57051558 56540863 58401249 58086251 56821583
9554E6821583j246467q60853L37165r1871k106063N79976j581574j376130l90130
9545E0085636m86633j528190k8998p13880j300753j93858j430445m09871m11075
9536D3581933l46737k0689Q54302j365214j943751q04709l55333K114398L36390
9527D2050590r69710j38336l9956R5993J66640J18194p28846q11294q0352R11880
9517D0574803P4246p73281N18809J699696J08475j40790N12995r61898J220255
9508D2833310J163161M79459J26127p69792K34614R49084J01144k23747N21525
9499D5414885J29478J88476Q69447J037938J056691J343824O72273J937426Q79758
9490E3530196K375641J031933J000777K277331J553876K294757J019941L459660
$$ plain form
9554 56821583 55575116 54714263 55051428 54959557 52853494 53433470 51851896 50475766 50085636
9545 50085636 49599003 48070813 48041815 47327935 46027182 45833324 44402879 43993008 43581933
9536 43581933 43235196 43214507 44068809 42703595 40759844 39955135 39599802 41714200 42050590
9527 42050590 41080880 40942544 40902588 40998581 41165221 41283415 40554569 39743275 39662923 40574803
9517 40574803 40649049 39875768 40394577 42094273 42202748 42061958 42574953 41613055 42833310
9508 42833310 43996471 44475930 44602057 43832265 44066879 45015963 45117107 44893360 45414885
9499 45414885 45544363 45732839 46602286 47640224 48696915 50040739 50713012 52650438 53530196
9490 53530196 55905837 56937770 57938547 60215878 61769754 64064511 65084452 68544112
9482F8544112L493140L176802L786228K772915M219546N435032M821468P861240
9474A04110483P842066Q273387R189670J1114597J4919788J9929143K0092271
9467A95471405K0509883J8529765J7963797J6788349R656601M461454L930676
9460B87311930K89828j703233j629320l116310o127731j0365472j6168320j8097168
9452B30394204k1643550k3976881k2863501k1793013j8641485j8024499j4532263
9445H8919012j0145983q275728p688322n811199n709476m527101l561417l872625
9437C9327161l003608j565553j770630j505339j412342j239897k083802j305634
9429B5440356k407659q84096m39430k122259k571512j941603Q9262N5853J79923
$$ plain form
9482 68544112 72037252 75214054 79000282 81773197 85992743 91427775 96249243 104110483
9474 104110483 111952549 120225936 129415606 140530203 155449991 175379134 195471405
9467 195471405 215981288 234511053 252474850 269263199 278919800 283381254 287311930
9460 287311930 287601758 285898525 284269205 281152895 275025164 264659692 248491372 230394204
9452 230394204 208750654 184773773 161910272 140117259 121475774 103451275 88919012
9445 88919012 78773029 70497301 62808979 56997780 51288304 46761203 43199786 39327161
9437 39327161 36323553 34758000 32987370 31482031 30069689 28829792 26745990 25440356
9429 25440356 23032697 22148601 21709171 19586912 17015400 15073797 15163059 15218912 15398835
9420A5398835M74597r40618J007021j063305j944539P15642n59029n00909q87648
9411A1700047j826336J691598R30064j886366m93291j492977l49791r01470M99830
9402G871308M60774o39046K01822n37990j048373j623439J766695m43241J181201
9393G189711j311137j39842N07681J7892n14520j013309L44069k04496J648P69804
9383E647501l49567q43515q41980Q63373L47358j908068R69785J054725p12225
9374D227387l75314n93808N67261J216400l5036L96831j024998p4439P6536N15329
9364D896149n19916M41538j107334l08561M30136O86393p44116j75784P53424
9355D351929k67118M12807k46514j374712O31140R8203k251611q4030K115641
$$ plain form
9420 15398835 15873432 14932814 15939835 14876530 12931991 13647633 13088604 12587695 11700047
9411 11700047 9873711 11565309 12495373 10609007 10115716 8622739 8272948 7371478 7871308
9402 7871308 8332082 7693036 7894858 7356868 6308495 4685056 6451751 6008510 7189711
9393 7189711 5878574 5738732 6246413 6264305 5749785 4736476 5080545 4876049 4877697 5647501
9383 5647501 5297934 4454419 3612439 4475812 4823170 2915102 3884887 4939612 4227387
9374 4227387 3852073 3258265 3825526 5041926 5006890 5403721 4378723 4304284 4380820 4896149
9364 4896149 4376233 4817771 3710437 3401876 3832012 4518405 3774289 3598505 4351929
9355 4351929 4084811 4497618 4251104 2876392 3507532 3605735 1354124 1270094 3385735
9346C385735j206026j440299J894757p52420n73349M39722J393280J332598k80086
9337D193912j360323o55514Q87270L81145M3753P82543r34585M05120K50714n48624
9327C445411Q34259j030752j148522L55882J78686l70300J031788J36661j609535
9318A823578R7181K91131J54739Q17317J78572k16283k69195j78451K02614o23457
9308B277746n35716M24614R22668m02040n78576L34234J201058K813n77375L70149
9298C439575p55851m6808L82545l63421N35292N32935k02556m36148Q31961J337741
9288E255265K95281l22738p60288P95196J786566Q2448n68677J05476j355139
9279E313390P10j44302j41262Q03267m42141L85867j80093j062029j297957O79857
$$ plain form
9346 3385735 2179709 739410 2634167 1881747 1308398 1748120 3141400 4473998 4193912
9337 4193912 2833589 2178075 3065345 3446490 3490243 4272786 3338201 3743321 3994035 3445411
9327 3445411 4279670 3248918 2100396 2456278 2634964 2264664 3296452 3433113 1823578
9318 1823578 1920759 2211890 2366629 3183946 3362518 3146235 2877040 2698589 2901203 2277746
9308 2277746 1742030 2166644 3089312 2687272 2108696 2442930 3643988 3646801 3069426 3439575
9298 3439575 2683724 2636916 3019461 2656040 3191332 3724267 3521711 3085563 3917524 5255265
9288 5255265 5550546 5227808 4467520 5262716 7049282 7131730 6563053 6668529 5313390
9279 5313390 5314100 5169798 5028536 5831803 5389662 5775529 5595436 4533407 3235450 3915307
9269C915307J299606j580384q8776n89178j5073N22354j40051M30347O7102k00347
9259C620907k04874J857056j552179j813750J52601n28626J855721r9384N61398
9250C848870J06001m14774o39764j64818J245816O72752M99632o53370r3724M10740
9240D817361n22286j180047k58952o3204j576377R97162J461979L5496j299479
9231B411653Q67526j11009m07956M83420P72908L97909j160095l83560L24141
9222C194937q09158J123999o22958j082453j30502r0683j83659Q42557N16802
9213B758882N44978L87211k0900K19136m91790L45581m26630J58425m68366M48531
9203C455058O87694j167844N32493J29455O43910j71968j645134P09264J046821
$$ plain form
9269 3915307 5214913 3634529 3545753 2956575 2941502 3463856 3323805 3754152 3821254 3620907
9259 3620907 3416033 5273089 3720910 1907160 2059761 1531135 3386856 3287472 3848870
9250 3848870 3954871 3540097 2900333 2735515 3981331 4654083 5153715 4500345 4406621 4817361
9240 4817361 4295075 3115028 2856076 2792872 1216495 2213657 3675636 3711132 2411653
9231 2411653 3279179 3168170 2760214 3243634 4016542 4414451 3254356 2870796 3194937
9222 3194937 2385779 3509778 2886820 1804367 1673865 1583182 1399523 2242080 2758882
9213 2758882 3303860 3691071 3670171 3889307 3397517 3743098 3316468 3474893 3006527 3455058
9203 3455058 4142752 2974908 3507401 3636856 4280766 4108798 2463664 3172928 4219749
9194D219749j64187M91340N11552k304439j90730J34448O83253r02997r36981
9185A541008J20926Q66069N40765N78087N61589N65833m94367j805414R17409
9176C391905P75543m26780N43917n77179J269049m93879J58796o68171L9630q88204
9166C124627P99425O77413l95920n75784N05893P94990m73027o84217O72952j0161
9156D436191n10763n0468r08301J569584p44126J351535o25646p90441Q23473
9147D551038q91140M38459J70379J239260n46032j00889j73979J87373o44390
9138D230079O98051l42921r48122Q05068K83262J260565J6273p39035J52554Q94187
9128F309961O73552J51275j066718o8310k8436j68576l50969M2491P21178k78312
$$ plain form
9194 4219749 4055562 4546902 5058454 2754015 2563285 2697733 3380986 2477989 1541008
9185 1541008 1661934 2528003 3068768 3646855 4208444 4774277 4279910 2474496 3391905
9176 3391905 4167448 3740668 4284585 3707406 4976455 4482576 4641372 3973201 4012831 3124627
9166 3124627 3924052 4601465 4205545 3629761 4135654 4930644 4457617 3773400 4446352 4436191
9156 4436191 3925428 3874960 2966659 4536243 3792117 5143652 4518006 3727565 4551038
9147 4551038 3659898 4098357 4268736 5507996 4961964 4861075 4687096 4874469 4230079
9138 4230079 4928130 4585209 3637087 4442155 4725417 5985982 6002255 5263220 5415774 6309961
9128 6309961 6983513 7134788 6068070 5999760 5971324 5802748 5451779 5494270 6215448 5937136
9118E937136M31054j295817R55328N27048p67138l39757n52375n45186K01801
9109D552094N59425K343075J43969j688292P24092k28677l89802L31456l40832
9100F006508p50843O63333L26882J002018k08946J020609n1576M03250k44083
9091H167152n01228O76534K19092p21138Q54719M73633p24757O45585O4231r24075
9081H229748K02446Q17045Q39214j55635j019469M49325M61177n80486J104582
9072A0347947j295606R79391L61950J12912J395886q94531l05953J50793o68833
9063A0183956J109313J08090j550087L9617p15327l93845K596632N44158L00765
9054A2223272j369298m07167L91540J043653K10642l15884p72113j207594L78236
$$ plain form
9118 5937136 6368190 5072373 6027701 6554749 5787611 5447854 4895479 4350293 4552094
9109 4552094 5111519 7454594 7598563 5910271 6634363 6405686 6015884 6347340 6006508
9100 6006508 5255665 5918998 6245880 7247898 7038952 8059561 8007985 8411235 8167152
9091 8167152 7665924 8342458 8561550 7840412 8695131 9168764 8444007 9089592 9153823 8229748
9081 8229748 8432194 9249239 10088453 9932818 8913349 9362674 9823851 9243365 10347947
9072 10347947 9052341 10031732 10393682 10506594 11902480 11007949 10701996 10852789 10183956
9063 10183956 11293269 11401359 9851272 9890889 9175562 8781717 11378349 11922507 12223272
9054 12223272 10853974 10446807 10838347 11882000 12092642 11776758 11004645 9797051 10175287
9045A0175287J028778N12891N00669O79307j298604j27J587831l0246L59314j60024
9035A3355076p46921J524227J815349K78930J86813m22589N01156r1906R31782
9026A7331917k15697J79247J44303m39307J003660J225099J47910j229241J330081
9017A9477972J153100J03576j72085J079332r1188n15772J000333Q88336k95999
9008B2627605J043883L20017l9462P27772J338452q7788P02862J182394J469521
8999B9285256P28846L0109k01336J745548l48564m26916K887737q84155J422641
8990C4239166J586732O93186J581749R47369J504934M11620L38715l1077K172494
8981D3444888m6935K360057J465133J296978J206154M79519J54331J652614K899308
$$ plain form
9045 10175287 11204065 11716956 12217625 12896932 11598328 11598201 13186032 13155786 13515100 13355076
9035 13355076 12608155 14132382 15947731 16226661 16413474 15990885 16492041 16400135 17331917
9026 17331917 17116220 17295467 17439770 17000463 18004123 19229222 19377132 18147891 19477972
9017 19477972 20631072 20734648 20562563 21641895 21550707 21034935 22035268 22923604 22627605
9008 22627605 23671488 23991505 23952043 24679815 26018267 25930479 26633341 27815735 29285256
8999 29285256 30014102 30044211 29842875 31588423 31239859 30812943 33700680 32816525 34239166
8990 34239166 35825898 36519084 38100833 39048202 40553136 40964756 41303471 41272394 43444888
8981 43444888 43397953 45758010 47223143 48520121 49726275 50205794 50360125 52012739 54912047
8972E4912047J559830J569250L494649J763706J554854L855570L752441M439544
8964G6901891N659999O390373O370378L663689J049241n00958j629608j530646
8956I6374359l62989L73765K661905K792577R44965k362831k164572k429060k018618
8947I3809501j083066n24012P64061J485791K125074O8982M335373J908493K323214
8938A05213411L358412K844492M768471L468056N765194Q054639P677173P829634
8930A48979482J0387884R914025J1451718J5389271J8988038K5201461L0484626
8923B70796505L3498538K6127931J0057766j840591n184391n763054k215657P843662
8915C33320709J7435458J8554865N894475n313583j0897644j5022446j1035939
$$ plain form
8972 54912047 56471877 58041127 61535776 63299482 64854336 68709906 72462347 76901891
8964 76901891 82561890 88952263 95322641 98986330 100035571 99534613 97905005 96374359
8956 96374359 96011370 96385135 99047040 101839617 102784582 100421751 98257179 95828119 93809501
8947 93809501 92726435 92202423 92966484 94452275 96577349 96646331 100981704 102890197 105213411
8938 105213411 108571823 111416315 116184786 119652842 125418036 133472675 141149848 148979482
8930 148979482 159367366 169281391 180733109 196122380 215110418 240311879 270796505
8923 270796505 304295043 330422974 340480740 338640149 333455758 327692704 325477047 333320709
8915 333320709 350756167 369311032 375205507 369891924 358994280 343971834 332935895
8908C32935895R45862J2299496K2569266K2364705J3998712O333016p61378j2355950
8900C98329624l1036388l8294445m1874171m0684873l5557332k9522336k2726153
8893A58633926j9696667j5984458j2963600j1122311p452509o811724o631154
8886G7971503m548990m187550j789476k463528j652457j539369q62472M47739
8878F1375400j936389r0929m39626k25040J215289q59056K690855L139921M23513
8869F5293938K185373L849092M787162M606862M369527K60644J383842j966185
8861H4770255l895751p925308n533308n253090n358723m924133n227350j866222
8853D4786370j639269j940727q82438j474938j385225p96296o19147J358001J92274
$$ plain form
8908 332935895 333881757 346181253 368750519 391115224 405113936 411446952 410685574 398329624
8900 398329624 367293236 328998791 287124620 246439747 210882415 181360079 158633926
8893 158633926 138937259 122952801 109989201 98866890 91414381 84602657 77971503
8886 77971503 73422513 69234963 67445487 64981959 63329502 61790133 60927661 61375400
8878 61375400 59439011 59348082 58908456 58683416 59898705 59039649 61730504 64870425 65293938
8869 65293938 67479311 71328403 76115565 80722427 85091954 85352598 86736440 84770255
8861 84770255 80874504 72949196 67415888 62162798 56804075 51879942 46652592 44786370
8853 44786370 43147101 41206374 40323936 38848998 37463773 36667477 36048330 37406331 37598605
8844C7598605J343235n00324q52638N93002n70470M648J6366J107701J525622
8835D0265747J755144J141779n3942R64059J257454J730310K292956J037839K114056
8826E2505402M606442K830078J541415L715743M364587O167496Q056260Q105703
8818I1893126Q356992J0801151J3022652J5788197K1334751K9595211L6332462
8811B27124542M1102467K0712506j2222620k4838103l3482630m0014983l4132698
8804A44248481k5486089k1434650j5035346j2099977r110740p793521n895073
8797D7393085l448522m351456l371614j385643k073659k642717j041947j740063
8789B7337464j563981q47290j550693j596107j422900j414817j140237o62271
$$ plain form
8844 37598605 38941840 38441516 37588878 38181880 37611410 37616058 37632424 38740125 40265747
8835 40265747 42020891 43162670 43108728 44072787 45330241 47060551 49353507 50391346 52505402
8826 52505402 57111844 59941922 61483337 65199080 69563667 75731163 83787423 91893126
8818 91893126 100250118 111051269 124073921 139862118 161196869 190792080 227124542
8811 227124542 268227009 288939515 276716895 251878792 218396162 178381179 144248481
8804 144248481 118762392 97327742 82292396 70192419 61081679 53288158 47393085
8797 47393085 43944563 39593107 36221493 34835850 32762191 30119474 29077527 27337464
8789 27337464 25773483 24926193 23375500 21779393 20356493 18941676 17801439 17139168
8781A7139168j338659j201277o41357n66473j403332O0437J247789L3162j537561
8772A1791897j731992k056581O82240J795092o48613K57254N97646j822972k84666
8763H579305j187305J311921l6055j171372j68016P30554p20053k87564J00368
8754G151783N47096j07979Q99339P9213p12732J92975K02060j438085k87448R47681
8744G473903p95157p10055o74063j047127P79039P85622q61585j031390J49657
8735D068844N72556p88514j266429N60676J250617R43593r33325o82464J620123
8726E345677p08750M5838l25498n38831R62227M59715k371683n29369J268740
8717C608066n55886l65127M1689q32104K69022q20936J081106M68532m73017n29228
$$ plain form
8781 17139168 15800509 14599232 13957875 13391402 11988070 12048507 13296296 13329458 11791897
8772 11791897 10059905 8003324 8685564 10480656 9832043 10089297 10686943 8863971 8579305
8763 8579305 7392000 8703921 8667866 7496494 7328478 8059032 7338979 7051415 7151783
8754 7151783 7698879 7590900 8490239 8569452 7856720 8049695 8251755 6813670 6526222 7473903
8744 7473903 6678746 5968691 5294628 4247501 5026540 5812162 4950577 3919187 4068844
8735 4068844 4641400 3852886 2586457 3147133 4397750 5341343 4408018 3725554 5345677
8726 5345677 4636927 4682765 4357267 3818436 4780663 5240378 2868695 2339326 3608066
8717 3608066 3052180 2687053 2728742 1896638 2165660 1344724 2425830 2894362 2421345 1892117
8707A892117K83967j01128N9403N74622k61313r40286o56669J150311J333798
8698C334822r59251q49858P28142l42964N41510m23184L64390M21154Q8826l23446
8688B580141K00564N04993j10283j17962j218463Q97351Q91093l11195l04476
8679C011763M60547L53783j320335m84213J345842k42610j507148J91009K41129
8670B049767J127687K62919j551781M18944J18213N70630r9271O8098m02601J23570
8660B686175O22795p83511r0414n03344j154062M19533m42992Q50971j399040
8651B06111j675480J677127K574583n22358j376378p7294P52901n36468l65694
8642F57050o33553J594315N85161J52095j062868K29172J194612j84169Q62923
$$ plain form
8707 1892117 2176084 2074956 2134359 2708981 2447668 1507382 850713 2001024 3334822
8698 3334822 2375571 1525713 2253855 1910891 2452401 2029217 2393607 2814761 2903587 2580141
8688 2580141 2780705 3285698 3175415 3057453 1838990 2736341 3627434 3316239 3011763
8679 3011763 3472310 3826093 2505758 2021545 3367387 3124777 1617629 1808638 2049767
8670 2049767 3177454 3440373 1888592 2307536 2425749 2996379 2897108 2965206 2562605 2686175
8660 2686175 3308970 2525459 2435045 1931701 777639 1197172 754180 1605151 206111
8651 206111 -1469369 207758 2782341 2259983 883605 806311 1559212 1022744 657050
8642 657050 23497 1617812 2202973 2355068 1292200 1521372 2715984 2531815 3394738
8633C394738o83995j06415K36934k03123q10034N79745j568402k65653M54985
8624A028780Q41062P39948q31669J118725o42712j161167J021610q22751l40245
8615I51581L35263N92380K86922k83258O91048K3116k05267j7516o25998J079343
8605B827614P1187q21683j214879L47847m8118J081504O8865j655478J137780
8596A794639r79373N86431J545357j350779M23072j53370M76730N35962j029098
8587A849571J77771r95443L96685M70198j03616m23566J130070j141073n88659
8578G71938K22120M0186N68513p00293J363962P03912l48608j237232o31758N49495
8568A302235J256085p00464M75528O59933k19445L47211j45033n39586o55677
$$ plain form
8633 3394738 2710743 2604328 2841262 2638139 1828105 2407850 839448 573795 1028780
8624 1028780 1869842 2609790 1778121 2896846 2254134 1092967 2114577 1291826 951581
8615 951581 1286844 1879224 2166146 1882888 2573936 2597052 2391785 2374269 1748271 2827614
8605 2827614 2898801 2077118 862239 1210086 1161968 2243472 2312337 656859 1794639
8596 1794639 815266 1401697 2947054 1596275 2019347 1865977 2342707 2878669 1849571
8587 1849571 2027342 1031899 1428584 1898782 1795166 1371600 2501670 1360597 771938
8578 771938 994058 1034244 1602757 902464 2266426 2970338 2621730 1384498 752740 1302235
8568 1302235 2558320 1857856 2333384 2993317 2773872 3121083 2976050 2436464 1780787
8559A780787N07730J010330j847118L39416j00424j141733K02605N72839N4959
8550A379391L28759j054936R4598M19026O78732Q6752j107974P54326K12713l564
8540A787823p31686l39232J274604L11608O8567j187041j104189j57453L04344
8531B27345J74419j51291l43134O19580R6455L70181J9898M47883p0112r79700
8521D11524O66249m31907n23622j76857l26297L63953N73912r29095K13073J41257
8511a7810M77070l20309P6772m18078l82520J429275K84184j365210L11622n4045
8501B0951j54263N87206R15166J66940l2040r38746n49270p17387n27868J411049
8491A81738L21463N14581j228908n42106O64590R5316P81391j184703o05506M04699
$$ plain form
8559 1780787 2288517 3298847 1451729 1791145 1690721 548988 751593 1324432 1379391
8550 1379391 1708150 653214 747812 1166838 1845570 1932322 824348 1578674 1791387 1787823
8540 1787823 1056137 716905 1991509 2303117 2371684 1184643 80454 -76999 227345
8531 227345 401764 250473 -92661 526919 623374 993555 1013453 1461336 1391224 411524
8521 411524 1077773 645866 122244 -54613 -380910 -16957 556955 -372140 -159067 -17810
8511 -17810 459260 138951 215723 -202355 -584875 844400 1128584 -236626 74996 20951
8501 20951 -133312 453894 1369060 1536000 1503960 565214 15944 -701443 -1229311 181738
8491 181738 503201 1017782 -211126 -753232 -88642 6674 788065 -396638 -1002144 -597445
8481e97445j07870R49200L93562o90472J207976K60023j263380O21250K17243
8472I90087l14485l02433J31420r00465k43173J625641n5340k28567o98858j33212
8462a29385l89793K17397P60594o05272P9122R43758K30767Q2488r8942p21774
8452C68960J446037m21027j496557k67280N67954K56135L34817P16082n22053
8443I83068j259238j726626L34390J111740m9079J633164N3629k030924r21531
8434a871407K70245L87914J667052O28482j046612N12781m91708r46139P76968
8425a12424O02528r14663K02442k08311K84973N61616Q41003P4538o74739p38805
8415h1842Q50814L73560l99681n53461N17984j11046Q65316j23476l31037o0803
$$ plain form
8481 -597445 -705315 243885 637447 -53025 1154951 1414974 151594 772844 990087
8472 990087 675602 373169 504589 -395876 -639049 986592 931252 702685 3827 -129385
8462 -129385 -519178 -301781 458813 -146459 -67337 876421 1107188 1189676 1090734 368960
8452 368960 1814997 1393970 -102587 -369867 198087 454222 789039 1505121 983068
8443 983068 -276170 -2002796 -1668406 -556666 -605745 1027419 1081048 -949876 -1871407
8434 -1871407 -1601162 -1213248 453804 1082286 35674 548455 56747 -889392 -112424
8425 -112424 490104 -424559 -222117 -430428 -145455 416161 1257164 1331702 656963 -81842
8415 -81842 768972 1142532 742851 189390 707374 596328 1461644 1338168 1007131 946328
8405I46328o6040m3307o12918k39808J06910m51089J014654O66455p44577n61278
8395A5330r25147Q2482l31890j38732R28889j76801K64359J302064J39656k14415
8385I45795j459340j616315J114532Q42269o99150n33982J386932K58519l28288
8376h9028J224884j37282J2888j129249n35290m53773J515625j55543L97257M87523
8366A138012n30704K90190j341863j246693J392811j66094L54442k59413m07994
8357g77306K16636J074653J15654K76438P20762k061313n97874J087939k96450
8348b40861m23000M91810j235466j8863K10219p18908M74511j240363J664722
8339a036199O49213M41935j0669o35250L26811R78034K1394q71565j09560o16679
$$ plain form
8405 946328 880288 836981 224063 -15745 91165 -359924 654730 1321185 576608 15330
8395 15330 -909817 -827335 -1159225 -1297957 -369068 -545869 -281510 1020554 1160210 945795
8385 945795 -513545 -2129860 -1015328 -173059 -872209 -1406191 -19259 239260 -89028
8376 -89028 1135856 998574 1011462 -117787 -653077 -1106850 408775 253232 650489 1138012
8366 1138012 607308 897498 -444365 -1691058 -298247 -464341 -109899 -369312 -777306
8357 -777306 -560670 513983 629637 906075 1626837 -434476 -1032350 55589 -240861
8348 -240861 -663861 -172051 -1407517 -1426380 -1216161 -1935069 -1460558 -2700921 -1036199
8339 -1036199 -386986 54949 44280 -590970 -264159 713875 735269 -136296 -245856 -862535
8329h62535J283953q00037j181786P9016k54750k61378K399816j105055o71307
8320a374063M25896l68267M24183L96169N95697m70243j423414K07625j76219
8311a762636N88554r78160j70541n18304R21984J190021j056682J184239j433602
8302b035127L40755J360153j054784j646588J514937O76248l33618n54502J163903
8293e68623L58742r73455r42852Q52922N27127p950m90317n819M16592r14444
8283a748077m39150q7516Q6826l39252J32417K1234q5408J332088L21067o5962
8273h71733P921J066465l71348l1213Q12632j553688n10675J463197j206815L57752
8263h37505j087886j339011O33895q83989J315658o44034R4040Q74977L17581
$$ plain form
8329 -862535 421418 -378619 -1560405 -1481389 -1736139 -1997517 402299 -702756 -1374063
8320 -1374063 -948167 -1316434 -892251 -496082 99615 -370628 -1794042 -1586417 -1762636
8311 -1762636 -1174082 -2152242 -2322783 -2841087 -1919103 -729082 -1785764 -601525 -2035127
8302 -2035127 -1694372 -334219 -1389003 -3035591 -1520654 -844406 -1178024 -1732526 -568623
8293 -568623 -209881 -1183336 -2126188 -1273266 -746139 -754089 -1244406 -1250225 -833633 -1748077
8283 -1748077 -2187227 -2274743 -2187917 -2527169 -2394752 -2373518 -2458926 -1126838 -805771 -871733
8273 -871733 -863812 202653 -168695 -199908 612724 -940964 -1451639 11558 -1195257 -837505
8263 -837505 -1925391 -3264402 -2630507 -3514496 -2198838 -2842872 -2748832 -1873855 -1556274
8254a556274L67143M42740L97968J350679o56908j242089Q881l44178j242657
8245b474695R3745p74922P6248O03361M62828o33417O20375l55550j33188M17491
8235b097724J462629k69674L3775l62568O43978K62272j444211K84780R55651
8226e31092K70861p16191j38510o71405n97228J27731N83081J714770j105941
8217a063924n32652N80436k04400N62070J49528n7063N42470m49606r40564l45252
8207a758957L55478j97075j492510R12130J263775N17577p50035j104413l22650
8198b576680K540712j13828n07374J7087M47726K519016L906219o401770j767201
8189a936093J658348j554719n4716O29374K8611j063124K26847J082398N73454
$$ plain form
8254 -1556274 -1189131 -746391 -348423 1002256 345348 -896741 -887860 -1232038 -2474695
8245 -2474695 -2380950 -3155872 -3079624 -2476263 -2013435 -2646852 -2026477 -2382027 -2515215 -2097724
8235 -2097724 -635095 -904769 -870994 -1233562 -589584 -327312 -1771523 -1486743 -531092
8226 -531092 -260231 -976422 -1114932 -1786337 -2383565 -2255834 -1672753 42017 -1063924
8217 -1063924 -1596576 -1016140 -1220540 -658470 -508942 -566005 -23535 -473141 -1413705 -1758957
8207 -1758957 -1403479 -1600554 -3093064 -2180934 -917159 -399582 -1149617 -2254030 -2576680
8198 -2576680 -35968 -149796 -657170 -640083 -192357 2326659 6232878 -168892 -1936093
8189 -1936093 -277745 -1832464 -1887180 -1257806 -1229195 -2292319 -2065472 -983074 -409620
8180d09620n089J4679o10921M6329j83540J12782m76518J92851O57031M99427
8170a62589o61760N8870O35217l18881j190862J294587l28981j853366J21930
8161b405835K45752J348674M54028P5670l9042j312194J077455O21216n41935
8152d76211m49082J022912o0737q71925r55272J183579r2651n09491q05696K38456
8142a776118M98266j65110k94145k79876R25901J69309p62922L91213L94413M94048
8132d05021j85555p04854P27655o54893Q20897k11731p61982j05801k88621O87609
8122a082297N49277q17089l19201J48030l96384J78657l5950M73050M06053k11605
8112a107459R9965P28931l65673o51316j009162R07291J22394p24812N48347J34184
$$ plain form
8180 -409620 -414709 -400030 -1010951 -964622 -1148162 -1035380 -1511898 -1319047 -662016 -162589
8170 -162589 -824349 -765479 -130262 -449143 -1640005 -345418 -674399 -2527765 -2405835
8161 -2405835 -2160083 -811409 -357381 -281711 -320753 -1632947 -555492 65724 -476211
8152 -476211 -925293 97619 36882 -835043 -1790315 -606736 -699387 -1208878 -2014574 -1776118
8142 -1776118 -1277852 -1442962 -1737107 -2016983 -1091082 -921773 -1684695 -1293482 -899069 -405021
8132 -405021 -590576 -1295430 -567775 -1222668 -401771 -613502 -1375484 -1481285 -1769906 -1082297
8122 -1082297 -533020 -1350109 -1669310 -1521280 -1917664 -1739007 -1774957 -1301907 -895854 -1107459
8112 -1107459 -1007494 -278563 -644236 -1295552 -2304714 -1397423 -1275029 -1999841 -1451494 -1317310
8102a317310j92499q05770J414866P2601j019849j093729J086881J59186N73516
8093a122107p86016N8791j103120R36875J131458r17395k10170M87339o05091
8084b129436k41181J307454J090123q04522k95743j83930Q69037P41476j361468
8075a008190j212455O76984M15036K2960m11469k78156N09727q8004j22128j972025
8065c467720K094541J66127J465067m31463j509758k85417k68704J103308m26870
8056a560889L59023K7323M09367J16920j508982P95916L67289j320161m05052
8047b719246J159631K68432n97642R40003O15650J55280K80544n88556K75268
8038b10636J62538p51440J032579p32586L89000Q97031p03883L63680j107797
$$ plain form
8102 -1317310 -1509809 -2315579 -900713 -828112 -1847961 -2941690 -1854809 -1695623 -1122107
8093 -1122107 -1908123 -1849332 -2952452 -2015577 -884119 -1801514 -2011684 -1524345 -2129436
8084 -2129436 -2370617 -1063163 26960 -777562 -1073305 -1257235 -388198 353278 -1008190
8075 -1008190 -2220645 -1543661 -1128625 -1105665 -1517134 -1795290 -1285563 -1373567 -1495695 -3467720
8065 -3467720 -1373179 -1207052 258015 -173448 -1683206 -1968623 -2237327 -1134019 -1560889
8056 -1560889 -1201866 -1174543 -765176 -648256 -2157238 -1361322 -994033 -2314194 -2719246
8047 -2719246 -1559615 -1291183 -1888825 -948822 -333172 -177892 102652 -485904 -210636
8038 -210636 -48098 -799538 233041 -499545 -110545 786486 82603 446283 -661514
8029f61514K41266O97811m01238j031934o18152m00900O23478L46460o01180J92849
8019a613054J147198J1861m50583J08011p13168O51625P95214O81362R4972j17352
8009E96086k26832p26236k17992N32810N6084o03193k71305l6862L75333N3834
7999d68273N22158n11593k027242Q8709Q12675k08649k78144O72754k51572j596813
7989c245990R80742J605806M72717j386475j136300j69705J283660K32354Q9457
7980a273734Q40336q33506M54341o24481K16901J144044L04513j158549j562506
7971b492641J047889n71964R71546J869286j575769o48736k10498o21393k6832
7962b259112K75170P83122r9318o9711n93306j04278M11737P63198O4152L30135
$$ plain form
8029 -661514 -420248 277563 -123675 -1155609 -1773761 -2174661 -1551183 -1204723 -1805903 -1613054
8019 -1613054 -465856 -453995 -904578 -796567 -1509735 -858110 -62896 618466 713438 596086
8009 596086 369254 -356982 -574974 -42164 13920 -589273 -860578 -897440 -522107 -468273
7999 -468273 53885 -457708 -2484950 -2396241 -1583566 -1792215 -2070359 -1397605 -1649177 -3245990
7989 -3245990 -2265248 -659442 -186725 -1573200 -2709500 -2879205 -1595545 -1363191 -1273734
7980 -1273734 -433398 -1266904 -812563 -1437044 -1220143 -76099 228414 -930135 -2492641
7971 -2492641 -1444752 -2016716 -1045170 824116 -751653 -1400389 -1610887 -2232280 -2259112
7962 -2259112 -1983942 -1200820 -1300138 -1369849 -1963155 -2067433 -1655696 -892498 -828346 -498211
7952d98211j33362q9165J012733r99631J79747j192224l40567J619331q49r14815
7942a357013n61790J340291j37041L25001O13231j33762m82456J77314l92569
7933f08794n28907L11382M84736O88161q97530O83117K59798j244002m56153j135051
7923b443243K60915J079654P49563J132370j093565m13801Q67536j535345J084986
7914c10930m8582j294485J664456M70277j124728o18698o2318P63140l18528r47741
7904a828137J29319J14106q7993R22065R86162j415594k20831k26627L0706P4874
7894a521950q25166q98226J370599P17219k39478j030668k6980J408644o42994
7885a689000m31050Q10108k55846Q73155N90000j737896O37433K99286m81784
$$ plain form
7952 -498211 -631573 -720738 291995 -707636 -527889 -1720113 -2060680 -441349 -442198 -1357013
7942 -1357013 -1918803 -578512 -715553 -390552 222679 88917 -393539 -216225 -608794
7933 -608794 -1137701 -826319 -341583 346578 -550952 132165 391963 -852039 -1308192 -2443243
7923 -2443243 -2182328 -1102674 -353111 779259 -314306 -728107 139429 -1395916 -310930
7914 -310930 -359512 -1653997 10459 480736 -643992 -1262690 -1325008 -561868 -880396 -1828137
7904 -1828137 -1698818 -1584712 -1672705 -750640 235522 -1180072 -1400903 -1627530 -1596824 -1521950
7894 -1521950 -2347116 -3245342 -1874743 -1157524 -1397002 -2427670 -2454650 -1046006 -1689000
7885 -1689000 -2120050 -1309942 -1565788 -692633 -102633 -1840529 -1203096 -903810 -1385594
7876a385594j005415L14583N90434r51113M57000O4463O30302l35155n35000O65469
7866a490026J096866n06828k53274j63107Q14956R67288l83362o52820P370k87969
7856h50906J403002j93583j538122O14696L36222o03037j38053O79689r8723r2863
7846d81678J216518q98856J52381j065111j664559L27082N65668R2157J39166
7837a617232r25747Q75461m73808J86396o91282L23070J727448r87254p52479
7828b335427M40468j02837M07981l71926K09076O62419j661471N43640N06018
7819a702059R34893p84406J84687P9517m7540J32741J293784L36603K91065p36097
7809a6812L92222L09449O38982k355578m51371o12175m88636J215445Q2444O14686
$$ plain form
7876 -1385594 -2391009 -2076426 -1485992 -2437105 -1980105 -1915642 -1285340 -1620495 -2155495 -1490026
7866 -1490026 -393160 -899988 -1153262 -1316369 -501413 465875 82513 -570307 -562937 -850906
7856 -850906 552096 358513 -1179609 -564913 -228691 -831728 -969781 -290092 -388815 -481678
7846 -481678 734840 -164016 -11635 -1076746 -2741305 -2414223 -1848555 -1756398 -1617232
7837 -1617232 -2542979 -1667518 -2141326 -1954930 -2646212 -2323142 -595694 -1582948 -2335427
7828 -2335427 -1894959 -1997796 -1589815 -1961741 -1752665 -1090246 -2751717 -2208077 -1702059
7819 -1702059 -767166 -1551572 -1366885 -1287368 -1334908 -1202167 91617 428220 719285 -16812
7809 -16812 375410 684859 1323841 -1031737 -1483108 -2095283 -2583919 -1368474 -1286030 -671344
7799f71344j94634j33730j51050m97342O99217l60341q97738R21438N06007o43314
7789a422831M95635n09908J083380O1381L89745L99970m2776p59654l66794Q56519
7779A84667k80942q59444j255580P04841j227524j65548J351481o97342N97982
7770a647409R21746j14415m3951j149293l43262J564305l32842L80233j31552
7761h96440m20116J4224n98121p35938J865803M37283n77335K82253J75906L02461
7751a50020r33714m76054J93685j96223k00860P52952L27437O27434r22872l58861
7741a337096p19556K7816p85948J101709M2039n69584Q69556J085205m87293p21277
7731a494429J152947j80700N8121L04077r78604o04866o22575O91194q4138N94626
$$ plain form
7799 -671344 -865978 -999708 -1150758 -1648100 -948883 -1309224 -2206962 -1285524 -779517 -1422831
7789 -1422831 -927196 -1437104 -353724 -292343 97402 497372 454596 -305058 -671852 184667
7779 184667 -96275 -955719 -2211299 -1506458 -2733982 -2899530 -1548049 -2245391 -1647409
7770 -1647409 -725663 -840078 -884029 -2033322 -2376584 -812279 -1145121 -764888 -896440
7761 -896440 -1316556 -1302332 -1900453 -2636391 -770588 -333305 -910640 -628387 -452481 -150020
7751 -150020 -1083734 -1559788 -1366103 -1562326 -1763186 -1010234 -682797 -55363 -978235 -1337096
7741 -1337096 -2056652 -2028836 -2814784 -1713075 -1671036 -2240620 -1371064 -285859 -773152 -1494429
7731 -1494429 -341482 -522182 -464061 -159984 -1138588 -1743454 -2366029 -1674835 -1758973 -1164347
7721a164347L43326j209077O18905R11704M38003L78157p72364Q75661p16813
7712b96845P65040p7766o90836p88958l04921J912699j14204m38381L33998K20851
7702E20677J76437l8078p85807k12523J139860k146459r25455j16366O37008Q18837
7692i31869o6975K79991r96675m3218M64432J29486K9577J425401j41736r33152
7682g84738m11048K96470O28119k56576M62363l14684L45562l10536j252172P25454
7672h71786m78621L48973P53886j043891j271815J056701r20726N44431J823655
7663e9193R22546J93280o47649m70657p692N25191j330538K9912m90338j13151
7653a448289J034330o18617N88777J018427l06891l14213l33944l16284P26147
$$ plain form
7721 -1164347 -821021 -2030098 -1411193 -499489 -61486 316671 -455693 419968 -296845
7712 -296845 468195 390429 -300407 -1089365 -1394286 518413 404209 -34172 299826 520677
7702 520677 697114 659036 -126771 -339294 800566 -1345893 -2271348 -2387714 -1750706 -931869
7692 -931869 -998844 -718853 -1715528 -1758746 -1294314 -1164828 -1135251 290150 148414 -784738
7682 -784738 -1195786 -899316 -271197 -527773 -65410 -380094 -34532 -345068 -1597240 -871786
7672 -871786 -1350407 -1001434 -247548 -1291439 -2563254 -1506553 -2427279 -1882848 -59193
7663 -59193 863353 1056633 408984 -61673 -69365 455826 -874712 -844800 -1335138 -1448289
7653 -1448289 -413959 -1032576 -443799 574628 267737 -46476 -380420 -696704 29443
7644B9443l84013m94510m66891R51525Q36680l05395l37609j124751j56693K26665
7634a225549L50518Q48344P40777l07676n16794j028391o16675O11534j171163
7625b315075O03416P16789L55571j44999K23916M95786J27071o72454o20712k23733
7615a454424M5650P20246Q21645p74729r10692O45320M18494k98281R22673j241960
7605a106058m9229J309819n82031j051869J21148L13755l24637n50688L32535
7596a587255J024464k02774m16611O00334p4697o69150p87204N06445L98445J65170
7586a042833N27190j14570j78409L50367q43265j053972J532487k10560N42538
7577d91027L06762K95574j459764O46500l88231O94517n99461q21746L17146M9971
$$ plain form
7644 29443 -354570 -849080 -1315971 -364446 472234 166839 -170770 -1295521 -1452214 -1225549
7634 -1225549 -875031 -26687 714090 406414 -110380 -1138771 -1755446 -1143912 -2315075
7625 -2315075 -1711659 -994870 -639299 -784298 -560382 -64596 62475 -609979 -1230691 -1454424
7615 -1454424 -1408774 -688528 133117 -641612 -1552304 -906984 -488490 -786771 135902 -1106058
7605 -1106058 -1155287 154532 -427499 -1479368 -1358220 -1044465 -1369102 -1919790 -1587255
7596 -1587255 -562791 -765565 -1182176 -581842 -656539 -1325689 -2112893 -1606448 -1208003 -1042833
7586 -1042833 -515643 -630213 -808622 -458255 -1301520 -2355492 -823005 -1033565 -491027
7577 -491027 -184265 111309 -1348455 -701955 -1090186 -395669 -995130 -1816876 -1499730 -1449759
7567a449759J80206P04632K68356P0672R0862R26057m18284j037842N70495L02612
7557B08007k01040m43011o35863M28577o31627o7671K17792J462152J180252n70749
7547I46819k55712k157404P876O81642r43119o63062J299447R44096R64663j202297
7537c77051q2153M38391p82642l95881l62742j03628J108684l73302q94181j1317
7527a835822Q99470J08758p52854l80129J852252J119112q01227m57381j398815
7518a646636o74876L71536L1373J48011k6782N96878M86199M51938K57182Q33756
7508H28579n5865l14052k23004o10167O65763j85924P48779Q948j058394M46836
7498B51499M08427k61512R1458o38225j037275J1813J74491o79256n6657L1008
$$ plain form
7567 -1449759 -1269553 -564921 -296565 -225893 -135031 791026 372742 -665100 -94605 208007
7557 208007 6967 -436044 -1071907 -643330 -1274957 -1342628 -1124836 337316 1517568 946819
7547 946819 691107 -1466297 -1458421 -776779 -1719898 -2382960 -1083513 -139417 825246 -377051
7537 -377051 -459204 -20813 -803455 -1199336 -1562078 -1665706 -557022 -930324 -1824505 -1835822
7527 -1835822 -936352 -827594 -1580448 -1960577 -108325 1010787 209560 -247821 -1646636
7518 -1646636 -2321512 -1949976 -1918603 -1770592 -1797374 -1200496 -714297 -262359 -5177 828579
7508 828579 772714 458662 235658 -374509 291254 105330 854109 863057 -195337 251499
7498 251499 659926 398414 489872 -148353 -1185628 -1173815 -999324 -1678580 -1735237 -1704229
7488a704229L22824J394988o02927j04291M49096p13348L58581Q60392k14244
7479D6842p7804k85635j30002m25628m52064O04257L96128O31609j533640j419868
7469b645805L60307J307973L05753k15875j457160N4771N75408m17621N60876
7460a571373R18292K271707r0227j491822j238375l5531J467302N18055n01587
7451B46441j41960q05303K41363R4986L25352o35338M92526j27994j689469J060584
7441i38812J447285J51275j12738j207761Q24811n79382j82302M45636l97239
7432e49227M75051q9628k411r75086N99285n1001j9009M42660J358840j719525
7422e30051j24925J34415L47558l42335m81831p58467p41769Q23883j118650P77466
$$ plain form
7488 -1704229 -1381405 13583 -589344 -693635 -244539 -957887 -599306 261086 46842
7479 46842 -30962 -316597 -446599 -872227 -1324291 -720034 -323906 307703 -1225937 -2645805
7469 -2645805 -2285498 -977525 -671772 -887647 -2344807 -2290036 -1714628 -2132249 -1571373
7460 -1571373 -653081 1618626 1528399 36577 -1201798 -1237329 229973 748028 246441
7451 246441 104481 -700822 -459459 -364473 -39121 -674459 -181933 -309927 -1999396 -938812
7441 -938812 508473 659748 547010 -660751 164060 -415322 -597624 -151988 -549227
7432 -549227 -74176 -163804 -166215 -1141301 -542016 -593017 -612026 -169366 1189474 -530051
7422 -530051 -654976 -520561 -173003 -515338 -997169 -1755636 -2497405 -1673522 -2792172 -2014706
7412b014706Q23158p24539J082411M23590L17614n10880j677561p63617J040828
7403b003702N16882L85373o39053p84271J263176o98636N19846L83730P00340
7394c56315o12581o0325P15398J081122j23139o10425Q03983M99162o78467j799389
7384a140976R23570J106200m70804r31760n10031P75201n35469R2895q7910j293842
7374b072926J428539N97522j03231p74242l48924N98058J74220J15522n03543
7365h89005l1482J396941O53363j471508p85982k7988K8209L44247p98050M75155
7355a106100J124968r38187M77490L63985r1453k77508j011632J291930R43682
7346G77175j296969o00295R5368j8611j72391P0074p67774N58076M45442o21429
$$ plain form
7412 -2014706 -1191548 -1916087 -833676 -410086 -92472 -603352 -2280913 -3044530 -2003702
7403 -2003702 -1486820 -1101447 -1740500 -2524771 -1261595 -1960231 -1440385 -1056655 -356315
7394 -356315 -968896 -1029221 -313823 767299 644160 33735 837718 1336880 658413 -1140976
7384 -1140976 -217406 888794 417990 -513770 -1023801 -248600 -784069 -691174 -779084 -2072926
7374 -2072926 -644387 -46865 -150096 -924338 -1273262 -675204 -500984 -385462 -889005
7365 -889005 -920487 476454 1129817 -341691 -1127673 -1155661 -1127452 -783205 -1581255 -1106100
7355 -1106100 18868 -919319 -441829 -77844 -169297 -446805 -1458437 -166507 777175
7346 777175 -519794 -1120089 -1024721 -1043332 -1215723 -1145649 -1913423 -1355347 -909905 -1531334
7336a531334J00207R54632r62099m99615q6416L81847J309137J109544j598778
7327h22875q22192n61023k69388O60097K27123O21536m07771P21425m25350J369266
7317B90848K60551j56259k2800K20357k13544j114140l03153J375736o96237l24032
7307f82673o05150k36831j89364J206918p8421q61599P3551N39898R68023l39564
7297b05212p61279m36057M33544M73393j21424M5559J256188J248539j121526
7288H11725j136784n85368q17684p43857M71038L14455M28309O8285p67682J309291
7278f48272n63950N05497k69684P11963P45983r63519K081J120640r70680n80768
7268i10709m86872k85050n37336N16697M96356L61577o46320k6633K38016J243734
$$ plain form
7336 -1531334 -1431127 -476495 -1438594 -1938209 -2024625 -1642778 -333641 775903 -822875
7327 -822875 -1645067 -2206090 -2475478 -1815381 -1588258 -966722 -1374493 -653068 -1078418 290848
7317 290848 551399 395140 372340 592697 379153 -734987 -1038140 337596 -358641 -682673
7307 -682673 -1287823 -1524654 -1714018 -507100 -585521 -1447120 -1373569 -833671 134352 -205212
7297 -205212 -966491 -1402548 -969004 -495611 -617035 -571476 684712 1933251 811725
7288 811725 -325059 -910427 -1728111 -2471968 -2000930 -1686475 -1258166 -1189881 -1957563 -648272
7278 -648272 -1212222 -706725 -976409 -264446 481537 -481982 -479901 640739 -329941 -910709
7268 -910709 -1397581 -1682631 -2219967 -1703270 -1206914 -845337 -1491657 -1518290 -1280274 -36540
7258c6540m09447o20537j1070m86489N4902Q61363k74182P65740N31803q36120
7248d60577j0272L66504m04364o90403r71645P97355J313992M97411j980901k54818
7238a797718P41035L24594J644937j043217n80255J5312K89779M65884M72260
7229E32611J681856n53557j778042R71617j278756J24769l45318l25740o32514
7220a603074J197266j14223m85921j179572J77448O29077j713216r93549K350425
7211a735339J783100K40594N94407k22322j013958R405k93586k64881m96896M30809
7201i68667N43728k99534r24434p27547J006733O17877p71597L5635O03920m21904
7191a305790J182063J01713k20128P81710P26184j331714p94653k68740j37629
$$ plain form
7258 -36540 -445987 -1066524 -1077594 -1564083 -1509181 -647818 -922000 -156260 375543 -460577
7248 -460577 -470849 -104345 -508709 -1199112 -2170757 -1373402 -59410 438001 -1542900 -1797718
7238 -1797718 -1056683 -732089 912848 -130369 -710624 -695312 -405533 60351 532611
7229 532611 2214467 1660910 -117132 854485 -424271 -299502 -644820 -970560 -1603074
7220 -1603074 -405808 -520031 -1005952 -2185524 -2008076 -1378999 -3092215 -4085764 -1735339
7211 -1735339 47761 288355 882762 660440 -353518 -344113 -637699 -902580 -1399476 -968667
7201 -968667 -424939 -724473 -1648907 -2376454 -1369721 -751844 -1523441 -1487806 -883886 -1305790
7191 -1305790 -123727 -22014 -242142 539568 1265752 -65962 -860615 -1129355 -1266984
7182a266984J614084j2953o96283q14119R6659N23193n47921L6936M05094m78833
7172a141127o77081J523656J32331l10562K52459p04522p37790p07346J09115
7163b260867J704886j29670k70159J371231m91468j36786m13773n17257j6586
7154a160449n48583N23849J349785j048101n11864Q29453l53795l37929O68897
7145e88737N75440q39061p43206P23867J048100q89235L82062l18386l20984R22952
7135d7188r99322J42859J01221O26319o68755j512533K286007o0804j074818L0098
7125a176916K096172q02256n94390o32167J081387J236682o96431m53847q52430
7116g94196J215209n408m488j084728o76965m99756j87011j21815J228781l56740
$$ plain form
7182 -1266984 347100 334147 -362136 -1176255 -1079596 -556403 -1104324 -1067388 -662294 -1141127
7172 -1141127 -1818208 -294552 -162221 -472783 -220324 -924846 -1662636 -2369982 -2260867
7163 -2260867 -555981 -685651 -955810 415421 -76047 -212833 -626606 -1143863 -1160449
7154 -1160449 -1709032 -1185183 164602 -883499 -1395363 -565910 -919705 -1257634 -588737
7145 -588737 -13297 -852358 -1595564 -871697 176403 -712832 -330770 -649156 -970140 -47188
7135 -47188 -1046510 -903651 -802430 -176111 -844866 -2357399 -71392 -132196 -1207014 -1176916
7125 -1176916 919256 117000 -477390 -1109557 -28170 1208512 512081 58234 -794196
7116 -794196 421013 415605 411117 -673611 -1350576 -1850332 -2037343 -2159158 -930377 -1287117
7106a287117J5505M21550k13281M38367K46152Q6119l9632m77603j52468j041808
7096b004216R5787J401745R72161o92708R44914k52160j352105k69912m04745
7087a561239J166085R59033q12731j101252l87627O89762J081520o11034J61719
7078d15764J707776k87912j69652M773r96320L09424p60719o49170J54158o9299
7068a172705K19324O823J112231j04339j33238J06008n60978J032020j106286
7059f01140L52821L32493o99400m23789r00993r5814J252806N1958M78115L15188
7049F2245k81929o93842k07650j223428M15922O638J072732m04828P39792N55112
7039D0764o97578K49340J0568m96097M8171M09758Q19232j185552l81843J810545
$$ plain form
7106 -1287117 -1271612 -850062 -1063343 -624976 -378824 -292705 -332337 -809940 -962408 -2004216
7096 -2004216 -1908429 -506684 465477 -227231 717683 465523 -886582 -1156494 -1561239
7087 -1561239 -395154 563879 -248852 -1350104 -1737731 -1047969 33551 -577483 -415764
7078 -415764 1292012 1004100 834448 839221 -157099 152325 -608394 -1257564 -1103406 -1172705
7068 -1172705 -953381 -946558 165673 61334 -71904 34104 -526874 505146 -601140
7059 -601140 -248319 84174 -615226 -1039015 -1940008 -2035822 -783016 -731058 -252943 62245
7049 62245 -219684 -913526 -1121176 -2344604 -1928682 -1922044 -849312 -1254140 -514348 40764
7039 40764 -656814 -407474 -396906 -893003 -844832 -435074 384158 -801394 -1183237 627308
7029F27308j310583n17496J006398j886702J76562O57616k59933J38107O10407
7020g58316Q85144j384827l5197J587211L45906j308806r59994N16152J40935
7011i71792M20651l00977N10257J034177q10583r75435L49919P4559j133187k01198
7001b003609J421061P75726l98464l853L53742J491793j690582p22463q77698
6992a654347O30825K74066L03213q76459L96226M65920M70737n25300P25517M52254
6982F62652o14722o63554N68179m08008j63165O63401J97124L08609l13718j157907
6972i21109Q92572p87838P49634j03311q25900k19768n60078K76559J80323R79042
6962c39874M6285p89538M72722J989260q4759o43242j369706K97013n2726N74579
$$ plain form
7029 627308 -683275 -1200771 -194373 -2081075 -1904513 -1246897 -1506830 -1368723 -758316
7020 -758316 126828 -1257999 -1293196 294015 639921 -668885 -1628879 -1112727 -971792
7011 -971792 -551141 -852118 -341861 692316 -118267 -1093702 -743783 -669224 -1802411 -2003609
7001 -2003609 -582548 193178 -205286 -209139 144603 1636396 -54186 -776649 -1654347
6992 -1654347 -1023522 -749456 -446243 -1322702 -926476 -460556 10181 -515119 210398 662652
6982 662652 47930 -615624 -47445 -455453 -618618 44783 241907 550516 236798 -921109
6972 -921109 -28537 -816375 -66741 -170052 -995952 -1215720 -1775798 -1499239 -1318916 -339874
6962 -339874 -293589 -1083127 -610405 1378855 1294096 650854 -718852 -421839 -474565 100014
6952A00014k31686j45503n7135n37086L67004J165849Q16025N06408j390210M03707
6942I97387m4446q31861N27128k12257k006053Q33012J824615r91213j46616L77137
6932C26833j25616q13227J704326J96984j172128N03122J271851m99204j396462
6923c521l3797r454M56525J314595k40264j032081o98760M18643R28921N0870
6913A151677k72935O18654M09276M92490N53234j143141K93728J40079j397079
6904H45983J691024j261141l85930M41272j033604K60605j19180L1346j607848
6895a137473J041866j10142r2612M48305K93358r76600N84327k55507n60900k30629
6885i96007R72372j899013J83335J887131o09086K92005O93059N79664r30836
$$ plain form
6952 100014 -131672 -277175 -334310 -871396 -504392 661457 1477482 1983890 593680 997387
6942 997387 952941 121080 648208 435951 -1570102 -737090 1087525 96312 -50304 326833
6932 326833 201217 -612010 1092316 1289300 117172 620294 1892145 1392941 -3521
6923 -3521 -37318 -46772 409753 1724348 1484084 452003 -246757 171886 1100807 1151677
6913 1151677 878742 1497396 1906672 2399162 2952396 1809255 2102983 2243062 845983
6904 845983 2537007 1275866 889936 1331208 297604 558209 439029 470375 -1137473
6895 -1137473 -95607 -205749 -298361 149944 443302 -533298 51029 -204478 -765378 -996007
6885 -996007 -23635 -1922648 -1739313 147818 -461268 -169263 523796 1103460 172624
6876A72624L6765j331739K20592k6487j80172J424670L23599k19499m68465j867980
6866a916092l56667Q611Q76803J040949k68403o67398J897922N10247k106305
6857i80333N15424J69223K56303n13760J13573R47413O50534Q9262p62481l85772
6847I9386n67337p21907J741099M15555M36345q82419j116296l47545Q69152K79671
6837B05704O00448R38418l86090j12096q61670j669950l12312J363033J952153
6828A717638O0150q22129p60176k35666J51710m48176J80781J239069J93714j008642
6818B68273L953o24024k86786M20137O50057m87057j021722l80327m89533J236101
6808g10928O47222p55609J999846r57829m06982l96566q22043m74881J009222
$$ plain form
6876 172624 209389 -1122350 -901758 -928245 -1108417 316253 639852 420353 -48112 -1916092
6866 -1916092 -2272759 -2264148 -1387345 -346396 -614799 -1282197 615725 1125972 -980333
6857 -980333 -464909 -295686 -39383 -553143 -439570 507843 1158377 1247639 485158 99386
6847 99386 -467951 -1189858 551241 966796 1403141 520722 -595574 -943119 -73967 205704
6837 205704 806152 1744570 1358480 1246384 384714 -1285236 -1597548 -234515 1717638
6828 1717638 1777788 955659 195483 -40183 111527 -336649 -155868 1083201 1276915 268273
6818 268273 272226 -351798 -638584 -218447 431610 -55447 -1077169 -1457496 -1947029 -710928
6808 -710928 -63706 -819315 1180531 222702 -184280 -580846 -1402889 -1877770 -868548
6799h68548p9424M58602o68631K08209N38025p59090Q43647q2988q75486J005995
6789b79689N22767l68647p54869rJ216822j625469J019632P54154O13131O8150
6779A165973l1738o68407p67064m77692j191680r8229k2651J027427L70956j4301
6769g07406p29987J850816J175003j328464m52300j106616O21767K34792r97411
6760a439806O05443M75251L23148M97650n9669r80967k0966n79274N61621j010350
6750a627919l86337O65638K64794J143211O60513q43772N51285j237864q60139
6741a670590Q37562K41511J43430M81717j65011o42873N7897n93364L97277O27256
6731b85188K91938J646393p2428j212630o06327j036865J646751J157126l62985
$$ plain form
6799 -868548 -947972 -489370 -1158001 -949792 -411767 -1170857 -327210 -410198 -1285684 -279689
6789 -279689 243078 -125569 -880438 -880447 336375 -1289094 -269462 484692 1097823 1165973
6779 1165973 1134235 465828 -301236 -778928 -1970608 -2068837 -2091488 -1064061 -693105 -707406
6769 -707406 -1437393 413423 1588426 259962 -192338 -1298954 -677187 -442395 -1439806
6760 -1439806 -834363 -359112 -35964 461686 402017 -578950 -599916 -1179190 -617569 -1627919
6750 -1627919 -2014256 -1348618 -1083824 59387 719900 -123872 427413 -810451 -1670590
6741 -1670590 -833028 -591517 -448087 33630 -131381 -774254 -716357 -1309721 -912444 -285188
6731 -285188 6750 1653143 1580715 368085 -238242 -1275107 371644 1528770 1165785
6722A165785j504818J01423k57479K40217N14664n70421q65168Q39649O61572
6713C25424n26600l39456q8411O92828P6847l48386j32170K04623O51999r636
6703E07062j250702j102374J766107n84156K9340O82802K06663n15913p4858m33053
6693g69082P54856K46295j452432M44325J04346q36443Q38939O07609J03099m72135
6683d30623k581807Q4483J778628J373177m30855K21683r44824l07619J562636
6674C24879k8237j424031R7490J02877J58455J86960q1681p53865J12102J576218
6664B71167k40701J16904l8250p54777l78356P06806k31042q70852J22043J337215
6654D0157o75907j218935Q37146m39590k59995J176178j80158j63848K43385K03442
$$ plain form
6722 1165785 -339033 -237610 -495089 -254872 259792 -310629 -1175797 -336148 325424
6713 325424 -201176 -540632 -629043 63785 140632 -207754 -339924 -135301 516698 507062
6703 507062 -743640 -1846014 -79907 -664063 -634723 48079 254742 -261171 -336029 -769082
6693 -769082 -14226 232069 -1220363 -776038 -671692 -1508135 -669196 -61587 41512 -430623
6683 -430623 -3012430 -2927947 -1149319 223858 -206997 14686 -930138 -1237757 324879
6674 324879 296642 -1127389 -1029899 -927022 -768567 -581607 -663288 -1417153 -1305051 271167
6664 271167 30466 147370 109120 -645657 -1024013 -317207 -548249 -1419101 -1297058 40157
6654 40157 -635750 -1854685 -1017539 -1457129 -1717124 -540946 -721104 -884952 -641567 -438125
6644d38125L35156m05295m75320K07804n75203m58428p0496J8955j61286J279267
6634g42971J263162n28617r05841L75735j18525p70425M28569J14320N00517Q99097
6624E15021R77262r57760j190127n62346J569818k29652n20757r07405l64024
6615a669970J38614O03133N98599j375021m96118N63525J412992L52380o53433
6606e25299q26700N55637J825553m41396j201343P41071L22217O7657k17268P017
6596C07146l74797p83668J83926n81962L57735l50324P96155L91469n39040J023110
6586D29750k35037J42279R72563j400228m50765L8804j28217N5264j169368n23898
6576b268853R04861Q68779j11925K61041q67738L16927P22556p46093n74503J265680
$$ plain form
6644 -438125 -102969 -508264 -983584 -775780 -1350983 -1809411 -1879907 -1860952 -2022238 -742971
6634 -742971 520191 -8426 -914267 -538532 -657057 -1427482 -998913 -884593 -384076 515021
6624 515021 1492283 534523 -655604 -1217950 351868 122216 -398541 -1305946 -1669970
6615 -1669970 -1531356 -928223 -329624 -1704645 -2200763 -1637238 -224246 128134 -525299
6606 -525299 -1351999 -796362 1029191 587795 -613548 127523 449740 517397 300129 307146
6596 307146 -67651 -851319 -667393 -1249355 -891620 -1241944 -445789 -54320 -593360 429750
6586 429750 194713 336992 1309555 -90673 -541438 -502634 -630851 -575587 -1744955 -2268853
6576 -2268853 -1363992 -495213 -607138 -346097 -1213835 -896908 -174352 -920445 -1494948 -229268
6566b29268p53899l37922j84569L43881N04067q0321K03511J46261m20670m54063
6556a262992K93881O3371M09340N69940j185667P73241J126490j328318q46869
6547a387583L62200R69501K02455o92585P83796O95609j101108o19568k71788
6538a059071M54033n45582L4847j43326M03237O73442j8306L21624j375179J069166
6528a85115j81569j600948K20907J62796m4575n08117O51549M7191J126505K64968
6518d6408j55623L47135l41368j530378K025543r29474m85361K20622l72936Q0016
6508a188232R70779J31471L71600j441678j005256M05054k10012J557501n3418
6499d62191J477194j126174q45339J3523N16286q32955J308844j123796q0482
$$ plain form
6566 -229268 -983167 -1321089 -1505658 -1161777 -657710 -738031 -534520 -388259 -808929 -1262992
6556 -1262992 -969111 -905740 -496400 73540 -1112127 -338886 787604 -540714 -1387583
6547 -1387583 -1025383 -55882 146573 -546012 237784 933393 -167715 -787283 -1059071
6538 -1059071 -605038 -1150620 -1115773 -1259099 -855862 -182420 -200726 120898 -1254281 -185115
6528 -185115 -366684 -1967632 -1746725 -1583929 -1628504 -2136621 -1485072 -1437881 -311376 -46408
6518 -46408 -202031 145104 -196264 -1726642 298901 -630573 -1115934 -895312 -1268248 -1188232
6508 -1188232 -217453 -85982 285618 -1156060 -2161316 -1756262 -1966274 -408773 -462191
6499 -462191 1015003 -111171 -956510 -942987 -426701 -1259656 49188 -1074608 -1155090
6490a155090J631379O97483j080400j006043L09175M77158N17150j209596j195468
6481b014252n39043J829551k20394j314967k08676K411106n44496o98365J328347
6472B8811j103196j18179M98639q18298R4379J540604n26021m40483n23073j315199
6462b682016m5980K219624O98527p8069j014469q3089O76002N94598p86814j075629
6452a577315Q19999M98295J349473r66885j056809m56055M81716m33864m52784
6443a794229O40077J290509k42381J6194j081034k31003M5315M01851N89120j018407
6433a383988l5785L99574j768719j76602O37025J023902M99968l4582l66329N79031
6423f26505j71231l95348J054124O6114Q08488L14205L18766r50594l56815n77898
$$ plain form
6490 -1155090 476289 1173772 93372 -912671 -603496 -126338 390812 -818784 -2014252
6481 -2014252 -2553295 -723744 -944138 -2259105 -2467781 -56675 -601171 -1299536 28811
6472 28811 -1074385 -1192564 -693925 -1512223 -1417844 122760 -403261 -843744 -1366817 -2682016
6462 -2682016 -2727996 -508372 190155 112086 -902383 -985472 -309470 285128 -501686 -1577315
6452 -1577315 -757316 -259021 1090452 123567 -933242 -1389297 -907581 -1341445 -1794229
6443 -1794229 -1154152 136357 -106024 -89830 -1170864 -1401867 -1356552 -954701 -365581 -1383988
6433 -1383988 -1419773 -1020199 -2788918 -2965520 -2328495 -1304593 -804625 -839207 -1205536 -626505
6423 -626505 -797736 -1193084 -138960 -72846 735642 1049847 1368613 418019 61204 -516694
6413e16694l11096m69741J566676n33682J45181K25721R73681m50282k70822L12653
6403F71595j117150J9594P12370j646085K14819J251922Q5634k00139l2883r85073
6393a025396j56166q09662O77289J168725M925K85003m73952M02612m75464J92078
6383b10008K38410m5055o19974N22558L80291L82236j49432O87358l51107l6409
6373G98868o32384o0411q1237n51971r46913L6005j042766J224741K157124P7251
6363I78307j600890P68260J023618j012301k55442p96614Q86660p22506n51622
6354a282530K04380L16015J532852N2438k22260K62119r97537L71284o19766m59430
6344h42435M01735j228307j99506R05561l0201k3508q3350M79778l48637k51720
$$ plain form
6413 -516694 -827790 -1297531 269145 -264537 -119356 106365 1080046 629764 358942 671595
6403 671595 -445555 -425961 286409 -1359676 -1144857 107065 192699 -7440 -40323 -1025396
6393 -1025396 -1181562 -1991224 -1313935 -145210 -140285 144718 -329234 73378 -402086 -210008
6383 -210008 28402 -16653 -636627 -114069 266222 648458 499026 1186384 835277 798868
6373 798868 166484 106073 24836 -527135 -1474048 -1438043 -2480809 -1256068 901056 978307
6363 978307 -622583 145677 1169295 156994 -98448 -895062 -8402 -730908 -1282530
6354 -1282530 -1078150 -762135 770717 823155 600895 863014 -134523 236761 -383005 -842435
6344 -842435 -440700 -1669007 -1868513 -962952 -993153 -1016661 -1100011 -620233 -968870 -1220590
6334a220590R87638j75828N64376n42532n56734R60734M89562j004042j019183
6325a516599j35158p05016J397596R75270N91763k00579l90705n49517j306711
6316a839656N90732O11498k19652j55337J190666m2071j70464n80268l43616o87611
6306a645779J280958O44092k403499K08386Q76364Q02369n53488O15850J326926
6297A152179k107160K43616J009474r15798k40072J94724L23791Q45637P71269
6288A277660o99415m0901p89609P41044m50680L76275k79223K08673j998296J16418
6278a538054J002267L89555J064715o19890J291377O35102j923049l69969M54376
6269C86430o62194M20102J398631j001686p50443J989323k457616o46926Q362
$$ plain form
6334 -1220590 -232952 -408780 155596 -386936 -943670 17064 506626 -497416 -1516599
6325 -1516599 -1651757 -2356773 -959177 16093 607856 407277 16572 -532945 -1839656
6316 -1839656 -1248924 -637426 -857078 -1012415 178251 136180 -34284 -614552 -958168 -1645779
6306 -1645779 -364821 279271 -2124228 -1915842 -1039478 -237109 -790597 -174747 1152179
6297 1152179 -954981 -711365 298109 -617689 -857761 -663037 -339246 506391 1277660
6288 1277660 578245 537344 -252265 488779 38099 414374 135151 343824 -1654472 -1538054
6278 -1538054 -535787 -146232 918483 298593 1589970 2225072 302023 -67946 386430
6269 386430 -275764 144338 1542969 541283 -209160 1780163 -677453 -1324379 -1316017
6260a316017J93940K34761q942J351648L60280r79254l2321o97004l1267J847746
6250I23570k10780j831560p89070P52692K218277n19100l17617O25478L50333
6241A202223N4303j732660j107575N73052J78463J360679L18368L32684j096503
6232H3034N3306r9225m52147o98163J655016J637332l09091j94571m38922J91881
6222A428450p47429J225J691686j279944l24503Q24528j41234p81715j603082
6213i32018J64159J079791J540370q57301N30298k65293j768057L84441P23957
6204F00347o70574Q00738l41623k09220L32307k31916J92950L85055K05245j40256
6194I23053m35001J302783q91697p06495j243732J011378J360864P34154j4697
$$ plain form
6260 -1316017 -1122077 -887316 -896258 455390 815670 -163584 -195905 -892909 -924176 923570
6250 923570 712790 -1118770 -1907840 -1155148 1063129 544029 226412 851890 1202223
6241 1202223 1256526 -476134 -1583709 -1010657 -832194 528485 846853 1179537 83034
6232 83034 136340 37115 -415032 -1113195 541821 2179153 1870062 1675491 1236569 1428450
6222 1428450 681021 682246 2373932 1093988 769485 1594013 1452779 671064 -932018
6213 -932018 -767859 311932 1852302 995001 1525299 1260006 -508051 -123610 600347
6204 600347 -70227 730511 388888 179668 511975 280059 473009 858064 1063309 923053
6194 923053 488052 1790835 899138 192643 -1051089 -39711 1321153 2055307 2040610
6185B040610J29043r29018j089309M37347J832404j94403j227306J103593O15894
6176B718855K35199j639433R95716R80733M47451j493996L11428m48070J108333
6167C216216J52599m96115l47539k20104J195159J53787O10565L3055P99809j042380
6157D055052j340044j10731J352392M02141m62278n95252K28993J015271k56828
6148D288716o29754k5056J17022O03741p85715O47080O70617J063895j055242
6139D895304P59982J62944l34226Q00522l1618J042357P83039j269958m12362
6130F395984o09395M17312J84888p95363L49829J77221L7232j232547R10090j59022
6120E676229l24586p46239M1535j6847l18145O9481Q72948l72827p8032J86864
$$ plain form
6185 2040610 2169653 1240635 151326 588673 2421077 2226674 999368 2102961 2718855
6176 2718855 2954054 1314621 2310337 3291070 3738521 2244525 2555953 2107883 3216216
6167 3216216 3368815 2872700 2525161 2305057 3500216 3654003 4264568 4297623 5097432 4055052
6157 4055052 2715008 2604277 3956669 4358810 3896532 3301280 3530273 4545544 4288716
6148 4288716 3658962 3633906 3750928 4354669 3568954 4216034 4886651 5950546 4895304
6139 4895304 5655286 5818230 5484004 6284526 6252908 7295265 8078304 6808346 6395984
6130 6395984 5786589 6203901 6388789 5593426 5943255 6120476 6157708 4925161 5835251 5676229
6120 5676229 5351643 4605404 4646939 4630092 4311947 4381428 5254376 4881549 4803517 4990381
6110D990381J068695M67813j892858J445667j042235j242174L52139j40213M43531
6101D450746O0204j577553Q00223j42292j111127O79139j02245k74312j368574
6092A414209J829226K90643j136538L68099n18227j588299K9951J056137n21522
6083A223679N74202P47842j96581N38729J190J54423o81315m0825o12571K96629
$$ plain form
6110 4990381 6059076 6526889 4634031 6079698 5037463 3795289 4147428 4007215 4450746
6101 4450746 4510950 2933397 3733620 3591328 2480201 3159340 3057095 2782783 1414209
6092 1414209 3243435 3534078 2397540 2765639 2247412 659113 689064 1745201 1223679
6083 1223679 1797881 2545723 2349142 2887871 2889061 3043484 2362169 2321344 1708773 2005402
$$ [...]
##END NTUPLES=NMR SPECTRUM
##END=
