##TITLE=1H_CG-1199-3
 CDCl3
 8 sc, 
 8.4.2024
##JCAMPDX= 6.0         $$ Bruker NMR JCAMP-DX V2.0
##DATA TYPE= NMR SPECTRUM
##DATA CLASS= NTUPLES
##ORIGIN= UXNMR, Bruker Analytische Messtechnik GmbH
##OWNER= root
$$ XWIN-NMR		Version 3.5
$$ Mon Apr  8 13:59:40 2024 Russian Standard Time (UT+4h)  she@DPX200
##.OBSERVE FREQUENCY= 200.1309
##.OBSERVE NUCLEUS= ^1H
##.ACQUISITION MODE= SIMULTANEOUS
##.ACQUISITION SCHEME= undefined
##.AVERAGES= 8
##.DIGITISER RES= 18
##SPECTROMETER/DATA SYSTEM= spect
##.PULSE SEQUENCE= zg30
##.SOLVENT NAME= CDCl3
##.SHIFT REFERENCE= (INTERNAL, CDCl3, 0, 15.6852)
##AUDIT TRAIL= $$ (NUMBER, WHEN, WHO, WHERE, WHAT)
$$ ##TITLE= Audit trail, XWIN-NMR		Version 3.5
$$ ##JCAMPDX= 5.01
$$ ##ORIGIN= Bruker BioSpin GmbH
$$ ##OWNER= she
$$ F:/spectra/data/she/nmr/H-F/1/pdata/1/auditp.txt
$$ ##AUDIT TRAIL=  $$ (NUMBER, WHEN, WHO, WHERE, WHAT)
(   1,<2024-04-08 13:58:08.98 +0400>,<she>,<DPX200>,
      <created by zg, POWCHK disabled, PULCHK disabled
       configuration hash MD5:
       00 E9 B6 7A A2 85 ED C7 34 08 36 98 17 FE 4E 26
       data hash MD5: 16K
       93 36 59 CA EE 06 CC 92 FF A0 C6 DC 7C 0D E0 CA>)
(   2,<2024-04-08 13:58:13.39 +0400>,<she>,<DPX200>,
      <Start of raw data processing
       efp BC_mod = 2 LB = 0.24 FT_mod = 6 PKNL = 1 PHC0 = -25302.08 PHC1 = 17.58731 SI = 16K 
       data hash MD5: 16K
       97 20 9B BB FA 3D 91 63 E8 F3 DB 6C 19 44 D5 AB>)
(   3,<2024-04-08 13:58:31.45 +0400>,<she>,<DPX200>,
      <pk PHC0 = 1.505308 PHC1 = -6.2 
       data hash MD5: 16K
       91 44 0B D6 9E 61 3F 9B 99 0A B1 A1 8D B6 7C AC>)
(   4,<2024-04-08 13:58:35.57 +0400>,<she>,<DPX200>,
      <abs ABSG = 5 
       data hash MD5: 16K
       2D 26 D2 65 3B 85 4B 6C F2 70 F4 0A 32 17 91 D1>)
$$ ##END=
$$ 
$$ hash MD5
$$ 2C 1E 21 F5 73 5E 08 3C 4E CF 6E 70 C2 7A 0C C3
##$RELAX= 
##$RELAX= 
##$RELAX= 
##$RELAX= 
##$RELAX= 
##$RELAX= 
$$ Bruker specific parameters
$$ --------------------------
##$DU= <F:/spectra>
##$EXPNO= 1
##$NAME= <H-F>
##$PROCNO= 1
##$TYPE= <nmr>
##$USER= <she>
##$AMP= (0..31)
100 100 100 100 100 100 100 100 100 100 100 100 100 100 100 100 100 100 
100 100 100 100 100 100 100 100 100 100 100 100 100 100 
##$AQSEQ= 0
##$AQ_mod= 1
##$AUNM= <au_zg>
##$AUTOPOS= <>
##$BF1= 200.13
##$BF2= 200.13
##$BF3= 200.13
##$BF4= 200.13
##$BF5= 200.13
##$BF6= 200.13
##$BF7= 200.13
##$BF8= 200.13
##$BYTORDA= 1
##$CFDGTYP= 0
##$CFRGTYP= 5
##$CHEMSTR= <none>
##$CNST= (0..31)
1 1 145 1 1 1 1 1 1 1 1 1 1 1 1 1 1 1 1 1 1 1 1 1 1 1 1 1 1 1 1 1 
##$CPDPRG= <>
##$CPDPRG1= <>
##$CPDPRG2= <>
##$CPDPRG3= <>
##$CPDPRG4= <mlev>
##$CPDPRG5= <mlev>
##$CPDPRG6= <mlev>
##$CPDPRG7= <mlev>
##$CPDPRG8= <mlev>
##$CPDPRGB= <>
##$CPDPRGT= <>
##$D= (0..31)
0 1.2 0 0 0 0 0 0 0 0.06 0 0.03 0 0 0 0 0.0002 0 0 0 0 0 0 0 0 0 0 0 0 
0 0 0 
##$DATE= 1712570288
##$DBL= (0..7)
120 120 120 120 120 120 120 120 
##$DBP= (0..7)
150 150 150 150 150 150 150 150 
##$DBP07= 0
##$DBPNAM0= <>
##$DBPNAM1= <>
##$DBPNAM2= <>
##$DBPNAM3= <>
##$DBPNAM4= <>
$$ [...]
##$SUBNAM3= <"">
##$SUBNAM4= <"">
##$SUBNAM5= <"">
##$SUBNAM6= <"">
##$SUBNAM7= <"">
##$SUBNAM8= <"">
##$SUBNAM9= <"">
##$SW= 18.0517689322627
##$SWIBOX= (0..15)
0 0 2 0 0 0 0 0 0 0 0 0 0 0 0 0 
##$SW_h= 3612.71676300578
##$TD= 16384
##$TD0= 1
##$TE= 0
##$TE2= 300
##$TE3= 300
##$TEG= 300
##$TL= (0..7)
0 120 120 120 120 120 120 120 
##$TP= (0..7)
150 150 150 150 150 150 150 150 
##$TP07= 0
##$TPNAME0= <>
##$TPNAME1= <>
##$TPNAME2= <>
##$TPNAME3= <>
##$TPNAME4= <>
##$TPNAME5= <>
##$TPNAME6= <>
##$TPNAME7= <>
##$TPOAL= (0..7)
0.5 0.5 0.5 0.5 0.5 0.5 0.5 0.5 
##$TPOFFS= (0..7)
0 0 0 0 0 0 0 0 
##$TUNHIN= 0
##$TUNHOUT= 0
##$TUNXOUT= 0
##$USERA1= <user>
##$USERA2= <user>
##$USERA3= <user>
##$USERA4= <user>
##$USERA5= <user>
##$V9= 5
##$VALIST= <valist>
##$VCLIST= <CCCCCCCCCCCCCCC>
##$VD= 0
##$VDLIST= <DDDDDDDDDDDDDDD>
##$VPLIST= <PPPPPPPPPPPPPPP>
##$VTLIST= <TTTTTTTTTTTTTTT>
##$WBST= 1024
##$WBSW= 4
##$XGAIN= (0..3)
0 0 0 0 
##$XL= 0
##$YL= 0
##$YMAX_a= 332775
##$YMIN_a= -396913
##$ZGOPTNS= <>
##$ZL1= 120
##$ZL2= 120
##$ZL3= 120
##$ZL4= 120
##$ABSF1= 15.61581
##$ABSF2= -2.436077
##$ABSG= 5
##$ABSL= 3
##$ALPHA= 0
##$AQORDER= 0
##$ASSFAC= 0
##$ASSFACI= 0
##$ASSFACX= 0
##$ASSWID= 0
##$AUNMP= <proc_1d>
##$AZFE= 0.1
##$AZFW= 0.1
##$BCFW= 0
##$BC_mod= 2
##$BYTORDP= 0
##$COROFFS= 0
##$CY= -3
##$DATMOD= 1
##$DC= 0
##$DFILT= <>
##$DTYPP= 0
##$F1P= 0
##$F2P= 0
##$FCOR= 1
##$FTSIZE= 16384
##$FT_mod= 6
##$GAMMA= 0
##$GB= 0
##$INTBC= 1
##$INTSCL= 3.70164e-10
##$ISEN= 128
##$LB= 0.24
##$LEV0= 0
##$LPBIN= 0
##$MAXI= 10000
##$MC2= 0
##$MEAN= 0
##$ME_mod= 0
##$MI= 1.114404
##$NCOEF= 0
##$NC_proc= -7
##$NLEV= 6
##$NOISF1= 3.799351
##$NOISF2= 2.8
##$NSP= 0
##$NTH_PI= 0
##$NZP= 0
##$OFFSET= 15.68522
##$PC= 1
##$PHC0= -25300.57
##$PHC1= 11.38731
##$PH_mod= 1
##$PKNL= yes
##$PPARMOD= 0
##$PSCAL= 0
##$PSIGN= 0
##$REVERSE= no
##$SF= 200.129567281573
##$SI= 16384
##$SIGF1= 3
##$SIGF2= 2
##$SINO= 5.538805
##$SIOLD= 16384
##$SREGLST= <1H.CDCl3>
##$SSB= 0
##$STSI= 16384
##$STSR= 0
##$SW_p= 3612.71676300577
##$SYMM= 0
##$S_DEV= 0
##$TDeff= 16384
##$TDoff= 0
##$TI= <>
##$TILT= no
##$TM1= 0
##$TM2= 0
##$TOPLEV= 0
##$USERP1= <user>
##$USERP2= <user>
##$USERP3= <user>
##$USERP4= <user>
##$USERP5= <user>
##$WDW= 1
##$XDIM= 16384
##$YMAX_p= 416936012
##$YMIN_p= -763004
$$ End of Bruker specific parameters
$$ ---------------------------------
##NTUPLES= NMR SPECTRUM
##VAR_NAME=  FREQUENCY,     SPECTRUM/REAL,   SPECTRUM/IMAG
##SYMBOL=    X,             R,               I
##VAR_TYPE=  INDEPENDENT,   DEPENDENT,       DEPENDENT
##VAR_FORM=  AFFN,          ASDF,            ASDF
##VAR_DIM=   16384,         16384,           16384
##UNITS=     HZ,            ARBITRARY UNITS, ARBITRARY UNITS
##FACTOR=    0.220516191357247, 1,           1
##FIRST=     3139.07624422768, 0,            0
##LAST=      -473.640518778087, 0,           0
##MIN=       -473.640518778087, -763004,     0
##MAX=       3139.07624422768, 416936012,    0
$$ Real data points
##PAGE= N=1
##DATA TABLE= (X++(R..R)), XYDATA
$$ [...]
5986E7515464k206395k740861k570758k623731k155213j827612j102758q38786
$$ 57515464 55309069 52568208 49997450 47373719 45218506 43390894 42288136 41449350
5978D1449350R6338L67112P18643J847828K206009L059056L469018M547582N694706
$$ 41449350 41545688 41912800 42631443 44479271 46685280 49744336 53213354 57760936 63455642
5969F3455642O725547P246688P290063O532511N041349K805146J19985l552890
$$ 63455642 70181189 77427877 84717940 91250451 96291800 99096946 99216931 95664041
5961I5664041o236711p462759q243595p593031o664810n530225m385103l244270
$$ 95664041 89427330 81964571 73720976 66127945 59463135 53932910 49547807 46303537
5953D6303537k336285k188072j159899k18916P4547K27777J123009J695503K402219
$$ 46303537 43967252 41779180 40619281 40400365 40474912 40702689 41825698 43521201 45923420
5944D5923420K777867L258784L096033K769831J823623P41142k52757k303748
$$ 45923420 48701287 51960071 55056104 57825935 59649558 60390700 60137943 57834195
5936E7834195l644689l725793l649767m055783l795873l453119l360962k825238
$$ 57834195 54189506 50463713 46813946 42758163 38962290 35509171 32148209 29322971
5928B9322971k209591j624761j373829j585857j054729j021271p86939m40008
$$ 29322971 27113380 25488619 24114790 22528933 21474204 20452933 19665994 19225986
5920A9225986r77292n66613l77189J25805k85496o27047k29138K66181K61401
$$ 19225986 18248694 17682081 17304892 17430697 17145201 16518154 16289016 16555197 16816598
5911A6816598J63515L71268J53745M92138Q03195P78241M57762P90759J026796
$$ 16816598 16980113 17351381 17505126 17997264 18800459 19578700 20036462 20827221 21854017
5902B1854017J543702J357072N37666p19680j299125j512339j085172j132555
$$ 21854017 23397719 24754791 25292457 24572777 23273652 21761313 20676141 19543586
5894A9543586q25245p11216m39171m54300l88672k84929j16868l39601O3151L25230
$$ 19543586 18718341 18007125 17567954 17113654 16724982 16440053 16323185 15983584 16046735 16371965
5884A6371965K11978O42153O37360P85877j00899L00397N34622Q06442Q93323
$$ 16371965 16583943 17226096 17863456 18649333 18548434 18848831 19383453 20189895 21083218
5875B1083218J057367J119561J623331J423715J695401J249310J124513J31895
$$ 21083218 22140585 23260146 24883477 26307192 28002593 29251903 30376416 30508311
5867C0508311j387579k172580k792690k039690j163466q19360p81627p36564j4956
$$ 30508311 29120732 26948152 24155462 22115772 20952306 20132946 19351319 18614755 18599799
5858A8599799J30625J53671J19462J72551J02957M98965J219585J011951J101875
$$ 18599799 18730424 18884095 19003557 19176108 19279065 19778030 20997615 22009566 23111441
5849B3111441J647684J852375J802006K102782J985444J212497N57610l73730
$$ 23111441 24759125 26611500 28413506 30516288 32501732 33714229 34271839 33898109
5841C3898109j380188k250891k144316j457092r32265p38412j392396j336081
$$ 33898109 32517921 30267030 28122714 26665622 25733357 24994945 23602549 22266468
5833B2266468q68088o80425p46600m82254m93946R6547J98184L90993R47164Q45256
$$ 22266468 21398380 20717955 19971355 19489101 18995155 19091702 19289886 19680879 20628043 21473299
5823B1473299P53298Q66733P90848J506417J075075J208513R08292j2235o31434
$$ 21473299 22226597 23093330 23884178 25390595 26465670 27674183 28582475 28570240 27938806
5814B7938806j254772j352019j150316j473329r80097q13079k26203m44969q9050
$$ 27938806 26684034 25332015 24181699 22708370 21728273 20915194 20688991 20244022 20154972
5805B0154972O12326K64090N01368Q77811Q02522J309014J037852J375340J716122
$$ 20154972 20767298 21031388 21532756 22410567 23213089 24522103 25559955 26935295 28651417
5796B8651417R40468R65670J02561m42333j154685j108916j120747j308062j581763
$$ 28651417 29591885 30557555 30660116 30217783 29063098 27954182 26833435 25525373 23943610
5787B3943610o06180m93215n01711m5565N2670k43418M47401O82740N61470J058509
$$ 23943610 23337430 22844215 22342504 22296939 22349609 22106191 22553592 23236332 23797802 24856311
5777B4856311J298030J842373K259454K539687K991376L232193L599925K753405
$$ 24856311 26154341 27996714 30256168 32795855 35787231 39019424 42619349 45372754
5769D5372754J215894j72460j581734k696236l374934l004247k138441j778251
$$ 45372754 46588648 46416188 44834454 42138218 38763284 35759037 33620596 31842345
5761C1842345j218962q64754o78303n27097p19793l36322l27754j1262O04457
$$ 31842345 30623383 29758629 29080326 28553229 27833436 27497114 27169360 27158098 27762555
5752B7762555L11508R49493J259551J499167J979977K055022K143063K189388
$$ 27762555 28074063 29023556 30283107 31782274 33762251 35817273 37960336 40149724
5744D0149724K469952K139276J900770J303861J176337J191246J456624K153142
$$ 40149724 42619676 44758952 46659722 47963583 49139920 50331166 51787790 53940932
5736E3940932K666153K615226K289601J012039n1472j684328k765211l145862
$$ 53940932 56607085 59222311 61511912 62523951 62472479 60788151 58022940 54877078
5728E4877078l142831l138180k531404k184144j343636j073845m64063M093M44522
$$ 54877078 51734247 48596067 46064663 43880519 42536883 41463038 40998975 41003068 41447590
5719D1447590R85988J773161K304014K683398L829946M445998N920707P390661
$$ 41447590 42433578 44206739 46510753 49194151 53024097 57470095 63390802 70781463
5711G0781463P869067Q361739Q168618O141728L174299o47069m830032q026340
$$ 70781463 78650530 87012269 95180887 101322615 104496914 103849845 99019813 90993473
5703I0993473r345604r093890q408746o911476n557474m579870l476273k431009
$$ 90993473 81647869 72553979 64145233 57233757 51676283 47096413 43620140 41189131
5695D1189131j528049j322380o16651m17409J63511N16870J776075K027033K441598
$$ 41189131 39661082 38338702 37722051 37304642 37468153 37985023 39761098 41788131 44229729
5686D4229729L293509M117531L929295L132428J963581L62666j649492l596750
$$ 44229729 47523238 51640769 55570064 58702492 60666073 61028739 59379247 55782497
5678E5782497m840442n196268m812101m343254l760141l405976l064450k438130
$$ 55782497 50942055 45745787 40933686 36590432 32830291 29424315 26359865 23921735
5670B3921735k041994j785662j480636j099963j326333p62880o77878j025459
$$ 23921735 21879741 20094079 18613443 17513480 16187147 15424267 14746389 13720930
5662A3720930m59173j21080n93940r50872o28102l28094j55472k87328l43768
$$ 13720930 13261757 13140677 12546737 11595865 10967763 10639669 10484197 10196869 9853101
5653I853101N0308j07576K28087j7040J31057J90545J1897n35028o30102k16593
$$ 9853101 9903409 9795833 10023920 10006880 10137937 10328482 10340379 9805351 9175249 8958656
5643H958656l85483k40547l44502l08267O9662m55591l35481m16272r4671M21506
$$ 8958656 8573173 8332626 7988124 7679857 7749519 7293928 6958447 6542175 6447504 6869010
5633F869010k01439j98285J55934L7321l37691J51932p0635n4050J8212M0710
$$ 6869010 6667571 6469286 6625220 6662541 6324850 6476782 6406147 6352097 6370309 6411019
5623F411019N7665J69485M8919k92523n10706j28508j07935M753j52134n2421
$$ 6411019 6468684 6638169 6687088 6394565 5883859 5755351 5647416 5652169 5500035 5447614
5613E447614m02333l60748j61024J59927N5022K3138J33623J13887j54769j14848
$$ 5447614 5045281 4684533 4523509 4683436 4738458 4761596 4895219 5009106 4854337 4739489
5603D739489R1622J53700j86870L88896K28757k40349j40414k34983L35005K99327
$$ 4739489 4831111 4984811 4797941 5186837 5415594 5175245 5034831 4799848 5134853 5434180
5593E434180l79108n5950k21019J65814J58142R9728p2300J20189j6417l09500
$$ 5434180 5055072 4999122 4778103 4943917 5102059 5201787 5129487 5249676 5233259 4923759
5583D923759l66916K71912N819Q5284r7144K8220M86570l09996M1177j70502K70871
$$ 4923759 4556843 4828755 4834574 4919858 4822714 4850934 5337504 5027508 5068685 4898183 5169054
5572E169054J12830J15701j01224L57531J34729o2850p0909M6461r5732q6928
$$ 5169054 5281884 5397585 5296361 5653892 5788621 5725771 5654862 5701323 5605591 5518663
5562E518663k7339L34450p4052k88630K70184L06642j34022l703K20356K12079
$$ 5518663 5491324 5825774 5751722 5463092 5733276 6039918 5905896 5902193 6122549 6334628
5552F334628K04630q6150k71289J64682M21848J39316Q7934P7521l675j17963
$$ 6334628 6539258 6453108 6181819 6346501 6768349 6907665 6995599 7073120 7069445 6951482
5542F951482j4113J12585l8350K66845k10883L63907J67700O0150K77589Q92N50195
$$ 6951482 6937369 7049954 7011604 7278449 7067566 7431473 7599173 7659323 7936912 7937804 8487999
5531H487999q3928k60353j56090m20553k5921K36512j69338n7133K11710K82994
$$ 8487999 8404071 8143718 7987628 7567075 7541154 7777666 7608328 7551195 7762905 8045899
5521H045899J61485o0716J18097O13253K59735L67076R961N7460M7844K91621
$$ 8045899 8207384 8146668 8264765 8878018 9137753 9504829 9514790 9572250 9620094 9911715
5511I911715j42154k772J24095K38656J44327J29959R6327M05310L9513L91804
$$ 9911715 9769561 9766789 9890884 10129540 10273867 10403826 10500153 10905463 10944976 11336780
5501A1336780M54343k22896j61235J21388J75123j34631J29149j58454J88042
$$ 11336780 11791123 11568227 11406992 11528380 11703503 11568872 11698021 11539567 11727609
5492A1727609N71084M17069J78147J68202K08623L45568K07138J79422P1780J58763
$$ 11727609 12298693 12715762 12893909 13062111 13270734 13616302 13823440 14002862 14074642 14233405
5482A4233405o0630J13501J71665L73705L71209N20914M75307L40810J99121P98835
$$ 14233405 14172775 14286276 14457941 14831646 15202855 15723769 16199076 16539886 16739007 17537842
5472A7537842N83711N59622P63962R01500K48131L21444O11711P23819M33055
$$ 17537842 18121553 18681175 19445137 20346637 20594768 20916212 21527923 22251742 22684797
5463B2684797K68386J63159R5020O98157M14624O28785P8954Q05853J161912Q48830
$$ 22684797 22953183 23116342 23211362 23909519 24324143 24952928 25031882 25837735 26999647 27848477
5453B7848477J153261R18386J162963J655581J609415J988688K566106K707818
$$ 27848477 29001738 29920124 31083087 32738668 34348083 36336771 38902877 41610695
5445D1610695L171560L815010M262631M480976M475014M915389N119263M052677
$$ 41610695 44782255 48597265 52859896 57340872 61815886 66731275 71850538 75903215
5437G5903215L338256K542640R87311j094147k408007l600264m245714m125549
$$ 75903215 79241471 81784111 82771422 81677275 79269268 75669004 71423290 67297741
5429F7297741l109290k816001k403272j261857n04866R7322J095294J869928K318486
$$ 67297741 64188451 61372450 58969178 57707321 57202455 57299777 58395071 60264999 62583485
5420F2583485L447605L974783N029702O243332P407846Q986590J0323267J0324496
$$ 62583485 66031090 70005873 75035575 81278907 88686753 97673343 107996610 118321106
5412A18321106Q587498N883160J530325l483637p625815j0271260j0902444j0117506
$$ 118321106 126908604 132791764 134322089 130838452 123212637 112941377 102038933 91921427
5404I1921427q744035p499096o029288n097012m037791k890309k321777j401874
$$ 91921427 83177392 75678296 69649008 64551996 60514205 57623896 55302119 53900245
5396E3900245r26741q29796j68029J009673J541044K190618K569884K875463L800526
$$ 53900245 52973504 52143708 51975679 52985352 54526396 56717014 59286898 62162361 65962887
5387F5962887L669885K841767O68393j081819k649973l871554m905656m405362
$$ 65962887 69632772 72474539 73142932 72061113 69411140 65539586 60633930 56228568
5379E6228568m331085m137117l286626k703177k312257k129889j891069j847983
$$ 56228568 51897483 47760366 44473740 41770563 39458306 37328417 35437348 33589365
5371C3589365j831781j352792j393325j208052r59917j088332q36942o08082m08470
$$ 33589365 31757584 30404792 29011467 27803415 26843498 25755166 24918224 24310142 23901672
5362B3901672j88083m1277m5052k16811L6764N02918J6355J23242K92893J09134
$$ 23901672 23713589 23672312 23627260 23410449 23447213 23950131 23966486 24089728 24382621 24491755
5352B4491755K19157J15088L06972L11620M5072k1089R6021l5326k9887R3123
$$ 24491755 24710912 24826000 25132972 25444592 25489664 25468575 25564596 25529270 25499383 25592506
5342B5592506M58939L91616M99485R34608J331134J398856J519120J787306K140844
$$ 25592506 26051445 26443061 26942546 27877154 29208288 30607144 32126264 33913570 36054414
5333C6054414K176144J639888J420623Q47975J07770p69357r35634j127414j262423
$$ 36054414 38230558 39870446 41291069 42139044 42246814 41477457 40541823 39414409 38151986
5324C8151986r25034r2263o776J70384N68468M31409Q31570J193897J677402J894533
$$ 38151986 37226952 37134689 37127913 37298297 37866765 38298174 39129744 40323641 42001043 43895576
5314D3895576K276112K870267L647290M685787N923365P135044P783766R100319
$$ 43895576 46171688 49041955 52689245 57375032 63298397 70433441 78217207 87317526
5306H7317526Q994615P519414N023584J403991l475078n881989p091151p807319
$$ 87317526 96312141 103831555 108855139 110259130 106784052 100902063 93810912 86003593
5298H6003593o761417n808841m446510l350506k681512j785916j005134m35884
$$ 86003593 79242176 73433335 68986825 65636319 62954807 61168891 60163757 59727873
5290E9727873K43238P51152J544097K658881L836924M745002O247793Q019502
$$ 59727873 59971111 60722263 62266360 64925241 68762165 73507167 79754960 87774462
5282H7774462R551015J0666770J0841736J0061859O789008J379215m181615q667127
$$ 87774462 97325477 107992247 118833983 128895842 135684850 137064065 132882450 124215323
5274A24215323j0779418j1082084j0488576q620622o857962o007803m543744l055727
$$ 124215323 113435905 102353821 91865245 83244623 76386661 70378858 65835114 62779387
5266F2779387k024724j352179p02210j63923O24045R74475J567622K378108L430032
$$ 62779387 60754663 59402484 58700274 58536351 59160396 60134871 61702493 64080601 67510633
5257F7510633M100210M415658N168110M573619M512771L690487J772794m94535
$$ 67510633 71610843 76026501 81194611 85768230 90281001 93971488 95744282 95249747
5249I5249747k595941m150546m539886m348625l694371l245157l105314m199536
$$ 95249747 92653806 88503260 83963374 79614749 75920378 72675221 69569907 65370371
5241F5370371m516775m138141l687501k810498k914224l139403l167878k787429
$$ 65370371 60853596 56715455 53027954 50217456 47303232 44163829 40995951 38208522
5233C8208522k709085k151508j857951j850180j446472j257625q59757m98810
$$ 38208522 35499437 33347929 31489978 29639798 28193326 26935701 26075944 25577134
5225B5577134m80016p8157k12073p58003r77223j032733q18865q30388j040501
$$ 25577134 25097118 25018961 24806888 24048885 23071662 22038929 21220064 20389676 19349175
5216A9349175r26368m87423l10800m05777j70555q38918p40645m23429m11165
$$ 19349175 18422807 17935384 17624584 17218807 17048252 16209334 15468689 15045260 14634095
5207A4634095k52597n41224m53314l27564P0291j30047O0653L54576j79841k92675
$$ 14634095 14381498 13840274 13386960 13059396 13129687 12999640 13060293 13414869 13235028 12942353
5197A2942353L61032J6639O3898O15342L64501Q11725R54686R99730Q44410N05120
$$ 12942353 13303385 13320024 13383922 13999264 14363765 15175490 16130176 17129906 17974316 18479436
5187A8479436m26992j280805j187714j118560q37305o94672n41550o30294m45892
$$ 18479436 18052444 16771639 15583925 14465365 13628060 12933388 12391838 11761544 11315652
5178A1315652q6216j18194q28181l56616J3047l36255n00542l00908l4662n13995
$$ 11315652 11229436 11111242 10283061 9926445 9939492 9603237 9102695 8801787 8767125 8253130
5168H253130m07161j89570p7863J41108P6496j24157k31598p4301J9371k54462
$$ 8253130 7845969 7656399 7578536 7719644 7796140 7671983 7440385 7366084 7385455 7130993
5158G130993j34631r2617J78916K3536n8023j80868o9806M4279m16507n234j27269
$$ 7130993 6996362 6903745 7082661 7106197 7048174 6867306 6797500 6841779 6425272 6420038 6292769
5147F292769j97387J48005l63799K4551L304j49185p0048j57671K62282Q1398
$$ 6292769 6095382 6243387 5879588 5904139 5907443 5758258 5688210 5530539 5792821 5874219
5137E874219m41266o5028K09016P8322l22906K51341m5377j41156k31303R9762
$$ 5874219 5432953 5367925 5576941 5655263 5332357 5583698 5538321 5397165 5165862 5265624
5127E265624K21882L37197N1117J16451L2014J81424J68339K37490J26973j98953
$$ 5265624 5487506 5824703 5875820 5992271 6024285 6205709 6374048 6611538 6738511 6539558
5117F539558k74332j35197o33257k2618K02614l74980Q1953l78473M3293J26671
$$ 6539558 6265226 6130029 5496772 5474154 5676768 5301788 5383741 5005268 5048561 5175232
5107E175232r0438k31916j2997j42165r0855L7517J3293J30446j5406n7946K23034
$$ 5175232 5084794 4852878 4839881 4697716 4606861 4644378 4657671 4788117 4772711 4714765 4937799
5096D937799j01270J9729N7597J56570M88372K48779L54411J50040n3581j19811
$$ 4937799 4836529 4856258 4913855 5070425 5558797 5807576 6161987 6312027 6258446 6138635
5086F138635p1159r8171n32217k72937m79469m3904n6584j4169q5611K1266k81046
$$ 6138635 6067476 5969305 5437088 5164151 4684682 4640778 4584194 4570025 4484414 4505680 4224634
5075D224634k6479k68017J61775J16414k85829J68793L11342k53066j38501P2459
$$ 4224634 4198155 3930138 4091913 4208327 3922498 4091291 4402633 4149567 4011066 4083525
5065D083525j52366k46995L12700J15293J6497J42698k09340J20053J38384k69070
$$ 4083525 3931159 3684164 3996864 4112157 4128654 4271352 4062012 4182065 4320449 4051379
5055D051379Q6948l13999j17122J31495J28175j4875k72950J1246j13695N9987
$$ 4051379 4138327 3824328 3707206 3838701 3966876 3952001 3679051 3690297 3576602 3636589
5045C636589k16162Q1818j19460k45169j34518J43019k25191J22535o8921O9816
$$ 3636589 3420427 3502245 3382785 3137616 3003098 3146117 2920926 3043461 2974540 3044356
5035C044356K60J1983N13115n7436n80j48099k44593o5356K53302Q453l90519
$$ 3044356 3044616 3056599 3569714 3512278 3511698 3363599 3119006 3053650 3306952 3315405 2924886
5024B924886K29801J09984j01893J61529l3003o2015L45277P9911K2637M6598
$$ 2924886 3154687 3264671 3162778 3324307 3291304 3229289 3574566 3654477 3677114 3723712
5014C723712K4651n4827J757M19709j26520k47699K43628M2243k22750l02435
$$ 3723712 3748363 3693536 3695293 4115002 3988482 3740783 3984411 4026654 3803904 3501469
5004C501469L3391K57562N2004j34642j14207k45269p4642K75932k0703j05259
$$ 3501469 3534860 3792422 3844426 3709784 3595577 3350308 3275666 3551598 3530895 3425636
4994C425636J77650j47218j0213j76659l2820m4606m4379K9013J71578K25375
$$ 3425636 3603286 3456068 3445855 3269196 3236376 3191770 3147391 3176404 3347982 3573357
4984C573357J49659J48019l84067K97363k2073K26963J64037M5353l43051Q330
$$ 3573357 3723016 3871035 3486968 3784331 3762258 3989221 4153258 4198611 3855560 3863890
4974C863890L17258j83036p0049J3259r2004L2571Q0751j17925N132j20856j85639
$$ 3863890 4181148 3998112 3928063 3941322 3849318 3881889 3962640 3844715 3849847 3728991 3543352
4963C543352L49608K72822Q8912L41758k82948J65047M02558K48649n534N5716
$$ 3543352 3892960 4165782 4254694 4596452 4313504 4478551 4881109 5129758 5124224 5179940
4953E179940K54336J67295K65710O70294L32662M26986N84687Q48690J006202
$$ 5179940 5434276 5601571 5867281 6537575 6870237 7297223 7881910 8730600 9736802
4944I736802R90687O93449j34832n67096r12955r15575q35313r59075n47448o61541
$$ 9736802 10727489 11420938 11286106 10719010 9806055 8890480 8055167 7096092 6548644 5887103
4934E887103l42065n04457n43509J51761K30448l67685l07483J59996r6580n31415
$$ 5887103 5545038 5040581 4497072 4648833 4879281 4511596 4204113 4364109 4267529 3736114
4924C736114j35016j02689J6759P9008K0315j69337k28048J05664k10000l4158
$$ 3736114 3601098 3498409 3515168 3594176 3614491 3445154 3217106 3322770 3112770 3078612
4914C078612k32269J63341l24893K52208Q8204R800K43165l38034L167n2930k28499
$$ 3078612 2846343 3009684 2684791 2936999 3025203 3035003 3278168 2940134 2943301 2890371 2661872
4903B661872P3560k90094J66864J48478j62312J9051R3462J07171k03641M544
$$ 2661872 2735432 2445338 2612202 2760680 2598368 2617419 2710881 2818052 2614411 2618955
4893B618955K7045j0293K389K7242J3103J26639J67866l8076N2259k68960l11747
$$ 2618955 2646000 2635707 2638096 2665338 2678441 2805080 2972946 2934870 2987129 2718169 2406422
4882B406422J28889k9162L08689p5533Q3750j98050Q6901J76792M7912l61352
$$ 2406422 2535311 2506149 2814838 2739305 2823055 2625005 2711906 2888698 2936610 2575258
4872B575258m4881J77727P448o8577K39200K98362O5876n7220k80188Q5017j75047
$$ 2575258 2530377 2708104 2715552 2646975 2886175 3184537 3250413 3193193 2913005 2998022 2822975
4861B822975m7821L83315j80160p2154p4593l7945n2492j38647K3465k79218J32230
$$ 2822975 2775154 3158469 2978309 2906155 2831562 2793617 2741125 2602478 2625943 2346725 2478955
4850B478955m00786K44716L37348J64404p5137R4853K75032j96236j37272J77240
$$ 2478955 2078169 2322885 2660233 2824637 2749500 2844353 3119385 2923149 2785877 2963117
4840B963117r4134n2750M73580k49093o385k5432q7877R5231l3442M16343j68382
$$ 2963117 2868983 2816233 3289813 3040720 3034335 3008903 2921026 3016257 2982815 3399158 3230776
4829C230776j61059k71581L14967r0282j56477L26517r832j87955j65206J4076
$$ 3230776 3069717 2798136 3113103 3022821 2866344 3192861 3183029 2995074 2829868 2843944
4819B843944K33072J51722k23902M8145K81063k99818j93634m8218K17874K22404
$$ 2843944 3077016 3228738 3004836 3052981 3334044 3034226 2840592 2792374 3010248 3232652
4809C232652K77272O423R375l1256J9392J5317k35508j55573K54874J10609j46111
$$ 3232652 3509924 3516347 3525722 3494466 3513858 3529175 3293667 3138094 3392968 3503577 3357466
4798C357466J52409l5201N9511o403J77591J53800m7159n4208j85642r8552J54291
$$ 3357466 3509875 3474674 3534185 3527782 3705373 3859173 3812014 3757806 3572164 3473612 3627903
4787C627903K27511N26717J58194k97847k6439K47157J44753J21973k22543k45151
$$ 3627903 3855414 4382131 4540325 4242478 4216039 4463196 4607949 4729922 4507379 4262228
4777D262228k5951p8049K68529K5776l45274K31118n5386J73338K23886J89783
$$ 4262228 4236277 4158228 4426757 4452533 4107259 4338377 4282991 4456329 4680215 4869998
4767D869998J36672k58000j73652J67847Q4992M14498r9116j58675J61432m2296
$$ 4869998 5006670 4748670 4575018 4742865 4827857 5242355 5143239 4984564 5145996 5103700
4757E103700J21820k00849N0687N5543j98960k58232K65292k00266j74489L654
$$ 5103700 5225520 5024671 5075358 5130901 4931941 4673709 4939001 4738735 4564246 4567900
4747D567900j24445J28738J97951M61840l7037k31976j87428K98523L81824k44603
$$ 4567900 4443455 4572193 4770144 5231984 5194947 4962971 4775543 5074066 5455890 5211287
4737E211287k75609K71851r8717J25429L1046m0190J37630j17383J03057k95289
$$ 5211287 4935678 5207529 5108812 5234241 5265287 5225097 5362727 5245344 5348401 5053112
4727E053112k93702J08142L90672O0611j05281k00530k37416K55761K92467j508
$$ 5053112 4759410 4867552 5258224 5318835 5213554 5013024 4775608 5031369 5323836 5322328
4717E322328j78231J62157L56243Q8798J4129q8355k12422K01933K80405Q7921
$$ 5322328 5144097 5306254 5662497 5751295 5765424 5677069 5464647 5666580 5946985 6034906
4707F034906R9587m3445k75736J61514J30588L04813N05720J32713K50555N73353
$$ 6034906 6134493 6091048 5815312 5976826 6107414 6412227 6917947 7050660 7301215 7874568
4697G874568Q44325Q16660P84707O70747m74537j084259r77078o92514q14454
$$ 7874568 8718893 9535553 10320260 10991007 10516470 9432211 8455133 7762619 6948165
4688F948165K9310k95033j57391k27534o09984l43826J07839K0661k9111K85481
$$ 6948165 6977475 6682442 6525051 6297517 5687533 5343707 5451546 5472207 5443096 5728577
4678E728577k79401L7439q475k02975J14944j08264m0712P0225J31481J05661
$$ 5728577 5449176 5486615 5478140 5275165 5390109 5281845 5241133 5311358 5442839 5548500
4668E548500N6755K96704J27060J94897J65826k30156J6147j28407j27176k07631
$$ 5548500 5605255 5901959 6029019 6223916 6389742 6159586 6175733 6047326 5920150 5712519
4658E712519j07028q2990J50030N27174k57054j75544K0309J97302j87566K60854
$$ 5712519 5605491 5522501 5672531 6199705 5942651 5767107 5787416 5984718 5797152 6058006
4648F058006j30714L99096J40704k35705j30880J45199K90849Q0264J74681J68299
$$ 6058006 5927292 6326388 6467092 6231387 6100507 6245706 6536555 6616819 6791500 6959799
4638F959799p1603J22904j67094J17981K53562M266j043L69769r9151J81338K4956
$$ 6959799 6888196 7011100 6844006 6961987 7215549 7219815 7218772 7588541 7489390 7670728 7695684
4627G695684J95012L00740M90275K37449Q552K37121j67539J45529J68289K78942
$$ 7695684 7890696 8191436 8681711 8919160 8927712 9164833 8997294 9142823 9311112 9590054
4617I590054J76349M66141P987K3618J66898K31871K54450P5206L99569K61568
$$ 9590054 9766403 10232544 10240531 10264149 10431047 10662918 10917368 10992574 11392143 11653711
4607A1653711J59406K69020K21390K45792K65018J95070M63182L72574L48040
$$ 11653711 11813117 12082137 12303527 12549319 12814337 13009407 13472589 13845163 14193203
4598A4193203M42126J50468N05538O05140L42895J21844P65819L45241L69021
$$ 14193203 14635329 14785797 15291335 15896475 16239370 16361214 17127033 17472274 17841295
4589A7841295P8671M76560O35407L41710M91032J42786O28431L88147K42954P41991
$$ 17841295 17919966 18396526 19031933 19373643 19864675 20007461 20635892 21024039 21266993 22008984
4579B2008984R50151O39357M40895O58966J115112R88910O94607P40852J267818
$$ 22008984 22959135 23598492 24039387 24698353 25813465 26802375 27496982 28237834 29505652
4570B9505652J127662J123439J255127J206367R18380R93388J036800O19292R50207
$$ 29505652 30633314 31756753 33011880 34218247 35136627 36130015 37166815 37786107 38736314
4561C8736314O98493P71732P20138L54850M91130O84578P62880J431927Q19004
$$ 38736314 39434807 40206539 40926677 41281527 41772657 42457235 43220115 44652042 45471046
4552D5471046P49233J586442J203067J672742K343757K229301K081258K836615
$$ 45471046 46220279 47806721 49009788 50682530 53026287 55255588 57336846 60173461
4544F0173461L066298K686477K927956K617456K487115K404783J739260Q74655
$$ 60173461 63239759 65926236 68854192 71471648 73958763 76363546 78102806 78977461
4536G8977461Q71512L59917r114j27923L54374N16820M27565P03383Q49005Q97703
$$ 78977461 79848973 80208890 80199776 80071853 80426227 80943047 81370612 82073995 82923000 83820703
4526H3820703J959920J975482J875099K342161K620550K503194K964031K528118
$$ 83820703 85780623 87756105 89631204 91973365 94593915 97097109 100061140 102589258
4518A02589258J937081K309144K146416J563637J350789J097775R33946N98897
$$ 102589258 104526339 106835483 108981899 110545536 111896325 112994100 113928046 114526943
4510A14526943j98149l23348k14471P2715M1667m92051L94515M31121J71411Q36827
$$ 114526943 114328794 114005446 113790975 113863690 113905357 113413306 113807821 114238942 114410353 115247180
4500A15247180L56052O87133N55808M73949N91945L16647l02237q87781j688484
$$ 115247180 115603232 116290365 116846173 117320122 117912067 118228714 117926477 117038696 115350212
4491A15350212j581342j853196k016778k054704k180015k597406k748773k582071
$$ 115350212 113768870 111915674 109898896 107844192 105664177 103066771 100317998 97735927
4483I7735927k659953k290555j507781j656018j403626j203722j095838j324523
$$ 97735927 95075974 92785419 91277638 89621620 88217994 87014272 85918434 84593911
4475H4593911j220217j804320k051980j879941k278414k146479k521247k784871
$$ 84593911 83373694 81569374 79517394 77637453 75359039 73212560 70691313 67906442
4467F7906442k291830k611150k462053k274854k225535j343552j327524j225784
$$ 67906442 65614612 63003462 60541409 58266555 56041020 54697468 53369944 52144160
4459E2144160j238037q68066q06115o04443o73340n7927k15896l52474o93056
$$ 52144160 50906123 50038057 49231942 48627499 47954159 47896232 47680336 47327862 46634806
4450D6634806o62195j004998j428939r90094j190029j372055j336365j603540
$$ 46634806 45972611 44967613 43538674 42548580 41358551 39986496 38650131 37046591
4442C7046591j728617j108855j400786j013798o94616p93303q71698o13933l87404
$$ 37046591 35317974 34209119 32808333 31794535 31099919 30306616 29434918 28820985 28433581
4433B8433581k84909k49615p4825p0458k56482k42151J61879j00665j84291j59086
$$ 28433581 28148672 27899057 27824232 27753774 27497292 27255141 27417020 27316355 27132064 26972978
4423B6972978o74685o61981k82122m57724o79723o37704j60943q87073o20941
$$ 26972978 26298293 25636312 25354190 24896466 24216743 23579039 23418096 22531023 21910082
4414B1910082p07114m25857m90691o54296j99665q46280j33704p2601m0535j27122
$$ 21910082 21202968 20777111 20286420 19632124 19432459 18586179 18452475 18379874 18339339 18212217
4404A8212217J94112J29878o0895j24653L7788K67111L52934J30353Q7022M97721
$$ 18212217 18406329 18536207 18475312 18350659 18388447 18655558 19008492 19138845 19225867 19723588
4394A9723588N07609M90992M05201L91401J51516M79628P51839L68671L82977
$$ 19723588 20231197 20722189 21127390 21518791 21670307 22149935 22901774 23270445 23653422
4385B3653422J046177N81778O95841Q99053N72046Q08914J069287J469375J036005
$$ 23653422 24699599 25281377 25977218 26876271 27448317 28257231 29326518 30795893 31831898
4376C1831898J604044J530195J690719J518617J824293J784709J303127J361344
$$ 31831898 33435942 34966137 36656856 38175473 39999766 41784475 43087602 44448946
4368D4448946J622924J286562Q89181J193757J290027J101939O89423O80220K68689
$$ 44448946 46071870 47358432 48247613 49441370 50731397 51833336 52522759 53202979 53471668
4359E3471668L17875L88612L66967N73209N63899J158589J331420J426920J926106
$$ 53471668 53789543 54178155 54545122 55118331 55682230 56840819 58172239 59599159 61525265
4350F1525265J555447J201999J376174J234933J318138J481713R62864N31079
$$ 61525265 63080712 64282711 65658885 66893818 68211956 69693669 70656533 71187612
4342G1187612Q3279n47407o53539j142656j276809j685696j697070j952718k218560
$$ 71187612 71270891 70723484 70069945 68927289 67650480 65964784 64267714 62314996 60096436
4333F0096436k345078k799750k592897k166190k174402j819075j369082j486593
$$ 60096436 57751358 54951608 52358711 50192521 48018119 46199044 44829962 43343369
4325D3343369p66186r36439k74628n4311m27560n13250l35069k82572m49628o17938
$$ 43343369 42577183 41640744 41366116 41311805 40884245 40370995 40035926 39753354 39303726 38685788
4315C8685788o10870j141177j175465j387807j320740j452598j516083j610070
$$ 38685788 38074918 36933741 35758276 34370469 33049729 31597131 30081048 28470978
4307B8470978j840717j475054j623638j381129j377346j255049j307884j200425
$$ 28470978 26630261 25155207 23531569 22150440 20773094 19518045 18210161 17009736
4299A7009736o00608q21658n13161k98331p57579q19164n80672m29775m38166
$$ 17009736 16409128 15587470 15074309 14775978 14018399 13199235 12618563 12188788 11750622
4290A1750622n49551l38784k98246n71229l03374j67128n90977j79982J49678
$$ 11750622 11201071 10862287 10564041 9992812 9689438 9522310 8931333 8751351 8901029
4281H901029p5388o5727j82578k98286o6337j85351k62750j77648j41776J67116
$$ 8901029 8825641 8759914 8577336 8279050 8212713 8027362 7764612 7586964 7445188 7612304
4271G612304l02221j44502j06828N8270K10391l56564m00312m4849K04696j76382
$$ 7612304 7310083 7165581 7058753 7117023 7327414 6970850 6570538 6525689 6730385 6554003
4261F554003j25326J83321k36834P4671j53223n8096N4987J20569Q4141j59761
$$ 6554003 6428677 6611998 6375164 6449835 6296612 6238516 6293503 6414072 6498213 6338452
4251F338452l26330k9434J61745J53194r7263p6618k49923k76857J88481k41270
$$ 6338452 6012122 5982688 6144433 6297627 6200364 6123746 5873823 5596966 5785447 5544177
4241E544177J59409L1804k12079R7824M36193j47746l45648j9847k92891K07891
$$ 5544177 5703586 5735390 5523311 5621135 6057328 5909582 5563934 5544087 5251196 5459087
4231E459087L18278P6681N3419q6734J09438k85250j68821N1332q8431N7018K6621
$$ 5459087 5777365 5854046 5907465 5820731 5930169 5644919 5476098 5527430 5438999 5496017 5522638
4220E522638K85654P7745l9429K1584p6549m0627K32899l18642j03794r9165J40701
$$ 5522638 5808292 5886037 5846608 5868192 5791643 5751016 5983915 5665273 5561479 5462314 5603015
4209E603015J13222M15j4952K91107m91546k89761J13100K68262j34734l35823
$$ 5603015 5716237 5716652 5701700 5992807 5501261 5211500 5324600 5592862 5458128 5122305
4199E122305M4023N291J74217o8752K84579n9981J09721M3963P5468j11818L29577
$$ 5122305 5166328 5171619 5345836 5277084 5561663 5501682 5611403 5655366 5730834 5619016 5948593
4188E948593P5794k91224N04927q8213m72350k36220K84866L53267l10162j14069
$$ 5948593 6024387 5733163 6238090 6149877 5677527 5441307 5726173 6079440 5769278 5655209
4178E655209k96618R8622R914Q2595j56513l5192k85143j5494L57831q842n116
$$ 5655209 5358591 5457213 5467127 5549722 5393209 5358017 5072874 5057380 5415211 5406369 5401253
4167E401253J512l8815n1770P8784N16671k65985l79144k30635L09558N11469
$$ 5401253 5402765 5363950 5312180 5390964 5907635 5641650 5262506 5031871 5341429 5852898
4157E852898R4590K7589O145J93543k47558j4256J73558r7319r287J87194j41046
$$ 5852898 5947488 5975077 5981222 6174765 5927207 5912951 6086509 5989190 5979903 6167097 6026051
4146F026051j0391L09687M59672J97466K4661L02564R92634L56850M95378Q02891
$$ 6026051 6015660 6325347 6785019 6982485 7007146 7309710 8302344 8659194 9154572 9957463
4136I957463J04699j20961n01784m96577n61313l96304k76640M03293Q2259K61400
$$ 9957463 10062162 9941201 9439417 8942840 8381527 7985223 7708583 8111876 8194135 8455535
4126H455535L61437O35150L49582L0195k09765p16244m90473n41884k07833j87590
$$ 8455535 8816972 9452122 9801704 9831899 9622134 8905890 8415417 7873533 7665700 7478110
4116G478110o41932r6799P343j35717L52444K69499k11728J70638L34185r6169
$$ 7478110 6836178 6739379 6746722 6611005 6963449 7232948 7021220 7191858 7526043 7429874
4106G429874k5494k08037k82837n9130k3133l58570p1800j88462L64938Q1780
$$ 7429874 7404380 7196343 6913506 6854376 6831243 6472673 6400873 6212411 6577349 6659129
4096F659129j23975N8750j2340M87593q9349j27143j00372j13110m2389L31710
$$ 6659129 6535154 6593904 6581564 7069157 6979808 6852665 6752293 6639183 6596794 6928504
4086F928504J32638l57144K50839K8980L06298k86238J28408k02028n9700P7436
$$ 6928504 7061142 6703998 6954837 6983817 7290115 7003877 7132285 6930257 6870557 6947993
4076F947993o0234m45454m8132J27473M2897r4626J69949J72262L4046J44518
$$ 6947993 6887759 6442305 6394173 6521646 6564543 6469917 6639866 6812128 6846174 6990692
4066F990692J71309Q2276m8221j55810J38821L97996R5381j83992j30812L95519
$$ 6990692 7162001 7244277 7196056 7040246 7179067 7577063 7672444 7488452 7357640 7753159
4056G753159K3865q0335l6978l21337J08052L46144J68517j54309l34215K26671
$$ 7753159 7777024 7696689 7659711 7338374 7446426 7792570 7961087 7806778 7472563 7699234
4046G699234j36197L19967K33902K03491J29162j15250p365k1227j79472Q5462
$$ 7699234 7563037 7883004 8116906 8320397 8449559 8334309 8326944 8305717 8126245 8211707
4036H211707J80632n0467L33000J56441J06141J70262k0587k04620L30599J67906
$$ 8211707 8392339 8341872 8674872 8831313 8937454 9107716 9087129 8882509 9213108 9381014
4026I381014j3423M46884K80292j70353k310K69032K55176N04344J28048L45450
$$ 9381014 9367591 9814475 10094767 9924414 9922104 10191136 10446312 10950656 11078704 11424154
4016A1424154M83057J74564J44384L01720N81376L08158M75228J080640R37321
$$ 11424154 11907211 12081775 12226159 12527879 13109255 13417413 13892641 14973281 15910602
4007A5910602J640750K446368K652057L799870N069915O008146O741211L956156
$$ 15910602 17551352 19997720 22649777 26449647 31519562 37527708 44268919 48225075
3999D8225075j974533o473458o865670n872878m212724l220412j980915j584619
$$ 48225075 46250542 39777084 32911414 27038536 22825812 19605400 17624485 16039866
3991A6039866j301280q61933m53042p09888m50209k35388j96125n75265m73585
$$ 16039866 14738586 13876653 13423611 12713723 12263514 12028126 11832001 11256736 10783151
3982A0783151J30314k72501j67288j39898J37970j54639l09874J56930J64618
$$ 10783151 10913465 10640964 10473676 10333778 10471748 10317109 10007235 10164165 10328783
3973A0328783K00903j95267O3037N58606o6297j16519L45436J50384j09079j52600
$$ 10328783 10529686 10334419 10397456 10956062 10889765 10773246 11118682 11269066 11159987 11007387
3963A1007387r8872L64999o7225k49080o7416P0137k52771k11202L19571p7616
$$ 11007387 10908515 11273514 11206289 10957209 10889793 10959930 10707159 10495957 10815528 10737912
3953A0737912J13281K58449q6223q180O1163L38193J08197k88781Q9788k18962
$$ 10737912 10851193 11109642 11023419 11015239 11076402 11414595 11522792 11234011 11323799 11104837
3943A1104837L4238N24449J12696J24988j41809n7564R1489J51101K24815K12131
$$ 11104837 11139075 11663524 11776220 11901208 11759399 11701835 11793324 11944425 12169240 12381371
3933A2381371L01030K12833k18783K82046K37064L77095L74209l360k41984K82195
$$ 12381371 12682401 12895234 12676451 12958497 13195561 13572656 13946865 13943505 13701521 13983716
3923A3983716j19763K79024K70848K24445M11231J69986N19953N598J30661J95575
$$ 13983716 13863953 14142977 14413825 14638270 15049501 15219487 15739440 15745038 15875699 16071274
3913A6071274L60177M8408M68703M41199n881K85932L83912K48465K4393K83763
$$ 16071274 16431451 16479859 16948562 17389761 17383880 17669812 18053724 18302189 18326582 18610345
3903A8610345K03434O68335M54661K80556O5857M00031M71008L06329M92893M49157
$$ 18610345 18813779 19482114 19936775 20217331 20283188 20683219 21154227 21460556 21953449 22402606
3893B2402606N85399P34360O98700N24623Q07726M73061Q08364M50173M29307
$$ 22402606 22988005 23722365 24421065 24945688 25753414 26226475 27034839 27485012 27914319
3884B7914319J66575M66587L57628L72984P28157L42603L71033P13697N04713
$$ 27914319 28080894 28547481 28905109 29278093 30006250 30348853 30719886 31433583 31938296
3875C1938296K78650M24687O70272N67153M11989N12582M31451M75865Q52424
$$ 31938296 32216946 32641633 33311905 33879058 34291047 34803629 35235080 35710945 36563369
3866C6563369Q17602O15870R32585Q40180R86029N84358J044781P65980P05741
$$ 36563369 37380971 37996841 38929426 39769606 40755635 41339993 42384774 43150754 43856495
3857D3856495N29289Q63510N18416Q92235M37382M71879Q79865P22366Q62712
$$ 43856495 44385784 45249294 45767710 46659945 47097327 47569206 48449071 49171437 50034149
3848E0034149P20977J035849R12460P63830N01006R88983J007729P18006Q80455
$$ 50034149 50755126 51790975 52703435 53467265 53968271 54957254 55964983 56682989 57563444
3839E7563444J517861J428853J066759J133041J016013J149479J172474J513906
$$ 57563444 59081305 60510158 61576917 62709958 63725971 64875450 66047924 67561830
3831F7561830J342521J371811J681234J013075J178106J568545J209400J183499
$$ 67561830 68904351 70276162 71957396 72970471 74148577 75717122 76926522 78110021
3823G8110021R29747R92881R88778J029572J249707N54934R81959J067141J236438
$$ 78110021 79039768 80032649 81021427 82050999 83300706 83855640 84837599 85904740 87141178
3814H7141178R49091J733665J953907J924461J859161J522134J326044P41397
$$ 87141178 88090269 89823934 91777841 93702302 95561463 97083597 98409641 99151038
3806I9151038Q86945O38636P60167N49816J2139R35533K74990K13059L22014N75763
$$ 99151038 100037983 100676619 101436786 101986602 101998741 102934274 103209264 103422323 103744337 104320100
3796A04320100L22517M78909J233436J177783R07781P59802O68000P35565M41408
$$ 104320100 104642617 105121526 106354962 107532745 108440526 109200328 109868328 110603893 111045301
3787A11045301Q68171J417113J505992J387590J852737J998856J585174J492839
$$ 111045301 111913472 113330585 114836577 116224167 118076904 120075760 121660934 123153773
3779A23153773L52845O8981M50232N19405J35076j55370n05476J2400n6139M73183
$$ 123153773 123506618 123575599 124025831 124545236 124680312 124524942 124019466 124031866 123975727 124448910
3769A24448910R35470J604580J476589J930462K474895L394601L798070L478609
$$ 124448910 125384380 126988960 128465549 130396011 132870906 136265507 140063577 143542186
3761A43542186L284839K811123J842577O48145M3071n22052m69968k54626K84257
$$ 143542186 146827025 149638148 151480725 152128870 152171941 151649889 151179921 150925295 151209552
3752A51209552K35725N20881L07330N65709m7718m72816j036706j099270r53768
$$ 151209552 151445277 151966158 152273488 152839197 152791479 152318663 151281957 150182687 149228919
3743A49228919j470801j703159j749567j917528k477595k376417k440421k262680
$$ 149228919 147758118 146054959 144305392 142387864 139910269 137533852 135093431 132830751
3735A32830751j977101j930500k164289k411101k656051l749284m271482m436897
$$ 132830751 130853650 128923150 126758861 124347760 121691709 117942425 113670943 109234046
3727A09234046m625779m242771l844716l359752k621043j994605k171483k247933
$$ 109234046 104608267 100365496 96520780 93161028 90539985 88545380 86373897 84125964
3719H4125964k315769k193471k093598k531164j838577j500138j704191j428402
$$ 84125964 81810195 79616724 77523126 74991962 73153385 71653247 69949056 68520654
3711F8520654j646353j865271k126220k098639k229147j913517j796786j938278
$$ 68520654 66874301 65009030 62882810 60784171 58555024 56641507 54844721 52906443
3703E2906443j763323j445927j216255j119945j608773j126289j080935r35694
$$ 52906443 51143120 49697193 48480938 47360993 45752220 44625931 43544996 42609302
3695D2609302j139729j193072j062086q95728n84417q76531m65081m55066q41537
$$ 42609302 41469573 40276501 39214415 38318687 37734270 36857739 36392658 35937592 35096055
3686C5096055j51973l57609n66076k78703n10123n10305n67725j046582l04877
$$ 35096055 34944082 34586473 34020397 33741694 33231571 32721266 32153541 31106959 30802082
3677C0802082o95188m36087n30333o50601l82850o38439j09873l77987m23898
$$ 30802082 30106894 29670807 29140474 28489873 28107023 27468584 27358711 26980724 26556826
3668B6556826o23601j75357j45501k59705m29235l16724l56422m12789l68357
$$ 26556826 25933225 25757868 25612367 25352662 24923427 24606703 24250281 23837492 23469135
3659B3469135m10395m74843j40659q4421j33095n37883l8440q9960m69704j57888
$$ 23469135 23058740 22583897 22443238 22358817 22225722 21687839 21649399 21559439 21089735 20931847
3649B0931847Q3121j55424k11129l24984k42228n4740j3021l96384k74026N6953
$$ 20931847 21014968 20859544 20648415 20323431 20081203 20026463 20013442 19617058 19343032 19399985
3639A9399985k17136P670k36203j95676k78917l2986k11738J94606j72237j53930
$$ 19399985 19182849 19190519 18954316 18758640 18479723 18446737 18234999 18429605 18257368 18103438
3629A8103438j75072N4889j08169l95566O4081M05186k41029l30668j00182J17597
$$ 18103438 17928366 17983255 17875086 17479520 17543601 17948787 17707758 17377090 17276908 17394505
3619A7394505r527l74721r2453l0622J96660j5662k66371l94648O3031J38505
$$ 17394505 17384978 17010257 16917804 16887182 17083842 17068180 16801809 16407161 16470192 16608697
3609A6608697K49958j90014r6065L58576n804k31636L9326j83340J18556j09321
$$ 16608697 16858655 16668641 16572576 16931152 16925348 16693712 16733038 16549698 16668254 16558933
3599A6558933o6233J24712Q255j62447J63120l0234J15321L18799q3230j60529
$$ 16558933 16492700 16617412 16625667 16463220 16626340 16596106 16711427 17030226 16946996 16786467
3589A6786467J79447K08748K5027R6880K7054j28340q3032K58038M53050J13685
$$ 16786467 16965914 17174662 17199689 17296569 17323623 17195283 17112251 17370289 17823339 17937024
3579A7937024j84637j11874O4589p458N4046Q3609L51877q1773L00738J69382
$$ 17937024 17752387 17640513 17705102 17697644 17751690 17835299 18187176 18105403 18406141 18575523
3569A8575523n08528j49593L53315q728M42088K38535j1571J1901o14494J92612
$$ 18575523 18066995 17917402 18270717 18261989 18704077 18942612 18931041 18942942 18328448 18521060
3559A8521060M65892j57878J55787K13318R4185J86656p7826K07701j71278Q7431
$$ 18521060 18986952 18829074 18984861 19198179 19292364 19479020 19401194 19608895 19437617 19525048
3549A9525048N06670q9908L77837L10561m08474j57535K24876k82044j9701K36221
$$ 19525048 20031718 19941810 20319647 20630208 20221734 20064199 20289075 20007031 19987330 20223551
3539B0223551K12774j75645k70406r461J25812M59513L79310m6661l56177L34218
$$ 20223551 20436325 20260680 19990274 19980813 20106625 20566138 20945448 20898787 20542610 20876828
3529B0876828L99768L18935J01553K22929p1908p543J64168M15868M13811M20657
$$ 20876828 21276596 21595531 21697084 21920013 21848105 21840562 22004730 22420598 22834409 23255066
3519B3255066M97853N36223M66146P51415J390063J699561J718778J538039k52376
$$ 23255066 23752919 24289142 24755288 25506703 26896766 28596327 30315105 31853144 31600768
3510C1600768j311981k415352j627251q54988j032332p74000o49867k14476j02099
$$ 31600768 30288787 27873435 26246184 25391196 24358864 23584864 22934997 22720521 22618422
3501B2618422k94027r8816p9549j15923l07789L8146K257l51345K73282p0944
$$ 22618422 22324395 22225579 22146030 22030107 21722318 21760464 21762721 21411376 21684658 21613714
3491B1613714m6405J77385j78676P0923p4606K55499k4701n080r5960j6350m52002
$$ 21613714 21567309 21744694 21566018 21636941 21562335 21817834 21793133 21788053 21692093 21675743 21223741
3480B1223741k9724K58186K3496l30338K83566L24184j78591M8491K82241M43920
$$ 21223741 21194017 21452203 21475699 21145361 21428927 21753111 21574520 21623011 21905252 22349172
3470B2349172p8789J05201j09404K00131p0239m2481K65565N840J48524K86779
$$ 22349172 22270383 22375584 22266180 22466311 22396072 22353591 22619156 22624996 22773520 23060299
3460B3060299R748j71817K45444O3455J20921J51998j51412J81444j39054O0101
$$ 23060299 23070047 22898230 23143674 23207129 23328050 23480048 23328636 23510080 23371026 23431127
3450B3431127m8497M0639M5290L15214J78681J31176j67752l0341j01259L88016
$$ 23431127 23382630 23423269 23468559 23783773 23962454 24093630 23925878 23895537 23794278 24182294
3440B4182294M38911O2108L19263m7630K62111M49446J32412J16710J03275K89771
$$ 24182294 24621205 24683313 25002576 24954946 25217057 25666503 25798915 25915625 26018900 26308671
3430B6308671j35875K14460K05633o8645K92163K44505J60078L20028J29353L32883
$$ 26308671 26172796 26387256 26592889 26524244 26816407 27060912 27220990 27541018 27670371 28003254
3420B8003254K15606J69948L85492K75853L9441N73339K25240L43896L04184Q3273
$$ 28003254 28218860 28388808 28774300 29050153 29089594 29662933 29888173 30232069 30536253 30619526
3410C0619526M72723O53834L69060J77719L09975J62215J35623K54311L20436
$$ 30619526 31092249 31746083 32115143 32292862 32602837 32765052 32900675 33154986 33475422
3401C3475422J13546L95137K8470M81857M43725M99215L70694L80880P21695J66021
$$ 33475422 33588968 33984105 34012575 34494432 34938157 35437372 35808066 36188946 36910641 37076662
3391C7076662R6658N84086K83319K19852N13207K11963O87845L79969N38653L11967
$$ 37076662 37173320 37757406 38040725 38260577 38773784 38985747 39673592 40053561 40592214 40904181
3381D0904181M23445O97105N45580N73820O06215P38465O14935N84703K34850
$$ 40904181 41327626 42024731 42570311 43144131 43750346 44488811 45103746 45688449 45923299
3372D5923299M67918Q50329P71807O04906P45081P86707P34285O77042K79814
$$ 45923299 46391217 47241546 48013353 48618259 49363340 50150047 50884332 51561374 51841188
3363E1841188Q07023Q02680R21449J234926P77010Q72044Q30161J213252J061363
$$ 51841188 52648211 53450891 54372340 55607266 56384276 57256320 58086481 59299733 60361096
3354F0361096O63604J346088R72254J146989J224308Q46773J320266J420351J537750
$$ 60361096 61024700 62370788 63343042 64490031 65714339 66561112 67881378 69301729 70839479
3345G0839479J512663J292961J368135J762585K100990J801807J558472J734812
$$ 70839479 72352142 73645103 75013238 76775823 78876813 80678620 82237092 83971904
3337H3971904J503013J844656K136172J870972J991898K138125J882884J880357
$$ 83971904 85474917 87319573 89455745 91326717 93318615 95456740 97339624 99219981
3329I9219981J435748J353561J793417J952756K161870K139992K199655K269702
$$ 99219981 100655729 102009290 103802707 105755463 107917333 110057325 112256980 114526682
3321A14526682K642594K927089L335462L838988L919419M471445L412394J299067
$$ 114526682 117169276 120096365 123431827 127270815 131190234 135661679 139074073 140373140
3313A40373140K78515J089301J747658K479077K309270L142431L780227L949645
$$ 140373140 140651655 141740956 143488614 145967691 148276961 151419392 155199619 159149264
3305A59149264M617613M943032N444060O092197O788392P792539P691727Q369753
$$ 159149264 163766877 168709909 174153969 180246166 187034558 194827097 202518824 210888577
3297B10888577R199519R392871J0656861J1554164J2522239J3280382J4292313
$$ 210888577 220088096 229480967 240137828 251691992 264214231 277494613 291786926
3290B91786926J5609941J6243495J7747415J7806107J7351207J5957091J4092943
$$ 291786926 307396867 323640362 341387777 359193884 376545091 392502182 406595125
3283D06595125R355749R85138p785505j4022098j7667099k0281944k0871491j9590861
$$ 406595125 415950874 416936012 409150507 395128409 377461310 357179366 336307875 316717014
3275C16717014j8323878j6435334j4127151j2700022j0939151r391280q589905
$$ 316717014 298393136 281957802 267830651 255130629 244191478 234800198 226210293
3268B26210293p671778o604831o174052n899493n584413n382653m543295l822230
$$ 226210293 218538515 211933684 205759632 199860139 194275726 188893073 184349778 180527548
3260A80527548l840978l663025l573383k801672k650937k464984k530070k293781
$$ 180527548 176686570 173023545 169450162 166648490 163997553 161532569 159002499 156708718
3252A56708718j729375j322182l131738m509795n459949n078859m266776m263990
$$ 156708718 154979343 153657161 150525423 146015628 140555679 135476820 131210044 126946054
3244A26946054l928158l918560l250946l106693l104657k678574k876995k140344
$$ 126946054 123017896 119099336 115848390 112741697 109637040 106958466 104081471 101941127
3236A01941127k112021k160074j786905j844672j794436j662906j585412j405596
$$ 101941127 99829106 97669032 95882127 94037455 92243019 90580113 88994701 87589105
3228H7589105q76462j348382j739151j468198j557292j593582j704940j622391
$$ 87589105 86712643 85364261 83625110 82156912 80599620 79006038 77301098 75678707
3220G5678707j477272j219420j217833j298510j369564j288544q14009j041863
$$ 75678707 74201435 72982015 71764182 70465672 69096108 67807564 66993555 65951692
3212F5951692j403831r41655l74360q46293r48643n95995p07533l60647n29408
$$ 65951692 64547861 63606206 63231846 62385553 61436910 60840915 60133382 59772735 59243327
3203E9243327n42958q34315p22424n54023o60108l43479k87264m28971j78282
$$ 59243327 58700369 57866054 57143630 56589607 55929499 55586020 55298756 54869785 54691503
3194E4691503l83895m16668o02002o74556n37987n20152p89008n59672k43854
$$ 54691503 54307608 53890940 53288938 52614382 52076395 51556243 50767235 50207563 49963709
3185D9963709o85725m45462n34199m53086n44317o24331p64073k99874l0133M11384
$$ 49963709 49277984 48832522 48298323 47845237 47300920 46676589 45912516 45612642 45582509 45993893
3175D5993893j95577l89949n87219o05144k82955p25676m05350n36469k22946
$$ 45993893 45798316 45408367 44821148 44216004 43933049 43207373 42802023 42265554 42042608
3166D2042608p24469l72290j44426k23724j01936k68586l4466n30311r5355o4666
$$ 42042608 41318139 40945849 40801423 40577699 40475763 40207177 40172711 39642400 39547045 39482379
3156C9482379o68244n5592l60859j29828k09546m41242k41365j24633L36725M5398
$$ 39482379 38814135 38758543 38397684 38267856 38058310 37617068 37375703 37251070 37587795 37633193
3146C7633193p16573J39152k09384k60990J59321k93597l69693l77926k23382
$$ 37633193 36916620 37055772 36846388 36585398 36744719 36451122 36081429 35703503 35480121
3137C5480121k42190J62033l10519J23229p6015m44025m2932L1790j64718J30666
$$ 35480121 35237931 35399964 35089445 35212674 35136659 34692634 34649702 34681492 34516774 34647440
3127C4647440l7097n07625k99361K03687j68985k94797K7307j22839j70280p3121
$$ 34647440 34610343 34102718 33803357 34007044 33838059 33543262 33570569 33447730 33277450 33204329
3117C3204329j46954l51317l85086l90004k87289K97194j53199m06453l28392
$$ 33204329 33057375 32706058 32320972 31930968 31643679 31940873 31787674 31381221 31052829
3108C1052829O0578j82193k94616l23346k93929j0892j89300j97706j59798k18045
$$ 31052829 31113407 30931214 30636598 30313252 30019323 30008431 29819131 29621425 29461627 29243582
3098B9243582j0981l2081l53327r4948p8298k48835j15870J17368j65836l09981
$$ 29243582 29232601 29200520 28847193 28752245 28673947 28425112 28309242 28426610 28260774 27950793
3088B7950793J77334j15714j75520k45140l64044k13218J6940J33441k68309q15237
$$ 27950793 28128127 28012413 27836893 27591753 27227709 27014491 27031431 27164872 26896563 26081326
3078B6081326O732K74987k97171o9196l12495j73585M18609L8084J92635L73697
$$ 26081326 26088058 26363045 26065874 25996678 25684183 25510598 25929207 25967291 26159926 26533623
3068B6533623j30723k61475k63834m02957o1386n19626l80809m2866q2500k92722
$$ 26533623 26402900 26141425 25877591 25474634 25413248 24893622 24512813 24469947 24387447 24094725
3058B4094725p121J59773R311L7353J24699k15991k55216P4765K94935j6422j73526
$$ 24094725 24087604 24247377 24256688 24294041 24418740 24202749 23947533 24022298 24317233 24300811 24127285
3047B4127285j48054m6209M47292J01972J51894k53291N5843L39834M67100K10502
$$ 24127285 23979231 23933022 24380314 24482286 24634180 24380889 24436732 24776566 25243666 25454168
3037B5454168Q785J9289N49778K46367J92918P2094M98948J30025J76032M86633
$$ 25454168 25462953 25482242 26032020 26278387 26471305 26543399 27042347 27172372 27348404 27835037
3027B7835037L62053L92957K39114P04503Q2739J13772N37350L46162Q49915M94254
$$ 27835037 28197090 28590047 28829161 29533664 29616403 29730175 30267525 30613687 31463602 31957856
3017C1957856K35008K71575Q8566M17767O51949J40319O7528M69045N10209L89852
$$ 31957856 32192864 32464439 32553005 32970772 33622721 33763040 33830568 34299613 34809822 35199674
3007C5199674j1444N17015P94011L49944M45292L06628N71113N94979N09683P35485
$$ 35199674 35188230 35705245 36499256 36849200 37294492 37601120 38172233 38767212 39276895 40012380
2997D0012380O64139P46121R28933J160142J233416N73449J087049J140124J495339
$$ 40012380 40676519 41422640 42351573 43511715 44745131 45318580 46405629 47545753 49041092
2988D9041092J165397J155312J387083J368839J762714J777904J624266J752470
$$ 49041092 50206489 51361801 52748884 54117723 55880437 57658341 59282607 61035077
2980F1035077J630074K006691K114266K201470J922987J728849J717333J556142
$$ 61035077 62665151 64671842 66786108 68987578 70910565 72639414 74356747 75912889
2972G5912889J543899J142698J300523L60296N60690P89204Q50416Q30899P42307
$$ 75912889 77456788 78599486 79900009 80260305 80820995 81610199 82460615 83291514 84033821
2963H4033821R42042J006493J141886J873366J910643K175440K561869K752781
$$ 84033821 84975863 85982356 87124242 88997608 90908251 93083691 95645560 98398341
2955I8398341L188666L355992L358400M343143M760776M621349N334958N405884
$$ 98398341 101587007 104942999 108301399 112644542 117405318 122026667 127361625 132767509
2947A32767509N212625N012506M075745K682939O36481j836875m065374n259720
$$ 132767509 137980134 142992640 147068385 149751324 150387805 148550930 144485556 139225836
2939A39225836n720640n365287m046145l069211k043239j115108o59786M74110
$$ 139225836 133505196 128139909 124093764 121024553 118981314 117866206 117206420 117680530
2931A17680530O02714J471650J986915K549603K199165K354874K815675K883509
$$ 117680530 118283244 119754894 121741809 124291412 126490577 128845451 131661126 134544635
2923A34544635L458458L328819L386834K803055K247023J643908L40652j397872
$$ 134544635 138003093 141331912 144718746 147521801 149768824 151412732 151753384 150355512
2915A50355512j892070l446957m043702m411313n151324n411355n721167n301564
$$ 150355512 148463442 145016485 140972783 136561470 131410146 125998791 120277624 114976060
2907A14976060m339534l057622k906789j852076j435676j368447l22919k05311
$$ 114976060 110636526 107578904 104672115 102820039 101384363 100015916 99692997 99487686
2899I9487686j73467N64504m9192k6481l51626r23390j181522j348825j338901
$$ 99487686 99314219 99878723 99829531 99803050 99451424 98528034 97346512 95997687 94658786
2890I4658786j830976k903781l509844m379202l916373m083836m029457l566647
$$ 94658786 92827810 89924029 86414185 82034983 78118610 74034774 70005317 66438670
2882F6438670l452476k832183k808217k308401k252050j968490j713967j597525
$$ 66438670 62986194 60154011 57345794 55037393 52785343 50816853 49102886 47505361
2874D7505361j619194r00053j334745j017272r46625p93301o96241r20224j084248
$$ 47505361 45886167 44986114 43651369 42634097 41687472 40894171 40197930 39277706 38193458
2865C8193458p94840o83898q22862j194023j298248j023936r26822q92440j391111
$$ 38193458 37398618 36714720 35891858 34697835 33399587 32375651 31448829 30556389 29165278
2856B9165278r45105o83699o96897q95535m00628r6408o57902n68257p74657l89025
$$ 29165278 28220173 27536474 26839577 25944042 25543414 25447006 24789104 24220847 23446190 23057165
2846B3057165q63314p79422m60700k66439m60654n64017j97013k93351n3860l95712
$$ 23057165 22193851 21414429 20953729 20687290 20226636 19662619 19465606 19172255 19118395 18722683
2836A8722683k87662j20859j98675k16379j35023l29676n18099n8504k00622j55704
$$ 18722683 18435021 18314162 18115487 17899108 17764085 17434409 16916310 16857806 16657184 16501480
2826A6501480j87078n37470p4150j74963l43275l01759l33902m27221m49086j02085
$$ 16501480 16314402 15776932 15702782 15527819 15184544 14882785 14548883 14121662 13672576 13570491
2816A3570491k92017n99706m53850k75297k32905j07410l02231N6701J5521M4073
$$ 13570491 13278474 12678768 12224918 11949621 11716716 11609306 11307075 11363776 11379297 11423370
2806A1423370k74821l73555P5164j29398j75049n1909k69336n9924J61098l06118
$$ 11423370 11148549 10774994 10850158 10720760 10545711 10493802 10224466 10164542 10325640 10019522
2796A0019522j70968k60206k32703J04558l15326r3241M9691n94760j17488l96022
$$ 10019522 9848554 9588348 9355645 9460203 9144877 9051636 9101327 8506567 8389079 7993057
2786G993057j10114k46205J3148Q5202l85607k87325N2378L0935j25073j71279
$$ 7993057 7882943 7636738 7649886 7735088 7349481 7062156 7114534 7145469 7020396 6849117
2776F849117k34130l17965N5333K73570j74214J28519J74111j53450k38683k65125
$$ 6849117 6614987 6297022 6352355 6625925 6451711 6580230 6754341 6600891 6362208 6097083
2766F097083l09121k78017k04378K54009K13027j15838k04426k05737L19240m455
$$ 6097083 5787962 5509945 5305567 5559576 5772603 5656765 5452339 5246602 5565842 5561387
2756E561387m52402P673J43858p9776l06109j71316K1465J81199P6412j52137
$$ 5561387 5108985 5116658 5260516 5180740 4874631 4703315 4724780 4905979 4982391 4830254
2746D830254k47987n3006J48602J02514j82719p7531J14488j84837m41672k17750
$$ 4830254 4582267 4529261 4677863 4780377 4597658 4520127 4634615 4449778 4008106 3790356
2736C790356J15937m3284J37346K54371P9241j98285l4737j59532k4776M60016
$$ 3790356 3906293 3863009 4000355 4254726 4333967 4135682 4100945 3941413 3916637 4376653
2726D376653k21150j76477q9966r5122j49617J23718J9176N28838m58253k31653
$$ 4376653 4155503 3979026 3889060 3793938 3644321 3768039 3787215 4316053 3857800 3626147
2716C626147R6476p0925J40292j21311L8305k51321L16747k48017J13818J87894
$$ 3626147 3722623 3651698 3791990 3670679 3708984 3457663 3774410 3526393 3640211 3828105
2706C828105J06418k67930m6077p4105J9180P6569o7033K49599j34160o3857k00067
$$ 3828105 3934523 3666593 3620516 3546411 3565591 3642160 3575127 3824726 3690566 3626709 3426642
2695C426642j34967K19816j74134k54191K32851Q8465K5991j18158l9693L53278
$$ 3426642 3291675 3511491 3337357 3083166 3316017 3404482 3430473 3312315 3272622 3625900
2685C625900l43160n3985K24786J97554o0085J2060j59684j58553k4015j62341
$$ 3625900 3282740 3228755 3453541 3651095 3591010 3603070 3443386 3284833 3260818 3098477
2675C098477J93583J32334k74204k01445R3080K3377L09970J43622m6378q5504
$$ 3098477 3292060 3424394 3150190 2948745 3041825 3065202 3375172 3518794 3472416 3386912
2665C386912K12675o4157n4105p5130k34091Q0571l8632j26811K18877n13393
$$ 3386912 3599587 3535430 3481325 3406195 3172104 3252675 3214043 3087232 3306109 2792716
2655B792716k01744P9182M9565r3414k7615J47053K27507p0970k0091K2598J14992
$$ 2792716 2590972 2670154 2719719 2626305 2598690 2745743 2973250 2902280 2882189 2904787 3019779
2644C019779j27121k31354J49965J75761p9978m22318K79523q1848O6589J70167
$$ 3019779 2892658 2661304 2811269 2987030 2907052 2484734 2764257 2682409 2748998 2919165
2634B919165q7810P4837r1578j24666r3716q8623L5272K9152n02L11578j21834
$$ 2919165 2831355 2906192 2814614 2689948 2596232 2507609 2542881 2572033 2571531 2883109 2761275
2623B761275L62149j97651n15758j67532l05456j5166N9641M16315J70398k85984
$$ 2761275 3123424 2925773 2410015 2242483 1937027 1921861 1981502 2397817 2568215 2282231
2613B282231O2297o8003n5045J74532p408Q5350M2789q2332l33361m01159j52311
$$ 2282231 2344528 2276525 2221480 2396012 2388604 2473954 2516743 2434411 2101050 1699891 1547580
2602A547580K99941j4888J43998L42390O6434k66678j02788k32193L68653J29118
$$ 1547580 1847521 1832633 1976631 2319021 2385455 2118777 2015989 1783796 2152449 2281567
2592B281567j38133k82691k07155o0600n677k6066K87952p5528k17019J26429
$$ 2281567 2143434 1860743 1653588 1592988 1587311 1561245 1849197 1773669 1556650 1683079
2582A683079p5283O14561j81895m97610m7330k31368P9754L0452q2133p7504L30945
$$ 1683079 1607796 2222357 2040462 1542852 1495522 1264154 1343908 1374360 1292227 1214723 1545668
2571A545668O471J97856K37711o6642J5313l10833k07078n5356Q3177K4928n3710
$$ 1545668 1552139 1749995 1987706 1921064 1936377 1625544 1418466 1363110 1446287 1471215 1417505
2560A417505k21639L02946L11462o17044J25988m6404k86993J08040J15305L42755
$$ 1417505 1195866 1498812 1810274 1193230 1319218 1272814 985821 1093861 1209166 1551921
2550A551921J56030j79708j37170r4233Q3863L97070j37259k11383J21986n0821
$$ 1551921 1707951 1528243 1391073 1296840 1380703 1777773 1640514 1429131 1551117 1500296
2540A500296m18691J63612J47266k22016k9355J08363l2527l5365K63483l58140
$$ 1500296 1081605 1245217 1392483 1170467 1141112 1249475 1216948 1181583 1445066 1086926
2530A086926o6974M3583o9514q3097j80807N19537j51119j02433l76769K70170
$$ 1086926 1019952 1063535 994021 910924 730117 1249654 1098535 996102 619333 889503
2520H89503K26388m4227L53378j34201j47465L1498p2688Q0373r903R9316l18964
$$ 889503 1115891 1071664 1425042 1290841 1143376 1174874 1102186 1182559 1172656 1271972 953008
2509I53008k69193L83267J65759j00014j04685r8094J60774J947P1326O2579k8515
$$ 953008 683815 1067082 1232841 1132827 1028142 930048 1090822 1092769 1164095 1226674 1198159
2498A198159J77261k66934k01603M7325K30709M071j93063k98169Q5156J67749
$$ 1198159 1375420 1108486 906883 954208 1184917 1188988 995925 697756 782912 950661
2488I50661J3833O7435l58259j45325J97764j66580l0972j17274J63666l1346
$$ 950661 964494 1031929 673670 528345 726109 559529 528557 411283 574949 543603
2478E43603j35093K30435k22214m9064J69266o435J13971j3105n1830j11464j60673
$$ 543603 408510 638945 416731 367667 536933 530498 644469 631364 579534 468070 307397
2467C07397J49219l2477r5391J78511K24258j4219j75283j45198J24085j1225
$$ 307397 456616 424139 328748 507259 731517 717298 542015 396817 520902 509677
2457E09677j05835R4723j27913J84316J10495j12443L46131l24461r8559K58786
$$ 509677 403842 498565 370652 554968 665463 553020 899151 574690 476131 734917
2447G34917O9455p0046L94765Q383k50171j73149l05007r4271Q0993R6378r5869
$$ 734917 804372 734326 1129091 1137474 887303 714154 409147 314876 395869 492247 396378
2436C96378j48850M41101J33446r2642K95482j92565m6543j27324J04792k89220
$$ 396378 247528 688629 822075 729433 1024915 832350 785807 658483 763275 474055
2426D74055P844j02695K92996K20101j36950j61853l13549L02955K4765k01947
$$ 474055 481899 379204 672200 892301 755351 593498 279949 582904 607669 405722
2416D05722K15095J97097K94644j16240m48958N4679K2652j4888j59448k59949
$$ 405722 620817 817914 1112558 996318 547360 602039 624691 609803 450355 190406
2406A90406M13826R250l94539L12131l4004k55142m3695o7121J53603K33910m00928
$$ 190406 604232 613482 218943 531074 497070 241928 198233 131112 284715 518625 117697
2395A17697L16035q2626L5085r6325R1117J70190k1781k12515l38104o7553K15132
$$ 117697 433732 351106 386191 289866 380983 551173 529392 316877 -21227 -88780 126352
2384A26352L16367n8114l16429O5373N17635j45268R0174o4229j87230J52472
$$ 126352 442719 384605 68176 133549 651184 505916 596090 531861 344631 497103
2374D97103J27028J32901O1012k42293k05175j94470J75619p9026L27773k73612
$$ 497103 624131 757032 818044 575751 370576 176106 351725 272699 600472 326860
2364C26860P1311L1686Q4326l00250O4782K92764j14531L3833k08709l02430M5641
$$ 326860 398171 429857 514183 213933 278715 571479 456948 490781 282072 -20358 25283
2353B5283J55251J99059P9353N4188j06596L20717j44996j21309m07203j56447
$$ 25283 180534 379593 458946 513134 406538 727255 582259 460950 53747 -102700
2343a02700L26430K57745P4205k81851Q7607j66898L26391K04271j55287j48403
$$ -102700 223730 481475 555680 273829 361436 194538 520929 725200 569913 421510
2333D21510q9521l41101R3866p823m6887k39200P2663J37615n2554K00697m4688
$$ 421510 331989 -9112 84754 76931 30044 -209156 -136493 1122 -51432 149265 104577
2322A04577j12912M9899J32354J89125j77769j17801o7576j07691j4841J15384
$$ 104577 -8335 41564 173918 363043 185274 67473 -103 -107794 -122635 -7251
2312g251L13238j76139j56626L70139K28809l87212m35557K43059j17116J05232
$$ -7251 305987 129848 -26778 343361 572170 184958 -250599 -7540 -124656 -19424
2302a9424O8053k13550p329N57642o5382j69558q8178J58742n5511l05326L31881
$$ -19424 48629 -164921 -172250 385392 320010 150452 62274 221016 165505 -139821 192060
2291A92060J81239o5156K53610L32996o70373l08661J32387J1171K8552o4675
$$ 192060 373299 308143 561753 894749 224376 -84285 48102 59273 87825 23150
2281B3150Q7770J05607J95682k38396L9487p3547r818J74780j68740k6576p5407
$$ 23150 110920 216527 412209 173813 213300 139753 129935 304715 135975 109399 33992
2270C3992K07027L57243o8423j99182r9010O3813j59177o305j05083O1277J76036
$$ 33992 241019 598262 529839 330657 231647 295460 136283 129978 24895 86172 262208
2259B62208p3769j00759o5758L76198K54842k83547M2328M9761j87962J41130
$$ 262208 188439 87680 21922 398120 652962 369415 411743 461504 273542 414672
2249D14672j01968L0278L28946R283m0575j20470q4505J6230O1377k28017J95243
$$ 414672 312704 342982 671928 681211 640636 520166 435661 451891 513268 285251 480494
2238D80494J1842R467K97785j0378l63601j24790K32665n4649n6175J65514K376
$$ 480494 492336 501803 799588 789210 425609 300819 533484 478835 422660 588174 590550
2227E90550j33681P4542r9388J80916J38445J73595j55530J73150P485k23000
$$ 590550 456869 531411 432023 612939 751384 924979 769449 942599 950084 727084
2217G27084j70891j03150J53163J26297L64427L5078j78046K00719Q0256j31879
$$ 727084 556193 453043 606206 732503 1096930 1132008 953962 1154681 1234937 1103058
2207A103058p2472J49897L4408K01247j40290k72821M7185K36952r721k93596
$$ 1103058 1030586 1180483 1214891 1416138 1275848 1003027 1050212 1287164 1277443 983847
2197I83847J04629L20911q2251K71465p8523k2031K40510J04543j65052M2162
$$ 983847 1088476 1409387 1327136 1598601 1520078 1498047 1738557 1843100 1678048 1720210
2187A720210K98237j93238K1802K08234K50332m6458k3874j37889L29074K34188
$$ 1720210 2018447 1825209 1847011 2055245 2305577 2259119 2235245 2097356 2426430 2660618
2177B660618l11896N6127L43409J17566N3265J1687n0608K57762K02441L87529
$$ 2660618 2348722 2404849 2748258 2865824 2919089 2930776 2880168 3137930 3340371 3727900
2167C727900L58942K63610N15621L91840K35157J70339O1484M19630M31747M90957
$$ 3727900 4086842 4350452 4866073 5257913 5493070 5663409 5724893 6144523 6576270 7067227
2157G067227Q62514J072067J287393J757304K830876L533347M212459N789948
$$ 7067227 7929741 9001808 10289201 12046505 14877381 18410728 22623187 28413135
2149B8413135O669364O443765j80991o726831q018617n844989m353800l160298
$$ 28413135 35082499 41526264 41345273 34618442 26599825 20754836 16401036 13240738
2141A3240738k298363k278836q72814o16718j124194l29574r0239m66020p1667
$$ 13240738 10942375 8663539 7790725 7174007 6049813 5720239 5630000 5163980 5092313
2132E092313k73477o78901o73143K6784l52079n6818n39461l10661m1181p9514
$$ 5092313 4818836 4139935 3466792 3493576 3141497 3084679 2545218 2234557 2193376 2113862
2122B113862m7480j74178J02578k40115k54133J87709j45219q3453o4166k26069
$$ 2113862 2066382 1892204 1994782 1754667 1500534 1688243 1543024 1459571 1395405 1169336
2112A169336j50061q0966k9543q6861K19662K41807m30390m0344J28780k45556
$$ 1169336 1019275 938309 908766 821905 1041567 1283374 852984 812640 941420 695864
2102F95864j82805J33314J51201J49113j95947j56277M9716K952j07353K5799
$$ 695864 513059 646373 797574 946687 750740 594463 644179 647131 539778 565577
2092E65577j92832j66581n1869P0075J65844J65703o1879n7480J00939k72234
$$ 565577 372745 206164 154295 224370 390214 555917 494038 436558 537497 265263
2082B65263K9280K97958J19604k70698k71642M18243o9136k74585K76733K02198
$$ 265263 294543 592501 712105 441407 169765 588008 518872 244287 521020 723218
2072G23218l28959k10047L10841k51061k49880L09899L34705j29389j93682k2832
$$ 723218 394259 184212 495053 243992 -5888 304011 638716 509327 315645 292813
2062B92813K4147j76326J99048k08518j58974j82687P7136j66449K92449M70486
$$ 292813 316960 140634 339682 131164 -27810 -210497 -133361 -299810 -7361 463125
2052D63125j67538m12045O5244J16884o2122k58957j01189L42755R1705P7369
$$ 463125 295587 -116458 -51214 65670 3548 -255409 -356598 -13843 77862 155231
2042A55231j9688J68973J7604k46875k87163K55087j17216K68933n4842N0473
$$ 155231 135543 304516 322120 75245 -211918 43169 -74047 194886 140044 190517
2032A90517o6957J38307K40862k03345J24247j72081j87185j81092k36612J24355
$$ 190517 123560 261867 502729 299384 423631 251550 64365 -116727 -353339 -228984
2022b28984k2951r5640L20661L52720m46397k7642J42584R1583J02444M6632N5044
$$ -228984 -251935 -347575 -26914 325806 -120591 -148233 -5649 85934 188378 235010 290054
2011B90054m71701P7198L55912k42851k5949N5896J72254J67162O5381k4595j8180
$$ 290054 -181647 -104449 251463 8612 -17337 38559 210813 377975 443356 418761 400581
2000D00581O4187k45519j96556j8230L42564L6648k53374Q6027J31223L72k02373
$$ 400581 464768 219249 22693 4463 347027 383675 130301 216328 347551 347923 145550
1989A45550L5846m1222r3987M160o8120k18684K29514O5431m4980L12731K0347
$$ 145550 181396 140174 46187 50347 -17773 -236457 -6943 58488 13508 326239 346586
1978C46586j96766n4789M20718j19755n0969j21035j1881k17042p8620K7403j40166
$$ 346586 149820 95031 515749 395994 345025 223990 212109 -4933 -83553 -56150 -196316
1967a96316r5478P8979j25183L4605K60882L19225Q5727k05085k50064N4744J54662
$$ -196316 -291794 -212815 -337998 -303393 -42511 276714 362441 157356 -92708 -37964 116698
1956A16698k63870Q8630j16203k60707K36221j75701J41539k9029k9237N1034
$$ 116698 -147172 -58542 -174745 -435452 -199231 -374932 -233393 -262422 -291659 -240625
1946b40625J01962K98819j66909l49053J32501M66090l26803k84118j17483J04089
$$ -240625 -138663 160156 -6753 -355806 -223305 242785 -84018 -368136 -485619 -381530
1936c81530M60796L2701L25357J03351r1032K81860l98648j15622j11351q9733
$$ -381530 79266 111967 437324 540675 449643 731503 332855 217233 105882 16149
1926A6149K21185J99680k6667k95265R081L8992j9325l19688J97094K06728R4137
$$ 16149 237334 437014 410347 115082 124163 163155 143830 -175858 21236 227964 322101
1915C22101l63645J79858O4878L08036r7655k72154J61792j83843R5757l60763
$$ 322101 -41544 138314 203192 511228 413573 141419 303211 119368 215125 -145638
1905a45638j07880K02473R5467K13089j34738K48L1623k4977j60602J3887J73372
$$ -145638 -253518 -51045 44422 257511 122773 123021 154644 129667 -30935 -17048 156324
1894A56324K21618k9029R1180k18874L4585n0399l73452K39557N9792n4364o4065
$$ 156324 377942 348913 440093 221219 255804 205405 -168047 71510 131302 76938 12873
1883A2873K32465j54271J11500J09065l0911L05595R1839l49972j79134j17755
$$ 12873 245338 91067 202567 311632 280721 586316 678155 328183 149049 31294
1873C1294K67539R453j47861j67328k31997j2805K26332K13051J35070k53248
$$ 31294 298833 308286 160425 -6903 -238900 -251705 -25373 187678 322748 69500
1863F9500j16681O667M8853j04732M03170J73035k39688k30202J02306j17266
$$ 69500 -47181 -40514 8339 -96393 306777 479812 240124 9922 112228 -5038
1853e038j25434l87562K70091L73938r0718l32836l8388J68616L57060r7936J77889
$$ -5038 -130472 -518034 -247943 125995 35277 -297559 -335947 -167331 189729 91793 269682
1842B69682k97915k2320P315k5668L91463k08872n8239K6776Q8139l33490j21956
$$ 269682 -28233 -50553 -43238 -68906 322557 113685 55446 82222 170361 -163129 -285085
1831b85085J20875J21992Q9181L860j18273L38173q7742l90856k49932K73503
$$ -285085 -164210 -42218 46963 50823 -67450 270723 182981 -207875 -457807 -184304
1821a84304L1886j87809L85277k36458K24203L29162m19740J25662k14180M25679
$$ -184304 -152418 -340227 45050 -191408 32795 361957 -57783 67879 -146301 279378
1811B79378N2933k8632j93227k45743J8704K16262k1568q5431l2929n3651K53482
$$ 279378 332311 303679 110452 -135291 -116587 99675 78107 -7324 -40253 -93904 159578
1800A59578j14041j25012j6715K42724R1011M0740m0949l9430j32324j86125L11309
$$ 159578 45537 -79475 -96190 146534 237545 278285 237336 197906 65582 -120543 190766
1789A90766m06386j28643L50559K72610R9325k70066k63216K74996N2386j18464
$$ 190766 -215620 -344263 6296 278906 378231 108165 -155051 119945 172331 53867
1779E3867m50008J33185K74027r6171M2286j16350N4179k38193J25052k4338K83506
$$ 53867 -396141 -262956 11071 -85100 -42814 -159164 -104985 -343178 -218126 -242464 41042
1768D1042m9849k36761l280L40751l7367l1894J63885Q2527M6467k22875j44380
$$ 41042 -8807 -245568 -248848 91903 54536 22642 186527 269054 315521 92646 -51734
1757e1734J52380O6255K86867l25392R8791M5236m06973K96683r7102j49566P7182
$$ -51734 100646 166901 453768 128376 227167 272403 -134570 162113 65011 -84555 -7373
1746g373j26127r9659L43921p918n5092L12706m2938k68444N5305j78535l44031
$$ -7373 -133500 -233159 110762 102844 47752 360458 317520 49076 104381 -74154 -418185
1735d18185J07771M62752j93179k69213J65229m4163q5016M97729k19105J04531
$$ -418185 -310414 152338 -40841 -310054 -144825 -188988 -274004 223725 4620 109151
1725A09151J4442q4371p7780J05193j41135J55857J09181k20920j34014k0566
$$ 109151 123593 39222 -38558 66635 -74500 81357 190538 -30382 -164396 -184962
1715a84962J12399J58052j54755O5105M8097k64623K07575J75724Q6157K6350
$$ -184962 -72563 85489 -69266 -4161 43936 -220687 -13112 162612 248769 275119
1705B75119k54092k91997L70522J67561r6352k97548J17135J62831K06402k21235
$$ 275119 21027 -270970 99552 267113 170761 -126787 -9652 153179 359581 138346
1695A38346k1194J31515j96049J57324L1768l41954m08379K43739K80188l3872
$$ 138346 117152 248667 52618 209942 241710 -100244 -508623 -264884 15304 -18568
1685a8568j52880R08J07789K80840L30866k26519j7506J23800m39901j05200j11944
$$ -18568 -171448 -170540 -62751 218089 548955 322436 304930 428730 -11171 -116371 -228315
1674b28315k66219P7459K58779J200M26289K42519j14467q2202m65886j51635
$$ -228315 -494534 -417075 -158296 -157096 269193 511712 397245 315043 -150843 -302478
1664c02478K42026J32561m1582J30450q3930M1052K4405m2866J00707J37498k28798
$$ -302478 -60452 72109 30527 160977 77047 118099 142504 99638 200345 337843 109045
1653A09045j11023k53498L13325J30075r3743J78659o7815j07986m2614k03403
$$ 109045 -1978 -255476 57849 187924 94181 272840 205025 97039 54425 -148978
1643a48978K69652q4086Q7481M9279j70200l3951L4258J61108k5533J76399r2013
$$ -148978 120674 36588 124069 173348 3148 -30803 3455 164563 139030 315429 223416
1632B23416k36380J21803k8455k4337L7312l9236r6745P9390p5454K8650K37203
$$ 223416 -12964 108839 80384 56047 93359 54123 -42622 36768 -38686 -10036 227167
1621B27167J65513M3202j44950m1833l03023K68396k79057p6609N19181k33766
$$ 227167 392680 435882 290932 249099 -53924 214472 -64585 -141194 377987 144221
1611A44221K9116M7312J15399j34432k43010j5849K17509k13118k31897L08129
$$ 144221 173337 220649 336048 201616 -41394 -57243 160266 -52852 -284749 23380
1601B3380J51653l3652K8350J05735j02759j09579k15439L04995q9817L57082
$$ 23380 175033 141381 169731 275466 172707 63128 -152311 152684 62867 419949
1591D19949J50282m12579j31553R2503p9348j52896j15159K67266k018j12002
$$ 419949 570231 157652 26099 118602 39254 -113642 -228801 38465 36447 -75555
1581g5555j05059j18201K18607k87439L56901J01049K9726m3171K659N5272j78845
$$ -75555 -180614 -298815 -80208 -367647 -10746 90303 120029 76858 79517 134789 -44056
1570d4056J79395k52615j97846L33726o4073O6895K08095k3736L2716Q3798k99944
$$ -44056 135339 -117276 -315122 18604 -45469 21426 229521 205785 238501 322299 22355
1559B2355p0638J40916L31077j23201l6369l17431k61978J64336J80513P0173
$$ 22355 -48283 92633 423710 300509 264140 -53291 -315269 -150933 29580 99753
1549I9753k47120P0209J46805K63607p7374j09695j37579K6375l22095J74830
$$ 99753 -147367 -77158 69647 333254 255880 146185 8606 34981 -287114 -112284
1539a12284M52480k875j46747J5837m95903J64456K65506j53655k05494L93214
$$ -112284 340196 337321 190574 206411 -289492 -125036 140470 -13185 -218679 174535
1529A74535q7720j10319l19682L37414L79017N7477l46554k27143L30208L25707
$$ 174535 86815 -23504 -343186 -5772 373245 430722 84168 -142975 187233 512940
1519E12940Q8584k44989l5838k36567N6270j43020o819Q9093l6958l37537J69706
$$ 512940 601524 356535 320697 84130 140400 -2620 -9439 79654 42696 -294841 -125135
1508a25135j07983K2798l7537J55305J69031J55583l35427O0761P0655J03196
$$ -125135 -233118 -210320 -247857 -92552 76479 232062 -103365 -42604 28051 131247
1498A31247k90300j84715J26961L44922L26465j87499j94916j4593J21253k06557
$$ 131247 -159053 -343768 -216807 128115 454580 267081 72165 57572 178825 -27732
1488b7732J07457l7449K0884q8763o524K13367k78273m89118M87112j89571L0500
$$ -27732 79725 42276 63160 -25603 -32127 181240 -97033 -586151 -99039 -288610 -258110
1477b58110J45443n5415k45625J8462N30427J26881l6631n5902j11908j11944
$$ -258110 -112667 -168082 -413707 -395245 135182 262063 225432 169530 57622 -54322
1467e4322J169K41156j5782Q5952J15622k74606J65569k17169K5042J71362k9110
$$ -54322 -53153 188003 172221 258173 373795 99189 264758 47589 72631 243993 214883
1456B14883k34799j76132l08839L72748N8990L89495L90151l46112j98885k24756
$$ 214883 -19916 -196048 -504887 -132139 -73149 316346 706497 360385 161500 -63256
1446f3256J4514l32697K64120J45588K38800k80948k55498J58897K52999M4589
$$ -63256 -48742 -381439 -117319 28269 267069 -13879 -269377 -110480 142519 187108
1436A87108k18996j60413m5877M55212k66898l02335o766L44214k1606n1903J07707
$$ 187108 -31888 -192301 -238178 217034 -49864 -352199 -358965 -14751 -36357 -88260 19447
1425A9447p0710m4881l9504M24L15940P582m1124J95995j53420l84077j30539
$$ 19447 -51263 -96144 -135648 -135224 180716 188298 147174 343169 189749 -194328 -324867
1414c24867J00845N4468J95862j94440j03260P7771L3402k34395J11330J95035
$$ -324867 -224022 -169554 26308 -168132 -271392 -193621 -160219 -394614 -283284 -88249
1404h8249M1938m491r3503J97033q0500M1818L4708J63288k50115j33081K26839
$$ -88249 -46311 -50802 -144305 52728 -27772 14046 48754 212042 -38073 -171154 55685
1393E5685n4671j24915l4794J04964j71401L80620k4910k23906j03166K12235
$$ 55685 1014 -123901 -158695 -53731 -225132 155488 130578 -93328 -196494 15741
1383A5741J25154K42837J55647m70908j70542K056N9989k38878J48149J15891
$$ 15741 140895 383732 539379 68471 -102071 -100015 -40026 -278904 -130755 -14864
1373a4864N6910r1892q652j26577J81721k1344k74111L27385j58021n0511r1874
$$ -14864 42046 -49846 -58498 -185075 -3354 -24698 -298809 28576 -129445 -179956 -271830
1362b71830j2850K27840J03077J36285M1500j70859m1946Q0982N8002j15839K11544
$$ -271830 -284680 -56840 46237 182522 224022 53163 11217 92199 150201 34362 245906
1351B45906J55301l27526j45631j85938J78874p2452L11284Q7406K0699O87k10515
$$ 245906 401207 73681 -71950 -257888 -79014 -151466 159818 247224 267923 268610 58095
1340E8095k16622J99769P4895J02142Q0411j76565J20706Q3447k13584l42442
$$ 58095 -158527 41242 116137 218279 298690 122125 242831 326278 112694 -229748
1330b29748J97786r5474N4849j06174N7824k636p5154J1375N8605j84229K32787
$$ -229748 -31962 -127436 -72587 -178761 -120937 -123573 -198727 -187352 -128747 -312976 -80189
1319h0189j23259J15600J32672J37336J3377m69216J0553K76894j8496m70517
$$ -80189 -203448 -87848 44824 182160 195537 -273679 -263126 13768 -4728 -475245
1309d75245M16270M08911j32300k95803M65096r7957m66611J04195m5546J79704
$$ -475245 -58975 349936 217636 -78167 386929 288972 -177639 -73444 -118990 60714
1299F0714j01525K24372m0768J37447j07266j22693J72283l77581K56160Q1285
$$ 60714 -40811 183561 142793 280240 172974 50281 222564 -155017 101143 182428
1289A82428j45172L3124j11308m3538J90098q0105l14291L2763L50672M4328j15784
$$ 182428 37256 70380 -40928 -84466 105632 25527 -288764 -256001 94671 138999 23215
1278B3215K9714k23228r7523j5328J76434q0043j03145K34513J91121k39681j16104
$$ 23215 52929 -170299 -267822 -283150 -106716 -186759 -289904 -55391 135730 -103951 -220055
1267b20055K59215N2539m6497k130J18430J97378k92318o5563K9404N4235J52428
$$ -220055 39160 91699 45202 43072 161502 358880 66562 999 30403 84638 237066
1256B37066J01776n6840j82565J22448m39785M4498L88498r1727L727r4234k14633
$$ 237066 338842 282002 99437 221885 -217900 -173402 215096 123369 127096 32862 -181771
1245a81771l4452L9217j84261J92505M30594k02075p0994J65089P564r1209M6388
$$ -181771 -216223 -177006 -361267 -168762 261832 59757 -11237 153852 161416 70207 116595
1234A16595j36737l4874J84813K44550j72594J66255m67412j81698L51351K86081
$$ 116595 -20142 -55016 129797 374347 201753 368008 -99404 -281102 70249 356330
1224C56330k66667m370J99240j16678j9876j43658J67721r6990n3995j38713R7679
$$ 356330 89663 85293 284533 167855 147979 4321 172042 75052 21057 -117656 -19977
1213a9977J51696J1692K6334K33359k13744k42076J86821J97077k28671l50972
$$ -19977 131719 143411 169745 403104 189360 -52716 134105 331182 102511 -248461
1203b48461Q7784L13838J8592o472o6002m82976k4155J05956L37129k127m22806
$$ -248461 -160677 153161 171753 165281 99279 -383697 -407852 -301896 35233 33106 -389700
1192c89700K02117L36456J57354k0861j79888J68823J05646o3803k96767k10304
$$ -389700 -187583 148873 306227 285366 105478 274301 379947 316144 19377 -190927
1182a90927O4108r999K98089m7693k14370J02363K82941K7236R8852k26201n0060
$$ -190927 -126819 -136818 161271 113578 -100792 1571 284512 311748 410600 184399 134339
1171A34339L567k23610j40258J04322N6060j24561J04487J60310K79376O1054
$$ 134339 137906 -85704 -225962 -121640 -65580 -190141 -85654 74656 354032 415086
1161D15086k28597Q0614p5693j08249N2946P3218r5898k32725j89493J43415J97519
$$ 415086 186489 267103 191410 83161 136107 209325 113427 -119298 -308791 -165376 32143
1150C2143o2241j04336N739J75778J89248j77348o8084J9166j92309m3891M01123
$$ 32143 -30098 -134434 -128695 47083 236331 58983 -9101 10065 -182244 -226135 174988
1139A74988J28966j29437k99946l88392J58752L16668j35983m8223Q361m1959
$$ 174988 303954 174517 -125429 -513821 -355069 -38401 -174384 -222607 -214246 -256205
1129b56205J23208J41215J92331J05058j31168r821o5258L8602L20621k12907
$$ -256205 -132997 8218 200549 305607 174439 164618 99360 137962 458583 245676
1119B45676k96790j44929R5609P666Q9656j2848j13435o3240J69858l54711J30260
$$ 245676 -51114 -196043 -100434 -92768 -3112 -15960 -129395 -192635 -22777 -377488 -247228
1108b47228K25461J41656k64487n2547L00971p2721L969j41726L99137q3122O393
$$ -247228 -21767 119889 -144598 -197145 103826 31105 35074 -106652 292485 209363 215756
1097B15756m54386l05292N9882L42275N25945l89557J28202j66987K1137j59689
$$ 215756 -238630 -543922 -484040 -141765 384180 -5377 122825 -44162 -23025 -182714
1087a82714J07492J52810o1401K42905J1061o33077r4806K21262K5289N2014r7477
$$ -182714 -75222 77588 16187 259092 270153 -362924 -457730 -236468 -211179 -159165 -256642
1076b56642N942L50872O6554l15807K11685j14116p6968q097j14874K25645J35252
$$ -256642 -250700 100172 166726 -149081 62604 -51512 -128480 -136577 -251451 -25806 109446
1065A09446p7401J5667N0363K4995N32m4915m7953m524K17666k06014J00655J16421
$$ 109446 32045 47712 98075 123070 123602 78687 30734 26210 243876 37862 138517 254938
1053B54938k72199N5671J14531K55279j61345l44117n2806J43955K62884J13916
$$ 254938 -17261 38410 152941 408220 246875 -97242 -150048 -6093 256791 370707
1043C70707j90748k33387j66890K64336K61486k29727j46165K57839M8136j59306
$$ 370707 179959 -53428 -220318 44018 305504 75777 -70388 187451 235587 76281
1033G6281K5392k29587J75690j19720o80171J34449J62181L60755k7842j72916
$$ 76281 101673 -127914 47776 -71944 -752115 -617666 -455485 -94730 -122572 -295488
1023b95488K36181J17684J00402k12624J75719L841q5681j22575R7676m9611j01353
$$ -295488 -59307 58377 158779 -53845 121874 125715 40034 -82541 15135 -34476 -135829
1012a35829m1454j23588J48476j05970M21169P3176O8657k29455k5855J73544
$$ -135829 -177283 -300871 -152395 -258365 162804 235980 304637 75182 49327 222871
1002B22871J18609j30883j86773j65785L60396J72249l30910k76633J94328O0201
$$ 222871 341480 210597 23824 -141961 218435 390684 59774 -216859 -22531 37670
992C7670R4068j57458q2543K13467J86538R3209l20032j31070J99288k17714q1164
$$ 37670 131738 -25720 -108263 105204 291742 384951 64919 -66151 133137 -84577 -165741
981a65741K4912q2271j44756K23313j3585J25925K6059m7046o4144J93700J50218
$$ -165741 -140829 -223100 -367856 -144543 -158128 -32203 -6144 -53190 -117334 76366 226584
970B26584k82211l6957n5149K78810N517j47672j61411J67508r8971J44663n6910
$$ 226584 -55627 -92584 -147733 131077 136594 -11078 -172489 -4981 -103952 40711 -16199
959a6199P3207k8175k21054J13153J10021K1331N8113k55722j62407k56574K28335
$$ -16199 57008 28833 -192221 -79068 30953 52284 110397 -145325 -307732 -564306 -335971
948c35971q4269j22989J62800Q1105K85119j04424k8976J43854Q320R443J00747
$$ -335971 -420240 -543229 -380429 -299324 -14205 -118629 -147605 -3751 4569 14012 114759
937A14759K69109j48000j62795j79529j08126J16912N7579l7395Q6313j53301
$$ 114759 383868 235868 73073 -106456 -214582 -97670 -40091 -77486 8827 -144474
927a44474k13583J30080N0059P4927J04877J6832o0586L09N3588j53735P8795
$$ -144474 -358057 -227977 -177918 -102991 1886 18718 -41868 -41559 12029 -141706 -62911
916f2911J00952k58474J43868J80556l2193n8019k84421N6260M17232j33510P3078
$$ -62911 38041 -220433 -76565 103991 71798 13779 -270642 -214382 202850 69340 142418
905A42418j5072J18352q5165k17251n6655k37617n631L55859O17744k15211l75344
$$ 142418 127346 245698 160533 -56718 -113373 -350990 -356621 -762 616982 401771 26427
894B6427l94465R425M65245m361k69772M1614M7864J09588m37709K36518L49054
$$ 26427 -368038 -358613 106632 102271 -167501 -125887 -78023 31565 -406144 -169626 179428
883A79428J85477j18304J73725l09631K4302K6533k23282j01316j2319o6678j8327
$$ 179428 364905 246601 420326 110695 134997 161530 -61752 -163068 -175387 -242065 -260392
872b60392J60524M0601L06497k50486k64500m6634K40944l13310m2567K85087
$$ -260392 -99868 -59267 247230 -3256 -267756 -314390 -73446 -386756 -429323 -144236
862a44236L03724k67010l1662k1951k15397J67798L25002R0797o7047j10601n601
$$ -144236 159488 -107522 -139184 -161135 -376532 -208734 116268 207065 140018 29417 23816
851B3816N3547M1413j10568L42507J4569j35268q0522j69978M8472J86320j90308
$$ 23816 77363 118776 8208 350715 365284 230016 149494 -20484 27988 214308 24000
840B4000J12758k51982j21853K26696M8327M1496J1978L04740q8355o6465m93867
$$ 24000 136758 -115224 -237077 -10381 37946 79442 91420 396160 307805 241340 -252527
829b52527N9796J12570L7023L75556n8628l50177N8535M5465K27598Q0621j64022
$$ -252527 -192731 -80161 -43138 332418 273790 -76387 -17852 27613 255211 335832 171810
818A71810n1870j44074m8335j86805K25210j2863r256j54989J22322r5078j50302
$$ 171810 119940 -24134 -72469 -259274 -34064 -46927 -56183 -211172 -88850 -183928 -334230
807c34230q2430N8401K49152n6132K91607P2725K9332k42630k48351K69318J35517
$$ -334230 -416660 -358259 -109107 -165239 126368 199093 228425 -14205 -262556 6762 142279
796A42279j5514j52007k2983P7444j12519j47928J33706J38705K88058k76999
$$ 142279 126765 -25242 -48225 29219 -83300 -231228 -97522 41183 329241 52242
786E2242j25523o4573J33801J43044R9461k27451j88073J79275O1318J72965n9432
$$ 52242 -73281 -137854 -4053 138991 238452 11001 -177072 2203 63521 236486 177054
775A77054m6565k10583J93765j8269k7580J44376j53841q2105L01606m12772l29738
$$ 177054 130489 -80094 113671 95402 67822 212198 58357 -23748 277858 -134914 -464652
764d64652k8828K32474L02807k80973p9819o7931K0582J14213J13823n703j5727
$$ -464652 -493480 -261006 41801 -239172 -318991 -386922 -366340 -252127 -138304 -144007 -159734
753a59734j21359K21854l1354k00205M37564q891m92381J37670K10583l8669m4167
$$ -159734 -281093 -59239 -90593 -290798 146766 137875 -354506 -216836 -6253 -44922 -89089
742h9089l5552l8342k05476L03873K56833j67008q7628K93588K92696j52695l88305
$$ -89089 -124641 -162983 -368459 -64586 192247 25239 -62389 231199 523895 371200 -17105
731a7105n6481J72854k30190K36933K30534k53695j0495Q8158k02170J42834k24241
$$ -17105 -73586 99268 -130922 106011 336545 82850 72355 160513 -41657 101177 -123064
720a23064P0665M6062J48585K16789l20369j71282j01207J0550k13688K73145
$$ -123064 -52399 -6337 142248 359037 38668 -132614 -233821 -223271 -436959 -163814
710a63814j87092N04849p6834k60441J98298Q1360k70111L7027K35365Q5989r3806
$$ -163814 -350906 153943 77109 -183332 14966 96326 -173785 -136758 98607 184596 90790
699I0790j67252K72266J69865n9698j65063k32240l14006M39937J88891j56435
$$ 90790 -76462 195804 365669 305971 140908 -91332 -405338 34599 223490 67055
689F7055j73538J49331M0200m44757Q7421M8771J61490K38446q322p6435Q0285
$$ 67055 -106483 42848 83048 -361709 -274288 -225517 -64027 174419 166097 89662 169947
678A69947j3104r8320k68892M5038L62919L02360q9181k26895l41521q3558O9482
$$ 169947 156843 58523 -210369 -165331 197588 499948 410767 183872 -157649 -241207 -171725
667a71725L76739q9617n4417N240q8477J43470K92330l08017j74524M15442l57841
$$ -171725 205014 115397 60980 66220 -22257 121213 413543 105526 -68998 346444 -11397
656a1397k46776N1709J67655Q84P6289m8679P8812j4494K10990K04611l52381
$$ -11397 -258173 -206464 -38809 -37925 38364 -10315 68497 54003 264993 469604 117223
645A17223j29003j32512k79161Q8637L68709L6382k58818L2672N6643q525m4674
$$ 117223 -11780 -144292 -423453 -334816 33893 70275 -188543 -155871 -99228 -107753 -152427
634a52427l5202K46166K9981j8781r4248N3975n0421k80982Q0796k44712J82468
$$ -152427 -187629 58537 88518 69737 -24511 29464 -20957 -301939 -221143 -465855 -283387
623b83387K40422J39659n1977l62143j1040L35565q4833J73725j71235J39641
$$ -283387 -42965 96694 44717 -317426 -328466 7099 -77734 95991 -75244 64397
613F4397O045Q0932K3702J41851j33975J43031l4938m55677K29870P9041j24562
$$ 64397 70442 151374 175076 316927 182952 325983 291045 -164632 65238 144279 19717
602A9717k84633K42965L0825j04016r6339J35625J51205M4698o0994j95742R5472
$$ 19717 -264916 -21951 8874 -95142 -191481 -55856 95349 140047 79053 -116689 -21217
591b1217k13638K69949P7144q1309k13502m32984L54082j03303J09563N0925l1101
$$ -21217 -234855 35094 112238 30929 -182573 -615557 -261475 -364778 -255215 -204290 -235391
580b35391j18210R2937L00666j73603p5990P1167J44824J28880k24647j44000
$$ -235391 -353601 -260664 40002 -133601 -209591 -138424 6400 135280 -89367 -233367
570b33367J57064q6293j12161J94262K39851j13085m8308p4483J36406M29541
$$ -233367 -76303 -162596 -274757 -80495 159356 46271 -2037 -76520 59886 489427
560D89427l40081l93916J31563j68985N0245J70986K48175j78979N8297J10466
$$ 489427 149346 -244570 -113007 -281992 -231747 -60761 187414 8435 66732 177198
550A77198P9049k58030l40805m3510K51261J16292p0943J87434O0535j54399k23489
$$ 177198 256247 -1783 -342588 -386098 -134837 -18545 -89488 97946 158481 4082 -219407
539b19407R8064j24267j6924p6940K07865q3040j04j35812J77944J90836q7296
$$ -219407 -121343 -245610 -262534 -339474 -131609 -214649 -214753 -350565 -172621 18215 -69081
528f9081j96467j21759K80502J1446l73055N5554n4239J45666M1718j44580J26203
$$ -69081 -265548 -387307 -106805 -95359 -468414 -412860 -467099 -321433 -279715 -424295 -298092
517b98092k11448J11754N50218p2107k24002J90762Q4566J7265j41760r4221k71661
$$ -298092 -509540 -397786 152432 80325 -143677 47085 131651 148916 7156 -87065 -358726
506c58726J04478L8628J6390O08295k00849J561k7228m48216J55533K04312P8375
$$ -358726 -254248 -215620 -199230 409065 208216 209777 182549 -265667 -110134 94178 172553
495A72553j69088J66107o3245l193J07732J3429j17937k46338j75799Q8747Q8664
$$ 172553 3465 169572 106327 103134 210866 224295 106358 -139980 -315779 -227032 -138368
484a38368q0482R6141k2848j88186J20632J37178k30753Q0922P7159L14533j72464
$$ -138368 -218850 -122709 -145557 -333743 -213111 -75933 -306686 -225764 -148605 165928 -6536
473f536o524l36061J309N4355j32964J75749j87944J16004M06812k78961k12653
$$ -6536 -13060 -349121 -347812 -293457 -426421 -250672 -438616 -322612 84200 -194761 -407414
462d07414K52084N5148R5326N3331j30115k15128K07739K18305M68949l56514
$$ -407414 -155330 -100182 -4856 48475 -81640 -296768 -89029 129276 598225 241711
452B41711l7412N1775j39810O5343j61149j93428j55622J96845J80950p9630q6441
$$ 241711 204299 256074 116264 181607 20458 -172970 -328592 -131747 49203 -30427 -116868
441a16868J22935j3304P0378m202k06152L82783l89344J46051K54044j44415k76594
$$ -116868 6067 -7237 63141 58939 -147213 235570 -153774 -7723 246321 101906 -174688
430a74688Q6550K34472j18670p7860J7379K8658j50619j01751J1919J54517k69900
$$ -174688 -88138 146334 27664 -50196 -32817 -4159 -154778 -256529 -244610 -90093 -359993
419c59993j49563J96656O972K8988L69459o9478M9882m16863K55641J01920J13988
$$ -359993 -509556 -312900 -305928 -276940 92519 23041 72923 -343940 -88299 13621 127609
408A27609j00556r1614K55469j20099l72584K16708J21180J28977m981p1450J38919
$$ 127609 27053 -64561 190908 70809 -301775 -85067 36113 165090 160109 88659 227578
397B27578l75859K35043n218k12022j28759j9915J42266N12088k01668k85474
$$ 227578 -148281 86762 81544 -130478 -259237 -279152 -136886 375202 173534 -111940
387a11940J66222J2041J7698N5376m1943n22780K64363J93029k00546J01941j74109
$$ -111940 54282 66323 84021 139397 97454 -425326 -160963 32066 -168480 -66539 -240648
376b40648O1759N9385N8381k14036J28845p522n7373Q9329l13955K84338K30560
$$ -240648 -178889 -119504 -61123 -275159 -146314 -153836 -211209 -121880 -435835 -151497 79063
365G9063J47043r4101J03214M9195k28641k55150K62133r7671q3941J45207j16484
$$ 79063 226106 132005 235219 284414 55773 -199377 62756 -34915 -118856 26351 -90133
354i0133p9336j59698J91108N6969L85255R0378q6575j9090k78766r2814o2217
$$ -90133 -169469 -329167 -138059 -81090 304165 394543 307968 288878 10112 -82702 -144919
343a44919k42754R4065K5341j3011J60940j47190K95405J38023j32121r5754k9148
$$ -144919 -387673 -293608 -268267 -281278 -120338 -267528 27877 165900 33779 -61975 -91123
332i1123K95697k2495j06580l37840n2180n5361L52997j6879J43307O7318l4429
$$ -91123 204574 182079 75499 -262341 -314521 -369882 -16885 -33764 109543 176861 142432
321A42432J57685o0589p6587j51124K05174j66536M0385j90081k11366L55339
$$ 142432 300117 239528 162941 11817 216991 50455 90840 -99241 -310607 44732
311D4732o0949m4633J02858M23121o7123k38490j44724k01148K78921j24205n8191
$$ 44732 -16217 -60850 42008 465129 398006 159516 14792 -186356 92565 -31640 -89831
$$ [...]
##END NTUPLES=NMR SPECTRUM
##END=
