##TITLE=1H_CG-1199-2
 CDCl3
 8 sc, 
 5.4.2024
##JCAMPDX= 6.0         $$ Bruker NMR JCAMP-DX V2.0
##DATA TYPE= NMR SPECTRUM
##DATA CLASS= NTUPLES
##ORIGIN= UXNMR, Bruker Analytische Messtechnik GmbH
##OWNER= root
$$ XWIN-NMR		Version 3.5
$$ Fri Apr  5 14:21:08 2024 Russian Standard Time (UT+4h)  she@DPX200
##.OBSERVE FREQUENCY= 200.1309
##.OBSERVE NUCLEUS= ^1H
##.ACQUISITION MODE= SIMULTANEOUS
##.ACQUISITION SCHEME= undefined
##.AVERAGES= 8
##.DIGITISER RES= 18
##SPECTROMETER/DATA SYSTEM= spect
##.PULSE SEQUENCE= zg30
##.SOLVENT NAME= MeOD
##.SHIFT REFERENCE= (INTERNAL, MeOD, 0, 15.7106)
##AUDIT TRAIL= $$ (NUMBER, WHEN, WHO, WHERE, WHAT)
$$ ##TITLE= Audit trail, XWIN-NMR		Version 3.5
$$ ##JCAMPDX= 5.01
$$ ##ORIGIN= Bruker BioSpin GmbH
$$ ##OWNER= she
$$ F:/spectra/data/she/nmr/H-F/1/pdata/1/auditp.txt
$$ ##AUDIT TRAIL=  $$ (NUMBER, WHEN, WHO, WHERE, WHAT)
(   1,<2024-04-05 14:20:02.70 +0400>,<she>,<DPX200>,
      <created by zg, POWCHK disabled, PULCHK disabled
       configuration hash MD5:
       00 E9 B6 7A A2 85 ED C7 34 08 36 98 17 FE 4E 26
       data hash MD5: 16K
       BA 5F 91 05 45 DC 97 42 24 67 58 A8 13 15 00 9E>)
(   2,<2024-04-05 14:20:08.53 +0400>,<she>,<DPX200>,
      <Start of raw data processing
       efp BC_mod = 2 LB = 0.24 FT_mod = 6 PKNL = 1 PHC0 = -25297.38 PHC1 = 10.98731 SI = 16K 
       data hash MD5: 16K
       B5 B7 83 C6 5E DB F3 A3 F6 F3 46 75 1F 39 31 1A>)
(   3,<2024-04-05 14:20:28.67 +0400>,<she>,<DPX200>,
      <pk PHC0 = -0.04511408 PHC1 = 0 
       data hash MD5: 16K
       DC 48 07 5E 4C 4E 5C 51 CB 16 34 99 60 A2 0B 06>)
(   4,<2024-04-05 14:20:31.96 +0400>,<she>,<DPX200>,
      <abs ABSG = 5 
       data hash MD5: 16K
       7B 84 19 2D B3 89 9F 1F D9 67 07 2B 37 E2 AB 15>)
$$ ##END=
$$ 
$$ hash MD5
$$ 73 3B C3 68 84 EB BC 7D CB 14 18 CB 62 FF 84 5C
##$RELAX= 
##$RELAX= 
##$RELAX= 
##$RELAX= 
##$RELAX= 
##$RELAX= 
$$ Bruker specific parameters
$$ --------------------------
##$DU= <F:/spectra>
##$EXPNO= 1
##$NAME= <H-F>
##$PROCNO= 1
##$TYPE= <nmr>
##$USER= <she>
##$AMP= (0..31)
100 100 100 100 100 100 100 100 100 100 100 100 100 100 100 100 100 100 
100 100 100 100 100 100 100 100 100 100 100 100 100 100 
##$AQSEQ= 0
##$AQ_mod= 1
##$AUNM= <au_zg>
##$AUTOPOS= <>
##$BF1= 200.13
##$BF2= 200.13
##$BF3= 200.13
##$BF4= 200.13
##$BF5= 200.13
##$BF6= 200.13
##$BF7= 200.13
##$BF8= 200.13
##$BYTORDA= 1
##$CFDGTYP= 0
##$CFRGTYP= 5
##$CHEMSTR= <none>
##$CNST= (0..31)
1 1 145 1 1 1 1 1 1 1 1 1 1 1 1 1 1 1 1 1 1 1 1 1 1 1 1 1 1 1 1 1 
##$CPDPRG= <>
##$CPDPRG1= <>
##$CPDPRG2= <>
##$CPDPRG3= <>
##$CPDPRG4= <mlev>
##$CPDPRG5= <mlev>
##$CPDPRG6= <mlev>
##$CPDPRG7= <mlev>
##$CPDPRG8= <mlev>
##$CPDPRGB= <>
##$CPDPRGT= <>
##$D= (0..31)
0 1.2 0 0 0 0 0 0 0 0.06 0 0.03 0 0 0 0 0.0002 0 0 0 0 0 0 0 0 0 0 0 0 
0 0 0 
##$DATE= 1712312402
##$DBL= (0..7)
120 120 120 120 120 120 120 120 
##$DBP= (0..7)
150 150 150 150 150 150 150 150 
##$DBP07= 0
##$DBPNAM0= <>
##$DBPNAM1= <>
##$DBPNAM2= <>
##$DBPNAM3= <>
##$DBPNAM4= <>
##$DBPNAM5= <>
$$ [...]
##$SUBNAM3= <"">
##$SUBNAM4= <"">
##$SUBNAM5= <"">
##$SUBNAM6= <"">
##$SUBNAM7= <"">
##$SUBNAM8= <"">
##$SUBNAM9= <"">
##$SW= 18.0517689322627
##$SWIBOX= (0..15)
0 0 2 0 0 0 0 0 0 0 0 0 0 0 0 0 
##$SW_h= 3612.71676300578
##$TD= 16384
##$TD0= 1
##$TE= 0
##$TE2= 300
##$TE3= 300
##$TEG= 300
##$TL= (0..7)
0 120 120 120 120 120 120 120 
##$TP= (0..7)
150 150 150 150 150 150 150 150 
##$TP07= 0
##$TPNAME0= <>
##$TPNAME1= <>
##$TPNAME2= <>
##$TPNAME3= <>
##$TPNAME4= <>
##$TPNAME5= <>
##$TPNAME6= <>
##$TPNAME7= <>
##$TPOAL= (0..7)
0.5 0.5 0.5 0.5 0.5 0.5 0.5 0.5 
##$TPOFFS= (0..7)
0 0 0 0 0 0 0 0 
##$TUNHIN= 0
##$TUNHOUT= 0
##$TUNXOUT= 0
##$USERA1= <user>
##$USERA2= <user>
##$USERA3= <user>
##$USERA4= <user>
##$USERA5= <user>
##$V9= 5
##$VALIST= <valist>
##$VCLIST= <CCCCCCCCCCCCCCC>
##$VD= 0
##$VDLIST= <DDDDDDDDDDDDDDD>
##$VPLIST= <PPPPPPPPPPPPPPP>
##$VTLIST= <TTTTTTTTTTTTTTT>
##$WBST= 1024
##$WBSW= 4
##$XGAIN= (0..3)
0 0 0 0 
##$XL= 0
##$YL= 0
##$YMAX_a= 606453
##$YMIN_a= -662289
##$ZGOPTNS= <>
##$ZL1= 120
##$ZL2= 120
##$ZL3= 120
##$ZL4= 120
##$ABSF1= 15.64225
##$ABSF2= -2.409637
##$ABSG= 5
##$ABSL= 3
##$ALPHA= 0
##$AQORDER= 0
##$ASSFAC= 0
##$ASSFACI= 0
##$ASSFACX= 0
##$ASSWID= 0
##$AUNMP= <proc_1d>
##$AZFE= 0.1
##$AZFW= 0.1
##$BCFW= 0
##$BC_mod= 2
##$BYTORDP= 0
##$COROFFS= 0
##$CY= -3
##$DATMOD= 1
##$DC= 0
##$DFILT= <>
##$DTYPP= 0
##$F1P= 0
##$F2P= 0
##$FCOR= 1
##$FTSIZE= 16384
##$FT_mod= 6
##$GAMMA= 0
##$GB= 0
##$INTBC= 1
##$INTSCL= 3.70164e-10
##$ISEN= 128
##$LB= 0.24
##$LEV0= 0
##$LPBIN= 0
##$MAXI= 10000
##$MC2= 0
##$MEAN= 0
##$ME_mod= 0
##$MI= 1.114404
##$NCOEF= 0
##$NC_proc= -6
##$NLEV= 6
##$NOISF1= 3.799351
##$NOISF2= 2.8
##$NSP= 0
##$NTH_PI= 0
##$NZP= 0
##$OFFSET= 15.71056
##$PC= 1
##$PHC0= -25297.43
##$PHC1= 10.98731
##$PH_mod= 1
##$PKNL= yes
##$PPARMOD= 0
##$PSCAL= 0
##$PSIGN= 0
##$REVERSE= no
##$SF= 200.129562208899
##$SI= 16384
##$SIGF1= 3
##$SIGF2= 2
##$SINO= 5.538805
##$SIOLD= 16384
##$SREGLST= <1H.CDCl3>
##$SSB= 0
##$STSI= 16384
##$STSR= 0
##$SW_p= 3612.71676300577
##$SYMM= 0
##$S_DEV= 0
##$TDeff= 16384
##$TDoff= 0
##$TI= <>
##$TILT= no
##$TM1= 0
##$TM2= 0
##$TOPLEV= 0
##$USERP1= <user>
##$USERP2= <user>
##$USERP3= <user>
##$USERP4= <user>
##$USERP5= <user>
##$WDW= 1
##$XDIM= 16384
##$YMAX_p= 493473942
##$YMIN_p= -517381
$$ End of Bruker specific parameters
$$ ---------------------------------
##NTUPLES= NMR SPECTRUM
##VAR_NAME=  FREQUENCY,     SPECTRUM/REAL,   SPECTRUM/IMAG
##SYMBOL=    X,             R,               I
##VAR_TYPE=  INDEPENDENT,   DEPENDENT,       DEPENDENT
##VAR_FORM=  AFFN,          ASDF,            ASDF
##VAR_DIM=   16384,         16384,           16384
##UNITS=     HZ,            ARBITRARY UNITS, ARBITRARY UNITS
##FACTOR=    0.220516191357247, 1,           1
##FIRST=     3144.14746383069, 0,            0
##LAST=      -468.569299175075, 0,           0
##MIN=       -468.569299175075, -517381,     0
##MAX=       3144.14746383069, 493473942,    0
$$ Real data points
##PAGE= N=1
##DATA TABLE= (X++(R..R)), XYDATA
$$ [...]
7693i0463m4948n4077k1946p4822j4430R0151j0812m9118O788J53846k05274l9349
7681c54454L4146R2155m7288r761J40376K1352q6170q3852J06358J98564n1887
7670d0461j62388J48327J04219j52635K097j2736M5854k8328p6416m54J06409
7659f6512O0884j34967O3559O9225j2591q9913M4502R0504J54455j47111O282
7648C8317P9059o8141L1703L1671p4233n3400R8334k2493o3980N8028L6971k7678
7636F4158O1471j09054J093j4761R8941n6272q4149K2259l2194j17889o6273J39447
7624i3223P8594j2285L527J466O4163L2496L710k23905K9704Q3049j62585l7894
7612b33183K2518J44090K5989l7907P2394J06156n5390j3266n6696j08673k3254
$$ y = [-90463, -135411, -189488, -211434, -286256, -300686, -210535, -221347, -270465, -263677, -109831, -315105, -354454, -320308, -228153, -275441, -285202, -144826, -123474, -209644, -293496, -187138, 11426, -40461, -202849, -54522, 49697, -102938, -100841, -113577, -67723, -96051, -172467, -172921, -66512, -5628, -140595, -77036, -7811, -20402, -110315, -65813, 24691, 179146, 32035, 38317, 117376, 49235, 80938, 112609, 38376, -15024, 83310, 60817, -3163, 54865, 91836, 64158, 125629, 16575, 17668, 2907, 101848, 45576, -38573, -16314, -48508, -166397, -232670, -93223, -14629, -26914, -23387, -21921, 42242, 74738, 78448, -145457, -115753, -32704, -195289, -233183, -210665, -66575, -40586, -78493, -6099, 100057, 44667, 31401, -25295, -133968, -157222]
7601a57222R3127o1027k1245k0559m1333M3433r501O204R3349K4406q1459J8108
7589a13719J8858k6852J951K7270J828N358M6876L559l5757q4895K7001M7345
7577h1177j34487n0910J08289M771l0406K8562J0174l5013n1959J25465J10146
7566C455m0092J2047j17169j24998O4975J92371k949j30206m204R2989q409R8091
7554C5901j8791j26458m6005l1635Q896l1731P5514k6382L5853j29207N9784J28851
7542f5410L480r6326j73691J43557L0758L4854J84956n2338j52218j01749M5007
7531a99120J10753J9089j02226k796o374L2634P7222o9490K2099K3304j0746r3143
7519a98794j01766L9743L6372J18040J01815l3415K051k10574n7762K07954l1503
$$ y = [-157222, -64095, -125122, -146367, -166926, -208259, -164826, -174327, -168123, -74774, -50368, -131827, -113719, -94861, -121713, -119762, -92492, -90664, -85306, -38430, -34871, -70628, -155523, -128522, -81177, -215664, -266574, -158285, -153514, -183920, -155358, -145184, -180197, -232156, -106691, 3455, -36637, -24590, -141759, -266757, -201782, -9411, -12360, -142566, -146770, -53781, -62190, 35901, 17110, -109348, -155353, -186988, -178092, -209823, -134309, -160691, -124838, -254045, -194261, -65410, -61930, -158256, -331947, -188390, -157632, -122778, 62178, 9840, -142378, -244127, -199120, -88367, -69278, -171504, -174300, -180674, -148040, -70818, -140308, -118209, -94905, -105651, -198794, -300560, -260817, -224445, -106405, -4590, -38005, -35954, -246528, -304290, -96336, -127839]
7508a27839n5306O7222J15114m1762j03641k1549K5548l8202P6566J16400j14684
7497a02133k9259J25775l4563O9729n3124j18145M5153L4556n6648O0760k9663
7486h7562M1193L9471j4557M4863p809m2130J5367k8722O0056j6249k9447P8836
7474E3310m822J60334P209k2219j97859M7222J41870p4870j70133l6564M5299
7463e1223K00435J18664m7304K5320J15743J850o1880n8180O311k9246O3949J06952
7451C91391M4785r1247m3017j40926j7749q5219p2859P9750r124j11056J17753
7440F2482j11763j0776P2282N531j02459j06424J37633l0863M5256n9975K8013
7429g1063k7856j572J6504J07282m4889j26724m9450K8775N1860l6083N2074M7660
$$ y = [-127839, -183145, -115923, -809, -42571, -146212, -167761, -142213, -180415, -103849, 12551, -102133, -131392, -5617, -40180, 29549, -23575, -141720, -96567, -62011, -118659, -57899, -87562, -46369, -6898, -21455, 23408, 15599, -26531, -11164, -39886, 20170, 3921, -25526, 53310, 48488, 208822, 216031, 193812, -4047, 43175, 185045, 110175, -59958, -96522, -51223, 149212, 267876, 220572, 245892, 361635, 363485, 301605, 243425, 249736, 220490, 284439, 391391, 436176, 344929, 301912, 160986, 143237, 58018, -14841, 64909, 55785, -55271, 62482, -49281, -60057, 12225, 17756, -84703, -191127, -53494, -84357, -39101, -99076, -71063, -98919, -100491, -83987, 23295, -21594, -148318, -197768, -168993, -117133, -153216, -101142, -53482]
7417e3482m2791j458O3589r2482o3216J62777k1302j81838P7473J1874p5851P4315
7405a42392L8251q845q0596P5124j29505J9472P8392j4055O5197n5250k845m0599
7393a97651o2859n4366M7868O732M5946J12863r8296l454j21604J01770J00792
7382a22259k573k1953O1780k3349j51826j5860K2492L7725n7937P575Q1649M7807
7370a36729J10874r712n3253K3657M1620J542k5017q9269J13098o8336J23928
7359C2403J4862j45127k3929n2626N489O0874J1495j5696n2666J2671J1974j43718
7347b83994J52206n3550R7675K9943r4371O1061M2197o7405r2114K4214R7117
7336h7021q1587o931J84701K4137M997p1638k09595J11045o2177k6352J75149
$$ y = [-53482, -96273, -97731, -34142, -126624, -189840, -27063, -48365, -230203, -152730, -140856, -216707, -142392, -104141, -112986, -193582, -118458, -247963, -228491, -150099, -164154, -98957, -154207, -157052, -197651, -260510, -314876, -267008, -260276, -214330, -101467, -199763, -203217, -324821, -223051, -122259, -124832, -146785, -85005, -108354, -260180, -276040, -253548, -215823, -273760, -266185, -184536, -136729, -25855, -35567, -88820, -65163, -23543, -22001, -47018, -136287, -23189, -91525, 32403, 47265, -97862, -121791, -174417, -168928, -108054, -96559, -112255, -164921, -152250, -140276, -283994, -131788, -185338, -87663, -57720, -152091, -91030, -48833, -116238, -208352, -184138, -87021, -168608, -175539, 9162, 33299, 38296, -33342, -242937, -131892, -194069, -220421, -45272]
7325d5272n504l8381R126k1840j4116m6917n068o1076R9538k0386q2902J30326
7313a02472N4144j04185k6389N5802O7938J0960j5132M357j5788L6604l34R655
7301b4840q5609O8000j66359j0587J71818J999q1970n9358P6019N9929q6987P5804
7289f2141J7703n2172r6935p8845M2785k837M7976q847r7444n0944J23149R545
7277b09007l3638K1066P1521l1100j03778J2132Q0045N6759o2297k5230O6130
7266a57397j03478O0740k3786J0968l393j71538J4324J09685J0538M1375O1681
7255a50281O7748p6296q3540N808q0501l3983J59043P7321K8017m393j02458k960
7243a96475J42530p2079o662l987m2226o5535l7426R4737K5617l4047j30119J73258
$$ y = [-45272, -50776, -89157, -80031, -101871, -115987, -162904, -167972, -229048, -129510, -149896, -232798, -102472, -48328, -152513, -178902, -123100, -55162, -44202, -59334, -54977, -70765, -34161, -34495, -24840, -110449, -42449, -208808, -219395, -47577, -45578, -127548, -186906, -110887, -50958, -137945, -62141, -44438, -96610, -193545, -272390, -229605, -232442, -184466, -193313, -290757, -341701, -218552, -209007, -242645, -221579, -150058, -181158, -284936, -272804, -192759, -136000, -198297, -223527, -157397, -260875, -200135, -223921, -212953, -216346, -387884, -373560, -263875, -253337, -211962, -150281, -82533, -158829, -242369, -236561, -317062, -351045, -192002, -114681, -86664, -91057, -193515, -196475, -53945, -126024, -132686, -136673, -178899, -244434, -281860, -187123, -161506, -195553, -325672, -152414]
7231a52414P1880j15241r164J03465M8970o5813m2865J9524l3527Q7436j03580
7220a91329Q978K9819j3019r2678j0450R118r9513R2892P4955n6068o6772K3552
7208b90515Q6807L3361M2941m880j03282K0949O8986Q1703m2160m1121k0270j15453
7196b82934L7383J51804p6934l141q8974L6490J40592K5401o2775m7933L3504
7185a37517J8599O1423l7802N8812J9821k5028J0774j02892k5093Q0603J0659
7174f7641j00048N146R05M689o5423K1962l5727J67548J15822j10913K67l8577
7162a01990L0808j25514n8838K5199Q6211m3633m7074O0125n1922L510J19638
7151a03480J24253Q817L715M4577o1766o4343j18682L1731l7566J1729R4002r7061
$$ y = [-152414, -80534, -195775, -204939, -101474, -52504, -118317, -161182, -141658, -175185, -87749, -191329, -182351, -152532, -165551, -258229, -268679, -259561, -359074, -266182, -191227, -247295, -314067, -290515, -203708, -170347, -127406, -132286, -235568, -214619, -145633, -63930, -106090, -147211, -167481, -282934, -245551, -93747, -170681, -173822, -262796, -226306, -85714, -60313, -123088, -171021, -137517, -118918, -57495, -95297, -36485, -16664, -41692, -30918, -133810, -158903, -78300, -67641, -167689, -162543, -161638, -156949, -222372, -200410, -236137, -68589, 47233, -63680, -63413, -101990, -71182, -196696, -255534, -230335, -144124, -187757, -234831, -174706, -226628, -223118, -103480, 20773, 29590, 33305, 77882, 16116, -48227, -166909, -135178, -172744, -161015, -67013, -164074]
7139a64074j36627J16099O1022j7316n9751R5136J47250m9644O5328N5012j74323
7128f1888k3018L4233j5416j55296p8488K4708m177M2456P3247K9558J13138M9434
7116B8491r9313o2551r2142r080k6394J77510k7984l0396l5808k0668N2255Q7086
7104e8994J49775j06996n5347q0160r2428P6961N8697m8285K6308l5222k3017
7093a88708k3294M9130o1616K2590J27957M2320m7231j468Q6106j8390j20894
7082a33498p803J7030j2872J44281o8014j00986p107j0881L9833J19316n6357
7071g7058j6713J2478j9008n6375R649J06990Q3489L5210j41837p0625P9988N3878
7059F6L9082j57314O5530K5950k2637L3947l8492m51m016K4368n1810J33992L3279
$$ y = [-164074, -300701, -184602, -123580, -140896, -200647, -105511, 41739, -7905, 57423, 112435, -61888, -84906, -50673, -66089, -221385, -299873, -275165, -279342, -236886, -163639, -134081, -20943, 28491, -70822, -133373, -225515, -234595, -260989, -83479, -111463, -141859, -177667, -198335, -146080, -58994, 90781, -16215, -71562, -151722, -244150, -167189, -108492, -156777, -130469, -165691, -188708, -212002, -162872, -224488, -201898, -73941, -31621, -78852, -80320, 5786, -12604, -133498, -141301, -124271, -137143, 7138, -60876, -161862, -168969, -179850, -140017, -20701, -77058, -93771, -81293, -100301, -156676, -147027, -40037, 43452, 78662, -63175, -133800, -53812, 66, 39148, -118166, -52636, -26686, -49323, -15376, -53868, -54319, -58335, -33967, -85777, 48215, 81494]
7046H1494j86844K1982p424k6048K4381Q5216r4424P0064J6910j48030j02198
7035b64921N1760J05567l5973k2756k5360k4708K8124j6065J48205K438J09222
7024E5533m4235L0123l9200j11494k2496K5612P8895L9114r2175k1361o5804l8064
7012b05552J03881j1351p2924J2116J8998p0036O9755j1110K4276j10576M8456
7001b04067m3472J26400P5647L7650O3p3497O0955q4154j2675J8873r3396M621
6989a87052l1580J8454p616Q599L5531L8247j25767n9362J36670L2394K4722K7452
6977h9308l9932J4274o6315J59530J13363j04736j14873O9494p5731N7135n6824
6966a33923k2143j280L1758j7111L3409j07071L3133J73135o1623n0766L7299
$$ y = [81494, -105350, -83368, -90792, -116840, -92459, -7243, -101667, -31603, -14693, -162723, -264921, -213161, -107594, -143567, -166323, -191683, -216391, -188267, -204332, -56127, -53689, 55533, 11298, 41421, 2221, -109273, -131769, -106157, -27262, 11852, -80323, -101684, -167488, -205552, -101671, -113022, -185946, -173830, -154832, -224868, -155113, -166223, -141947, -252523, -204067, -247539, -121139, -45492, -7842, -7779, -81276, -20321, -104475, -117150, -98277, -191673, -187052, -218632, -200178, -207794, -199195, -163664, -125417, -251184, -310546, -173876, -141482, -116760, -89308, -129240, -114966, -181281, -21751, 91612, -13124, -127997, -58503, -134234, -77099, -133923, -156066, -157346, -125588, -142699, -109290, -216361, -183228, -10093, -71716, -122482, -85183]
6955h5183P5777Q9933K993p8044l5729N7733k6663l130m9681K267l4108j74512
6943b58347J027k6579N4314p27q8927J3173J6746n4495J02047M5176K3978L4072
6931a38542R5879K5903L9627k6361l939o7445J3397j11142j7312J55452N6347
6920B1864o8900o1176m4117k25625R9189J67605k9815K3617n4518l375K2039m4811
6908a98023J5810O7396n8262K4572k5190R4953l0612p1219n3801J50539j46852
6897b30689r0697Q2473N5251l4424m6459l3365J18870j07659L7968J50369k9921
6886a28283J45428j40466r8119O3865R9468l0674P0301o5193k9008K5529r1397
6875a78549n7634q9768O1754P8593j326J28489N0308n590j07744P9547R2488l7604
$$ y = [-85183, -9406, 80527, 83520, 5476, -30253, 27480, 817, -2313, -51994, -49727, -83835, -258347, -257320, -283899, -229585, -230312, -319239, -306066, -289320, -343815, -241768, -196592, -172614, -138542, -42663, -16760, 22867, -3494, -7433, -74878, -61481, -172623, -189935, -34483, 21864, -47036, -108212, -152329, -377954, -278765, -111160, -140975, -117358, -171876, -175251, -153212, -198023, -182213, -114817, -173079, -148507, -173697, -78744, -109356, -180575, -234376, -83837, -230689, -321386, -238913, -183662, -218086, -264545, -297910, -179040, -286699, -248731, -98362, -128283, 17145, -123321, -221440, -157575, -58107, -88781, -18480, -83673, -112681, -87152, -178549, -236183, -325951, -264197, -185604, -186930, -58441, -8133, -13723, -121467, -41920, 50568, 12964]
6863A2964p886m9469n2800Q1751k2009k3958P1493K5358k6454J0023j36r2587
6851g3710n1243L5633k5344J51287N5878M7857o1440q1709m5268j06119J66931
6840A2753J18686O25K2008j788j01987K7595p1290j79971q172L2314Q8863j3213
6828g3577n4888P5136O9969p6712L4287j34457r9657K0819J43308J59117o5386
6817b041K305j7019p7724Q508J75063l6547n5901r2951L0809K15108l1780k77603
6805a59773J8456N3183o9j6912r1005J16173P4388o9425R5964K4307j14354M5199
6793b3868K2936o6321J36627J09584K1842K2167p5535p1188q2553J30547J06535
6782B30773j1444l8752j31199P0985j18727q4629P1120J20412p575n9096O2922
$$ y = [12964, 5078, -44391, -97191, -15440, -37449, -61407, 10086, 35444, 8990, 19013, 18877, -73710, -124953, -89320, -114664, 36623, 92501, 140358, 78918, -2791, -48059, -154178, 12753, 131439, 132064, 154072, 152284, 50297, 77892, 6602, -173369, -181541, -149227, -60364, -73577, -128465, -53329, 16640, -60072, -25785, -160242, -259899, -239080, -95772, 63345, -2041, 264, -16755, -94479, -85971, 89092, 52545, -3356, -96307, -65498, 149610, 117830, -159773, -141317, -88134, -88203, -105115, -196120, -79947, -5559, -74984, 20980, 45287, -69067, -23868, -932, -67253, 69374, 178958, 200800, 222967, 147432, 76244, -6309, 124238, 230773, 219329, 180577, 49378, 120363, 1636, -82993, -11873, 108539, 100964, 41868, 104790]
6771A04790N6446J30497p3198j01389K0828M9286j29936m4928J5168L840j9102
6760A2302q6135P0136J4841q9009o4517j2444J6021J02077m0350l4565L8922K2188
6748e0533K4937N224J1853J1496O576M4521j748j59457P6307J26294p9282o593
6736I595Q6720L7827l3787j39311P5738j3719q4605K20974M7261j43080M1578
6725A05191j37685j2311L8082L5168n6659J03718N2288j8453j70941K8621N2837
6714A9856n5030L8719j1281n2203m3081J41583J9391O2343r5707N510m2587j04472
6702a16959Q2258l2109j04680N9527J74064o3878k528Q6058q4646l6630M3616
6691D093L6545j1191p3464j47168N0271O1850k19226M9713J91324l551M0202l2137
$$ y = [104790, 161236, 291733, 218535, 117146, 137974, 187260, 57324, 12396, 27564, 31404, 12302, -73833, -3697, 11144, -77865, -142382, -154826, -138805, -36728, -77078, -111643, -72721, -50533, -25596, -20372, -8519, 2977, 9553, 54074, 52326, -107131, -30824, 95470, 16188, 9595, 96315, 134142, 100355, -38956, 36782, 23063, -61542, 159432, 206693, 63613, 105191, -32494, -44805, -6723, 28445, -28214, 75504, 127792, 109339, -61602, -32981, 19856, -35174, 3545, -7736, -59939, -103020, 38563, 57954, 120297, 24590, 30100, -12487, -116959, -34701, -66810, -171490, -111963, 62101, -1777, -4305, 81753, -2893, -39523, 4093, 40638, 29447, -44017, -191185, -140914, -79064, -298290, -248577, -57253, -60804, -20602, -52739]
6679e2739j99042O1570K29269o648j16251j7401K0264l8333R7654j06531J774
6668a26414J3952O080P7034k809K8220o2651j17665k0193J51170P8025L1828M6153
6656A02730k01750j0818n0760j6974P6762O3652j76252P39J06436J8308n8169
6645a46096m7850k8981L1475P6468q4416J2080J52465J0889q8435Q0661P2249
6634D0509l2065j24924N499Q5065n7915K943l3865n0193Q0438j01517k4980J29057
6622h1948m6477n9081P6079K2418n4510n8160J33606N7197J894P7800p0119n9947
6610f1248r5420k0431O9326o830N7836j1691K5860M210r1686O9815l5223o79M2223
6597e3938J22270R772l0136o4470j90707O7132M6557o295J7439L2068q2076p988
$$ y = [-52739, -251781, -190211, 39058, 32410, -83841, -101242, -80978, -119311, -21657, -128188, -126414, -112462, -106382, -29348, -32157, -3937, -66588, -184253, -204446, -53276, 24749, 56577, 102730, -99020, -109838, -160598, -177572, -100810, -37158, -213410, -212671, -106235, -87927, -146096, -193946, -222927, -191452, -114984, -199400, -187320, -34855, -23966, -112401, -31740, 40509, 8444, -116480, -110981, -25916, -83831, -80888, -114753, -164946, -84508, -186025, -211005, -81948, -128425, -187506, -111427, -89009, -143519, -201679, -68073, -10876, -8982, 68818, -1301, -61248, -156668, -177099, -107773, -114603, -56767, -68458, -42598, -38388, -130074, -60259, -95482, -96161, -53938, 68332, 78104, 47968, -16502, -207209, -140077, -93520, -99815, -82376, -50308, -132384, -140372]
6585a40372M5669O264N3684n48k4805P3679J01699J9829j5235p6717L880m0021
6573G006O6781n4931o2908J32500j63332J5389Q825r9021j0207N7653K2991P4141
6561e113q6987K6324o0679m8992J352M8063J1058J24706L6757R539n9523j4839
6549a8334n4577m6464P9583l6790L2151J37680l0997k5213M7106q8744L4015O8159
6537I7575o5176O1673r3319K8821J17160j37758P0733o8564Q901K1647Q6430m6982
6525H1141j06503J0202j6351J26632K1392j22225j09030M1253K723L0085J16643
6514G5962q2251p611k2647k8136j6505J01375j02131P7236K8566K2818P4452l4829
6502H6299j2133N130L5095p4437J6396j6467o0768O7769M3177o0209n524n4942
$$ y = [-140372, -94703, -88439, -34755, -35303, -60108, 13571, 115270, 135099, 119864, 43147, 47027, 7006, 73787, 18856, -44052, 88448, -74884, -59495, -50670, -149691, -159898, -102245, -79254, -5113, -92100, -65776, -126455, -175447, -174095, -126032, -114974, 9732, 46489, 56028, -3495, -18334, -72911, -119375, -39792, -76582, -44431, 93249, 62252, 37039, 84145, -4599, 29416, 97575, 32399, 94072, 753, 29574, 146734, 8976, 79709, 11145, 20046, 41693, 128123, 81141, -25362, -15160, -31511, 95121, 116513, -5712, -114742, -73489, -70766, -40681, 75962, -6289, -13900, -36547, -64683, -81188, 20187, -81944, -4708, 23858, 46676, 121128, 86299, 74166, 79296, 114391, 39954, 56350, 39883, -20885, 46884, 90061, 29852, 24328, -30614]
6490c0614R0147K6782j03946j34193L9037J46656J23401n5835j02111j44542m9981
6479a95199P1526P0146Q8686L0454M1638L514l9061r9456m1133J235M2990P8131
6467E3471K8817p8460K1352m806N6030j48952J34995j28378q9955P4632J24663
6456D3409k7164O59K0471o9161N1753O0188k4062k4365l543j14134L4265o7852
6444a19536l2650P5413l7720P0106L1710k8970N5122N3600l5091L4273q0340r7282
6432a11365K03339l3654j18719m2487L2829n5908M1208J05184K791j7019j8496
6421a2297K7436Q3199k3777j75175L0970J13253r9871J02002R9026N353q9542
6410F0577J2192j9482k9119j54838O3208J7422R3574n8613p7369m992m1203J13826
$$ y = [-30614, 59533, 86315, -17631, -151824, -112787, 33869, 157270, 101435, -676, -145218, -195199, -123673, -53527, 35159, 65613, 107251, 110765, 71704, -27752, -68885, -67650, -24660, 53471, 82288, 3828, 25180, 20374, 76404, -72548, 62447, -65931, -155886, -81254, 43409, 16245, 16904, 37375, -31786, 19967, 80155, 56093, 31728, 28185, -85949, -51684, -119536, -152186, -76773, -114493, -44387, -12677, -41647, 13475, 67075, 31984, 66257, -14083, -111365, 91974, 58320, -60399, -102886, -70057, -125965, -84757, 20427, 23218, 6199, -12297, 15139, 98338, 74561, -100614, -69644, 43609, -56262, 45740, 144766, 150119, 60577, 72769, 53287, 24168, -130670, -67462, -50040, 43534, -15079, -92448, -97440, -138643, -24817]
6398b4817j1980j07399J6063j9201K9886K05549q3862K6047N6646M3885j75634
6387d4817M618R9032q5841M6696o8506J23704O6159j24744J8735j5994k0443l0967
6375c2368L3057R2801m6531j10874J67693K1244j66680J1520k7854O9134J31723
6364A42865m6830o056n007R474J6451j161Q0741j07207l7541r6759N428L5774
6352i828P4692O7125l8394L0426o4415m886M7438J01534k5571n6585l9537J5878
6340I7877M2255j61129O1715L5327J20308j62486o2229J69314J48186P293k15532
6329H0899M2456p4929N5097n4509J9217J43474n6539M959O6929j21942k2326O5366
6317A48152N7785J20426M8342o7276q2568O346M0044Q7654N7908L8651j17422
$$ y = [-24817, -36797, -144196, -128133, -147334, -117448, 88101, 4239, 30286, 86932, 130817, -44817, -40199, 58833, -27008, 19688, -48818, 74886, 141045, 16301, 35036, 19042, -1401, -32368, 689, 93490, 46959, -63915, 103778, 125022, -41658, -30138, -57992, 11142, 142865, 96035, 89979, 84972, 94446, 110897, 109736, 190477, 83270, 45729, -51030, -45602, -9828, 64864, 131989, 93595, 124021, 59606, 54720, 102158, 203692, 178121, 121536, 81999, 97877, 140132, -20997, 40718, 76045, 196353, 33867, -28362, 140952, 289138, 296431, 80899, 123355, 48426, 103523, 49014, 68231, 211705, 155166, 160125, 227054, 105112, 82786, 148152, 205937, 326363, 374705, 307429, 224861, 231207, 271251, 358905, 416813, 455464, 338042]
6306C38042j70416L2107k7562K2805o6304J56121K8791l05M7867k19224K702Q2086
6294B26710l0228q9563j4541Q8256J67927k3911K4095o9817q7177M2626q5976
6283A48401j0515M0282M8005L5598l1454J7430O0631m9633J68673l7280o7327
6272C22811j21598J2065J68149j22966J399M3058M3319p5207l2780J05460r953
6261C33757j8631q5811l3988J29177P8479p1001M3963J44088N096k43297J04177
6250C86009J50651N9955j38838q1113r6380q0258K53404J24788M394j73824k4679
6239C84109N5799M6522J13298j5868o9600R8011k22826K851R1395J6634o2787
6228D37538N089q1151p2499j3238N5932J38319K6317J5146j629O5044m3723j24163
$$ y = [338042, 167626, 199733, 172171, 194976, 128672, 284793, 313584, 313279, 361146, 141922, 144624, 226710, 196482, 106919, 92378, 180634, 348561, 324650, 348745, 278928, 191751, 234377, 148401, 137886, 178168, 226173, 261771, 230317, 247747, 308378, 258745, 427418, 390138, 322811, 201213, 213278, 381427, 258461, 259860, 302918, 346237, 271030, 238250, 343710, 333757, 315126, 229315, 195327, 324504, 402983, 331982, 375945, 520033, 525129, 281832, 386009, 536660, 596615, 457777, 376664, 280284, 200026, 453430, 578218, 582612, 408788, 384109, 439908, 486430, 599728, 583860, 514260, 612271, 389445, 392296, 483691, 500325, 437538, 442627, 361476, 288977, 275739, 331671, 469990, 496307, 511453, 509824, 574868, 531145, 406982]
6216D06982q642R4172j8915l9306M0039j685J10639Q5178j05128K2245k5589p8634
6204D81356N3893M3334l9686m4221k08551N4641k0393O8455k9533N2112R0660
6193E02067q6194J07123R2267j28792j77366N0656Q3680J29623O0344L3702r844
6182F57266j3458n8191m8181O4291Q380O9477M5229l527Q4309p1663J7242r1825
6170F59349N0699M2580j0308o5482l6426P2216L2427j66797J31798M8166k9765
6159G28457o5669P9599P0243j9170J02877Q3384J24080J0063n3207j62040j6066
6148H82551N8328O8814j17235m7027J04156J53845Q370j41972n8624O6347Q6913
6137A064466N7935j25983K9974Q5519l044N9485P5206J6661l481J5046n3290N5895
$$ y = [406982, 398340, 492512, 473597, 434291, 474330, 472645, 583284, 668462, 563334, 585579, 559990, 481356, 535249, 578583, 538897, 494676, 286125, 340766, 320373, 388828, 359295, 411407, 502067, 415873, 522996, 615263, 486471, 309105, 359761, 443441, 573064, 633408, 667110, 657266, 643808, 585617, 537436, 601727, 610107, 679584, 724813, 721286, 805595, 733932, 751174, 659349, 710048, 752628, 742320, 676838, 640412, 712628, 745055, 578258, 710056, 758222, 728457, 662788, 742387, 812630, 793460, 896337, 979721, 1103801, 1113864, 1060657, 898617, 882551, 940879, 1009693, 892458, 845431, 949587, 1103432, 1111802, 969830, 911206, 977553, 1064466, 1122401, 996418, 1026392, 1111911, 1108867, 1168352, 1243558, 1260219, 1256738, 1271784, 1218494, 1274389]
6125A274389K69p7952k6689K9231L1634p9961L5836m0292J10755J51192O649k06504
6113A208557J9318Q8813j23156j84103J28935K1022J05049R0012N7160M4855j21978
6102A334484N3908O9849N7893J00302M1299p8830J35237k8254j6544p4397M6305
6091A641252J0714m3924J8565N3971j5045J10525o3669j60850O2205J10755J0468
6080A734967J9481n6679j9683N5520l4628Q2382J98757M9807j3621J60565O1506
6069B238374k3732O2747O9290Q0371m0545J0340O0921m0569o0913P6611p5433
6058B357462k0458J51911P223m5125N604Q7418p3499J19232Q8318J8482P4742
6047B771310N1684J60313J74416l5237K7383J05211n1916N7596J82042Q1175k9517
$$ y = [1274389, 1274658, 1196706, 1170017, 1199248, 1230882, 1150921, 1186757, 1146465, 1257220, 1408412, 1415061, 1208557, 1227875, 1316688, 1193532, 1009429, 1138364, 1159386, 1264435, 1354447, 1411607, 1456462, 1334484, 1388392, 1458241, 1516134, 1616436, 1657735, 1578905, 1714142, 1685888, 1669344, 1594947, 1641252, 1651966, 1608042, 1626607, 1680578, 1665533, 1776058, 1712389, 1551539, 1613744, 1724499, 1734967, 1754448, 1697769, 1678086, 1733606, 1698978, 1781360, 1980117, 2029924, 2016303, 2176868, 2238374, 2214642, 2277389, 2346679, 2427050, 2386505, 2396845, 2457766, 2417197, 2356284, 2432895, 2357462, 2337004, 2488915, 2496138, 2451013, 2456617, 2544035, 2470536, 2589768, 2678086, 2696568, 2771310, 2822994, 2983307, 3157723, 3122486, 3149869, 3255080, 3203164, 3260760, 3442802, 3523977, 3494460]
6036C494460l0636K8654p4710l3897K12415M2298R7096J52858K8033K14212m1571
6025D089212N9354j34985O2292J30127K43923K11378M7701J02249O8441P7324
6015D957016J80723J27275J04987O9175J82744K44849K01477K14748J07490K17326
6005F607810K88367P1750J6294K05419J63355N9624j6776J97094Q1305M1640J18700
5994G834582J37145Q0887J90002M6627K72823K22151L44853K50111K51704K94986
5984I925871M38540L66023M52166M47593L65314M52991K53895K18840J42200M0731
5974A3104164J25228K98214K45696K21874K69240M61386M77429L97878N34578
5965A6135687M57526O59350Q36152P46299J035178J116161J238074J431436J749583
$$ y = [3494460, 3463824, 3492478, 3417768, 3383871, 3596286, 3638584, 3735680, 3888538, 3916571, 4130783, 4089212, 4148566, 4013581, 4075873, 4206000, 4449923, 4661301, 4709002, 4811251, 4879692, 4957016, 5137739, 5265014, 5370001, 5439176, 5621920, 5866769, 6068246, 6282994, 6390484, 6607810, 6896177, 6967927, 6984221, 7189640, 7352995, 7412619, 7395843, 7592937, 7674242, 7715882, 7834582, 7971727, 8052614, 8242616, 8289243, 8562066, 8784217, 9129070, 9379181, 9630885, 9925871, 10364411, 10730434, 11182600, 11630193, 11995507, 12448498, 12702393, 12921233, 13063433, 13104164, 13229392, 13527606, 13773302, 13995176, 14264416, 14725802, 15203231, 15601109, 16135687, 16593213, 17252563, 18088715, 18835014, 19870192, 20986353, 22224427, 23655863, 25405446]
5956B5405446J849012J877999J768296J468862J181015Q35842J50358k58186m38399
5947C3840245p55323r61650p15460o12613m21049k68007Q976L04917J96426N05893
5937C1122355R20664J257271J645274J828096K361760K903536L033486L060069
5929D8132511L154871K570986J770350O16066m12094j414605k337760k935406
5921D9144919l193245l148678k927503k557513k289019j744392j309122j043973
5913C0931474p31441m58313j8692L03109L54306P04553J062680J359257J413846
5904C4920779J508119J028641O65073J63266k69315r05182j363739j805651j998803
5895C1943188k147578k133471j926470j690284j525880j091209r96119q84240
$$ y = [25405446, 27254458, 29132457, 30900753, 32369615, 33550630, 34386472, 34536830, 34278644, 33840245, 33084922, 32123272, 31407812, 30795199, 30374150, 30106143, 30115119, 30420036, 30616462, 31122355, 32043019, 33300290, 34945564, 36773660, 39135420, 42038956, 45072442, 48132511, 51287382, 53858368, 55628718, 56244784, 55832690, 54418085, 52080325, 49144919, 45951674, 42802996, 39875493, 37317980, 35028961, 33284569, 31975447, 30931474, 30200033, 29741720, 29723028, 30026137, 30380443, 31084996, 32147676, 33506933, 34920779, 36428898, 37457539, 38122612, 38285878, 38016563, 37111381, 35747642, 33941991, 31943188, 29795610, 27662139, 25735669, 24045385, 22519505, 21428296, 20432177, 19547937]
5887A9547937o59088p10101l92277m77062l89597k17928r541L0772k724L94383
5877A7114774M46954N38477N92460P15132O12124N16307M15217k34270n83854
5868B0133321p85485r57324p71996m80383l68849k48036k92910r5235j55549j09811
5858A5867743N6314J74530R2128N8715K41757K09778L93249N33943M73437O66047
5848A8767641P39477Q22823Q96537P68612M94285K44035r7262l57942n37441o47488
5838B1093277q15724o40071p12404n67223n92163k48451k82395k26835r4842n7626
5828A6855543J04721K22415M18896K35835M73645O36182P50684R05295R20251
5819B1523467J024194J221915J424340J464998J133544N66120k92296r24351j410640
$$ y = [19547937, 18888849, 18178748, 17786471, 17309409, 16919812, 16701884, 16692343, 16723115, 16720391, 17114774, 17561728, 18100205, 18692665, 19407797, 20019921, 20536228, 20951445, 20717175, 20133321, 19347836, 18390512, 17618516, 17138133, 16769284, 16521248, 16228338, 16133103, 15977554, 15867743, 15924057, 16098587, 16190715, 16249430, 16491187, 16700965, 17094214, 17628157, 18101594, 18767641, 19507118, 20329941, 21226478, 21995090, 22489375, 22733410, 22636148, 22278206, 21740765, 21093277, 20277553, 19637482, 18925078, 18357855, 17765692, 17517241, 17234846, 17008011, 16913169, 16855543, 16960264, 17182679, 17601575, 17837410, 18311055, 18947237, 19697921, 20603216, 21523467, 22547661, 23769576, 25193916, 26658914, 27792458, 28358578, 28066282, 27141931, 25731291]
5810B5731291j540982j606475j632389j292574r48658r90449p72796l97038l88430
5801A6161500l49524j26551j39191O5343L20203L27557M29519O23405M30406P09367
5791A8452034Q59845P59374P96979O07671J94837k05312n82206r42737j034356
5782A8906129j049609q48689p05158m35105m63463l22743k25403k2278P4857P9940
5772A4988478L67780M26231L73470M74790P33072P80449Q74061P59964O28645
5763B0406940L94020l7117l24442m72671o76618p42914o81716l87432k99755j93305
5753A6984990j73602N6595J42050J43270M64805N45832P04050O39821P75825J026746
5743B1310382J311683J451832J440903J642395J590682J193278O65924k84166
$$ y = [25731291, 24190309, 22583834, 20951445, 19658871, 18710213, 17719764, 16946968, 16549930, 16161500, 15811976, 15685425, 15546234, 15611577, 15931780, 16259337, 16688856, 17312261, 17742667, 18452034, 19311879, 20071253, 20868232, 21475903, 21670740, 21465428, 20883222, 19940485, 18906129, 17856520, 17007831, 16302673, 15867568, 15404105, 15081362, 14855959, 14833681, 14908538, 14988478, 15356258, 15782489, 16155959, 16630749, 17363821, 18144270, 19018331, 19778295, 20406940, 20800960, 20763843, 20439401, 19966730, 19290112, 18547198, 17865482, 17478050, 17178295, 16984990, 16811388, 16867983, 17010033, 17153303, 17618108, 18163940, 18867990, 19507811, 20283636, 21310382, 22622065, 24073897, 25514800, 27157195, 28747877, 29941155, 30607079, 30322913]
5735C0322913j045089j339121j370650j330711j219358j137210q51525o14101
5727B1415148o34300k21796l49858l96156j30297K04749L93005L41976N40530
5718B1163001N70450O78847R49874J070514J143553J124782R89288Q75502N26559
5709B9092370P1891k3134P7586M29348O12982Q35165J432472J508163J294124
5700C5330967J420404J067940K80943k45731j023733j268966j508832j448849
5692C2604143j377993j180282p98309m66718k00072r6806K85659N63350J058556
5683C0391528J356382J508987J736477K171305K662431L057662L574367L830330
5675E0289469L880887L763121K587642O48019j318608l050730m098414m400295
$$ y = [30322913, 29277824, 27938703, 26568053, 25237342, 24017984, 22880774, 22029249, 21415148, 20780848, 20559052, 20209194, 19813038, 19682741, 19887490, 20280495, 20622471, 21163001, 21733451, 22412298, 23362172, 24432686, 25576239, 26701021, 27690309, 28565811, 29092370, 29164261, 29141127, 29218713, 29648061, 30261043, 31096208, 32528680, 34036843, 35330967, 36751371, 37819311, 38100254, 37854523, 36830790, 35561824, 34052992, 32604143, 31226150, 30045868, 29247559, 28780841, 28580769, 28483963, 28769622, 29332972, 30391528, 31747910, 33256897, 34993374, 37164679, 39827110, 42884772, 46459139, 50289469, 54170356, 57933477, 60521119, 61169138, 59850530, 56799800, 52701386, 48301091]
5667D8301091m155714l793595l152245k667400k167443j712967j386270j021545
5659B8243912p82864l76224k4858J26473L58458O34610J014518J200104J505849
5650C1899978J689779J581623J217775M94042n17551j427337k121473k530122
5642C0286714k618215k366362j945378j948347j650219j387911j089507j186193
5634A6094582q77731p54585q72066p13038o40784o35502o07796m95789m69383
5625A0027908n27418l09058k44754m16325l34772k03262r1942k16420l3122J2023
5615G662858k49047j52640k27845l117O7407j07939j53977M3427r5851m7401j37347
5604F598528k03176j88054q7648r0553j08104j88842j27984m7457n4727m067j51357
$$ y = [48301091, 44145377, 40351782, 37199537, 34532137, 32364694, 30651727, 29265457, 28243912, 27461048, 27084824, 27059966, 27186439, 27544897, 28179507, 29194025, 30394129, 31899978, 33589757, 35171380, 36389155, 36883197, 36365646, 34938309, 32816836, 30286714, 27668499, 25302137, 23356759, 21408412, 19758193, 18370282, 17280775, 16094582, 15216851, 14462266, 13590200, 12877162, 12236378, 11600876, 10993080, 10497291, 10027908, 9500490, 9191432, 8946678, 8530353, 8195581, 7992319, 7900377, 7683957, 7650835, 7662858, 7413811, 7261171, 7033326, 7030209, 7097616, 6989677, 6835700, 6879127, 6783276, 6735875, 6598528, 6395352, 6207298, 6119650, 6029097, 5920993, 5732151, 5604167, 5556710, 5501983, 5497916, 5346559]
5593E346559j055j90194r8702k9575L8905K4286k7463j1529o169o334m9769j11809
5581D877151j30966m1229K9054j81075j3511P7213J9022q9534l3696j25010J37654
5570D525073n0687j09261R804N2878n8301r5577K20502M9707p1357L1020O7881
5559D571682l4866k7953N7255J06086m5125j04031J7749R1144o0274n6378j0703
5548D504586M539J22688r156R2065Q7949Q3294O4183M131J1158j13357j8496M5467
5536D879051K3534P2268K03655P0548J4610O4247j41828L9169J67064k681m2467
5525E347170O8677J87831J16463K0355J16566l8676l9041N1891J69925J58772
5515F159933L9757o8846o3071J77728J50745J26966M2228k2528J47911J20230
$$ y = [5346559, 5345504, 5155310, 5056608, 5027033, 5065938, 5090224, 5062761, 5051232, 5045063, 5038729, 4988960, 4877151, 4746185, 4704956, 4734010, 4552935, 4539424, 4616637, 4635659, 4546125, 4512429, 4387419, 4525073, 4474386, 4365125, 4374929, 4427807, 4369506, 4273929, 4494431, 4544138, 4472781, 4503801, 4571682, 4536816, 4508863, 4566118, 4672204, 4627079, 4523048, 4540797, 4631941, 4571667, 4515289, 4504586, 4509125, 4631813, 4622657, 4714722, 4802671, 4885965, 4950148, 4954279, 4965437, 4852080, 4833584, 4879051, 4902585, 4974853, 5178508, 5249056, 5263666, 5327913, 5186085, 5225254, 5392318, 5389637, 5347170, 5415847, 5603678, 5720141, 5740496, 5857062, 5818386, 5779345, 5831236, 6001161, 6159933, 6199690, 6130844, 6067773, 6245501, 6396246, 6523212, 6565440, 6542912, 6690823, 6811053]
5505F811053J52099R7204J04726J87758m3611L1819J27758K00941J20537J88784
5495G979068J14878J49838J83481J15415K67258L18832L82575M14673L97156M88447
5485A0811621L95751N53327O40143O30750N92100L16429J31560n0497m06721l15859
5475A3298604l10242k10608J4030k08447m4526L01719J83616J08608O0953L18656
5465A3512363N05986K98081K99717M25046O74429P09399P66717Q98698R98004
5456A9088440J173263J026121O85947j67201o19321n96030p02370n88972l93502
5447A8906375l62591k46102n8600q1110O2528J59804K30374K43073L66501M86505
5437A9706757M66255N50588N37312N80353N19460P06369P37991N92281P71389
$$ y = [6811053, 6963152, 7060356, 7165082, 7352840, 7309229, 7341048, 7468806, 7669747, 7790284, 7979068, 8093946, 8243784, 8427265, 8542680, 8809938, 9128770, 9511345, 9926018, 10323174, 10811621, 11207372, 11760699, 12400842, 13031592, 13623692, 13940121, 14071681, 14021184, 13614463, 13298604, 12988362, 12777754, 12791784, 12583337, 12538811, 12840530, 13024146, 13132754, 13193707, 13512363, 14018349, 14316430, 14616147, 15041193, 15715622, 16425021, 17191738, 18090436, 19088440, 20261703, 21287824, 21973771, 21806570, 21187249, 20591219, 19888849, 19299877, 18906375, 18543784, 18297682, 18239082, 18157972, 18220500, 18380304, 18610678, 18853751, 19220252, 19706757, 20173012, 20723600, 21260912, 21841265, 22360725, 23067094, 23805085, 24397366, 25168755]
5428B5168755N69227M60772L79288J28903K44550L93824M52679M60364Q94219
5419B9152581R86249J146338J352942J666092J652008J875559J855346J799265
5411D1486380J587391J178906J285472J105029J333599J429114J781286J762765
5403E2949942J815061J292561O84176n7887q02903j280810j374267j187940q48164
5394E1189769n13358p7103L28764O83720J279233J742359K248351K681624L080798
5385F2644157K660676K129213J497432J283066J713160K159670K533122K252424
5377G8872920J208318n48448k346981l596643m354505m580972m376966l899686
5369E6377037l429002k974855k527928j801710j279291j048979n70754j89915
$$ y = [25168755, 25737982, 26198754, 26578042, 26706945, 26951495, 27345319, 27797998, 28258362, 29152581, 30138830, 31285168, 32638110, 34304202, 35956210, 37831769, 39687115, 41486380, 43073771, 44252677, 45538149, 46643178, 47976777, 49405891, 51187177, 52949942, 54765003, 56057564, 56741740, 56683853, 55880950, 54600140, 53225873, 52037933, 51189769, 50676411, 50599308, 50928072, 51611792, 52891025, 54633384, 56881735, 59563359, 62644157, 65304833, 67434046, 68931478, 70214544, 71927704, 74087374, 76620496, 78872920, 80081238, 79532790, 77185809, 73589166, 69234661, 64653689, 60276723, 56377037, 52948035, 49973180, 47445252, 45643542, 44364251, 43315272, 42744518, 42554603]
5361D2554603K28043L47160O79650P26837N11263N86725M96007K97793J88615
5352D6616696l12102p32871j437723j846676k097082k125563k144767j938880
5344C3981032j657752j657387j721428j524753j422759j013284q50305r49431
5336B3183933n48119m96893m48097m54820l38047k90703j47361Q343p1191m983
5326B0392062k8506k4621K65892L11808L03012N1869J66920N3301J68193K35258
5316B1895188K47344J74139J30467R8634J95856L35107M18777O55293O18261P06481
5306B5475547Q61374Q85707R47041J178793J161313P68751L03164N5434k97537
5297C1339587o18083m66731k80545j51651q5908l1004J45682J65575M81368O77398
$$ y = [42554603, 42782646, 43129806, 43809456, 44536293, 45047556, 45634281, 46130288, 46428081, 46616696, 46304594, 45571723, 44134000, 42287324, 40190242, 38064679, 35919912, 33981032, 32323280, 30665893, 28944465, 27419712, 25996953, 24983669, 24133364, 23183933, 22635814, 22138921, 21690824, 21236004, 20897957, 20607254, 20459893, 20468236, 20397045, 20392062, 20363556, 20338935, 20604827, 20916635, 21219647, 21271516, 21438436, 21491737, 21659930, 21895188, 22142532, 22316671, 22447138, 22545772, 22741628, 23076735, 23495512, 24150805, 24769066, 25475547, 26336921, 27222628, 28169669, 29348462, 30509775, 31278526, 31581690, 31637124, 31339587, 30721504, 30254773, 29974228, 29822577, 29736669, 29705665, 29851347, 30016922, 30498290, 31175688]
5287C1175688O57680R61762J276502J307592J588574J824265K000633K339962
5279D3132658K812616L161771L585701L687737L544586K815922J871286J271024
5271F5883301M96217k32882j199622k003266k485193k767279k662411k303564
5263E2725301j935533j359786q32412m50562k5144L68867Q75056J315910J713988
5254E2395685J862753K337829K948838L599920M423239M842101N507310N678029
5246H3595704N235107L869483J229931k087952m525027n702784n264637m734622
5238G1615203l996734l206257k322171j576679r80872m25433M14202P84907J111462
5229F1417628J213360J125921J440086K054549K540407K509109J903538J224701
$$ y = [31175688, 31833368, 32795130, 34071632, 35379224, 36967798, 38792063, 40792696, 43132658, 45945274, 49107045, 52692746, 56380483, 59925069, 62740991, 64612277, 65883301, 66379518, 66146636, 64947014, 62943748, 60458555, 57691276, 55028865, 52725301, 50789768, 49429982, 48597570, 48147008, 48121864, 48490731, 49365787, 50681697, 52395685, 54258438, 56596267, 59545105, 63145025, 67568264, 72410365, 77917675, 83595704, 88830811, 92700294, 93930225, 91842273, 87317246, 81614462, 76349825, 71615203, 67618469, 64412212, 62090041, 60513362, 59532490, 59107057, 59521259, 60306166, 61417628, 62630988, 63756909, 65196995, 67251544, 69791951, 72301060, 74204598, 75429299]
5221G5429299Q16420L68578k66759j086563j971222l230885m026903m419988m183791
5212E7428186l578274l282394l218889k985005k837335k416353k036638j733174
5204C5340124j678397j705111j663877j427625j385659j220562j036072q12379
5196B4410442j056229r18957j001270q63753p60157o40692o14339l79431k26504
5187A7949110k78467l65400l27178l49814n76428n10293n97586n22955j96220
5178A4224769l32743m41174j32429k54256k20919o0881j45721l2428J8959n0685
5168A2572492m385j8959P0811O7021M04720L36442K84817R7816m46427p34764
5158A2629584m95035m82285l50636l60179n10376l48237k03128l36726l02634
$$ y = [75429299, 76245719, 76614297, 76347538, 75260975, 73289753, 70058868, 66031965, 61611977, 57428186, 53849912, 50567518, 47348629, 44363624, 41526289, 39109936, 37073298, 35340124, 33661727, 31956616, 30292739, 28865114, 27479455, 26258893, 25222821, 24410442, 23354213, 22435256, 21433986, 20570233, 19810076, 19169384, 18555045, 18175614, 17949110, 17670643, 17305243, 16978065, 16628251, 16051823, 15541530, 14943944, 14420989, 14224769, 13892026, 13450852, 13318423, 13064167, 12843248, 12782367, 12636646, 12604218, 12623177, 12572492, 12568107, 12549148, 12619959, 12686980, 13091700, 13428142, 13712959, 13810775, 13364348, 12629584, 12134549, 11652264, 11301628, 10941449, 10431073, 10082836, 9879708, 9542982, 9240348]
5149I240348j58413q0801k27681k86677j17548k33723j82968r6187j45183n2173
5139G658994n7266j04933N2786k38253k7133K7735o7720l4586o6327p6338o0090
5128G006869N7369O2798R8574J11181O3992K3219n789j5509j31592k03846j32940
5117F934326j21532j28553j45932k79612q0194J07992r7252n075K4979j05650
5107F103497J00355N7808O3802P7798m9721M8527J68808P5871K14303J38278J23998
5096G123324K69685J53762L63383O00482N23465M17749M93546K35143j90799k89617
5086I700123p8073q6237j27843k59803k72871m32913p31214m12261k55417k46645
5076F796846j45014k27522l5990O5191r466r8032K0877K2803O9622O51m0930J77543
$$ y = [9240348, 9081935, 9001134, 8773453, 8486776, 8369228, 8135505, 7952537, 7856350, 7711167, 7658994, 7601728, 7496795, 7549581, 7311328, 7284195, 7311930, 7244210, 7209624, 7143297, 7066959, 7006869, 7064238, 7127036, 7225610, 7336791, 7400783, 7424002, 7418213, 7402704, 7271112, 7067266, 6934326, 6812794, 6684241, 6538309, 6258697, 6178503, 6286495, 6189243, 6184168, 6209147, 6103497, 6203852, 6261660, 6325462, 6403260, 6353539, 6402066, 6570874, 6646745, 6861048, 6999326, 7123324, 7393009, 7546771, 7910154, 8510636, 9034101, 9451850, 9945396, 10180539, 9989740, 9700123, 9622050, 9535813, 9407970, 9148167, 8875296, 8442383, 7711169, 7298908, 7043491, 6796846, 6651832, 6424310, 6388320, 6453511, 6444045, 6346013, 6366890, 6389693, 6459315, 6459966, 6419036, 6596579]
5064F596579K12678O0050L05965M20372M10449N05906M39332J85071j74037l50019
5054H612346m94449l49194l63629k78596l86463j62731o4123k06805o8500j14258
5044F123598L0100L338J10492J31962J63790K10715Q7001J33411K29558l9260
5034G184705l9120j42562k69858k81941L7935j8885j47921n4431L4709m8396j54023
5023F100212P6130k19979k48322k11741j12730k1913l1796p2865O1002J278r7759
5012E221517p8122j33144J0552j12127n6948R056q2792L7562m5260n1506L5049
5001D753837l5165r452n484L7706k7151q3535M0569o2960R2941l5507l0873l0190
4989D604736j43907P0890J93427J40756O8555J180K9724J89313j82n3799k2158
$$ y = [6596579, 6809257, 6869307, 7175272, 7595644, 8006093, 8511999, 8951331, 9136402, 8962365, 8612346, 8117897, 7768703, 7405074, 7126478, 6740015, 6577284, 6513161, 6306356, 6237856, 6123598, 6153698, 6157036, 6267528, 6399490, 6563280, 6773995, 6860996, 6994407, 7223965, 7184705, 7145585, 7003023, 6733165, 6451224, 6489159, 6470274, 6322353, 6267922, 6302631, 6254235, 6100212, 6176342, 5956363, 5708041, 5496300, 5383570, 5361657, 5329861, 5256996, 5317998, 5319276, 5221517, 5143395, 5010251, 5020803, 4908676, 4851728, 4860784, 4777992, 4815554, 4770294, 4718788, 4753837, 4718672, 4709220, 4703736, 4741442, 4714291, 4630756, 4671325, 4608365, 4701306, 4665799, 4634926, 4604736, 4460829, 4531719, 4725146, 4865902, 4934457, 4935637, 4965361, 5154674, 5154492, 5100693, 5078535]
4978E078535k7664m0265o7299O3368o3357q1125p2665r0858Q1479m3806j88542
4967D547801J59360J6947k09203J78923J53873k22575o9239J51942M6434J2819
4957D767082J45909L0619K3680R4030R6659O3326n7085q388J58059J20960J10322
4946E545173K06447J4591J6642j00367r8863l5895m0737q5556j6116m8502L7n5092
4934E301762o1886m4901N0875M6261j0510J53472M131J92535p5584p4049J59371
4923E641477K3070M0472J28118J05158l2617Q1742J80007J20873q7238p3100N9193
4912F187155P5461M0083l5047j54596k3355Q021N7067K18686J00823L0264J07436
4901F611998M7889J29400l7825J40167L5454J60984L21813l7052M5278J62768
$$ y = [5078535, 5050871, 5010606, 4943307, 5006675, 4943318, 4862193, 4789528, 4698670, 4780149, 4736343, 4547801, 4707161, 4724108, 4514905, 4693828, 4847701, 4625126, 4555887, 4707829, 4754263, 4767082, 4912991, 4943610, 4967290, 5061320, 5157979, 5221305, 5164220, 5155832, 5313891, 5434851, 5545173, 5751620, 5766211, 5782853, 5682486, 5583623, 5547728, 5506991, 5421435, 5405319, 5356817, 5356854, 5301762, 5239876, 5194975, 5245850, 5292111, 5281601, 5435073, 5439204, 5631739, 5556155, 5482106, 5641477, 5664547, 5705019, 5833137, 5938295, 5905678, 5987420, 6167427, 6288300, 6201062, 6127962, 6187155, 6262616, 6302699, 6267652, 6113056, 6089701, 6097722, 6154789, 6373475, 6474298, 6504562, 6611998, 6659887, 6789287, 6751462, 6891629, 6927083, 7088067, 7409880, 7372828, 7418106, 7580874]
4891G580874N9300J32238L7303o2644L13730Q7464M4205J23049J35218J7957J82195
4880H650889J47637J16041K13377P4303J30726K54853J19980J83461K82241J25553
4870A0299061L40001J80704Q3003K40424K19637K10144M02124L96875K70065L80197
4860A3022235L33891J76342J77202M29175L68344L04241L41078N26038K76008
4851A5954554K21387L26188L31619K80457M15132K25926L75016M73332M33238
4842A9036849N55655L97000M08801M54680N54749N00592M82005N50530O83972
4833B3624833P71228P05868O84667N24259O49437O84357O92367O46868P10353
4824B9694237O06064N66976P50072O77029P55332N82424P35921O58947Q88395
$$ y = [7580874, 7640174, 7772412, 7809715, 7747071, 8060801, 8148265, 8192470, 8315519, 8450737, 8468694, 8650889, 8798526, 8914567, 9127944, 9202247, 9332973, 9587826, 9707806, 9891267, 10173508, 10299061, 10639062, 10819766, 10902769, 11143193, 11362830, 11572974, 11975098, 12371973, 12642038, 13022235, 13356126, 13532468, 13709670, 14138845, 14507189, 14811430, 15152508, 15678546, 15954554, 16175941, 16502129, 16833748, 17114205, 17529337, 17755263, 18130279, 18603611, 19036849, 19592504, 19989504, 20398305, 20852985, 21407734, 21908326, 22390331, 22940861, 23624833, 24396061, 25101929, 25786596, 26310855, 26960292, 27644649, 28337016, 28983884, 29694237, 30300301, 30867277, 31617349, 32294378, 33049710, 33632134, 34368055, 35027002, 35915397]
4815C5915397R15810R56702R19881J002721R64930Q53918J080911J253680J271987
4806D5135937J115447J340341J433178J331300J436531J544835J678240J677208
4798E6693017J833014K079365K293292K562556K822841L155682L683673M156206
4790G9279646M782555N344101O077079P278067Q841763J0303098J1841780J3423870
4782A47171959J5164208J7634209K1205048K6278823L3313142M2608573N3820933
4775C57196895O2885218N3508572J9883257j5379718m7912884o8141247o1516997
4768C00523096m6743274l5682763k8040322k2478859j8247185j4809082j2049286
4761A22472325r797490q051848o407250n138886m136273l553767l078590k516341
$$ y = [35915397, 36831207, 37787909, 38707790, 39710511, 40675441, 41529359, 42610270, 43863950, 45135937, 46251384, 47591725, 49024903, 50356203, 51792734, 53337569, 55015809, 56693017, 58526031, 60605396, 62898688, 65461244, 68284085, 71439767, 75123440, 79279646, 84062201, 89406302, 95483381, 102761448, 111603211, 121906309, 133748089, 147171959, 162336167, 179970376, 201175424, 227454247, 260767389, 303375962, 357196895, 420082113, 473590685, 493473942, 478094224, 430181340, 362040093, 300523096, 253779822, 218097059, 190056737, 167577878, 149330693, 134521611, 122472325, 112674835, 104622987, 98215737, 93076851, 88940578, 85386811, 82308221, 79791880]
4753G9791880k149329j558124r25444p47960m51347j81258J65549N86077Q80558
4744G5410602J378854J733857K107340K791431L403864M144954N075551O076612
4736A02123065P415051Q808149J0090138J2073151J4297242J6682887K0534157
4729A92023840K6120236L2420740L9421589M6764024N1338437L3168007l697044
4722D17559829j3414822k6332878n6490172n8714205m4241767l3305608k6094405
4715A58965972k0893910j7299313j4199835j1438623r259244p869794o628304
4708G1376949n474357m822714m176788l752524l430840k921069k617290k428539
4700D1752828k264052j894965j588372j555152j316439j264455j178224r80685
$$ y = [79791880, 77642551, 76084427, 75158983, 74411023, 73959676, 73778418, 73943967, 74530044, 75410602, 76789456, 78523313, 80630653, 83422084, 86825948, 90970902, 96046453, 102123065, 109538116, 118346265, 128436403, 140509554, 154806796, 171489683, 192023840, 218144076, 250564816, 289986405, 336750429, 388088866, 421256873, 417559829, 404145007, 377812129, 321321957, 262607752, 218365985, 185060377, 158965972, 138072062, 120772749, 106572914, 95134291, 85875047, 78005253, 71376949, 65902592, 61079878, 56903090, 53150566, 49719726, 46798657, 44181367, 41752828, 39488776, 37593811, 36005439, 34450287, 33133848, 31869393, 30691169, 29710484]
4692B9710484r91664r15674o35460o67960n59498m93331p22681p68640o10474
4683B3345102m28227m68613l91280k91674j27229l16269l37120j36336j71188
4674B0677166N6126k6416J29409M34377M24037O08910R57568J093242J229301
4665B5583720J275683o16541k226858k173864j647145j279003j048614r61195
4657A6906183p88121n47354n05945m84100l44920l60350k97227j85582k03079
4648A3189505j89267j69667r5330k3595l5724N4710J01629K9259j46207k9147
4638A2686166j41832j80585j11893j42215k5865K9886j52860l58198j98869l24917
4628A1078818k29967q0875P9297k3310q2398J0116l6401o7002j31406J25218Q1198
$$ y = [29710484, 28718820, 27803146, 27167686, 26499726, 25940228, 25446897, 24724216, 23955576, 23345102, 22916875, 22448262, 22056982, 21765308, 21638079, 21321810, 20984690, 20848354, 20677166, 20733292, 20706876, 20836285, 21270662, 21694699, 22303609, 23261177, 24354419, 25583720, 26859403, 26242862, 24016004, 21842140, 20194995, 18915992, 17867378, 16906183, 16118062, 15570708, 15064763, 14580663, 14235743, 13875393, 13578166, 13392584, 13189505, 13000238, 12830571, 12735241, 12711646, 12675922, 12730632, 12832261, 12861520, 12715313, 12686166, 12544334, 12363749, 12251856, 12109641, 12083776, 12113662, 11960802, 11602604, 11403735, 11078818, 10848851, 10767976, 10847273, 10823963, 10741565, 10751681, 10715280, 10648278, 10516872, 10642090, 10723288]
4617A0723288J02222j4100N4493J49159q055M1065r474j3038R4076N0466J27776
4606A1297878K19566L0247Q1907R8833K04753L42913L51573K53133L37619K19176
4596A3437598P1803J71249N8496J49396J67149K05502J42344J82326K35020J68313
4586A4989196K16768K95232L11669L85699M46716L05986L50615L10309M17830
4577A8030020L54961M31286L83123M67871L79335J82078L89028K16733K36821
4568B1071256M96300M72926K62304J64052L83400O07143K84404L39006O05699
4559B4686490M94624M63536N81612N92248O84327P19988O07821R03889Q18279
4550C0552814O73447Q43740J017188O98656Q28517P19965P53272O89212P35615
$$ y = [10723288, 10825510, 10811410, 10865903, 11015062, 11007007, 11048072, 11038598, 11025560, 11119636, 11170102, 11297878, 11517444, 11547691, 11629598, 11728431, 11933184, 12276097, 12627670, 12880803, 13218422, 13437598, 13509401, 13680650, 13739146, 13888542, 14055691, 14261193, 14403537, 14585863, 14820883, 14989196, 15205964, 15501196, 15812865, 16198564, 16645280, 16951266, 17301881, 17612190, 18030020, 18384981, 18816267, 19199390, 19667261, 20046596, 20228674, 20617702, 20834435, 21071256, 21567556, 22040482, 22302786, 22466838, 22850238, 23457381, 23741785, 24080791, 24686490, 25181114, 25644650, 26226262, 26818510, 27502837, 28222825, 28830646, 29734535, 30552814, 31226261, 32070001, 33087189, 33785845, 34614362, 35334327, 36087599, 36776811, 37512426]
4541C7512426O92472P56448O30865O02811N08617N60066N00442O88175N70398
4532D3022720M81653P87653Q04093O46941P25055P77826P79073R82580R94813
4523E0002407J182874J080109J282952J465028J439647J544454J720045J622118
4515F1339634J696844J711680J686790J354708J065709Q12208M57710N5590o7089
4506G0113784J85985N7502K4105J82381M69488M94907N60943P15885O45523Q54155
4496G4304658R79569J163630J300971J444510J318724J358044J242926J208974
4488H4322006J174965R04550P89677L22202k6561k95919n34365p01056r34708
4479H5020791q00059o50557k42820k36483j54967r9903k6581J2569j00987r6858
$$ y = [37512426, 38204898, 38961346, 39592211, 40195022, 40703639, 41263705, 41764147, 42452322, 43022720, 43504373, 44292026, 45096119, 45743060, 46468115, 47245941, 48025014, 49007594, 50002407, 51185281, 52265390, 53548342, 55013370, 56453017, 57997471, 59717516, 61339634, 63036478, 64748158, 66434948, 67789656, 68855365, 69667573, 70125283, 70180873, 70113784, 70299769, 70357271, 70381376, 70563757, 71033245, 71528152, 72089095, 72804980, 73450503, 74304658, 75284227, 76447857, 77748828, 79193338, 80512062, 81870106, 83113032, 84322006, 85496971, 86401521, 87191198, 87513400, 87486839, 87190920, 86656555, 85955499, 85020791, 84220732, 83570175, 83327355, 83090872, 82935905, 82836002, 82809421, 82821990, 82721003, 82624145]
4469H2624145J57238J15556O2407k39704m50758p15121q71100q40124r54299j136778
4459G7751462j428694j852012k037894k157302k058586j953815j835603j358614
4451F3068942j152469j200953j060920j045300j033359j078350j187008j210190
4443E4100393j194117j446906j442490j429559j523567j423299j429514j377092
4435D2833849j218128j139810r90063j042463p15612n96687o30574m29128l99000
4426C5672384l65073m57807j77683j85305n20394m81393n88694p49508p64724
4417C1381803q23131q37288q24254p70120q11357n82244m29760m15691m07132
4408B5480826l98860m69002m03867m68644m70672n98422l79214k81801l11955
$$ y = [82624145, 82781383, 82896939, 82959346, 82719642, 82268884, 81553763, 80682663, 79842539, 78888240, 77751462, 76322768, 74470756, 72432862, 70275560, 68216974, 66263159, 64427556, 63068942, 61916473, 60715520, 59654600, 58609300, 57575941, 56497591, 55310583, 54100393, 52906276, 51459370, 50016880, 48587321, 47063754, 45640455, 44210941, 42833849, 41615721, 40475911, 39485848, 38443385, 37727773, 37131086, 36500512, 36071384, 35672384, 35307311, 34849504, 34671821, 34486516, 33966122, 33484729, 32896035, 32146527, 31381803, 30558672, 29721384, 28897130, 28127010, 27315653, 26733409, 26303649, 25887958, 25480826, 25081966, 24612964, 24209097, 23740453, 23269781, 22671359, 22292145, 22010344, 21698389]
4399B1698389k99594r6501j70275k54431k94334l20739k54719n22247m61433m45056
4389A8579060m24946k09330n10946l73612l31329n30147l11713j68199l35111
4380A5383727j72193l30965k75755j44904J4591j18169j17547j9196J06030q1392
4370A4244227M7136K91236O9501o446J80794R5484k8236K62542J13307J67507
4360A5437052K74306L42982L19920K00832K70436K22976L27022L96890L93446
4351A8185862M24213K55020L70431N88081P72913N95520O72787Q04512P75581
4342B3444920Q46900R40050J170255R96080R81671Q63518R66716R42820R33505
4333C2086435P75059O53792P71520O69158P12287N66193K55786K48625K82699
$$ y = [21698389, 21398795, 21302294, 21132019, 20877588, 20583254, 20262515, 20007796, 19485549, 19024116, 18579060, 18154114, 17944784, 17433838, 17060226, 16728897, 16198750, 15887037, 15718838, 15383727, 15211534, 14880569, 14604814, 14459910, 14474501, 14356332, 14238785, 14219589, 14325619, 14244227, 14291363, 14582599, 14652100, 14645654, 14826448, 14921932, 14893696, 15156238, 15269545, 15437052, 15711358, 16054340, 16374260, 16575092, 16845528, 17068504, 17395526, 17792416, 18185862, 18610075, 18865095, 19235526, 19823607, 20596520, 21192040, 21864827, 22669339, 23444920, 24291820, 25231870, 26402125, 27398205, 28379876, 29243394, 30210110, 31152930, 32086435, 32861494, 33515286, 34286806, 34955964, 35668251, 36234444, 36490230, 36738855, 37021554]
4324C7021554K24445L68202L90017N11724M40449P59592N66557Q07735Q22829
4315D1913104O03795O05260N49581M87237N11552L53803N4303k37588n06322p22103
4305D3612622p66325r39043j083887j154706j260081j319640j441829j365259
4297C4281852j255490j164493r38860q58242p23154n65932o71291n52412l72508
4288B7179470l15425k62263l59923n08753k72934l49724n66408p23346p15224
4279B3105470p99611p61634q30012q80097q95345p77540q19304q77274q61994
4270A5602659r33776p32485n64470p31666o37819m50441m23947m30205m89682
4261A0208168l85449m34172j84113k92536k73835k47939l4029l25627l46303q6049
$$ y = [37021554, 37245999, 37614201, 38004218, 38515942, 38956391, 39715983, 40282540, 41090275, 41913104, 42516899, 43122159, 43671740, 44158977, 44670529, 45024332, 45078635, 44841047, 44334725, 43612622, 42846297, 41907254, 40823367, 39668661, 38408580, 37088940, 35647111, 34281852, 33026362, 31861869, 30923009, 30064767, 29341613, 28775681, 28104390, 27551978, 27179470, 26864045, 26601782, 26241859, 25733106, 25460172, 25110448, 24544040, 23820694, 23105470, 22305859, 21544225, 20714213, 19834116, 18938771, 18161231, 17341927, 16464653, 15602659, 14668883, 13936398, 13371928, 12640262, 12002443, 11552002, 11128055, 10697850, 10208168, 9822719, 9388547, 9204434, 8911898, 8638063, 8390124, 8356095, 8030468, 7684165, 7598116]
4251G598116j330j05607l24530j93312J7617j19888j48748R4302r9973j27008
4241F589639n7584r9199l4099m1752r5556L057j30640q1511r9294j06295j09057
4230E737709k0676P9541N5525m3772q7704j27038M0421n6952n2215l0343J4689
4219E509185n521J10967n419l2868J59573j43797m1344l570l6006J38247O7720
4208E717167k7389k7940N3643q7099n7382R2260N612n0701k7649k4923j65842
4197E399757K6492J63721M1682M8642P9213k0582J34244J17470N4249O0684J5869
4186F121441O7271J30999p335M6038k2106o9616j26099L8727j9122j03010o6520
4175E990668j29086j21312p6040j2464j0869k9811j9160j47026j77951o8875J67520
$$ y = [7598116, 7596786, 7491179, 7166649, 6973337, 6990954, 6871066, 6722318, 6816620, 6716647, 6589639, 6532055, 6432856, 6398757, 6357005, 6261449, 6264506, 6133866, 6052355, 5953061, 5846766, 5737709, 5717033, 5796574, 5852099, 5808327, 5720623, 5593585, 5634006, 5577054, 5524839, 5494496, 5509185, 5503664, 5614631, 5609212, 5576344, 5735917, 5592120, 5550776, 5547206, 5511200, 5649447, 5717167, 5689778, 5661838, 5715481, 5628382, 5571000, 5663260, 5668872, 5618171, 5590522, 5565599, 5399757, 5426249, 5589970, 5631652, 5680294, 5759507, 5738925, 5873169, 5990639, 6044888, 6105572, 6121441, 6188712, 6319711, 6312376, 6358414, 6336308, 6266692, 6140593, 6179320, 6160198, 6057188, 5990668, 5861582, 5740270, 5664230, 5651766, 5640897, 5611086, 5591926, 5444900, 5266949, 5198074, 5365594]
4164E365594R8365J186p1237l1402J73541J86776r8159j36504j84114j44949j03179
4153E055918j34380j2681j20094n2568K7626K15295Q8360r063o0587j32178q0948
4142D784700N1924N7368m263j00430n2305Q798P8282n0947P7582Q0778J43917
4131E075404q176N5273L4092r7584N6035J52689p7466j21510J10503J13735J02954
4120E395949N8436l9624P3040P4394P0291J7304P7119J02936Q8591K17479K80902
4109F416817K10930N7769L25809J73511J6557J2371k00281p4108j7086j12309
4099F809980J31786Q372j43602K6141N7817J44727J66379J23484K27069J08549
4089G660702J20404K84084K83743K82687N41564O14925Q48032P60169R84231R69952
$$ y = [5365594, 5463959, 5465145, 5393908, 5362506, 5536047, 5722823, 5624664, 5488160, 5304046, 5159097, 5055918, 4921538, 4908857, 4788763, 4736195, 4763821, 4979116, 5067476, 5058413, 4997826, 4865648, 4784700, 4836624, 4893992, 4889729, 4789299, 4736994, 4745792, 4824074, 4773127, 4850709, 4931487, 5075404, 5067228, 5122501, 5156593, 5059009, 5115044, 5267733, 5190267, 5068757, 5179260, 5292995, 5395949, 5454385, 5414761, 5487801, 5562195, 5632486, 5649790, 5726909, 5829845, 5918436, 6135915, 6416817, 6627747, 6685516, 7011325, 7184836, 7201393, 7213764, 7013483, 6939375, 6922289, 6809980, 6941766, 6950138, 6806536, 6832677, 6890494, 7035221, 7201600, 7325084, 7552153, 7660702, 7781106, 8065190, 8348933, 8631620, 9173184, 9788109, 10636141, 11396310, 12380541, 13350493]
4079A3350493R74161K62095j602501j445598j076004p12717n11339m35222l87504
4070H415864k11451P507m2705j91785O6549Q8916K44264k034K2782J79001J09170
4059H686078J14572o1299J2973m6708j15097p870m0994j03703m4597k4357k69258
4048H099740J38894k181n4401m5796j02980K62647m8329J61751K0965O5500J60935
4037H656745J15831m5986K64287P831J5322M3538J92374R8078K04087J41944Q3776
4026I777827N2492M9044J79579J57667J74490P603J26789O1438q542L9050Q2336
4015A0699773J27234J09816K8308L7067K65048m1306p569N3078M829P2528N8021
4004A1406827j56480J56627J41302K4028o4419j51339N3888R6410K5433l1740
$$ y = [13350493, 14324654, 14586749, 12984248, 11538650, 10462646, 9749929, 9238590, 8803368, 8415864, 8204413, 8211920, 8169215, 7977430, 8043979, 8132895, 8377159, 8375125, 8397907, 8576908, 8686078, 8800650, 8739351, 8752324, 8705616, 8590519, 8582649, 8541655, 8437952, 8393355, 8368998, 8099740, 8238634, 8236453, 8182052, 8136256, 8033276, 8295923, 8247594, 8409345, 8430310, 8495810, 8656745, 8772576, 8726590, 8990877, 8998708, 9014030, 9057568, 9249942, 9348020, 9552107, 9694051, 9777827, 9830319, 9879363, 10058942, 10216609, 10391099, 10398702, 10525491, 10586929, 10578387, 10617437, 10699773, 10827007, 10936823, 10965131, 11002198, 11267246, 11225940, 11218371, 11271449, 11276278, 11348806, 11406827, 11250347, 11406974, 11548276, 11572304, 11507885, 11356546, 11410434, 11506844, 11532277, 11500537]
3994A1500537O1341j08406N6070l659j67848j38072k1712r3909k7953j50804q7060
3983A0818525k24233j85326k22085k7163j70279j33237j4030k29966k1280j68093
3973I422833j61629N221j07476j67948N088j64585K6077n4429o3653j19369L2760
3962H652890q8306j20734P0546j00118n6687P95r1153L8206M7297j05839O2529
3951H309426o8645l8644J87424M304j48998J99289K6501l3659L09244Q5450M0101
3940H871793J86777J74363J6942R743m4490k6700p3925r0949N7980M040l3728
3929I051846n6718j1003R4229n8263o8980J2880l1640k271J12323K35570Q3954
3918I361927O5123O8250R5980K01909K4381M1800K82433P4262K94484K365J17252
$$ y = [11500537, 11561878, 11453472, 11509542, 11505883, 11338035, 11199963, 11178251, 11084342, 11056389, 10905585, 10818525, 10594292, 10408966, 10186881, 10159718, 9989439, 9856202, 9842172, 9612206, 9590926, 9422833, 9261204, 9266425, 9158949, 8991001, 8996089, 8831504, 8857581, 8803152, 8739499, 8620130, 8652890, 8564584, 8443850, 8514396, 8414278, 8357591, 8358386, 8267233, 8305439, 8352736, 8246897, 8309426, 8240781, 8202137, 8389561, 8393865, 8244867, 8444156, 8470657, 8436998, 8746242, 8831692, 8871793, 9058570, 9232933, 9249875, 9259618, 9215128, 9188428, 9114503, 9023554, 9081534, 9085574, 9051846, 8995128, 8984125, 9078354, 9020091, 8951111, 8963991, 8932351, 8930080, 9042403, 9277973, 9361927, 9427050, 9495300, 9591280, 9793189, 9817570, 9859370, 10141803, 10216065, 10510549, 10512914, 10630166]
3907A0630166J64507J31171J81726J65729L13084K63012J59881K17874R2923L13199
3897A2633272J99184J95273J16246J37485J78237L51742J77431J38312K26515
3888A4353697L01432K64801L66797M20314L80230L67071K53713K54012L19692
3879A7281759L47490N22746K97987L05618L97628L05389L96230M28503L35816
3870B0619166K97356M53265K07241M66430M07932L90975L30376M77415N05513
3861B4155669P10757O62606M93723O04487P33430P15631M74232M55473L93501
3852B9399509Q8014L82433M91839K90331L19060K43888L50477L63528K27058L27478
3842C2483615K60118M65499O31507N70113M99407N97896N75625N58317N69267
$$ y = [10630166, 10794673, 10925844, 11107570, 11273299, 11586383, 11849395, 12009276, 12227150, 12320073, 12633272, 12832456, 13027729, 13143975, 13281460, 13459697, 13811439, 13988870, 14127182, 14353697, 14655129, 14919930, 15286727, 15707041, 16087271, 16454342, 16708055, 16962067, 17281759, 17629249, 18151995, 18449982, 18755600, 19153228, 19458617, 19854847, 20283350, 20619166, 20916522, 21369787, 21577028, 22043458, 22451390, 22842365, 23172741, 23650156, 24155669, 24866426, 25529032, 26022755, 26627242, 27360672, 28076303, 28550535, 29006008, 29399509, 29487523, 29869956, 30361795, 30652126, 30971186, 31215074, 31565551, 31929079, 32156137, 32483615, 32743733, 33209232, 33840739, 34410852, 34910259, 35508155, 36083780, 36642097, 37211364]
3833C7211364Q62409P55680O52860N60390P07273P06507O88666N59189N63797
3824D3268135P75448O30280O76891O10967O90327P22466N44999M88239N13418
3815D8921170N77192N02991O17939O96063P35652Q77844P83207P10486R75199
3806E5397743R35563R54291Q69854P65960Q88476P63260O04076O26867P75051
3797F2581141P10993O54898P25553P60143N48958P50198O66735M93398O56968
3788F8548985N16946O37595P35705O95709P53271P50357R84067R27336P50047
3779G5300018N25112M41343K86278J23636K4488Q1698K40182n231m6547j66161
3769G6804816N7539K02428J75868L18303K92981K02507K00360Q5103J51432J25930
$$ y = [37211364, 38073773, 38829453, 39482313, 40042703, 40749976, 41456483, 42145149, 42704338, 43268135, 44043583, 44673863, 45350754, 45961721, 46652048, 47374514, 47919513, 48407752, 48921170, 49498362, 50001353, 50619292, 51315355, 52051007, 52928851, 53712058, 54422544, 55397743, 56333306, 57287597, 58157451, 58923411, 59811887, 60575147, 61179223, 61806090, 62581141, 63292134, 63947032, 64672585, 65432728, 65981686, 66731884, 67398619, 67892017, 68548985, 69065931, 69703526, 70439231, 71134940, 71888211, 72638568, 73622635, 74549971, 75300018, 75825130, 76266473, 76552751, 76676387, 76700875, 76782573, 77022755, 77017524, 76970977, 76804816, 76862355, 77064783, 77240651, 77558954, 77851935, 78054442, 78254802, 78339905, 78491337, 78617267]
3759G8617267K98095L38878L58350M46790Q42078Q45117Q00850Q38511O93699
3750H4079635N58125L14430q468k80961l89272k75951j20857m0627K06172L83138
3740H4425364O13936O00472P09670J065603J261809J219025J516755J521688J623411
3731I4557733J546246J368460O06054K26238j336j45961q3403J30617L10937P4814
3721I8590399O7736R7033j50339m99701m77797m55663p10639q01703q37155r69205
3711I3852966j249803j476264j561894j598631j596415j527436j570474j447738
3703H1824311j407510j449540j958331k194103k557701k713534k408519k298716
3695F4836357k247938k006955j732302j663916j519710j456900j383793j207521
$$ y = [78617267, 78915362, 79254240, 79612590, 80059380, 80901458, 81746575, 82547425, 83385936, 84079635, 84637760, 84952190, 84943722, 84662761, 84273489, 83997538, 83876681, 83836054, 84042226, 84425364, 85039300, 85639772, 86349442, 87415045, 88676854, 89895879, 91412634, 92934322, 94557733, 96103979, 97472439, 98078493, 98304731, 98303395, 98157434, 98074031, 98204648, 98515585, 98590399, 98658135, 98755168, 98604829, 98105128, 97627331, 97171668, 96461029, 95659326, 94822171, 93852966, 92603163, 91126899, 89565005, 87966374, 86369959, 84842523, 83272049, 81824311, 80416801, 78967261, 77008930, 74814827, 72257126, 69543592, 67135073, 64836357, 62588419, 60581464, 58849162, 57185246, 55665536, 54208636, 52824843, 51617322]
3687E1617322j367750j292312j206283j154717j104070j169902j168442j246934
3679D1906912j299689j195784j252506j191591j312680j111213q51385q53109
3671C2838955j030615r71453o07114p52973q44954q20314o50219m92228n10562
3662B6158523m59717n49386n86060l40676l80883k17498j91310k98538l45108
3653B2789347l00460k40786k56285l77988m39559j81195j60668l66720k82668
3644B0183018k81487k68541k95769l59700k41445j64999k53329k31093l28469
3635A7758186k35959k29381k10812l23333k05148j44127r5856j52559k36483k00067
3625A5724461j97116j62313r0331k46462k54254j29312O1229k11180q3745j34021
$$ y = [51617322, 50249572, 48957260, 47750977, 46596260, 45492190, 44322288, 43153846, 41906912, 40607223, 39411439, 38158933, 36967342, 35654662, 34543449, 33692064, 32838955, 31808340, 30836887, 30229773, 29476800, 28631846, 27811532, 27161313, 26669085, 26158523, 25698806, 25149420, 24563360, 24222684, 23841801, 23624303, 23432993, 23134455, 22789347, 22488887, 22248101, 21991816, 21613828, 21174269, 20993074, 20832406, 20465686, 20183018, 19901531, 19632990, 19337221, 18977521, 18736076, 18571077, 18317748, 18086655, 17758186, 17522227, 17292846, 17082034, 16758701, 16553553, 16409426, 16313570, 16161011, 15924528, 15724461, 15527345, 15365032, 15274701, 15028239, 14773985, 14644673, 14705902, 14494722, 14410977, 14276956]
3615A4276956j99556j52243p5669r6004p8091M9231J8671m6377j24451j75879
3605A3396588k7559Q3595p719j7369R665p4716M1816J38503j3309N5008K1531
3594A3606034k4253K68948J20631K605Q7515O0556P4834J48999Q0904J56345K23454
3583A4806572J62168J84886K34232L75722M50761K59470O0362K08715k22872l59401
3573A6160615m59674l62260l24125l01216k12907k26247k28418L6484K870r4093
3563A3991029j43628M3091j77473k39396q4159j20867p3907r4221j70222r8469
3553A2831778k06464k8268k3601q192m6039j78037J10479K06338Q8412j09128
3543A2637278j688l9547J02492J19118j10978P0560Q0092k6938j468P9031O1626
$$ y = [14276956, 14077400, 13925157, 13849488, 13753484, 13675393, 13724624, 13743295, 13696918, 13572467, 13396588, 13369029, 13452624, 13444905, 13427536, 13437201, 13362485, 13404301, 13542804, 13529495, 13584503, 13606034, 13581781, 13850729, 13971360, 13973965, 14061480, 14122036, 14196870, 14345869, 14426773, 14583118, 14806572, 14968740, 15153626, 15387858, 15763580, 16214341, 16473811, 16534173, 16742888, 16520016, 16160615, 15700941, 15338681, 15014556, 14713340, 14500433, 14274186, 14045768, 14082252, 14085122, 13991029, 13847401, 13890492, 13713019, 13473623, 13389464, 13268597, 13194690, 13100469, 12930247, 12831778, 12625314, 12597046, 12573445, 12565253, 12519214, 12341177, 12451656, 12657994, 12746406, 12637278, 12635590, 12596043, 12698535, 12817653, 12706675, 12777235, 12857327, 12830389, 12828921, 12907952, 12969578]
3532A2969578M6370R250L5130p2211n7137j3278P4975n781J69315j4049q4150
3521A3058012j8937J01092J32067o5141P458p8692P4682N7506p7100Q5292J79353
3510A3455592M3669p2309m43J51876L2293O4756L6562P0247k43359R0235L5547
3499A3664666J51274J25005K9312p6310n0971o7900j16540J03574j4619l3742
3489A3713749r0367J44083P2422J6960J21290o2570l3443K2212M6924q9358K7919
3478A3889821J29226P6284L8254p081l365M1489L1363o0929o2559J62550J01683
3467A4336736j17652j34583k4549N9380M42O3148R4643m2307P9962R1061j10955
3456A4295326P5132L7211R8796l906M2636j4617j3811O1131J56280M6806L7032
$$ y = [12969578, 13015948, 13025198, 13060328, 12988117, 12930980, 12917702, 12992677, 12986896, 13156211, 13142162, 13058012, 13039075, 13140167, 13272234, 13207093, 13214551, 13135859, 13210541, 13268047, 13190947, 13276239, 13455592, 13499261, 13426952, 13426509, 13578385, 13610678, 13675434, 13711996, 13782243, 13538884, 13629119, 13664666, 13815940, 13940945, 13970257, 13893947, 13842976, 13775076, 13658536, 13762110, 13747491, 13713749, 13623382, 13767465, 13839887, 13856847, 13978137, 13915567, 13882124, 13904336, 13951260, 13861902, 13889821, 14019047, 14095331, 14133585, 14126504, 14123139, 14164628, 14195991, 14135062, 14072503, 14235053, 14336736, 14219084, 14084501, 14059952, 14119332, 14119774, 14182922, 14277565, 14235258, 14315220, 14406281, 14295326, 14370458, 14407669, 14506465, 14502559, 14545195, 14530578, 14516767, 14577898, 14734178, 14780984, 14818016]
3445A4818016J65502J55050o1316L7196M0203J73198K72019J1037o9906P7539
3435A5618538J49183N5733r938O8931J86124l3876J10294J98016P2538r850O8048
3424A6473741K09752J9366K65003J66103J27157K21928J37470L63487K40736K40377
3414A8465120L01247K41138O2120j61108j67911o6310P977p0980M936O8049l1607
3403A8652671J84309K19905N7181j15750K69046K01470N0471J86791J59912K86233
3393B0152239J68640K14805J33998K6408N1708P9579L74788K62271J48002O8809
3383B1681247J06037J74080L16771K89214K27346J46577K00198K59887J88717
3374B3590074K48139L23832K91358L01344L37989R7639K02503J67026L14391L60798
$$ y = [14818016, 14983518, 15138568, 15077252, 15114448, 15154651, 15327849, 15599868, 15610905, 15540999, 15618538, 15767721, 15823454, 15813516, 15882447, 16068571, 16034695, 16144989, 16343005, 16415543, 16405693, 16473741, 16683493, 16702859, 16967862, 17133965, 17261122, 17483050, 17620520, 17984007, 18224743, 18465120, 18766367, 19007505, 19069625, 18908517, 18740606, 18674296, 18682273, 18611293, 18616229, 18684278, 18652671, 18836980, 19056885, 19114066, 18998316, 19267362, 19468832, 19519303, 19706094, 19866006, 20152239, 20320879, 20535684, 20669682, 20696090, 20747798, 20827377, 21202165, 21464436, 21612438, 21681247, 21787284, 21961364, 22278135, 22567349, 22794695, 22941272, 23141470, 23401357, 23590074, 23838213, 24162045, 24453403, 24754747, 25092736, 25190375, 25392878, 25559904, 25874295, 26235093]
3364B6235093L58041L08568J44818K50456M01667L83841L38487K56773L85427
3355B9063171M06129M75287L47768M02838M35245M88497M35776M83753O21130
3346C3159594N44338M17169M61419O15070M92140N58718M71808N30672M36154
3337C7687082M51566N38518N14985N55280N40027N98350O84662N53917O28287
3328D2752674O66928P22973O57815O66281P31800Q19181Q87381Q33199Q59150
3319D9597382P39116R10857R36198Q49781R33712R60966R98946J006566R06153
3310E7839677J022433R57218Q56058R71378R05727J050569R95177J123060R33911
3301F6655208R68683J078988R80993J054488J075621J090065J195737J379475
$$ y = [26235093, 26593134, 26901702, 27046520, 27296976, 27698643, 28082484, 28420971, 28677744, 29063171, 29469300, 29944587, 30292355, 30695193, 31130438, 31618935, 32054711, 32538464, 33159594, 33703932, 34121101, 34582520, 35197590, 35689730, 36248448, 36720256, 37250928, 37687082, 38138648, 38677166, 39192151, 39747431, 40287458, 40885808, 41570470, 42124387, 42752674, 43419602, 44142575, 44800390, 45466671, 46198471, 47017652, 47905033, 48738232, 49597382, 50336498, 51247355, 52183553, 53033334, 53967046, 54928012, 55926958, 56933524, 57839677, 58862110, 59819328, 60675386, 61646764, 62552491, 63603060, 64598237, 65721297, 66655208, 67623891, 68702879, 69683872, 70738360, 71813981, 72904046, 74099783, 75479258]
3293G5479258J318034J429476J627011J629524J731486J919345K050922K148905
3285H9333961K288138K553319K622860K894215L085815L324769L722361M052922
3277A13878360M406185M637243N080671N370276N837584O293368O670728O828721
3269A59003136O881225O838176O627968O492938O444087N868740M687309L303221
3261B06146800J805776l07724k599760m888340o826007q034270q492982q259568
3253A68543925p757250o906786o340640n603065n174510m755990m151591l797345
3245A24056748l535054l160235k804925k694159k454018k310517k221541j979371
3237A02896928j855331j732420j702375j659134j468009j562060j736195k041029
$$ y = [75479258, 76797292, 78226768, 79853779, 81483303, 83214789, 85134134, 87185056, 89333961, 91622099, 94175418, 96798278, 99692493, 102778308, 106103077, 109825438, 113878360, 118284545, 122921788, 128002459, 133372735, 139210319, 145503687, 152174415, 159003136, 165884361, 172722537, 179350505, 185843443, 192287530, 198156270, 202843579, 206146800, 207952576, 207644852, 205045092, 200156752, 193330745, 185296475, 176803493, 168543925, 160786675, 153879889, 147539249, 141936184, 136761674, 132005684, 127854093, 124056748, 120521694, 117361459, 114556534, 111862375, 109408357, 107097840, 104876299, 102896928, 101041597, 99309177, 97606802, 95947668, 94479659, 92917599, 91181404, 89140375]
3229H9140375k449429k318533k501900k215014k269409k012934j878725j880469
3221G1613962j797389j732793j597896j505270j330075j294941j294206j095466
3213E9965926j115340r58326q97876p89332o11203p05244n56774o12140l23670
3204E3396021k32006n238K21124L35954L84705Q7652o47531j375944j840522j719797
3194D8604418j393184j398106j174205j061862r09750p13173q28225o91550o15863
3185C9818500n68910m27780m87629l90225m03803m62448l03063k53152j74878
3176C6346612k15321k14402j91819k19522p1555L5031L5991J49787J66894M9021
3166C5870717k46049m67920p56741p10680p34936p87235n80469m21633m09034
$$ y = [89140375, 86690946, 84372413, 81870513, 79655499, 77386090, 75373156, 73494431, 71613962, 69816573, 68083780, 66485884, 64980614, 63650539, 62355598, 61061392, 59965926, 58850586, 57892260, 56994384, 56205052, 55593849, 54888605, 54331831, 53719691, 53396021, 53164015, 53158777, 53379901, 53715855, 54100560, 54188212, 53540681, 52164737, 50324215, 48604418, 47211234, 45813128, 44638923, 43577061, 42667311, 41954138, 41125913, 40434363, 39818500, 39249590, 38821810, 38334181, 37943956, 37540153, 37077705, 36774642, 36521490, 36346612, 36131291, 35916889, 35725070, 35505548, 35433993, 35469024, 35505015, 35654802, 35821696, 35870717, 35624668, 35156748, 34400007, 33689327, 32954391, 32167156, 31586687, 31165054, 30756020]
3157C0756020m86083m72529k32459l62889l25463m23298k62473k57014l03360
3148B7630452k02942k62269j81749j62902j97555k57399j15391j93379j31398
3139B5925468k54742o5825l67531k25973p3567k49963j84959l0249j31635k02010
3129B4139014j55498j45923j47366j56996M3491k40349j28563j2476k12705j93082
3119B2789547o0790J28121j9910r3513j15224j39798p9397q6384l494r4593m4339
3108B2180226L3968j62729j42694J582j65478j58086n8707j56305k3813o5102
3098B1282862k78960j50932j60292k00j36721l2424O599j83870q7139k20796k13051
3087A9825076j49069J6669n8950q4497K0404j78488j77666j9600m5930j95071
$$ y = [30756020, 30269937, 29797408, 29564949, 29202060, 28876597, 28453299, 28190826, 27933812, 27630452, 27427510, 27165241, 26983492, 26820590, 26623035, 26365636, 26250245, 26056866, 25925468, 25670726, 25604901, 25237370, 25011397, 24937830, 24687867, 24502908, 24472659, 24341024, 24139014, 23983516, 23837593, 23690227, 23533231, 23576722, 23336373, 23207810, 23195334, 22982629, 22789547, 22728757, 22856878, 22836968, 22743455, 22628231, 22488433, 22409036, 22322652, 22319158, 22224565, 22180226, 22214194, 22051465, 21908771, 21910353, 21744875, 21586789, 21528082, 21371777, 21347964, 21282862, 21003902, 20852970, 20692678, 20692478, 20555757, 20523333, 20529932, 20346062, 20258923, 20038127, 19825076, 19676007, 19692676, 19633726, 19549229, 19569633, 19391145, 19213479, 19193879, 19147949, 18952878]
3077A8952878j56231N8462r7627P694k6076p3237L1575j76015j45219q6465p0622
3066A8219117j86700J6197l7722k14453j19684J1808j09612p5901o0318j75783
3056A7266949q0515N4775K9465K4154O4486J36521J11021K07617K19689K08227
3046A8242389J86835M65434M79497N60884P03578J70154m46550p41000n75350
3037A9045871n15427m62620k95888k42105j35577j07179j21355P0254j46560q2732
3027A7006682j26575k3965Q2812J9189J8820j7451J03102J43660J23825R7309
3017A7427408O8099r032Q4665K22522M8733K29854L40923J94608Q8100J21112
3007A8816992K22276K36126J22609K23037K58257J64441J22800K41841K64567
$$ y = [18952878, 18796647, 18855109, 18757482, 18765176, 18739100, 18665863, 18697438, 18521423, 18376204, 18289739, 18219117, 18032417, 18048614, 18010892, 17796439, 17676755, 17688563, 17578951, 17503050, 17442732, 17266949, 17186434, 17241209, 17270674, 17294828, 17359314, 17495835, 17606856, 17814473, 18034162, 18242389, 18429224, 18894658, 19374155, 19935039, 20638617, 20808771, 20362221, 19621221, 19045871, 18530444, 18067824, 17771936, 17529831, 17394254, 17287075, 17165720, 17235974, 17089414, 17006682, 16880107, 16856142, 16938954, 16958143, 16976963, 16959512, 17062614, 17206274, 17330099, 17427408, 17495507, 17486475, 17571140, 17793662, 17842395, 18072249, 18413172, 18607780, 18695880, 18816992, 19039268, 19275394, 19398003, 19621040, 19879297, 20043738, 20166538, 20408379, 20672946]
2998B0672946M28775L64897K82008K78674J04392K01321K89085M09212J72047
2989B3203357J13740L53447L07712K15411J80034L20468L34150K40424L69304
2980B5638047K70505K83730L53677K99530L44767K95661M72688L99274N93866
2971B8951745N76318N63588Q06541N88933N58541N85727P34966P41679Q94290
2962C5002328J063698R73704R78810R62363J013576R86123P80779Q27376R12393
2953D3501150Q64856P39655P26578P29287N81765O87986O79146N90938M99783
2944D9601144M86443M02747N43215Q01347P65560P44436J010318J151934J133191
2935E6640335J511807J684598J680626J783212J790530K035115K030515K042071
$$ y = [20672946, 21101721, 21466618, 21748626, 22027300, 22131692, 22333013, 22622098, 23031310, 23203357, 23317097, 23670544, 23978256, 24193667, 24373701, 24694169, 25028319, 25268743, 25638047, 25908552, 26192282, 26545959, 26845489, 27190256, 27485917, 27958605, 28357879, 28951745, 29528063, 30091651, 30898192, 31487125, 32045666, 32631393, 33366359, 34108038, 35002328, 36066026, 37039730, 38018540, 38980903, 39994479, 40980602, 41761381, 42588757, 43501150, 44366006, 45105661, 45832239, 46561526, 47143291, 47831277, 48510423, 49101361, 49601144, 50087587, 50490334, 51033549, 51834896, 52600456, 53344892, 54355210, 55507144, 56640335, 58152142, 59836740, 61517366, 63300578, 65091108, 67126223, 69156738, 71198809]
2927G1198809K092458J926540J985196J629678R88771N90855O3656n93842j255142
2918G8626979j751661j964266j734261j274364q80666m63980l04412Q5438L66950
2909G0705757O75008Q70059P78788Q59021J119109J189892J265166J161401J069642
2900G9693843J119364R45013O57595M12637N0590m23835j102242j371217j636495
2891G8345253j761387j961868k202595k178413k300934k096057j712042j358996
2883F2772961j197400r47173o38824n40554n26667l52325k56910k27204m68573
2874E7617331n07291n98423r66083j003297j010390j197191j473995j669311j790205
2865D7401145j930176k056972j820927j876314j821174j546569j474908j391909
$$ y = [71198809, 73291267, 75217807, 77203003, 78832681, 79821452, 80412307, 80475963, 79882121, 78626979, 76875318, 74911052, 73176791, 71902427, 71021761, 70557781, 70253369, 70338807, 70705757, 71380765, 72250824, 73029612, 73888633, 75007742, 76197634, 77462800, 78624201, 79693843, 80813207, 81758220, 82415815, 82828452, 82879042, 82455207, 81352965, 79981748, 78345253, 76583866, 74621998, 72419403, 70240990, 67940056, 65843999, 64131957, 62772961, 61575561, 60628388, 59989564, 59449010, 58922343, 58570018, 58313108, 58085904, 57617331, 57110040, 56511617, 55545534, 54542237, 53531847, 52334656, 50860661, 49191350, 47401145, 45470969, 43413997, 41593070, 39716756, 37895582, 36349013, 34874105, 33482196]
2857C3482196j045552j027114r86527q16989o75040q47972p66115p26860o53095
2848B5936932l93781n82090n78552o43969n81991n91271n26796o73077n10241
2839B0855164m57993n37387o08990n80915m26565n49262l99017m03298l66743
2830A6524994m63529l67590k94176m38351l00648k50378l80284k17281k68896
2821A3543861m17091l32238j31292k09485j42591j03934j35612k14788j47324
2812A1709506r6977j82491j82865k36803j38575j46085q2512p5207k45897k44080
2802A0078014k43408k32984j38630l08825j64525j92759j87694r8710j20513j99554
2792H190412r6240k96763o3029o0462j81156o3334p9124O0941j71699l23603M0817
$$ y = [33482196, 32436644, 31409530, 30423003, 29606014, 28930974, 28083002, 27316887, 26590027, 25936932, 25543151, 24961061, 24382509, 23738540, 23156549, 22565278, 22038482, 21365405, 20855164, 20397171, 19859784, 19250794, 18669879, 18243314, 17694052, 17295035, 16891737, 16524994, 16061465, 15693875, 15399699, 14961348, 14660700, 14410322, 14030038, 13812757, 13543861, 13126770, 12794532, 12663240, 12453755, 12311164, 12207230, 12071618, 11856830, 11709506, 11612529, 11430038, 11247173, 11010370, 10871795, 10725710, 10643198, 10567991, 10322094, 10078014, 9834606, 9601622, 9462992, 9154167, 8989642, 8796883, 8609189, 8510479, 8389966, 8190412, 8094172, 7797409, 7734380, 7673918, 7492762, 7429428, 7350304, 7411245, 7239546, 6915943, 6956760]
2781F956760L3080o7651k31820j33603R8425M4584k35942j59000p2569j55246
2771F077018j68432j05373q1482j43327r9073n2580j01385N9688k67963k41501
2761D875590O8056l9096k86821M5775m4268j37819m7840m6823J23553l4018j68912
2750D307377q8201p7997j32647n7193n7595l9977j19822P7333r2690k3038m3796
2739C651754o169n626j39096j26531O6003p8301j1814j40438J84198n3653j54042
2728C186285J81415n2553j98156o6881R7527o3793J836j7543j28200L1090o0150
2717B910877N3582N5861l2423J31616Q3240j13506j04731r1653l1724J4481r6413
2706B779207n4192l9341j48818l1218J52129m2465p1377o2859M3266K585J4320
$$ y = [6956760, 6989840, 6922189, 6690369, 6556766, 6655191, 6699775, 6463833, 6304833, 6232264, 6077018, 5908586, 5803213, 5721731, 5578404, 5479331, 5426751, 5325366, 5385054, 5117091, 4875590, 4943646, 4904550, 4617729, 4663504, 4619236, 4481417, 4433577, 4386754, 4510307, 4476289, 4307377, 4219176, 4141179, 4008532, 3951339, 3893744, 3853767, 3733945, 3811278, 3718588, 3695550, 3651754, 3645585, 3639959, 3500863, 3374332, 3440335, 3362034, 3350220, 3209782, 3393980, 3340327, 3186285, 3367700, 3315147, 3116991, 3050110, 3147637, 3083844, 3085680, 3068137, 2939937, 2971027, 2910877, 2964459, 3020320, 2987897, 3119513, 3202753, 3089247, 2984516, 2892863, 2861139, 2875620, 2779207, 2725015, 2685674, 2536856, 2505638, 2657767, 2615302, 2543925, 2481066, 2524332, 2526917, 2541237]
2695B541237j4478j07730q234J0059J02813j281j01174r1566j14779J2912M7301
2684B275080k4933n5562n4917J04444M5045o0700K02843j64946K4619P741p8537
2673B220177l6845p4039n3196J10490N5442n1787Q826o3877Q17J4478q7298m532
2661B038656M2701q2228j9121J15309L115l0857L4660K9657J5183j22803p400
2650B016872M8852J9980k3623O1957j03602r282j2326J02582l9422J119j48313
2639A914794l1721o9461R0162R8804j59975p0077K3844O1925r0232p7065O331
2628A697329j1833M0410N4278J33319m0062j19276M5510l3657p798J7286o5855
2617A709651o639O4123O5567O06p8569p0656L5688J40893j03366r0316K3247Q3353
$$ y = [2541237, 2526759, 2419029, 2410795, 2420854, 2523667, 2522386, 2421212, 2329646, 2214867, 2227779, 2275080, 2250147, 2194585, 2139668, 2244112, 2289157, 2228457, 2431300, 2266354, 2290973, 2298714, 2220177, 2183332, 2109293, 2056097, 2166587, 2222029, 2170242, 2179068, 2115191, 2116008, 2130486, 2043188, 2038656, 2081357, 1999129, 1980008, 2095317, 2098432, 2067575, 2102235, 2131892, 2147075, 2024272, 2016872, 2065724, 2085704, 2062081, 2124038, 2020436, 2011154, 1998828, 2101410, 2061988, 2063107, 1914794, 1883073, 1813612, 1903774, 2002578, 1842603, 1772526, 1796370, 1858295, 1768063, 1690998, 1697329, 1685496, 1725906, 1780184, 1913503, 1873441, 1754165, 1799675, 1766018, 1758220, 1775506, 1709651, 1703012, 1767135, 1832702, 1833308, 1754739, 1684083, 1719771, 1860664, 1757298, 1666982, 1690229, 1773582]
2605A773582j9538l8808n4320n4857O8535j78099k32Q4864l4749P6028J1415j45838
2593A487983j15325l1047L3668K06645o1423L8282k3173n7177p9947j5802l1391
2582A351293j8729l1488K7970o4196K4382j02339Q0400m4444o9144o9072J969
2571A086602J40080j32490O6287k5949p3435r6434L6724M1861m8377o8539J3096
2560I39426J10496j12766m707J05552J1355P370j24629m5031J09746L8011L1078
2549A065901p2510o4173p2053j3850J038o5542J21144m4126n1537m3347L190J21650
2537H85785L6132q7743k2933k4100j11912J1120N3296L8198M8064m7870p9880
2526F98157j3558m6533R2633J02981n6996r4894j0071P1236n4612L6697j43613
$$ y = [1773582, 1754044, 1715236, 1660916, 1606059, 1674594, 1496495, 1496263, 1581127, 1546378, 1622406, 1633821, 1487983, 1372658, 1341611, 1375279, 1581924, 1520501, 1558783, 1535610, 1478433, 1398486, 1382684, 1351293, 1332564, 1301076, 1329046, 1264850, 1289232, 1186893, 1267293, 1222849, 1153705, 1084633, 1086602, 1226682, 1094192, 1160479, 1134530, 1061095, 964661, 1001385, 1043246, 994869, 926330, 939426, 1049922, 937156, 932449, 1038001, 1049356, 1056726, 932097, 887066, 996812, 1034823, 1065901, 993391, 929218, 857165, 843315, 844353, 778811, 899955, 855829, 804292, 760945, 764135, 885785, 921917, 834174, 811241, 787141, 675229, 686349, 739645, 777843, 825907, 778037, 698157, 684599, 638066, 730699, 833680, 776684, 681790, 671719, 742955, 688343, 725040, 581427]
2515E81427N3828J77773p6863l3387N9666o5465n8281j0405J9689r154j00084
2504E38744O7843P0106M493j0421N520j18647O4257M2970p911o939n7r9703L2515
2491E82770N7811j1559p437n4101n3161n1628J31146J3684m1841j40959K6974
2480D51699J17849r2891l3108n2226o1462P0608N0149J21578J21633r5321M4134
2469F42642k999j19328O5037n369m5200j67992J21129j2753m4448J8019K2724
2458D71462Q9375n8821J884L168o8605k1870j9031m8398m4841Q8179N4830r5056
2446C52276J35629j4421p7111o6463m9829J62364r0046k8113m1473R02Q2653N415
2434C71783m2014O6251l3225J4464N4073p1990M2687o1126J6997p8374K9818K3242
$$ y = [581427, 635255, 813028, 736165, 702778, 762444, 696979, 638698, 628293, 647982, 638828, 538744, 606587, 676693, 681186, 670765, 676285, 557638, 621895, 664865, 656954, 650015, 649958, 550255, 582770, 640581, 629022, 621585, 567484, 514323, 462695, 593841, 607525, 565684, 424725, 451699, 569548, 476657, 443549, 391323, 329861, 400469, 450618, 572196, 693829, 598508, 642642, 639643, 520315, 585352, 579983, 534783, 366791, 487920, 475167, 430719, 448738, 471462, 560837, 502016, 503900, 507068, 438463, 416593, 397562, 349164, 304323, 392502, 447332, 352276, 487905, 473484, 396373, 329910, 280081, 442445, 352399, 324286, 282813, 283715, 366368, 371783, 329769, 396020, 362795, 377259, 431332, 359342, 402029, 340903, 357900, 279526, 309344, 332586]
2422C32586l3500l741l282j595q270j6479K6645P5727k7635j01434q7542J55573
2410C07053J315l9021M5335j2410J1533L2496R984j19845l2241O2529R0581Q290
2398C65599N239j2428r4278R6457q1585m4083j8422j03886R7819k7859L8652Q3808
2386C05033m8114l850O7207m7050q800j04937K5500j8470N1531Q2493j16193M1405
2374B25755L9347R3251q5674j04550J02210L5859q7508k87609k4511L5700J3843
2363d3887K40388O8308l0310r2604n2554o5986J4229L3768j23589J15431J03980
2352A67174l3785p40n2466R823k7022o9127j6735J5334R7030j00653j0822J20238
2340I8249j52574l5833K4281N6848P4176q5270r8645J43928J8258j32867R1161
$$ y = [332586, 299086, 295345, 292063, 290468, 282198, 265719, 292364, 368091, 340456, 239022, 151480, 307053, 308368, 269347, 314682, 302272, 313805, 346301, 356285, 236440, 204199, 266728, 357309, 365599, 370838, 358410, 264132, 360589, 279004, 234921, 216499, 112613, 210432, 182573, 221225, 305033, 256919, 253069, 320276, 273226, 264426, 159489, 184989, 166519, 218050, 300543, 184350, 225755, 265102, 358353, 272679, 168129, 270339, 306198, 218690, -68919, -93430, -57730, -43887, 196501, 264809, 234499, 141895, 89341, 23355, 37584, 71352, -52237, 63194, 167174, 133389, 132649, 80183, 90006, 62984, -6143, -22878, -7544, 89486, -11167, -21989, 98249, -54325, -90158, -65877, -9029, 65147, -20123, -118768, 25160, 43418, -89449, 1712]
2329A712J2944K8318l9485j8232L0131J07223q7200n9880K1431J35369M2379J3607
2317A88317K6237k4479o7918j28274R3520J0525l1441n0561J22315K0093r4527
2306F3807L4717J6775r5263o6988N8009R4451P1971j15795j34466K9192L7422
2295f168J480O6334k887N084J4669r9566k5615L4811N0769k7927K141q1264j5038
2282h3177R6696O6714K1585n7920J03518q9510n2391J09760j20803m5753l8421
2271h9702P6361P1651L5729J9336p2962m8612L17N2834M9543J3508J2502p705
2259A12800J8810r0672J09205k7401R70L7512j13204P9975j07541p3568J52038
2248I8924l869J2172q4134K0982Q0971j024R6972j831m5606j48560O2915J3275
$$ y = [1712, 14656, 42974, 3489, -14743, 15388, 122611, 35411, -24469, -3038, 132331, 174710, 188317, 214554, 190075, 122157, -6117, 87403, 97928, 66487, 15926, 138241, 158334, 63807, 98524, 115299, 20036, -46952, 11057, 105508, 177479, 61684, -72782, -43590, -6168, -4688, 61646, 58759, 63843, 78512, -21054, -46669, -11858, 38911, 10984, 13125, -68139, -83177, 13519, 80233, 101818, 43898, 147416, 57906, 5515, 115275, -5528, -51281, -89702, -13341, 58310, 94039, 113375, 40413, -8199, -7882, 44952, 94495, 108003, 120505, 112800, 131610, 40938, 150143, 122742, 123712, 161224, 48020, 127995, 20454, -53114, 98924, 95055, 107227, 23093, 44075, 125046, 124022, 220994, 219163, 173557, 24997, 87912, 101187]
2236A01187J60420M0602L0878j88481j08666M6928J13090M6081N8967j19037l5941
2225A46028R4856q6246P7476R4009q1225j22882Q2262l9411k1689M2221l8390
2214A47009l2028L5249j8026O3185L3554P0428M4314O0972q5095Q0744l730J9075
2202D15651o3894J00530J08683n5553N5409l8282j14671K3423P3131R6834q9159
2191E12102k9372K63825k7892N9J7375K4192Q0687q7610j43624O472J18369n774
2179G28809N6085m8425Q0627Q4682j04477J34167j3071r7052P4190M5729o3486
2168H77778j0664J16672M7408n8226R02J19701P2183Q4008k6665L9881J0152J6078
2156A289208P1143Q1420M4776J7230J22656J68652J17518N8383J32351k803J35082
$$ y = [101187, 261607, 302209, 333087, 144606, 35940, 82868, 195958, 242039, 301006, 181969, 146028, 240884, 154638, 232114, 326123, 244898, 122016, 204278, 164867, 143178, 185399, 147009, 114981, 150230, 132204, 195389, 228943, 299371, 343685, 404657, 319562, 400306, 396576, 415651, 351757, 452287, 560970, 505417, 560826, 522544, 407873, 431296, 504427, 601261, 512102, 482730, 746555, 718663, 718722, 736097, 760289, 840976, 753366, 609742, 616214, 734583, 728809, 784894, 736469, 817096, 901778, 797301, 931468, 918397, 821345, 895535, 941264, 877778, 867114, 983786, 1031194, 972968, 973870, 1093571, 1165754, 1249762, 1223097, 1262978, 1273130, 1289208, 1360351, 1441771, 1486547, 1503777, 1626433, 1795085, 1912603, 1970986, 2103337, 2100534, 2235616]
2145B235616J27852K64109K34259L30402J35089M06091K35153M14712M87971M69301
2135E340555N96655N63615Q27295J166775J280214J814494J630077J654330J318924
2126A6192934J540201l96815l780339k850694j854255j322802j199613p52670
2118E575947q04127n64243l79428k33043l40769k55832k33518o8401k87039k79046
2108B130501o4275j33060j04918j15747j77549j80839j02836j39736J0563j89741
2098I32363m9783N1208p1521k3122j17215j70861J5885L0543N4916j7397N1267
2087F86283j50000j05130J3664n5424o7050o7339O0548R1286K0505p79M8921q6818
2075C88667j50557L7709p2662K7600k6352m7249P0654j4474q9026J23827l086
$$ y = [2235616, 2363468, 2627577, 2861836, 3192238, 3327327, 3733418, 3968571, 4383283, 4871254, 5340555, 5937210, 6500825, 7328120, 8494895, 9775109, 11589603, 13219680, 14874010, 16192934, 17733135, 17336320, 13555981, 10705287, 8851032, 7528230, 6328617, 5575947, 4771820, 4207577, 3828149, 3595106, 3254337, 2998505, 2764987, 2696586, 2409547, 2130501, 2066226, 1933166, 1828248, 1712501, 1534952, 1354113, 1251277, 1111541, 1122104, 932363, 882580, 933788, 862267, 839145, 721930, 551069, 566954, 597497, 652413, 635016, 686283, 536283, 431153, 444817, 389393, 322343, 255004, 315552, 406838, 427343, 426564, 475485, 388667, 238110, 275819, 203157, 230757, 204405, 157156, 227810, 213336, 124310, 248137, 245051]
2064B45051j7119O028Q987n3543O4884j6416j2119M867j44561M3555Q4628k7110
2052A87132p2380q720P0707j16059j2465r5547Q2101O0397q185M477k7784Q9003
2040A52677j14093L9743m976l2757N939K0385q3269m9184R7202j160K0182J6083
2028F6772m0257n2976j01024J56775o9023J0498k226j11100M7129R695L6444J40589
2016I1296N13r7273K1491J67255J0600j82797l3909R2395M4941j0311j07889p1154
2004g4842j71701J97985J34069j85977j23515J10499J63011r3842n3514O319J27190
1993C5682m650k2342n2476n4645J19226j16762J5363M7906j9024K3030l8721K2019
1981d5394N3512J8682m0042j19499m2594P3834J06219J35754p2880l6298m0287
$$ y = [245051, 227932, 233960, 242947, 189404, 254288, 237872, 225753, 230620, 86059, 129614, 214242, 187132, 114752, 106032, 176739, 60680, 48215, -47332, 34769, 95166, 86981, 91458, 63674, 152677, 38584, 78327, 73351, 40594, 46533, 66918, -16351, -65535, 31667, 30507, 50689, 66772, 26515, -26461, -127485, 29290, -39733, -29235, -31461, -142561, -95432, -85737, -49293, 91296, 91809, -5464, 16027, 183282, 193882, 11085, -22824, 69571, 114512, 104201, -3688, -74842, -246543, -48558, 85511, -100466, -223981, -113482, 49529, -44313, -97827, -91508, 35682, 31032, 8690, -43786, -98431, 20795, -95967, -80604, -32698, -51722, -28692, -67413, -45394, 8118, 26800, -13242, -132741, -175335, -101501, 4718, 140472, 67592, 31294, -8993]
1970h993j00068j5771O0872J19243J6209j04867p3307o1877N0392L2523J7937
1959f7707J67923p3701j43316P3978J21365J5905o998o5558m8869J8144j0001
1948a8835j557p0315m7368J3040N5955j9531K973R0061o2851r4479Q4000N0643
1936a8264K0518M2441k2575Q6645q3857j4640j04213j11539Q8372k215J7797q6688
1924a88218L8292L0250j48023O9142P4569K2165k6072k1746l315J4127Q6051m9700
1912a02478p4960J70530L7755p0546m5670J4160J77959l9046p166n0288n2498
1901d2248N2198J35142k33731k1450Q2451n8690o9325M3386J88271L495j43396
1890f3897m1092M6976j1185j19691M3349J42678j552J3544n3180J6164K084L336
$$ y = [-8993, -109061, -124832, -63960, 55283, 71492, -33375, -106682, -168559, -118167, -85644, -67707, 100216, 26515, -116801, -42823, 78542, 94447, 87449, 21891, -26978, -8834, -18835, -20392, -90707, -138075, -125035, -69080, -88611, -85638, 4423, -58428, -152907, -68907, -18264, 2254, 44695, 22120, 108765, 24908, 10268, -93945, -205484, -117112, -119327, -101530, -188218, -149926, -119676, -267699, -198557, -123988, -101823, -127895, -149641, -152956, -138829, -52778, -102478, -177438, -6908, 30847, -39699, -85369, -71209, 106750, 67704, 60538, 10250, -42248, 9950, 145092, -88639, -110089, -27638, -86328, -155653, -112267, 76004, 79499, -63897, -104989, -58013, -69198, -188889, -145540, -2862, -4414, 9130, -44050, -27886, -25802, -22466]
1878b2466M1539j61393K8915Q7863n1615Q9574Q042j00827J1380O1600j12491
1867a19879O0072R5339l5434p9493m8818K7746p3657o36o9135J82806O8009O4046
$$ y = [-22466, 19073, -142320, -113405, -25542, -77157, 12417, 20459, -80368, -68988, -7388, -119879, -59807, 35532, 98, -79395, -128213, -100467, -174124, -174760, -243895, -61089, 6920, 70966]
$$ [...]
##END NTUPLES=NMR SPECTRUM
##END=
