##TITLE=1H_CG-1199-1
 CDCl3
 8 sc, 
 5.4.2024
##JCAMPDX= 6.0         $$ Bruker NMR JCAMP-DX V2.0
##DATA TYPE= NMR SPECTRUM
##DATA CLASS= NTUPLES
##ORIGIN= UXNMR, Bruker Analytische Messtechnik GmbH
##OWNER= root
$$ XWIN-NMR		Version 3.5
$$ Fri Apr  5 14:03:01 2024 Russian Standard Time (UT+4h)  she@DPX200
##.OBSERVE FREQUENCY= 200.1309
##.OBSERVE NUCLEUS= ^1H
##.ACQUISITION MODE= SIMULTANEOUS
##.ACQUISITION SCHEME= undefined
##.AVERAGES= 8
##.DIGITISER RES= 18
##SPECTROMETER/DATA SYSTEM= spect
##.PULSE SEQUENCE= zg30
##.SOLVENT NAME= MeOD
##.SHIFT REFERENCE= (INTERNAL, MeOD, 0, 15.6632)
##AUDIT TRAIL= $$ (NUMBER, WHEN, WHO, WHERE, WHAT)
$$ ##TITLE= Audit trail, XWIN-NMR		Version 3.5
$$ ##JCAMPDX= 5.01
$$ ##ORIGIN= Bruker BioSpin GmbH
$$ ##OWNER= she
$$ F:/spectra/data/she/nmr/H-F/1/pdata/1/auditp.txt
$$ ##AUDIT TRAIL=  $$ (NUMBER, WHEN, WHO, WHERE, WHAT)
(   1,<2024-04-05 14:02:02.18 +0400>,<she>,<DPX200>,
      <created by zg, POWCHK disabled, PULCHK disabled
       configuration hash MD5:
       00 E9 B6 7A A2 85 ED C7 34 08 36 98 17 FE 4E 26
       data hash MD5: 16K
       60 FD A3 35 19 2B 83 85 7A 57 39 EA CD AA C7 C2>)
(   2,<2024-04-05 14:02:04.09 +0400>,<she>,<DPX200>,
      <Start of raw data processing
       efp BC_mod = 2 LB = 0.24 FT_mod = 6 PKNL = 1 PHC0 = -25380.77 PHC1 = 11.38731 SI = 16K 
       data hash MD5: 16K
       8B DB D0 A6 52 87 3A EF 3B 8E 8E 22 E8 C6 C4 03>)
(   3,<2024-04-05 14:02:18.92 +0400>,<she>,<DPX200>,
      <pk PHC0 = 82.54618 PHC1 = 0.6 
       data hash MD5: 16K
       86 86 02 A8 9D FC C6 0B E1 5A D7 55 74 38 EC 89>)
(   4,<2024-04-05 14:02:22.09 +0400>,<she>,<DPX200>,
      <abs ABSG = 5 
       data hash MD5: 16K
       69 C8 34 9B E8 68 EC BB 6D 3F 29 FD F1 5B A1 41>)
$$ ##END=
$$ 
$$ hash MD5
$$ 7F 03 B9 4B 1B A3 14 C9 96 0A 96 F5 37 60 85 07
##$RELAX= 
##$RELAX= 
##$RELAX= 
##$RELAX= 
##$RELAX= 
##$RELAX= 
$$ Bruker specific parameters
$$ --------------------------
##$DU= <F:/spectra>
##$EXPNO= 1
##$NAME= <H-F>
##$PROCNO= 1
##$TYPE= <nmr>
##$USER= <she>
##$AMP= (0..31)
100 100 100 100 100 100 100 100 100 100 100 100 100 100 100 100 100 100 
100 100 100 100 100 100 100 100 100 100 100 100 100 100 
##$AQSEQ= 0
##$AQ_mod= 1
##$AUNM= <au_zg>
##$AUTOPOS= <>
##$BF1= 200.13
##$BF2= 200.13
##$BF3= 200.13
##$BF4= 200.13
##$BF5= 200.13
##$BF6= 200.13
##$BF7= 200.13
##$BF8= 200.13
##$BYTORDA= 1
##$CFDGTYP= 0
##$CFRGTYP= 5
##$CHEMSTR= <none>
##$CNST= (0..31)
1 1 145 1 1 1 1 1 1 1 1 1 1 1 1 1 1 1 1 1 1 1 1 1 1 1 1 1 1 1 1 1 
##$CPDPRG= <>
##$CPDPRG1= <>
##$CPDPRG2= <>
##$CPDPRG3= <>
##$CPDPRG4= <mlev>
##$CPDPRG5= <mlev>
##$CPDPRG6= <mlev>
##$CPDPRG7= <mlev>
##$CPDPRG8= <mlev>
##$CPDPRGB= <>
##$CPDPRGT= <>
##$D= (0..31)
0 1.2 0 0 0 0 0 0 0 0.06 0 0.03 0 0 0 0 0.0002 0 0 0 0 0 0 0 0 0 0 0 0 
0 0 0 
##$DATE= 1712311321
##$DBL= (0..7)
120 120 120 120 120 120 120 120 
##$DBP= (0..7)
150 150 150 150 150 150 150 150 
##$DBP07= 0
##$DBPNAM0= <>
##$DBPNAM1= <>
##$DBPNAM2= <>
##$DBPNAM3= <>
##$DBPNAM4= <>
##$DBPNAM5= <>
$$ [...]
##$SUBNAM3= <"">
##$SUBNAM4= <"">
##$SUBNAM5= <"">
##$SUBNAM6= <"">
##$SUBNAM7= <"">
##$SUBNAM8= <"">
##$SUBNAM9= <"">
##$SW= 18.0517689322627
##$SWIBOX= (0..15)
0 0 2 0 0 0 0 0 0 0 0 0 0 0 0 0 
##$SW_h= 3612.71676300578
##$TD= 16384
##$TD0= 1
##$TE= 0
##$TE2= 300
##$TE3= 300
##$TEG= 300
##$TL= (0..7)
0 120 120 120 120 120 120 120 
##$TP= (0..7)
150 150 150 150 150 150 150 150 
##$TP07= 0
##$TPNAME0= <>
##$TPNAME1= <>
##$TPNAME2= <>
##$TPNAME3= <>
##$TPNAME4= <>
##$TPNAME5= <>
##$TPNAME6= <>
##$TPNAME7= <>
##$TPOAL= (0..7)
0.5 0.5 0.5 0.5 0.5 0.5 0.5 0.5 
##$TPOFFS= (0..7)
0 0 0 0 0 0 0 0 
##$TUNHIN= 0
##$TUNHOUT= 0
##$TUNXOUT= 0
##$USERA1= <user>
##$USERA2= <user>
##$USERA3= <user>
##$USERA4= <user>
##$USERA5= <user>
##$V9= 5
##$VALIST= <valist>
##$VCLIST= <CCCCCCCCCCCCCCC>
##$VD= 0
##$VDLIST= <DDDDDDDDDDDDDDD>
##$VPLIST= <PPPPPPPPPPPPPPP>
##$VTLIST= <TTTTTTTTTTTTTTT>
##$WBST= 1024
##$WBSW= 4
##$XGAIN= (0..3)
0 0 0 0 
##$XL= 0
##$YL= 0
##$YMAX_a= 237204
##$YMIN_a= -264760
##$ZGOPTNS= <>
##$ZL1= 120
##$ZL2= 120
##$ZL3= 120
##$ZL4= 120
##$ABSF1= 15.68852
##$ABSF2= -2.363369
##$ABSG= 5
##$ABSL= 3
##$ALPHA= 0
##$AQORDER= 0
##$ASSFAC= 0
##$ASSFACI= 0
##$ASSFACX= 0
##$ASSWID= 0
##$AUNMP= <proc_1d>
##$AZFE= 0.1
##$AZFW= 0.1
##$BCFW= 0
##$BC_mod= 2
##$BYTORDP= 0
##$COROFFS= 0
##$CY= -3
##$DATMOD= 1
##$DC= 0
##$DFILT= <>
##$DTYPP= 0
##$F1P= 0
##$F2P= 0
##$FCOR= 1
##$FTSIZE= 16384
##$FT_mod= 6
##$GAMMA= 0
##$GB= 0
##$INTBC= 1
##$INTSCL= 3.70164e-10
##$ISEN= 128
##$LB= 0.24
##$LEV0= 0
##$LPBIN= 0
##$MAXI= 10000
##$MC2= 0
##$MEAN= 0
##$ME_mod= 0
##$MI= 1.114404
##$NCOEF= 0
##$NC_proc= -8
##$NLEV= 6
##$NOISF1= 3.799351
##$NOISF2= 2.8
##$NSP= 0
##$NTH_PI= 0
##$NZP= 0
##$OFFSET= 15.66319
##$PC= 1
##$PHC0= -25298.22
##$PHC1= 11.98731
##$PH_mod= 1
##$PKNL= yes
##$PPARMOD= 0
##$PSCAL= 0
##$PSIGN= 0
##$REVERSE= no
##$SF= 200.129571690983
##$SI= 16384
##$SIGF1= 3
##$SIGF2= 2
##$SINO= 5.538805
##$SIOLD= 16384
##$SREGLST= <1H.CDCl3>
##$SSB= 0
##$STSI= 16384
##$STSR= 0
##$SW_p= 3612.71676300577
##$SYMM= 0
##$S_DEV= 0
##$TDeff= 16384
##$TDoff= 0
##$TI= <>
##$TILT= no
##$TM1= 0
##$TM2= 0
##$TOPLEV= 0
##$USERP1= <user>
##$USERP2= <user>
##$USERP3= <user>
##$USERP4= <user>
##$USERP5= <user>
##$WDW= 1
##$XDIM= 16384
##$YMAX_p= 398715332
##$YMIN_p= -1762530
$$ End of Bruker specific parameters
$$ ---------------------------------
##NTUPLES= NMR SPECTRUM
##VAR_NAME=  FREQUENCY,     SPECTRUM/REAL,   SPECTRUM/IMAG
##SYMBOL=    X,             R,               I
##VAR_TYPE=  INDEPENDENT,   DEPENDENT,       DEPENDENT
##VAR_FORM=  AFFN,          ASDF,            ASDF
##VAR_DIM=   16384,         16384,           16384
##UNITS=     HZ,            ARBITRARY UNITS, ARBITRARY UNITS
##FACTOR=    0.220516191357247, 1,           1
##FIRST=     3134.66748360007, 0,            0
##LAST=      -478.049279405696, 0,           0
##MIN=       -478.049279405696, -1762530,    0
##MAX=       3134.66748360007, 398715332,    0
$$ Real data points
##PAGE= N=1
##DATA TABLE= (X++(R..R)), XYDATA
$$ [...]
8191 4761725 461401 560518 -524063 831279 1418741 1350296 928015 1423304 71947
8182 71947 57811 1097321 807648 427548 111592 -153400 -10231 128960 139522 -189640
8172 -189640 -200546 82098 -99174 613470 1841745 1297808 1312 164867 -63424 -282994
8162 -282994 30036 713686 1083482 1194167 857398 695067 1222829 1497840 1677619 810908
8152 810908 807361 1185295 844466 590043 605810 501219 193477 317084 909275 1007625
8142 1007625 712387 1313739 823134 628176 979835 816113 195164 334437 939051 1420314
8132 1420314 1576364 1645399 1195121 827356 797783 801309 253912 449409 983003 262525
8122 262525 396016 675529 632941 333434 470826 526715 829548 1026216 802582 384111
8112 384111 -120278 852176 874847 506276 294157 198853 406971 772196 500055 522652
8102 522652 520089 108333 70548 276447 852129 367960 126805 820942 409860 507153
8092 507153 594167 995980 689700 136135 195998 378403 588152 66950 -38220 22049
8082 22049 525305 430824 512484 1463710 1584862 1409468 667057 773373 1008497 684327
8072 684327 618329 415482 1033400 982588 1437894 1470472 1016956 1074299 1437446 1153670
8062 1153670 1090748 1023907 1002905 946205 522149 644082 745448 995001 1250387 976194
8052 976194 817789 471379 782224 1448784 914151 754567 820630 1151312 1350206 1226652
8042 1226652 977015 1262396 1157712 375050 506774 682281 749767 805553 1401638 1234483
8032 1234483 954644 1297771 788127 245480 1006482 1332036 1093485 1287981 1822220 2005462
8022 2005462 1110748 796359 595235 301253 528505 206560 549424 880210 1447054 1135081
8012 1135081 551767 902016 971381 966633 1122439 1625663 982922 381691 667672 1167619
8002 1167619 1418930 1814794 1341968 567325 254640 268317 474271 468471 459512 -421432
7992 -421432 -170796 374563 1418033 1285972 985983 803929 664259 1248366 1437338 1004653
7982 1004653 1379916 1213879 518673 474071 728334 1073600 914360 1116756 1089989 1391102
7972 1391102 1203206 937371 1063418 978463 1043255 1442972 675074 608026 1258095 1537222
7962 1537222 1611673 1448381 884593 720614 81153 1152005 1146527 707422 927695 902557
7952 902557 1175514 1477798 598153 1215616 1051463 534656 912615 1049317 1852242 1813396
7942 1813396 1750178 1971234 2055323 1252237 546789 222104 1109687 670305 -55378 -268806
7932 -268806 288000 254738 228434 337048 609529 -49723 -230403 161858 489348 983655
7922 983655 409372 86771 369167 1149381 1864757 1284346 497751 667832 724761 1266647
7912 1266647 429033 150975 -102765 195469 539471 407820 67763 -209522 -41818 905728
7902 905728 594093 563599 782501 466307 726116 781073 704129 439979 473057 771002
7892 771002 931676 695241 693586 1028948 583429 105866 171082 206845 -333859 -608295
7882 -608295 -244223 8637 385855 -251879 174430 295383 -426817 102351 432506 -551212
7872 -551212 -481464 -900400 -579147 311715 195561 347909 465050 570635 433071 259662
7862 259662 -209487 -753032 -195227 -158512 121920 -228185 134244 319697 216156 267290
7852 267290 220478 102882 554202 -422751 58619 173000 -134692 -408366 -808734 -373667
7842 -373667 -470203 -280744 -13244 46611 43680 -240342 -757009 -309534 -93465 -270684
7832 -270684 -367177 319146 -73828 -768699 -471057 260353 480940 168927 392636 470723
7822 470723 220290 422752 43832 -585009 -696212 -979947 -1020608 -146599 18109 -307186
7812 -307186 -504116 -570286 -620043 -634818 -420579 111858 102772 262224 -292872 -562515 -621528
7801 -621528 -377855 133849 290780 -26640 -256570 -337336 -377442 -465283 248149 -54956
7791 -54956 107042 320101 -198624 -817156 -332834 -712916 -917442 -529911 -699673 -605063
7781 -605063 -694703 -182399 533792 396188 -581519 -1284505 -922444 -180874 -295492 -79412
7771 -79412 -505302 -1134406 -999099 -995323 -1213279 -1242860 -972016 -1192697 -1522268 -1527258 -801306
7760 -801306 199413 37642 -54174 -599023 -257339 67489 -804784 -691004 -929995 -451457
7750 -451457 -130518 -1132485 -724518 -247446 -725809 -564015 -688268 -209089 -348953 -130240
7740 -130240 -75177 -266295 -348414 -557542 -891040 -813079 45655 -69146 233730 362538
7730 362538 558171 255702 77537 174712 306124 133083 172464 -439440 -315395 -34022
7720 -34022 -414901 -84221 239086 -27253 -109363 -166443 -511541 -448689 -292345 -309648 198781
7709 198781 28965 -100733 -87553 28018 248247 569992 -78580 -482922 -777969 46922
7699 46922 4185 -326513 -815387 -391614 15832 -9450 187866 180461 -92447 311162 -176516
7688 -176516 -697948 -461074 647218 -35763 -711976 -678790 -708443 -481318 -567515 -2849
7678 -2849 -270532 -973511 -304414 -152734 -158232 75058 -739870 -96765 478748 239635
7668 239635 -422711 -247818 -623126 -253342 -608180 -1028473 -756445 151729 -591651 -786751
7658 -786751 -532403 -99539 -193105 535187 -98432 -127368 -164106 37136 -295670 -167792
7648 -167792 -68738 -244393 -29256 -104861 -73015 -63250 -382779 -457505 -249843 -17821 166049
7637 166049 573674 553188 280727 160361 -162583 -135552 74816 96061 -57570 -524399
7627 -524399 -47661 1184768 1092566 632153 363636 612523 1009656 1131281 943258 1350170
7617 1350170 800380 566717 23270 -455850 -58043 -197993 -1120122 -405400 -324000 -473224
7607 -473224 -125470 -347189 -216429 57438 169991 130722 12395 1007291 1060162 522355
7597 522355 -56092 -96757 -536898 244667 666215 633383 711986 -88635 298970 700483
7587 700483 1061272 1482391 1377329 461974 -237582 630391 781519 -151194 146367 94719
7577 94719 -469643 389204 205128 357698 504529 -231718 -149964 537885 328540 -54759
7567 -54759 -334173 -302188 -609100 -560348 -309986 -53493 360273 486959 -97069 -547061
7557 -547061 264702 275537 166528 451489 401742 566794 898253 82589 222913 396955
7547 396955 719499 826951 735781 -152162 60435 242770 212558 -234340 -695634 -481406
7537 -481406 -173685 -392736 -182444 34535 466087 262608 73409 27423 187917 369874
7527 369874 236024 621187 690661 59916 -478911 -234832 140652 194184 487310 934460
7517 934460 515569 126581 252851 -55497 -507488 -557863 162013 659680 -263532 -641088
7507 -641088 120297 541356 773585 917210 175297 442375 190848 686481 143647 -362159
7497 -362159 64988 -141660 -814727 -545964 -164453 -411771 341436 355286 -448441 -125653
7487 -125653 -149065 142151 150370 64914 74898 -345750 -408481 -229138 -617345 -82288 -181038
7476 -181038 -1324 95883 55389 814156 1286875 1281339 924722 197238 -350141 -121355
7466 -121355 -364236 -136163 36346 -48444 -314236 -700149 -931514 -611774 -74950 86582
7456 86582 -243492 -45960 -513547 47713 -198045 -28294 233064 628250 690770 373095
7446 373095 414209 -665393 -245080 -356643 -597384 -758696 -360745 -131670 -392095 -177581
7436 -177581 137355 188470 -374195 86642 500507 183782 -310686 -409970 -514754 -404232
7426 -404232 -239969 -249575 -259229 -509378 -873251 -601683 -41510 78375 -199268 -77059
7416 -77059 476907 -3559 266450 331328 -141019 -56844 -136373 382768 525911 423067
7406 423067 -254483 -337105 -31163 3678 -326426 -443220 -341478 236368 445110 23202
7396 23202 -552006 -278559 155692 147666 -82787 -500779 -555619 -187982 -359325 -577849
7386 -577849 -365740 249477 -76913 -199534 -92275 -288317 -346199 -307592 -18697 499991
7376 499991 280851 -41299 -520024 -437390 -415845 -796111 -704166 -1021728 -557587 -438942
7366 -438942 -14032 -393927 -376420 -528588 23353 -253998 19965 464166 503692 189557
7356 189557 76570 -101570 476233 182202 -123326 -84577 -725865 86892 -54897 -225573
7346 -225573 -730438 -543530 5749 -537977 -266632 -114212 -1114599 -777302 -351722 -502066
7336 -502066 -626491 -1013897 -1107409 -795707 -701513 -1057279 -192422 -433997 -798461 132488
7326 132488 102386 -389230 -879593 -1110724 -921607 -547476 -589015 -682331 -952217 -288654
7316 -288654 507972 541183 254134 594056 139898 -321662 -589548 -257474 -302142 -804773
7306 -804773 424781 985542 354580 -134875 -125548 -350857 -252889 -239780 83470 -435449
7296 -435449 -733673 -633001 -871881 -1298185 -1339328 -899815 -727146 -1035050 -413703 76229
7286 76229 430715 139434 -750630 -858532 -864285 -847268 -525509 -535321 16562 -30872 -140977
7275 -140977 -48935 273902 -342722 -235188 336515 211824 -102842 -109048 -502954 -690748
7265 -690748 84097 -399949 -476973 157940 241281 156232 -393574 -632335 -193310 -1093868
7255 -1093868 -848165 -720166 -342954 -350807 -299599 -109172 -350187 -129094 -166413 -348801
7245 -348801 -189539 -14168 344543 54278 94796 132091 -100466 -609552 -178383 -322294
7235 -322294 -179927 -439904 -452313 -783275 -1487691 -605838 -88362 -135937 -28561 -769312
7225 -769312 -220561 -143948 426201 446956 -102942 -228858 -680954 -391662 -66871 35907
7215 35907 302492 2149 -248791 80290 130882 -583402 -1146094 -1261623 -1124184 -558163
7205 -558163 -479014 331614 -57299 -277625 -963021 -1325774 -1203282 -1307478 -897487 -685030
7195 -685030 -601327 -642079 -106749 -135426 -457292 -382439 -304914 -7215 94158 -117344 -62953
7184 -62953 391666 510494 186382 -134594 751892 459939 606527 534637 769821 611306
7174 611306 227940 48421 -71787 -399334 -320444 769425 299543 386039 1227883 313925
7164 313925 -74119 -233991 -656676 -538056 -620462 -299285 -240549 -803058 -321974 -252674
7154 -252674 -79130 -77224 -146224 -107877 -273346 -241983 45536 239211 56511 -520547 -353524
7143 -353524 -341985 -643983 -385134 -242082 -173009 151109 303259 -68324 -290063 -89839
7133 -89839 101931 526870 686716 746103 975031 270526 -519445 -704111 -592408 -714958
7123 -714958 -426854 -34545 -565809 -234129 210835 -339803 -769765 -1387059 -734696 14664
7113 14664 538791 -89297 -463374 31640 -114742 -122279 -63156 -281407 -293798 197350 76724
7102 76724 -48529 -395051 -650270 -99527 -414142 31375 -183883 -273004 -777568 12882
7092 12882 -288141 -462851 5143 -234426 -49965 432404 499363 108576 64648 525069
7082 525069 743905 95292 -175477 -12333 645546 233772 -151608 -133157 -24452 -120755
7072 -120755 101858 84840 140783 -771216 -1065296 -508366 -156787 555504 316593 -106043
7062 -106043 -156212 -755473 -213178 -273910 387744 754924 22275 109273 -370290 -250281
7052 -250281 -57661 -401511 -261967 27564 302815 227611 -262432 117150 -86326 270884
7042 270884 -306044 -274361 130676 179149 201407 17093 -175842 211824 -102519 -293069
7032 -293069 68049 496217 134918 98190 483186 80852 -341391 -286682 -550878 -644134
7022 -644134 -383886 -354541 -272705 -717088 -566771 -378268 129529 184994 -295602 -279101
7012 -279101 892141 560533 669633 463286 365463 37413 -261167 -747207 -698096 -401471
7002 -401471 217640 7330 -532592 -187312 84867 448697 748685 796196 397409 5032
6992 5032 113775 -635887 -532459 -475357 -424235 329919 518155 539582 38506 196717 530938
6981 530938 708020 280268 -84931 12578 -4103 -32030 11628 42286 -12528 -43619 -184050
6970 -184050 -77530 31546 -202817 -454964 -344856 72723 298137 -56469 -705329 337810
6960 337810 90616 334359 1003859 506055 -27436 31689 -666416 -593869 141134 34355
6950 34355 2281 119731 64643 388459 409361 60033 -294408 -41766 264436 302452 655501
6939 655501 103454 -629393 -424461 -15393 618224 188996 -139357 180195 90573 578191
6929 578191 344701 348929 270558 -39100 -286080 -307480 -464608 -11006 -215282 -64749
6919 -64749 447460 392617 -128497 693901 1244003 761413 949597 -197540 -283310 810984
6909 810984 1219521 573360 186565 455868 125114 -225784 160015 856268 939930 679376
6899 679376 447264 689446 860444 -729 -427031 -794627 41590 218398 -414704 218225
6889 218225 258911 72552 -501250 -894262 -8301 146076 130528 639724 227782 141598
6879 141598 -230857 -778454 -191283 -141967 124938 -369201 -396606 -255194 -296266 224244
6869 224244 405241 -131578 -112372 314269 503107 549345 245434 484114 803901 1392639
6859 1392639 1237398 685134 532440 651690 209723 -283929 87717 720325 938091 216006
6849 216006 55029 332697 442692 706972 1156677 681005 -151179 535331 850943 1175245
6839 1175245 1353722 1370018 2063140 2125029 2047643 1265092 491428 587040 458066 956252
6829 956252 542152 464043 203059 152214 -68217 127315 799282 941525 1023153 502171
6819 502171 219641 604841 631142 535324 -125396 -183360 248979 48195 -127423 -168745
6809 -168745 -446630 691240 435805 -106781 394323 412418 250226 18803 642343 247721
6799 247721 -225997 -583899 -630991 116120 562401 368216 23170 -71515 493488 323365
6789 323365 670376 -85428 -454575 838362 545155 963483 1429356 930958 850588 -91253
6779 -91253 -149022 791501 694279 770119 660372 489015 170388 -330541 342359 158376
6769 158376 209649 340543 599578 665912 470168 205679 746943 722396 709907 565899
6759 565899 595535 487099 681656 403306 320390 -143714 -172671 598380 213378 -235414
6749 -235414 -287043 -296539 363815 745016 249697 432684 261247 -41805 7526 -154720
6739 -154720 62836 33693 -165384 64693 373279 284138 246713 -63174 -497383 -276557
6729 -276557 -197566 -354880 -242473 344710 -391995 -533063 -789642 57763 55475 -47995
6719 -47995 -142119 173997 94260 161070 -179631 159984 -450630 244027 613142 807195
6709 807195 905474 658765 217709 262702 1610281 772211 375888 299716 592243 105509
6699 105509 -454597 -415729 -187303 -350919 -375019 -40060 -63748 64518 190039 261328
6689 261328 -7858 232282 672719 316064 311260 269385 -232442 672780 761681 -169895
6679 -169895 -147349 -316424 163303 635602 302639 70573 367477 355645 238161 -38494
6669 -38494 447776 128178 426410 294984 220888 -170416 -168341 -177114 -312177 274362 395721
6658 395721 537103 415232 589253 640225 49670 -29983 -255892 -549530 6760 447679
6648 447679 693703 868462 240572 -225898 21789 225340 -203874 362213 434269 532331
6638 532331 428020 797652 273689 319608 490394 317004 748667 847495 1243017 133557
6628 133557 236485 497882 1357320 906926 629323 304821 243067 559002 235910 138311
6618 138311 118237 467496 605497 238738 908087 508780 -542443 -538838 -47845 693298
6608 693298 259380 315859 225744 9638 90059 639523 282970 980960 698531 399791
6598 399791 236621 319487 533621 7262 136039 -7569 -104669 -242090 405774 468873
6588 468873 1292935 1235059 931523 805360 821826 730038 705485 646557 556272 942873 329143
6577 329143 351538 355796 17331 20803 759386 679637 530044 934531 640208 453009 569271
6566 569271 376100 18978 -17296 175579 53984 136854 590254 862940 723795 287013
6556 287013 -99837 362248 343649 196793 385300 575990 989176 722313 837248 1290938
6546 1290938 765187 188761 326747 910387 1218201 505798 264422 460522 748906 1098163
6536 1098163 683802 -150576 535352 844463 1588988 1165191 862843 776279 326855 179559
6526 179559 -96920 -328381 -90718 -93423 -426124 324519 319712 -554425 292359 448353
6516 448353 324077 -114334 255241 759478 435879 214915 138752 119979 9518 -50857
6506 -50857 -37583 -165677 -118854 160542 65172 62067 -551809 207816 816903 848938 902819
6495 902819 421037 -136901 -457495 -165837 457058 974293 477453 49942 -511092 -399341
6485 -399341 227368 -258686 203133 292434 399317 818491 1493580 1429814 276574 -488348
6475 -488348 -303642 214035 825958 508202 209607 457625 957518 597952 521150 405478
6465 405478 584382 885962 394840 933633 1039104 332334 253195 578361 540914 893562
6455 893562 1284741 1002549 677824 1066755 658156 167142 1256462 858624 720796 231561
6445 231561 499791 928957 922522 864843 1150341 1108060 881156 805900 26091 -147729 349381
6434 349381 651184 -10325 325826 523223 397145 105411 -171434 363933 522585 554828
6424 554828 729118 435591 704589 156691 405538 399269 567331 591594 553955 760765
6414 760765 -70505 -165006 86326 542979 629141 646903 839996 733566 -17897 724086
6404 724086 940545 287111 4857 1297127 1022574 551452 766551 1109612 1172652 922298
6394 922298 993851 1351284 1034188 869740 1014889 1073009 814634 497399 982948 1043196
6384 1043196 847535 720544 829729 1059756 981534 1494074 1341589 1350922 1916172 884532
6374 884532 535092 602661 1347627 687360 838467 1312589 1008032 1279914 1974325 1915164
6364 1915164 2127423 1994991 1718436 1803156 1735616 1766739 1915173 2214272 2685841 1973641
6354 1973641 1431824 1926892 1526722 1297911 2061129 2022410 1857490 1738503 1976092 2425334
6344 2425334 1969033 1284015 1507383 1572706 1847673 1240406 1608106 2269052 1659756 1509411
6334 1509411 1830353 1884765 1787436 1152045 1025670 1962827 2272588 1906291 1874742 1827855
6324 1827855 2395826 2310613 2132762 1484459 1416113 1996885 2164593 1716344 1505568 1786664
6314 1786664 1097796 1060515 1997017 1744147 1663379 1797529 1969987 2112526 2043176 1595807
6304 1595807 1449230 1945000 1832689 1873183 1752975 1318708 1664270 2023854 1954536 2641081
6294 2641081 2124454 1291847 1638300 1812086 1790628 1917640 2620496 3021130 2183929 2380587
6284 2380587 2407849 2650528 2623723 2287655 1919403 1657895 1980892 2332898 1480674 2005860
6274 2005860 2381676 2637918 2466794 1889356 2084479 2571754 2552737 2702373 3056397 2963774
6264 2963774 2804381 2823710 2930060 2658952 2065691 1638131 1768969 2060169 2242317 2549854
6254 2549854 2575297 3063789 2351422 2190694 1959286 2061907 2078207 2786939 3218356 2627071
6244 2627071 2726856 1779231 2283416 3185399 2912360 3197766 3005591 3186998 2992503 2941398
6234 2941398 2871612 2957965 3195282 3205411 3013790 3483946 3922246 3501311 3806954 3505004
6224 3505004 3944013 3894278 3836088 3823846 4423587 4488714 4577600 4273229 3787671 4784600
6214 4784600 4656386 4321813 4193740 4535333 4831673 4250868 3969379 4229938 3901727 4363965
6204 4363965 4845343 4611963 4473679 4052938 3796384 4674848 4638630 4429482 4073201 4077460
6194 4077460 5250060 5170392 4823864 4393541 4698368 4872211 4552788 4129977 4556426 5234053
6184 5234053 5436497 5189073 4505824 4652938 5353037 5117604 4959367 5087260 5019329 5671098
6174 5671098 5961783 6121460 6265170 6176794 5776556 6284719 6644826 5965186 6423055 6422255
6164 6422255 6556469 6426886 7107608 8112672 7611644 7082467 7191749 7644120 7660005 7732849
6154 7732849 8223412 7834612 8104074 8317862 8717339 8661202 8913677 8602267 8416146 8694817
6144 8694817 8571139 8642930 9061793 9220045 8760015 9166677 10146043 10070219 10961123 10975282
6134 10975282 11252997 11669466 11770465 11883868 12296641 12773895 11571703 11673769 12071605
6125 12071605 12545622 12896963 13323356 14166888 14189608 13890219 14299911 14992319 15426938 15907898
6115 15907898 16328250 16479424 16709200 17158522 17450336 18451935 18789632 18885955 19145456
6106 19145456 19895355 19924310 20798445 20907356 20594758 21078794 21347744 21666647 21610989 22507090
6096 22507090 23190542 23486863 24141163 23933887 24400247 24765694 25246010 26029811 27122342
6087 27122342 28687131 29793694 30303795 30890572 32649039 33732825 34977937 36386401
6079 36386401 37835709 38827646 39943431 40404714 41949193 43228809 45883356 47924812
6071 47924812 50265831 53334547 56771303 61144099 66468614 71402112 76162541 78615121
6063 78615121 79886944 79580932 77534709 75476401 73358954 70757314 68528520 66843199
6055 66843199 65926133 65328558 64947356 65606463 67304076 68511508 70353592 73285001 76197774
6046 76197774 80809257 85859680 92603053 100232117 108921804 117784663 125777936 131115330
6038 131115330 132414747 130516254 125145642 116768725 108116292 99783070 91152585 84473629
6030 84473629 79376207 74684984 70570319 67535557 65704599 63563646 63666511 63385701
6022 63385701 62593630 63303412 65148653 67375011 70457128 74112921 76976499 80511157
6014 80511157 82056361 81953629 79401478 75090328 69424430 64553543 59734237 54850913
6006 54850913 50379918 47040100 44702883 41884715 38721920 37405886 35198937 33602534
5998 33602534 32591001 31662183 30593851 28321858 27461603 26670329 25929244 24656816 24402621
5989 24402621 24185475 24135362 23565045 23401867 22824978 22338935 22414849 21980355 21898007 22341085
5979 22341085 22376699 22458480 22677394 22728353 22596344 22483811 22139481 22046832 21516161 20653256
5969 20653256 20469873 20497292 20269776 20213985 19888873 20105649 20050491 19899433 19529248 20647763
5959 20647763 20321808 20665928 21325662 21627126 22008739 22151265 22179892 22065703 22060526 21689172
5949 21689172 21633617 22548331 21891319 21723663 21630281 21546597 21640660 21857294 21071395 21457218
5939 21457218 22891362 23250889 23352751 24218860 24830733 25014475 27059180 28509966 29695306
5930 29695306 30544951 30734566 30963477 30178538 29536227 28739451 27213912 26462634 25602664
5921 25602664 25607321 25057496 24777617 24234226 24879412 25642600 25767079 25582935 26393937 26526966
5911 26526966 27546366 28192299 29605603 31438394 32704181 33932717 36667021 39144501
5903 39144501 40866299 42346198 43228383 43081874 41913148 39027012 36660273 35131040
5895 35131040 34144638 32655376 30780452 30269843 29486231 28673786 28184258 28084128 27776077
5886 27776077 27565835 28058690 27581985 28239921 28821316 29647698 30580087 31370632 33089153
5877 33089153 33834315 35769670 36339428 36540474 36633136 36743407 36243398 35307378 34898599
5868 34898599 34529052 34686134 34230069 33516207 33149495 32956365 32665781 31407406 32151988
5859 32151988 32545526 32393466 32465120 33146021 34224225 34545947 36062100 38051729 39641825
5850 39641825 41682372 43601857 45131760 45959531 45626542 44848338 43476756 42457495 42888827
5841 42888827 42302994 41421750 41172201 41090652 41136991 41450963 41225000 41148512 41518807 41828573
5831 41828573 42881626 44238102 45525046 47556267 49822648 52453278 56071025 59848062
5823 59848062 63592313 67349664 69706908 71333180 70176287 67899138 63557317 60086901
5815 60086901 57712808 54580805 51762241 49921455 48802271 48057768 48023521 47263840 47551356
5806 47551356 48326065 49352695 50495196 52481674 53900427 55092376 57349126 60212790
5798 60212790 63724504 67453591 70877631 75006618 77618885 80886396 83178156 85644344
5790 85644344 88352239 90845913 93056302 93193185 91558954 88648232 85670867 81902459
5782 81902459 78312475 74538761 70471601 68085655 66415567 65029304 64874656 64738367
5774 64738367 65169903 66764176 69134661 72565892 76298751 80196990 85316969 91549133
5766 91549133 98729479 108103146 117965722 128544910 137163444 141066703 140629004 135096295
5758 135096295 125764821 115366296 104036042 93536663 85505425 79059720 72836670 68216026
5750 68216026 64717065 62163556 60029496 58318322 57653273 57783348 57765562 58537967 60477434
5741 60477434 62860845 66729117 71407041 76221180 80320009 83014568 83670936 82296239
5733 82296239 78179992 71884138 65475242 58841106 53088772 48615547 43958648 40101533
5725 40101533 37042938 34415403 31629675 29372202 27356617 25355102 24357880 23128765
5717 23128765 22053862 21822120 21027643 19854461 19387021 19288926 18570957 17372618 16560635
5708 16560635 16432174 16145844 16022349 15946767 16004402 15582127 15031358 14979462 14699235 14347616
5698 14347616 14985525 14796352 14063580 13456364 13944905 13912343 13198121 12222970 12436581 12112281
5688 12112281 12309650 12108563 11905492 11727878 12048009 12119997 11444497 11184166 11208658 11283678
5678 11283678 12173042 12006421 11571370 11648880 11122168 10970439 10886771 10980404 10267082 10256898
5668 10256898 9825461 10011588 9607179 9472728 8707641 8922838 9089601 8784074 9013499
5659 9013499 9465406 10095061 9996888 9302451 8649255 8591580 9029283 9297370 9446254 9090677
5649 9090677 8802872 9080645 9225683 8819784 8603126 9263661 9695686 9106309 8669418 8925464
5639 8925464 9181476 9471090 9450012 9160411 8641764 8498762 8347233 9112719 9270567 9565175
5629 9565175 9788598 9413952 9634006 10021986 9541078 9757110 10203086 9344632 9363274 9687812
5619 9687812 9686275 9792461 9842324 9568762 8797190 9659728 10114829 10220488 10018467 10152349
5609 10152349 10541534 10886438 11364555 11077222 11065308 11191717 11396478 11657216 11823636 12420242
5599 12420242 12298845 11985002 12140889 12040293 12358731 12749206 13587054 13018626 13315677
5590 13315677 13422056 13127695 13381648 13645450 13857020 13439138 13965685 14558917 14878684
5581 14878684 14762643 14115727 14476061 14063094 14662330 15359085 15120074 15000138 15624736
5572 15624736 15952423 16430182 16559587 16758912 16842898 17030749 18052607 18918100 19651211
5563 19651211 19572441 19325419 19650962 19337462 19870898 20113565 21312226 21217004 21586824 22019163
5553 22019163 21424962 22357855 23045118 23667192 24083420 23923017 24319778 25015479 24686426
5544 24686426 25379568 25302348 25307071 25728520 26084368 27008473 26974671 27561579 28302688 28615187
5534 28615187 29198516 30565632 31648132 32062280 33382826 34803693 35819643 36475347 37494409
5525 37494409 38111578 38530487 38710297 38837087 39509012 39823427 39873347 40333162 40903132 41798286
5515 41798286 42621262 43471419 44399624 46027690 47840803 49033310 50947433 53168822 55214810
5506 55214810 58370809 61222946 65145359 69272601 74234744 79056513 84475019 90526252
5498 90526252 96813709 103355438 108894222 112492568 113323661 111614988 109445152 105922943
5490 105922943 102640273 99558968 96857019 94394498 92518820 89696589 87860375 87665681
5482 87665681 88460560 90188443 92422839 95569983 100059841 106189114 111839671 119985295
5474 119985295 129139428 140049102 150516372 159568635 165000151 164639054 160143981 151280472
5466 151280472 141509899 132576667 126086210 120713652 115413486 110870472 105729178 100035796
5458 100035796 94435377 90995584 87730309 85439650 83953772 83126633 82907901 84145461
5450 84145461 85686172 88071061 91187082 94485910 97484174 99100037 98186486 95716476
5442 95716476 92023277 86717162 81372571 76362842 71557181 67949500 65117619 63138166
5434 63138166 61293570 59181130 57520896 55771587 53287489 50846569 49614172 48432804
5426 48432804 47259316 46438623 45588346 44452650 44159551 43996853 44711203 43815139 43494851
5417 43494851 43845155 43404442 43066855 43293373 42328211 41905325 41091762 40264391 40249075 39833421
5407 39833421 39569460 39194635 39528036 39705482 39845285 39440300 39497156 39826374 39915597 40206750
5397 40206750 40711183 41382797 42095067 42533439 42939365 44157834 45231860 46741226 48400034
5388 48400034 49793330 51138901 53013726 55175606 57911832 60443854 63883866 66363646
5380 66363646 67682109 68855406 69000492 68115455 66900895 65541027 64052746 63582214 63784539
5371 63784539 64283309 64876474 65825090 67035295 69011903 71531251 75396929 79597982 84519467
5362 84519467 89701464 96108567 103689870 112667472 122309263 133084317 142437120 148388517
5354 148388517 151102747 148631635 142628059 134811523 125719939 117358307 110012592 103832180
5346 103832180 98133318 94549295 92743328 91663233 91472378 92561834 94323748 97857988
5338 97857988 101522328 105833999 111838146 118772380 128673643 140525610 153388525 165063730
5330 165063730 172919767 175823290 171813501 163059298 150945932 138830951 126258148 115209939
5322 115209939 105628077 97525006 90713921 84643591 80398171 76979881 74427707 72747909
5314 72747909 71755914 71481240 71397324 72417427 74553709 77176950 80494610 83819597 88139979
5305 88139979 91352188 93051474 92860582 91006439 88044810 83370569 78409772 74470918
5297 74470918 70581421 66457092 63607232 62076592 60560669 60351167 60212828 61335403
5289 61335403 62881369 64612361 67291729 69457488 71984760 75830812 79388869 83492103
5281 83492103 86334640 89005670 90591263 90951911 89787363 87346950 83190765 78855934
5273 78855934 73679157 68895242 64775146 60169323 55407388 51642398 47791335 44241919
5265 44241919 41886498 39419678 36521262 34882315 34359922 33604910 32613061 31863279 31309788
5256 31309788 29882922 28875200 27855719 26723669 26358396 25809952 24932522 24477852 23878457
5247 23878457 23516365 23208345 22960446 22438543 21951438 21571328 21721261 21368461 21897684
5238 21897684 22484990 22550485 22356759 23796644 25404244 26117448 27541319 27822860 27168898
5229 27168898 26190510 24132530 22074526 21881116 21079920 20290044 18675663 17326028 16167711
5220 16167711 14978427 14855149 15042796 15497364 15324965 15213820 15069576 14909286 14778434
5211 14778434 14222349 13684480 13538019 12876605 13215848 12319786 12182874 12129101 11161965 10646770
5201 10646770 10999026 10988138 10835737 10507864 10719611 10448183 10446754 10278525 10229559 10594764
5191 10594764 10194365 9621392 9991434 9923273 9197637 9664857 9011247 8535527 9054965 8824026
5181 8824026 8918495 8956555 8221231 8503803 8306252 8883374 8707172 8805850 8193027 8087914
5171 8087914 8370907 8241379 7994010 7863426 8326837 7456775 7152549 7737347 7492955 7762194
5161 7762194 8149812 7568140 7348319 7183959 7572219 7950172 7699757 7911973 8166148 7969595
5151 7969595 7958966 8261937 7920781 7628624 7720766 7604757 7467670 7956114 7766176 7641248
5141 7641248 8136746 7422756 7920993 7564923 7479807 6875539 6084685 6393960 6413390 6518389
5131 6518389 7039294 6156114 5235831 5814697 6026765 6561499 6587232 6335617 5969939 6481142
5121 6481142 6262718 5939105 5862082 6429075 6770167 6347947 6256654 6277305 6859025 6780956
5111 6780956 6684643 6173258 5852868 5468800 4953329 5064435 5016321 4783758 4859082 5092421
5101 5092421 4534253 4487800 4478873 4801384 5049722 5124890 5570839 5553934 5694196 5178282
5091 5178282 4928912 5064665 4789961 4938129 5106328 5532231 5255906 5978447 5683639 4857698
5081 4857698 4412131 4276658 5124946 4712756 4231913 4785386 4802182 4118731 4224553 4671041
5071 4671041 4226395 4224802 4685697 5015213 5371707 5036683 5152820 4588547 4506431 4046276
5061 4046276 4814508 4426742 4322265 4141601 4076960 4235784 3974051 3559241 4063487 4855261
5051 4855261 4802848 4310511 4044369 4523665 4396430 4056386 4096120 4325776 3908162 4283854
5041 4283854 5078959 5026611 5849607 5370125 4732722 4986726 5260590 5259174 4732193 5430808
5031 5430808 5704743 5560917 5383594 5472554 5424899 4964434 4733436 4640406 4496658 4862856
5021 4862856 4309778 4628628 5531206 5290487 5102925 5339930 4655836 3947033 4785329 5713241
5011 5713241 5137865 5488151 5466577 4904458 5203605 4726502 4390439 5780913 6087447 5557826
5001 5557826 5037067 5156061 4651084 4310245 4850097 5149280 5076388 5043672 5523781 5570453
4991 5570453 4860363 4759599 4750702 5230539 5437373 5199382 5624117 5707536 5225345 5278788
4981 5278788 4521781 4287616 4608534 4852906 4596769 4449952 4729017 5001835 4863811 4459213
4971 4459213 4517128 4284340 4322153 4881321 5693408 5857496 4934406 4651159 4670483 4711711
4961 4711711 4602699 4767918 4950683 5411202 4769487 5071355 5658856 5527816 5074441 4940678
4951 4940678 5884782 5610774 5923974 5443758 5526029 5720829 5769938 6034090 5309865 5722612
4941 5722612 5766134 5988426 6161688 6522338 6616334 5780224 5991889 5674608 5958384 6381948
4931 6381948 7143609 6766461 7194056 7657493 7826009 7403733 6966997 7368159 7051847 6728446
4921 6728446 7311174 7425070 7816648 7811459 7808389 7688670 7640080 8135601 8117199 8183316 8629190
4910 8629190 8006355 7684044 8129226 8336724 8271833 8982094 8713966 8781311 8861009 9128193
4900 9128193 9483195 9545486 9649350 9865444 10175535 10477644 10716772 11098391 11236371 10934785
4890 10934785 11337194 12230349 12086304 11926144 11904421 12034290 12097564 12255376 12700329 12821795
4880 12821795 13220946 13459122 14207156 14436398 15437878 15799969 16025996 16349184 16693750
4871 16693750 16929857 16865205 16968577 17515661 18418347 19265953 20480048 20719132 20730887 21029775
4861 21029775 22132750 23147462 23878703 25301300 27076871 28284988 29320008 31547980
4853 31547980 33653036 35972970 39016502 42992917 47081902 51504562 57651100 65082778
4845 65082778 75433608 89424636 105168052 118872366 128976165 132138006 125153618
4838 125153618 112516479 97577083 83331558 70466662 60921212 53929303 47787862
4831 47787862 42214863 38215154 34714273 32175485 29639988 27841788 27313927 26309840
4823 26309840 25121235 24478421 23708985 22792244 22363364 22514493 22256302 21823496 21219111
4814 21219111 21634112 21237064 20974540 20560335 21003812 21724603 22162806 22758603 22550826
4805 22550826 23135809 23546346 23929627 24342741 25465144 26257610 26334087 27034370 28591100
4796 28591100 28610309 30319786 32568898 34035502 36790903 39927716 43134697 47178624
4788 47178624 51929138 58362425 66080647 76767841 89274649 102296282 111592602 118105378
4780 118105378 118363472 110894315 100147196 86858933 73773153 61922320 53337294 46280177
4772 46280177 40508754 35808917 32511281 29617938 26914483 24512457 23137057 22094641
4764 22094641 19956904 19362669 19396079 18129749 17103254 16721670 16458227 15767094 15472803
4755 15472803 14599086 14234511 14627363 14871302 14155969 14071703 14322763 14354457 13290156 13685964
4745 13685964 13702533 12559283 12543392 13379983 13184066 13192950 13459109 12766076 12772608 12442200
4735 12442200 12945281 12958737 13215260 13506888 13649977 13612155 13956688 13866086 13367266 13856697
4725 13856697 14537174 13335598 13036496 13222644 12823060 12726872 12809820 12670811 12652520 12697764
4715 12697764 12802636 13256991 13478025 13853060 13600106 13142561 12979871 13443564 13676475
4706 13676475 14177040 14532764 14302979 15250502 16623658 16564936 16422618 16045367 14996252
4697 14996252 14653544 14566734 14844445 14449244 14643828 13989754 13385977 13470904 12841473 13126026
4687 13126026 13717106 14096995 14014302 13533374 13632765 14101991 14899338 14852889 14910256 14893651
4677 14893651 15028508 15146512 15325481 15802199 15891427 15447884 15673959 16506466 16611233 17058848
4667 17058848 18149103 18064616 18044323 18715921 19133875 19500393 19455543 19501390 19489260 20016424
4657 20016424 20903347 21262743 21774597 22469031 23517709 23763157 23875417 24019438 24080693
4648 24080693 24227167 24771397 25858295 26498755 26809232 27284304 27529656 28071534 28488262
4639 28488262 28520763 29098338 29897444 30159913 31683802 32966228 33050985 33835801 34873442
4630 34873442 35588059 35946891 36794549 37849151 38889784 38994895 40228359 41405097 42717110
4621 42717110 44553426 45809389 46149314 47096756 48023619 49598602 49789915 50740511 51396022
4612 51396022 51508272 52746607 53494083 54352879 54981938 56746244 57535982 58736224 60386575
4603 60386575 61213756 62481415 63286807 64514524 65789960 66935024 68620044 70226033
4595 70226033 70939148 72445813 74287000 76507382 78226719 79965812 81846782 84171905
4587 84171905 85990011 87108261 88886845 90151815 92212460 93613472 95982822 97488429
4579 97488429 98415678 100300058 101749333 102631591 103320514 104812241 106048683 107382719 108866093
4570 108866093 110151370 111784214 113809082 115971649 117506411 120209231 122919102 125996580
4562 125996580 128021305 131185301 134272540 136611444 139883720 143633720 146968558 149296469
4554 149296469 151794764 153010137 154344328 155773780 155981070 156322722 156749436 156011572 155696115
4545 155696115 155249092 154945394 155973893 157535650 158803821 160394528 161132981 162846472
4537 162846472 164202768 164951361 165762297 167243412 168228051 168802045 168677143 168097652 167128149
4528 167128149 165582050 163612589 161577148 159561198 157504828 154354578 151147976 148087884
4520 148087884 143972153 140584554 137743461 135436733 132269608 130184922 128626003 127411399
4512 127411399 124884521 121909754 119330689 116992012 113989543 110868845 108088964 105087791
4504 105087791 102431434 99739884 97019681 94325643 92267089 89429881 87271381 85502256
4496 85502256 84121415 83107644 81827225 80037547 78606487 77620775 76159249 74660077
4488 74660077 72350670 69741259 67500790 65364546 63550302 62006616 60569248 58554566
4480 58554566 56889109 54779468 53231232 52563851 50892641 50605363 50177575 49491057 49268094
4471 49268094 48682974 48192432 48065656 48523852 48140565 48355595 48296385 47127782 46695321
4462 46695321 45232256 44673498 43924483 42285192 41402508 40465632 40099879 40106249 39391801
4453 39391801 38465679 37578855 36958423 36422714 35383608 34734762 34432154 34582502 34882459
4444 34882459 34676794 33774502 33491917 33556233 33405365 34451478 35145897 35674439 35399906
4435 35399906 35966782 36831129 37390069 37721867 37683728 37336296 38575092 39762265 40883432
4426 40883432 42172039 43125210 44526871 45438400 47076998 48483478 49239900 51328728 53553029
4417 53553029 54390573 55882668 58212142 61574020 63964343 65796398 67434976 69477329
4409 69477329 71793513 73600497 75457800 76405877 77940428 78833883 79774580 80516574 81286006
4400 81286006 81573018 81374862 81951906 83235372 85262441 86257405 87728116 89393642 91959067
4391 91959067 94862180 96464043 98121200 100008151 101069816 102522137 104038524 104178652
4383 104178652 103520775 102629742 101220327 99167799 97484261 94952741 92378312 89177415
4375 89177415 85375070 82256266 78503329 75093908 71950679 69447477 67804840 66028356
4367 66028356 63977462 62657419 63009133 61897540 60846525 60234229 59583496 58945212 57903623
4358 57903623 56945788 55992810 54562616 52500669 49954943 47728804 46731811 45000195 42335196
4349 42335196 39719271 37819829 35395753 33679109 31461002 30133832 28453930 27262788
4341 27262788 25504975 24422219 23741530 22211931 20680617 19922711 19951955 19491907 18535393
4332 18535393 18076539 17177564 16276061 16591957 15618825 14621498 14374818 14120748 14246317
4323 14246317 13198811 13535530 14035176 13249379 12673453 12491351 12277009 11769288 12265752
4314 12265752 12394162 11793524 11148562 10910008 10289568 10053064 10521177 10406053 10312086 10146007
4304 10146007 9286448 9050380 9588158 9523978 9562656 9688931 9526220 9145108 9061461 9531642
4294 9531642 9748798 9538641 8914002 9186858 9023429 8726638 8094600 7761463 8683637 9353330
4284 9353330 8881043 8588049 8468490 8835334 9033153 8863557 8949327 9201057 9265561 9183356
4274 9183356 9449597 9389725 9292207 9483909 9322965 9361130 8809407 8821010 9536879 9369997
4264 9369997 9226162 8816998 9197003 9444792 9181640 9061027 8877350 8833585 9697267 9746558
4254 9746558 9984441 10491183 9939710 9722485 10424786 10911084 10610210 10929121 10769784 11367713
4244 11367713 11379003 11659536 11560683 11475069 11831440 12042329 12349137 11491396 11063727 11001589
4234 11001589 10613369 10464975 9863671 9872967 9502059 9028353 9637842 9506434 9155572 9081105
4224 9081105 8631023 8733559 8804502 8307022 8420030 9009418 9337246 9009765 8800958 9191448
4214 9191448 8692972 8622082 9304233 9315812 8828185 9142257 8715245 8128459 8531547 8637911
4204 8637911 8473436 8791754 8381248 8109339 8364651 8230996 8382689 8279515 8488264 8709586
4194 8709586 8800785 8959731 8832392 8740475 9159174 9694584 9857139 9651725 9081293 9254291
4184 9254291 9369302 9516247 9878610 9519427 9465288 10205227 10604787 10779398 10823936 10908788
4174 10908788 11044018 11817199 13019189 14118381 13784465 13046401 13295158 12874339 12486935
4165 12486935 12277098 11521311 11121717 11668247 12343343 12670829 13683223 14573622 14177806
4156 14177806 13804177 12550773 12451637 12768477 12808317 12257396 11757289 11751951 12095111 12476647
4146 12476647 12899374 12945819 12798232 13361988 13993535 15088029 16312197 17412031 19558456
4137 19558456 22205395 24198029 24244525 24173621 22485499 19395133 17482907 16565381 15588250
4128 15588250 15244667 14166703 13193001 12994664 11925298 11591641 11883434 11374942 10635751
4119 10635751 10337039 10476786 10729389 10788850 10270059 10235262 10075160 9836221 9959836 10096436
4109 10096436 9549249 9912833 10284228 10387586 10051208 9858521 9732081 9756197 9695957 10352661
4099 10352661 9927411 9959943 10051557 9583343 9552770 10214634 10552112 9922453 9135637 9194959
4089 9194959 9279051 8974016 9211286 8812910 9925988 9350561 9533580 9863453 10229658 9690669
4079 9690669 9126319 9147860 9636322 9898027 9946736 9476521 9543120 9882075 10254187 10201749
4069 10201749 10079205 9702587 9798006 9902337 9847962 9789520 9807637 9994182 9391055 9341799
4059 9341799 9899626 10043516 9962875 9589572 10316362 10291940 10095498 10532369 10047730 9745547
4049 9745547 9807509 9875167 9587573 9726296 10003519 10582836 10423345 10198856 10686292 10863785
4039 10863785 11014313 10775110 11203349 11022608 10851644 11423718 10952182 10768404 11357408
4030 11357408 11417149 11635399 11677793 11549333 11533828 12259985 12391498 12042861 11852926 11600066
4020 11600066 11267671 10932378 11134655 11037259 11698879 12111351 11689412 11849590 11379069 11496900
4010 11496900 11939895 12557038 12880344 12307930 12169437 11999867 12811705 12725176 13084997 12694842
4000 12694842 13193258 13113408 13116971 14042017 14714422 14072800 13708623 14064345 14191729 14065887
3990 14065887 14631087 14478752 14272560 14852152 14536486 14509576 14641032 15196244 15276326 15443197
3980 15443197 15967356 15924357 15375590 15489109 16779657 16487717 16155293 16315689 16611963
3971 16611963 16767823 17228108 17941144 17671296 17716574 18099133 18556578 18932386 18833556 18980206
3961 18980206 19255243 19539901 19886912 20170023 20702133 20765587 21114569 21340516 22015177 21933057
3951 21933057 22736881 23243450 23424324 23757809 24328370 24099430 24267263 25312211 26674511
3942 26674511 26376853 26802176 27729447 28465990 28700329 29311356 30327245 30455102 30412899
3933 30412899 31187530 31755955 32799847 33833387 33705614 33853323 34416027 35792286 36819170
3924 36819170 37746810 38294573 39553958 39880569 40393499 41996628 42327902 43386570 43794497
3915 43794497 44169156 45021037 45497076 46610037 47668678 48737430 48916383 49650143 50151653
3906 50151653 50538764 51785086 52730222 53716977 54943543 55992819 57286608 58442316 59887691
3897 59887691 61365568 62623755 63685022 63990774 64526822 65851928 66502368 67231414 68314583
3888 68314583 69288614 69866991 70977316 73042674 74302044 74572624 75846455 77115605 78804627
3879 78804627 79806283 81069375 82095845 83725239 84582847 85448320 87118331 90125411
3871 90125411 92381039 94424200 96152313 98052427 99385382 101329405 103221410 104803427
3863 104803427 105893297 107061466 109053748 110474081 111023294 111583295 113256085 114834458
3855 114834458 116167605 117126541 117956031 119305133 121064224 122498879 124284159 126525612
3847 126525612 128139730 129976298 132610553 134242503 136301286 139142263 140656268 142014286
3839 142014286 143360284 144734828 145559061 146346045 147776228 147798737 148064327 148666665 149430228
3830 149430228 149412964 150601428 151173590 151737344 153003994 154894517 155806095 156958715 156981499
3821 156981499 157587853 158510105 160744776 163059918 165386861 167259314 169277046 171156884
3813 171156884 173673596 174712086 174695393 175704329 175980534 176962588 177381244 176825589 177540179
3804 177540179 177478430 178820059 180335713 182135752 185403536 188146636 191077261 195174491
3796 195174491 199315286 203576223 207972434 210716593 211586716 211365633 211502764 210940792 210260018
3787 210260018 210326715 211045722 211342150 211657392 211827972 211961075 211033457 210131878 208739422
3778 208739422 207576052 206038352 203520465 200352347 197070868 194164833 191490059 188466776
3770 188466776 185751325 183388427 180153327 177016177 174715429 171230217 166345053 160897313
3762 160897313 155076625 149005530 143423289 137927845 133448202 129355333 125738368 122163302
3754 122163302 119623999 116591341 113402900 110841309 107999115 105017278 102341648 100285358
3746 100285358 97826748 96055852 93842830 91629045 89256748 85972103 82920707 80012439
3738 80012439 77201706 75667301 73465448 71414942 69985998 67792581 66960832 65807119
3730 65807119 63049680 61589084 60399257 58502031 58035980 57430331 55525754 54641497 54449004
3721 54449004 54208371 54002791 53803878 53276660 52452726 52159603 50681638 50232808 50040350
3712 50040350 49391468 47840409 46491684 46081201 45733262 45577948 45501613 45127544 44381821
3703 44381821 43209910 43362548 42340911 41994125 42492356 43060484 42313790 40843181 40525904
3694 40525904 40737728 40947667 40779159 41350800 40268809 39271040 39017319 39281328 39765019
3685 39765019 39364954 39486336 39714693 39915283 39875092 39193848 39171443 38865374 39567303 39697484
3675 39697484 40038344 40131941 40723763 40898865 40748961 40373459 40557160 40737673 41143526 41068349
3665 41068349 41046812 41007769 41351212 41513852 41123684 42320611 42239173 41530292 41960832 41766034
3655 41766034 41929711 42750098 42912542 42729681 42606770 42446040 42593418 42465043 41974120
3646 41974120 42210365 42746116 41979761 41277952 41386775 41254151 42167584 42239855 41812645 41411977
3636 41411977 41819102 41651648 42126859 42201992 42073274 42134697 42047304 42266867 42586119 43278633
3626 43278633 43897870 44013374 44190957 43527896 42547362 42290391 40850061 39532511 38695039
3617 38695039 37021889 36849147 36757992 35707085 34261454 34198051 33660360 33055337 32445954
3608 32445954 31269042 30582119 31467457 32264950 31303284 30992619 30574361 30433749 29604692
3599 29604692 29601148 28997801 29599443 29163904 28922611 28698334 28683461 28507232 28509308 28829998
3589 28829998 28672850 28689194 28719586 28361142 28169906 27994753 28134527 27971617 27837850 27815476
3579 27815476 27399377 28317975 27991716 27509533 27517959 27540046 27630629 27876891 28113375 27400573
3569 27400573 27524515 26819039 26408636 26880872 27264797 27399909 27455757 27381118 27727830 27150167
3559 27150167 27158273 27022974 27030529 27594700 26834079 26549002 26490117 26417508 25996190 26204219
3549 26204219 26685024 27713650 27980756 27633096 27471065 28143569 27323940 27332723 27040273 27297734
3539 27297734 26855340 27054577 26787434 27150417 27661660 27038475 26941616 26900959 27560614 27970358
3529 27970358 27454266 27434661 27868516 27411648 27277962 27804359 27846081 28444767 27959359 28041177
3519 28041177 27955407 27432898 27585872 26878247 26783430 27080774 27015387 26782021 27262945 27283230
3509 27283230 26749502 26656877 27421434 28223494 28373632 27911166 28127699 27934337 28158575 28766488
3499 28766488 28997298 28733410 28728654 28414882 28490550 28658987 28344787 28718619 29329809 29866391
3489 29866391 29848166 29437258 29800055 29451928 29774844 29865247 29330743 29593016 29894552 30804560
3479 30804560 30559773 29763973 30732086 31076011 30825658 30754504 30297708 30517567 30576357 30612087
3469 30612087 30731130 31414191 32175118 32533661 31851617 32209600 32767747 31921182 32154945
3460 32154945 32845445 33217329 33156567 33223609 33203438 33674071 33364055 33405623 34083907 34542012
3450 34542012 34144907 34590368 34925440 35421765 36369936 36923381 36622696 36027542 37102040
3441 37102040 37982049 38205848 37807189 38179070 38699121 38425687 39142716 40204500 39645209
3432 39645209 39888008 40992220 41218639 41842862 42197741 42835632 43590988 44312551 44120305
3423 44120305 43768451 44535800 44861699 45141358 45683427 45836652 45904781 46286153 46670724 47157671
3413 47157671 47759268 48147489 48992135 49715609 50516224 51586415 51594678 52240588 53047431 53723057
3403 53723057 53979252 54197355 55013566 56150266 57227676 57724963 58643687 59781874 59694447
3394 59694447 60469764 61487637 62750556 64116331 64957098 65869155 66084883 66425998 67163341
3385 67163341 68176058 69233295 70525219 72105094 72758092 73490561 74350907 75382143 76580834
3376 76580834 77805339 78643472 80106558 81713007 82397645 83891890 84648730 86960351 88240899
3367 88240899 88955583 89888791 91654230 93374550 95035349 96415792 98265963 100023724
3359 100023724 100747508 102039440 103760703 105345882 107168109 108878877 110431247 111924079
3351 111924079 113952451 116437744 117922771 120100767 121820993 123627222 125415829 127721502
3343 127721502 129560238 131605725 134987219 138556082 141070800 143620111 146274318 149209423
3335 149209423 151851822 153857939 156080382 158848314 162316728 167063699 170987531 176101106
3327 176101106 180501455 186489232 191821085 197892857 204164964 211193562 220252462 229040825
3319 229040825 239094141 249033458 260276614 271969309 284331083 297302132 311316775
3312 311316775 326336220 340462276 354936895 368528487 380198518 390214254 396707308
3305 396707308 398715332 394808806 385839479 372897415 356694499 340070354 323603150
3298 323603150 307915921 293735424 280942336 269200578 258648159 248305761 238924352
3291 238924352 231111631 224118582 217054102 210287369 204610504 199240408 194413321 189390319
3283 189390319 185773356 182777744 179737221 176030097 172453528 169524386 167252872 163884439
3275 163884439 161358452 158423110 155305753 152785408 149979506 146425367 144121264 141021166
3267 141021166 137632078 134132144 131361073 128557146 125725262 123096673 120619418 117889174
3259 117889174 115050525 112478964 110104061 107392007 104781450 102579399 100311502 98838325
3251 98838325 97602559 95728758 94397178 92794930 90571361 89004352 87584244 86703387
3243 86703387 85578483 84364221 82887361 81607399 80429783 79809738 78941789 77928073
3235 77928073 76680436 75846966 74215551 73274338 72797626 71310592 70495611 69993645 69956995
3226 69956995 69361865 68155905 67671161 67183909 66179278 65141877 64553163 63979180 63069405
3217 63069405 62606184 62717275 62563155 61990835 61312651 59966727 59740375 59179062 58265075
3208 58265075 57805268 57039670 56555244 56292560 55485858 55436379 55742732 54788117 54517143 53570182
3198 53570182 52808021 52422226 52700470 52229145 51144917 50975422 51213255 50751152 50163063
3189 50163063 49794761 49223847 48030879 47342154 47503016 47364818 47232726 47481011 46664068
3180 46664068 46278189 46175579 46424529 46004439 45614792 45463801 45048485 44504323 44666948
3171 44666948 44191392 44044528 43884716 43076981 43043903 42892370 42858803 42852852 42745282 42524895
3161 42524895 42334731 42523948 42325074 42148407 41969171 41537065 41529787 41076117 41164763 41446363
3151 41446363 40871818 40266092 40269156 40627748 41296404 41135579 41041375 40378974 39989083 39978165
3141 39978165 39468914 39535607 39250368 38454810 38627461 38617400 38433639 38098041 37788811 38152546
3131 38152546 37542872 37287254 37148400 36841011 37622048 36893391 36143307 35881221 35639013
3122 35639013 35861959 35686812 34563386 34674593 34689336 34520280 35052586 34380939 34464706 33747434
3112 33747434 33266807 34440156 34444667 34361273 34189892 34174781 34182036 34487774 33730024 33264328
3102 33264328 33427268 32894043 32949552 32852449 32177195 32005863 31801921 31786819 31710027 31447117
3092 31447117 31465360 31390127 30957327 30479089 30565159 30974713 31219761 30494399 30494255 30022719
3082 30022719 30376409 30873637 31028961 30929718 30766766 30811337 31352940 31796390 31930751 31936454
3072 31936454 31746096 32253862 32008496 31841173 31940455 31988169 32239119 32419139 32280995 32856256
3062 32856256 32974917 32751982 34006693 34218258 34481789 34752951 34528795 35319450 35549920
3053 35549920 35538810 36425193 36135387 36073519 37301671 37544458 37761609 38244280 38968259 39343615
3043 39343615 40027782 40412582 40275234 40822019 41475339 41519289 41655849 41877032 41762033 42550348
3033 42550348 42854859 43357242 43643116 44389356 44876488 45224996 45860890 45615654 46603496
3024 46603496 47747380 48241259 48647118 49316157 49996763 50839534 51427400 52996732 54407485
3015 54407485 54886684 56111520 57239143 58678550 60419441 61377647 61453355 63273602 64781999
3006 64781999 65666143 67636176 68839239 70654636 71557702 73255882 74855621 77392903
2998 77392903 79264453 81432036 82967156 83682126 85286859 86443510 87821042 88752883
2990 88752883 90201332 91084694 91379725 91905668 93381293 94789453 96590837 98457381 99064398
2981 99064398 100333557 101987493 104835856 107494772 110215687 113701556 117570476 121195407
2973 121195407 125219732 128961444 132904411 137880503 142140979 146872971 150269385 152867151
2965 152867151 153188884 152337364 150090316 146887656 142597093 137745722 134670568 131383095
2957 131383095 129752799 128112805 127419554 127486034 128222764 129699489 130845558 132777720 134843870
2948 134843870 137452790 140109489 143159451 145923933 149225024 152066577 154726324 156331088
2940 156331088 157954693 158092354 157494096 156358379 154408160 151033593 146503816 141265836
2932 141265836 136931794 131848273 126097013 121423298 118339898 115497707 112855536 111195431
2924 111195431 109361308 108630785 107617855 106900894 107115404 106949234 107351398 106914409 105655915
2915 105655915 105444992 104845726 103016850 101390984 98325641 95343760 92224130 88243922
2907 88243922 84173640 79730832 75388635 72182291 69563560 66648584 64244210 62128869
2899 62128869 59932488 57249989 55588771 53577030 52642520 51416909 49705756 48213711
2891 48213711 47404323 46883764 46329487 45124651 43635765 42972891 41881046 40969965 39963219
2882 39963219 38068793 37575826 35882090 35263192 34240493 32806702 31944516 31728199 30895379
2873 30895379 29742750 29548835 28630774 27832432 27820202 27223118 26680010 26005004 25313866
2864 25313866 24813065 24467838 23952090 23446003 23176027 22502035 22342286 22684007 22518785
2855 22518785 21319937 21011206 20883553 20893874 20465581 19793105 19347232 19926999 19947939 19256664
2845 19256664 18779485 18910782 17831867 17149623 16771478 16103045 15800768 15995047 15681121
2836 15681121 15594792 15483975 14946283 13827289 13643996 13742907 13579410 13635693 13758804 13794346
2826 13794346 13775719 13812912 13246530 13064665 12973411 13110493 12613036 11952929 11599021 11667860
2816 11667860 11584502 11283479 11325733 11917692 11168603 11156646 10956978 10726030 10962158 10481499
2806 10481499 10016510 9872413 9808383 9282946 8801843 9152183 9244516 9279804 9349995 9475845
2796 9475845 9418657 9200400 8775134 8772309 8161031 7916135 7958698 8339632 8296870 7585861
2786 7585861 7704093 7729576 7461883 7914235 7432257 7326335 7309798 6719100 6910726 7471062
2776 7471062 6734377 5929977 6339583 6765689 6969438 6422730 6345922 5922145 5562771 5593300
2766 5593300 5741786 6193265 6569851 6515480 6310727 5964206 6126361 5534288 6224330 6065483
2756 6065483 5780166 5707452 5113778 4862827 5331913 5908801 5053504 4694028 5016458 4815456
2746 4815456 4609028 4719595 5213444 5115219 5174257 5258914 5200011 4706701 4147765 4324094
2736 4324094 4267958 4244666 4612916 4222956 3721389 3821931 4387875 5314498 5561169 5446270
2726 5446270 5172310 5151443 4611965 4323296 4464104 3885092 3841478 4086291 4545229 5325636
2716 5325636 5592976 4783062 4626267 4539799 4439988 4613747 4428327 3788281 3803303 3642154
2706 3642154 3664672 4345629 4702502 4410252 4516871 4174632 3382291 3340202 3544484 4057982
2696 4057982 3958184 3604851 3791020 4178654 4282610 3930051 3780105 3373454 3804982 3527042
2686 3527042 3377925 3230242 3259490 3758090 4093108 4310281 4178837 4197357 3810957 4193783
2676 4193783 3790021 3818441 3881453 3718251 3162085 3511401 3845112 3928006 3457373 3727866
2666 3727866 2508731 2755565 2902535 2961756 3598218 3988771 3914871 3679224 3735570 3758761
2656 3758761 3252722 2998510 2653325 3452981 3726147 3082522 3500394 3094079 3507228 3268249
2646 3268249 2999730 3395390 3339764 2948902 3068168 2348646 2252407 2712644 2652061 2445814
2636 2445814 2948066 3311608 3298395 3109980 3487181 3372377 2889898 2666087 3152963 3022980
2626 3022980 2459914 2755359 3042846 2822350 2911404 2940840 3359319 2948676 2472700 2765489
2616 2765489 2469710 1686663 2008326 2531177 3189593 2876783 2191292 2457394 2443876 2216028
2606 2216028 1773618 1926143 1847862 2283680 2595295 2360396 2575015 2322581 1790799 1708094
2596 1708094 1663398 2445810 2442419 2328868 2625873 2367310 2171087 1856217 2360521 2070959
2586 2070959 2189643 2339392 1863615 2312902 2625587 1842578 1676474 1619367 1348468 2157595
2576 2157595 2117656 1883533 1890437 1888121 1675401 1738992 2011872 2186342 2295655 2488426 2844522
2565 2844522 2697262 2667729 2278959 1878000 2266267 2600237 2580182 2177203 2001533 1444598
2555 1444598 994404 1441304 2222580 1804236 1493345 1779464 1937979 1778937 1376898 1520236
2545 1520236 1341276 1217738 1444193 1249904 1567332 1469746 1501576 1361459 1163256 1072184
2535 1072184 1029836 1247877 1697494 1718239 1612953 1377200 1441432 1340714 1167267 947065
2525 947065 1420860 1621030 1456687 1413751 1359505 1256959 1009600 529155 776993 1785551
2515 1785551 1649124 978425 1115349 915856 1570676 2032654 1452709 1445453 1267257 1211252
2505 1211252 1378624 1049154 698430 1319051 1150404 1164286 1090248 1005374 462242 563643
2495 563643 690282 593980 1001894 1159294 751025 695063 1154790 1010444 648076 720245
2485 720245 958914 1177223 1135689 1303279 1358772 1396437 829575 354804 528062 386822
2475 386822 292916 549707 759372 1574975 734796 542446 401951 664604 744331 801815
2465 801815 1643149 1202491 688488 1032102 1066925 1130688 312040 -405410 429613 369051
2455 369051 525301 1124366 769259 610002 406456 1135229 1052619 832379 709521 684981
2445 684981 900612 917643 1120245 640733 1060492 590568 350175 1434081 1275166 1202723
2435 1202723 1375788 1204946 1007009 812408 735340 645976 590121 1278757 412114 260064
2425 260064 1140730 809456 415748 117769 1343721 1485444 1527620 1409079 600141 613636
2415 613636 983676 599177 491399 539275 1004706 770763 956135 808000 731028 875950
2405 875950 943914 1181645 1130102 462732 924531 304353 -223537 171032 -20726 33180
2395 33180 295385 466229 529698 660731 511027 1049677 1712029 787526 732028 981399
2385 981399 232378 331559 1123269 1384220 1303326 797849 1224066 1248539 672119 33295
2375 33295 803046 838881 649021 526713 -89551 206544 865844 838002 343877 301786
2365 301786 890340 845831 600076 817997 65809 119505 -83172 332665 844458 904127
2355 904127 641382 396566 364481 13633 517545 933088 76382 286081 940241 511803
2345 511803 -207809 624324 560092 -98084 -325642 83108 223413 748308 660003 -29152
2335 -29152 131270 1064080 861146 381745 838890 751031 357566 730765 152177 485412
2325 485412 478243 450082 839659 969626 601052 474729 545154 608811 473433 409786 797040
2314 797040 1028036 1303599 1039725 997851 1005095 1430834 982208 1594481 979118 1022055
2304 1022055 671803 632366 800547 631997 565163 485216 849520 330011 -77460 199189
2294 199189 360319 365008 28362 99087 802793 971731 1088397 1184327 1180976 1094435 1399196
2283 1399196 655543 834633 1536265 1116566 997043 1349791 1156931 749941 1117629 750573
2273 750573 1597435 2155225 1523641 2233756 1698027 1750653 2121347 2171779 2095179 1665300
2263 1665300 1624133 1587206 1933239 2223839 2149849 2011387 2033434 2190494 2060001 2316801
2253 2316801 2106933 1748641 2232581 2095866 1930451 2229362 2669050 2593041 1974171 1746966
2243 1746966 2213898 2464355 2611858 3212092 3200269 2845838 3217367 3925200 3628670 3532931
2233 3532931 3441726 3242666 3101422 3278232 3511625 4200623 4030478 4155937 4635122 4353332
2223 4353332 4729194 4717639 4530133 4697494 5232066 4877173 4728074 4630776 4779342 5143101
2213 5143101 5035691 5505315 5241657 5856916 6339110 6042684 6510864 6820836 6341891 6749468
2203 6749468 7478024 7281378 7473407 7709232 7404965 7619353 8092464 8654377 9279461 9191611
2193 9191611 9506874 10379279 10631137 11132672 11319726 12556914 13481066 14539740 16280832
2184 16280832 17490987 18954990 19941944 20743030 21543421 23999424 26280832 28563554 32261017
2175 32261017 36722510 40371049 46655198 54322900 65647171 80669008 95730669 100332916
2167 100332916 94710918 80983139 64859581 53521790 44192466 37627263 32125719 26654282
2159 26654282 22910446 20322621 18603609 16557583 14965676 14513091 13350886 12076525
2151 12076525 11262815 10128369 9168198 8300125 7607882 6931637 6084721 5725627 5346526
2142 5346526 5626269 5053467 5182522 4537996 4848084 4536845 4131461 4579686 4079953 3557619
2132 3557619 3174820 3290087 3293102 2808804 2790193 3234620 3513197 3637266 3045951 2792066
2122 2792066 2343121 2277394 2510883 2107267 1971246 2304180 2107762 1830628 1285323 884069
2112 884069 1019762 966777 1196147 964525 1477035 1064535 1697637 1655415 1426518 755699
2102 755699 1254328 1287955 1482923 2108308 1835863 1025304 400390 513228 529091 807491
2092 807491 1303614 1248595 984332 859701 1293673 415383 558835 850167 1109560 1326207
2082 1326207 681533 406139 435423 1216135 577255 733150 194274 377369 339088 302552
2072 302552 152958 -223784 818845 1270479 40081 4201 694195 1092551 803626 701122
2062 701122 655656 911348 1213681 1296298 1003471 888620 682059 568408 252419 590303
2052 590303 606049 540508 112354 607860 1463536 1558755 1191003 600055 520517 435221 478747
2041 478747 681790 468999 714119 907508 475212 877146 524979 203598 399490 453130
2031 453130 1092824 985239 535651 87680 239133 -576 696488 518175 266453 576893
2021 576893 1052902 1391907 593525 667315 479009 786206 431377 -51193 182550 337109
2011 337109 554386 342746 216717 137058 -116447 -421669 -975905 -657532 239 115075
2001 115075 -216719 -365376 -761467 3028 171478 469799 -487423 -589201 -91691 177971
1991 177971 300231 448317 510663 207932 416605 626056 349180 391728 876058 1284294
1981 1284294 907446 672960 270554 628951 616679 671436 86900 -696251 -243205 -189040
1971 -189040 -433299 -374831 -208107 206032 578407 -93561 -659521 -570205 -69297 284256
1961 284256 286706 314218 221958 -705955 -674378 258578 346359 -604019 -337410 46712 165051
1950 165051 -351121 -123606 -4696 595911 965826 833620 796160 678536 408585 175693
1940 175693 134816 102067 497161 421196 -38808 301394 319364 -277381 -40101 -633021
1930 -633021 -430976 108805 44313 287171 271872 447968 159293 218299 406116 550298
1920 550298 647511 170297 301077 435282 576114 -389579 -276674 416455 586459 -44649
1910 -44649 -228192 219485 339119 126411 -239077 336686 345959 313118 357579 263685 237521
1899 237521 136466 223833 -197143 -207543 344155 82921 -21179 -399373 -463867 167320
1889 167320 159107 -49438 800406 113657 -108872 -115950 -119460 481034 308732 -462038 -108187
1878 -108187 300384 519787 -516511 -547989 -148637 -364363 -184772 485984 297883 -262573
1868 -262573 151578 -139423 205936 979143 685220 370466 60844 -27069 -15425 162144
1858 162144 -238209 -537628 49738 314864 792086 251022 281369 -298812 -390455 26354
1848 26354 -323447 -171115 -295454 -463582 39281 248810 -166686 -597207 -655723 -283703
1838 -283703 -782199 -272631 -60381 -327387 229424 30916 -191508 -166022 380295 109775
1828 109775 144565 61398 -549344 -518932 220583 424321 -155069 -744456 -719903 -509253
1818 -509253 14082 -481155 -82884 172723 -249942 307449 470681 517090 627046 401024
1808 401024 493850 346696 172403 -106920 -158711 -790388 -933687 -933497 -342186 129746 -532098
1797 -532098 -856510 43914 824767 342468 212015 90078 35264 22305 899141 446225
1787 446225 -211389 -450238 -799142 -271957 -302292 -409410 -15794 -138970 -248386 -110799
1777 -110799 299291 188410 -237187 240154 -139525 -245043 66523 191839 298374 -168188
1767 -168188 -509070 -436298 -212985 -569373 -417259 119847 159261 195731 154565 222710 133494
1756 133494 -242519 78119 138240 -278461 -151169 287784 -238500 -248972 104985 448297
1746 448297 738811 836169 491570 107060 245898 100214 442310 140134 -253106 474639
1736 474639 27274 129651 649448 136579 224475 214035 302670 79114 70246 156448 107614
1725 107614 -8911 572704 456319 150677 -799151 -218405 -238442 -65772 517373 -463132
1715 -463132 -701030 -413779 -163131 191117 170847 97495 -80422 -253769 -21022 -211340
1705 -211340 169506 -152754 -301582 -993859 -862058 -748080 -347696 750490 243761 -487702
1695 -487702 -64636 2510 820217 766193 631291 293412 627347 202567 -121796 -403499
1685 -403499 -821681 -266149 332635 -653909 -670691 59433 11518 50820 496 -743973
1675 -743973 -723585 -202473 -192989 527314 804527 1000951 259815 -625173 -137228 148667
1665 148667 466354 202632 -367288 58164 -249725 206649 -311752 -189032 -605368 -603081
1655 -603081 73580 212852 520517 884602 327755 563401 727904 67284 260261 426130
1645 426130 284134 389165 38051 9707 589446 307151 443637 391567 291146 383758
1635 383758 65040 -46124 111266 352501 45645 -368668 -4540 -467589 -74976 190940
1625 190940 -127886 753 -219728 -212815 -288869 -722181 -419544 95759 -210333 -232938
1615 -232938 -184797 92743 362640 299886 544124 499916 512485 276296 164832 606761
1605 606761 773251 1024101 309096 412564 297225 51016 216615 -73058 335526 715515
1595 715515 331919 -571506 -474253 -325195 -63834 -275322 -391103 -912306 -601309 60746
1585 60746 -392935 -297572 285 351433 996871 697386 -3811 281876 -34120 -133462
1575 -133462 -93558 -230827 -498790 -767310 -478154 -120392 -529612 -744827 43830 405453
1565 405453 64991 136319 200239 -264238 -451999 -18803 -378422 -668642 -234776 83752
1555 83752 330351 905972 -134728 -766436 -7205 110827 -670081 -491160 -344966 -357208
1545 -357208 147741 -146896 -366919 259317 895645 592102 171578 -247611 -474736 -531466
1535 -531466 -595425 -758378 -297575 -614854 -771116 -746407 -400678 230678 37696 -119812
1525 -119812 78832 -102100 -308791 392395 367913 67584 500106 342316 -634926 -903260
1515 -903260 -1121550 -1036517 -943711 -497382 -986262 -722800 56943 -759762 -1696652 -967757
1505 -967757 -334421 -221534 -397816 -202388 264788 215486 314530 -207744 -934181 -458586
1495 -458586 333937 153559 338671 -96653 308753 181792 257823 333186 428292 589569
1485 589569 -58656 -472405 -466713 -114517 -370083 -491484 -596463 -49696 484416 170423
1475 170423 47727 145212 206425 -224060 -600045 -684336 -370328 -535569 -194481 438761
1465 438761 717834 563913 472121 -72645 -254025 547207 1014378 250654 -10693 328782
1455 328782 26931 51931 832652 832080 862361 982250 422589 42554 -364262 -218572 -250300
1444 -250300 -50542 -228538 -159952 -10841 92084 606675 660624 755766 184825 418015
1434 418015 715958 600849 349513 25587 439499 318939 146744 -25268 -45396 527213
1424 527213 644435 287919 516577 897496 -31733 -309762 -444123 275921 775005 -99185
1414 -99185 -463580 -202070 -596295 -913190 -201054 161157 -452218 -686894 -194398 -644574
1404 -644574 -302592 635978 193657 375063 149082 -652133 -221241 -220515 -217434 -611769 -210183
1393 -210183 -256475 -529200 -701357 -1201105 -961060 173357 593892 344782 -433819 -312391
1383 -312391 -82197 296997 245727 -370312 -445050 -618586 -326226 -6813 181395 -592269
1373 -592269 139766 60844 85467 721780 698752 -89610 -874621 -428613 -323485 47270
1363 47270 -183290 -655920 214123 538255 182351 -520125 -37408 409498 274397 230862
1353 230862 -331110 157299 3013 489483 402361 170615 234646 227436 140478 601800 586739
1342 586739 -58777 26958 840651 1073309 620122 604505 433600 -108553 -321993 -243969
1332 -243969 -291227 -127337 11192 563841 838676 328826 103911 -198806 118263 551108
1322 551108 228126 81152 -105779 -267877 3720 -273562 -75142 259726 -406796 410521
1312 410521 177815 -409258 -60473 211722 337100 177905 -482096 -828018 -735105 -599068
1302 -599068 -686008 -573375 -321819 -270711 409638 608137 397633 39302 -225823 -393943
1292 -393943 -867071 -1265653 -714227 -56880 302725 214761 380643 -290841 214204 695997
1282 695997 -573815 -1052639 -611933 -412223 -95178 -144621 -15655 -141007 -57057 333009
1272 333009 957139 314965 -229937 -388230 -102371 -288993 -290020 228592 773591 399417
1262 399417 -339978 450964 275648 -136386 -473617 -685656 -563714 -377217 -308515 -39775
1252 -39775 -337380 -707947 -591191 -252756 -293498 164823 -381942 130646 -249323 64892
1242 64892 104931 485350 468069 197516 687793 -29423 793956 941428 550822 34296
1232 34296 -296664 -397770 -856768 -486601 277242 -11352 -392693 -952206 -920218 -242216
1222 -242216 -10356 330897 215856 217239 -236140 247418 -310197 24081 209134 -38835
1212 -38835 -348088 -105792 -493445 86138 -406779 -590222 -45741 198826 368527 -965497
1202 -965497 -731053 122329 -343447 -365710 -866487 -516790 -2641 -522324 172552 1401
1192 1401 -467399 -73721 -326903 -184647 4988 -180121 -519781 -534262 -187351 -35911
1182 -35911 298037 -546120 -684250 -318525 67238 328621 556723 221053 -80853 -378739
1172 -378739 29459 -567225 -558559 -283908 -548392 -583300 -380722 -355774 473808 756965
1162 756965 421095 706047 180236 -220920 -236474 -521903 229623 288778 -410607 -452994
1152 -452994 88400 -250154 -229132 -490284 -10118 -167609 -76044 -237543 -694029 -236555
1142 -236555 373341 499931 887855 -24516 149134 572725 -346100 -464295 250528 904065
1132 904065 396716 596621 116796 -277427 -489912 -604035 -235294 252447 -107812 -44114
1122 -44114 174323 130350 618193 155370 637980 276411 129351 -12132 560302 349213
1112 349213 95319 680037 139734 245631 652345 462767 -7135 300573 333942 521425
1102 521425 409912 493215 446671 -223949 253129 401668 78634 -143465 -17862 737358
1092 737358 420773 344864 210289 626859 76283 -484233 89451 -293137 -929223 -818705
1082 -818705 -593950 93308 -169283 161741 -443016 -898366 -1356220 -1150349 -244343 200847
1072 200847 266981 282643 -106297 122080 491634 936058 686766 -6304 413379 439738
1062 439738 -248068 -253740 -48000 65836 438443 794426 599149 385153 298893 138542
1052 138542 233631 626796 226463 -112077 327348 628637 852407 191948 189702 374961
1042 374961 5325 -82269 -34671 -161585 -202941 162709 706840 239723 195500 -609830
1032 -609830 -174580 -268080 -331830 -278719 -1037610 -1120548 -254596 158287 134594 158504 301202
1021 301202 95695 -42757 26476 -149049 -365599 -1043308 -552887 -130032 188133 203245
1011 203245 -374582 -337374 -300573 -689568 -558349 -458644 -202630 -14973 -472555 -744770
1001 -744770 -69213 603762 622166 -72687 -864005 -458894 316635 479189 -150051 -618243
991 -618243 -120985 -486282 272760 -72713 -342940 -647129 -114544 74809 167281 -569968
981 -569968 -967341 -1091719 -1004272 -1367906 -1189768 -287350 -181942 74739 -160444 -428308
971 -428308 -531785 9793 105705 388949 214315 1128749 294477 12707 -76489 409216
961 409216 528534 -21638 91423 262618 129267 -438642 -74808 -337008 -935725 -1020174
951 -1020174 -494680 -270959 -609239 -10660 -118889 324600 168822 -162215 -393952 -725428
941 -725428 -547286 -296664 -14168 -161241 -267954 -689776 -454374 583624 317072 584547
931 584547 331579 272010 939829 474812 496455 128376 -41863 210838 365100 334042
921 334042 -145252 161815 651942 162269 367746 590731 435725 63248 119391 -389415
911 -389415 -806242 -524724 -989529 -618026 -570880 -412481 -652403 -422388 288503 117833
901 117833 363255 523786 61545 485158 467043 382675 301047 65846 249711 552928
891 552928 701225 64924 -779838 -489442 -14826 114153 382417 -74781 230818 391224
881 391224 285669 -229045 -389487 -348738 -228589 63250 78664 77069 294404 485075 130338
870 130338 179607 -179639 138746 360356 555048 -103409 -943308 -743136 -425675 -770500
860 -770500 -87402 -129332 -907453 -189444 372650 519152 339375 -35002 -536280 -384532
850 -384532 60351 -287181 -455723 95677 311690 435788 -363432 -149978 -68227 76154
840 76154 321662 335819 222534 79281 -212875 -479157 -322317 95786 182374 137144 -208910
829 -208910 -236504 -234041 142371 200445 -348171 -496859 -9727 352379 149492 -854165
819 -854165 -153028 -324242 -312414 -122479 448609 47142 131838 513377 -376830 -637183
809 -637183 -278764 -200378 -628469 -98263 41860 -182468 -679681 -557998 -415442 -43678
799 -43678 -284759 638652 650517 -504410 -438563 -628681 -395823 -25571 -222808 326475
789 326475 54367 -11426 108836 158435 330701 -248946 -468227 27494 208787 233829
779 233829 670221 546948 354230 485173 -495321 -784551 -576636 297495 464109 -175674
769 -175674 -814887 -501363 501 -81332 -193995 55839 -333840 -556483 323799 -105178
759 -105178 -530067 -215662 156238 686082 302100 -45145 -120506 257463 809312 605965
749 605965 -95319 -349756 513229 801750 472340 -121870 -281322 -360446 772423 131885
739 131885 -509823 -177274 415949 468148 339251 461405 596354 339577 212648 175774
729 175774 -29878 88834 -153526 52080 -7976 479990 -231146 -687883 -381459 -359038
719 -359038 -454931 67974 84769 -221045 -397912 -9221 -270386 590132 1140878 302144
709 302144 -331917 -393308 -408233 -366209 232708 217164 -12148 -310844 -278532 -159569 -8079
698 -8079 -264623 219701 416761 213150 452666 -129757 -48074 -144050 -41515 326465 423213
687 423213 -107452 -567865 -378697 -37966 -125043 409085 506628 183535 9622 -579788
677 -579788 -635686 -425892 -67067 89601 -473738 -813703 -245202 460971 79869 106060
667 106060 71394 270153 412434 -457333 -235503 146737 206464 17682 416634 -17042
657 -17042 -864193 -781176 95771 -20622 242499 361322 428635 597363 282302 25623
647 25623 -170632 430021 100646 -197313 95837 -474422 -319615 175675 484472 548935
637 548935 98274 60608 203159 196351 584800 889532 550936 251523 244643 458798 -200684
626 -200684 -215390 -202515 -1142673 -614970 -418442 -257641 -410497 -701996 -157560 329974
616 329974 19315 315343 739780 328276 34559 -202417 -403302 194500 148853 384720
606 384720 213868 722900 353563 409060 691847 667661 109354 -90212 -187557 -656626
596 -656626 -569061 36711 675431 526644 140568 577309 187112 -793379 -769991 83223
586 83223 559927 220099 -731969 -386858 611302 300902 -102308 -466157 154788 132449
576 132449 -344937 5830 108649 -119946 -383522 -258235 -180163 -700225 -86516 18214
566 18214 50235 -62957 237530 -65338 206742 13317 -5389 157663 241671 308747 -104901
555 -104901 219258 287907 -48456 -220943 -252867 665669 503355 371930 -90661 -174828
545 -174828 19378 484354 59831 -753414 -401829 242163 -139447 -468546 -487965 -480452
535 -480452 -1356733 -552399 -70406 -238855 -217927 151455 229875 460530 103019 98005 -71310
524 -71310 -31796 -328195 381583 720578 232186 302416 179222 352222 261539 131913 -139884
513 -139884 -314790 -425497 41306 149898 594050 537768 185671 -866258 -780354 -331636
503 -331636 -295169 -631892 323302 556766 126113 -326156 -32666 -294444 -136884 -194203
493 -194203 -185 -321534 -490387 -390243 218311 120059 1896 -402288 -636242 -233100
483 -233100 -596958 -710762 -212135 -217556 -503858 137823 -41470 -179070 -13200 -5620 194011
472 194011 117843 255920 135266 358894 390732 -3381 -389219 -309220 -235911 -480161 -295821
461 -295821 -226478 212300 327061 132530 -424218 -567800 -735553 -853565 -749936 -683032
451 -683032 -425996 -599658 -572107 -456283 291345 221296 -755444 -519722 164457 -287631
441 -287631 -1007437 -1382913 -124775 322507 -264126 -586087 -495913 69807 -443764 -915161
431 -915161 -34214 25663 -380037 -639835 -731754 -539710 -166629 -495458 -639652 -886922
421 -886922 -810329 -288137 -174860 -69446 101797 550646 7192 -537244 -723025 -497592
411 -497592 -83844 1530 -450803 123180 -131847 139921 -8809 122522 248621 97361
401 97361 -265824 -581616 -513772 -562517 -621448 -996296 -949237 -656382 -283024 -357696 -385081
390 -385081 5721 259224 5029 -105655 165940 384141 310405 -98949 -254444 -236286
380 -236286 -637155 -87921 -376181 -453598 461535 118598 -452580 -616006 -635843 -551997
370 -551997 -576203 -427694 126397 188114 -734235 -1087055 -991366 -902237 -847578 -1042602 -353125
359 -353125 -526047 -366613 -487273 -621411 -626073 -796682 -762734 323474 739112 361420
349 361420 -406603 -392867 117787 -118042 -209065 -366779 -107510 579000 82238 -424709
339 -424709 -597327 -504818 -374013 -11309 -79629 -739181 -703229 -344693 -345184 -414083 -899305
328 -899305 -339913 -491466 -298266 -370529 -464741 323377 292364 -414829 -258612 -718557
318 -718557 -892683 -164387 -852759 -418988 84867 -103259 94511 614367 -75243 -253414
308 -253414 355197 -11246 -753203 -322288 -569736 -343433 -254409 216066 140315 -438347
298 -438347 -184913 178432 -90036 -292984 -406344 -450483 -670046 -6964 5403 -642411
288 -642411 -150349 38171 -97487 -507271 -612454 -85113 365191 129494 -26323 194114
278 194114 -296550 -347713 531972 522826 2740 405907 22808 -169319 -461679 254165
268 254165 255403 -579988 -683635 -1001428 -818675 -744561 -578557 -655310 -576498 -500393 -1124109
257 -1124109 -873586 -616179 -708123 -834687 -610218 -474614 -612931 -522114 -361649 -11463
247 -11463 344267 -130804 -156389 -863847 -436717 -202523 -717907 -597926 -552108 -717641
237 -717641 -417173 -690940 -639391 -484025 -202765 -350303 -636357 28476 -55183 -521516
227 -521516 -433443 -533332 -326089 -296395 -514889 -342434 9033 -220683 -685110 -168352
217 -168352 105888 158654 -490222 103769 216718 -715800 -1336015 -710813 -333085 -317446
207 -317446 -578536 -1018736 -956700 -581039 -573385 -45419 -16142 15926 296498 -188984 -519132
196 -519132 -215093 -897031 -1012834 -737026 -194770 -1102485 -878858 -901334 -976256 -169328
186 -169328 164128 165663 274497 -148942 -458925 -202243 -308056 -861710 -1144534 -358609
176 -358609 92610 58417 -11660 326518 162866 -700730 -1093446 -1064331 -445008 -240300
166 -240300 -605204 -310556 -239229 -431923 -942288 -378787 -206827 -395304 -455926 -776230
156 -776230 -247072 -237005 -215600 -334045 -865954 -705389 -516253 -788975 -495894 -344853
146 -344853 -391891 -255011 -554184 -477345 -231004 6408 20047 224166 63150 -621006
136 -621006 -703267 -305159 -458742 -740779 -354128 -336152 -164464 -215345 -352127 -371307 -693081
125 -693081 -817418 -401837 -437866 -596285 95333 76637 49262 146464 100089 220810 -127996
114 -127996 -406114 -688082 -974729 -725887 -60078 -253029 16283 -161395 -178518 -473846
104 -473846 -412176 -276499 -573682 -360819 -547336 -424483 -574952 -385732 -748544 -792741
94 -792741 -1224546 -832066 -639745 -344233 -377057 -615425 -502342 -150282 -179793 -186406 -191224
83 -191224 -347729 23263 -74525 -768490 -872625 -259173 -183615 129951 128630 -382620 -393071
72 -393071 -564941 -401902 -136339 -650539 -288877 -448429 -726678 -219346 -554260 -1009804
62 -1009804 -1080636 -1174092 -1255890 -853793 -428171 -609124 -656301 -989546 -857979 -227899 -381731
51 -381731 -309171 -415129 -278643 -521148 -304333 -617256 -442972 -681573 -247842 -370740
41 -370740 -279672 -180021 -273767 -706184 -358691 -396042 -176069 -290160 -462902 -345740 -463660
30 -463660 -669034 -302886 -71986 -746602 -944433 -870120 -623860 -470945 -420991 -675490
20 -675490 -658114 -668701 -197999 -343346 -25402 -265375 28485 -187043 -363198 -584320
10 -584320 -581566 -747747 -636600 -714725 -638043 -727756 -558356 -545865 22927 -237136
0 -237136
$$ Imaginary data points
##PAGE= N=2
##DATA TABLE= (X++(I..I)), XYDATA
16383 -4733945 -4939028 -4397568 -4072710 -3444589 -3758205 -3562367 -3324005 -3261609 -3222829 -3164319
16373 -3164319 -3163465 -3667679 -3580737 -3380470 -3324391 -3198833 -2848892 -3160224 -3167217 -2965822 -2912258
16362 -2912258 -3173899 -2792201 -2097255 -1971458 -2194530 -2421720 -2046834 -1960711 -1586785 -2035056
16352 -2035056 -2100798 -1958546 -1340587 -1278602 -1676268 -1998192 -1632241 -1775079 -1763396 -1755446
16342 -1755446 -1734131 -1321686 -836125 -737531 -954535 -840580 -1158605 -840384 -743223 -808450
16332 -808450 -600827 -651951 -172521 -235619 -1015007 -855437 -380360 -466643 -440896 163608
16322 163608 663409 675387 559797 272466 41753 477978 380840 307440 641315 688198
16312 688198 749270 508028 628893 1242863 1561857 1165429 810056 1110336 1271197 1363185
16302 1363185 1805679 1920360 1743618 1590862 1881108 1594261 1545590 1761310 2076886 2352587
16292 2352587 2028069 2390905 2416355 1881445 2278789 2820833 2596126 2762485 2561357 2799848
16282 2799848 2845589 2734523 2508804 2211121 2444340 2269197 2835275 2986249 3323282 3268802
16272 3268802 3201635 3568886 3740424 3635026 3549320 4049339 4101672 4113936 3819355 3493688
16262 3493688 3770149 3735885 3082308 3842385 4286560 3975192 4256242 4443576 4619467 4578243
16252 4578243 4654085 4354854 4311405 4387894 5291774 4505714 3480052 3471764 3916802 3904724
16242 3904724 4188337 4594852 4631354 5134653 4599114 3548208 4103562 4406456 4739414
16233 4739414 4882008 4910421 4709853 4319889 4874957 4965359 5106183 5450171 5552387 5758183
16223 5758183 6052902 5471318 5352724 5517080 5558498 5553739 5196934 5795502 5679504 5960035
16213 5960035 5704552 5572146 5752788 5459054 5332410 5729594 6786897 5603319 5176486
16204 5176486 4951610 4607163 4985826 6036537 6081999 6430386 5945316 6013245 6268475 6139355
16194 6139355 6362288 6844612 6941709 6065045 6330469 6014543 6353104 6444587 6565454 6635370
16184 6635370 6603221 6696209 6001312 6118620 6447225 6399090 6079996 6605854 6365310 6188738
16174 6188738 5956294 6431029 6480423 6700002 6683676 6713230 6402827 6403640 6154917 6243943 6517580
16163 6517580 7039858 7335704 6811573 6844355 6701510 6786838 6788113 6354012 6935796 7287300
16153 7287300 7346831 7013424 6511120 7005802 7227548 7216060 6969360 7534315 6815247 7487299
16143 7487299 7372421 6933421 6731329 6835201 7320585 7427519 7395906 7295761 7402883 7182335
16133 7182335 7125173 7098732 7517155 7122077 7090857 7505846 7860807 7530810 7007630 6526635
16123 6526635 6586621 6812512 7124106 6858151 7761805 7425627 6728556 6821427 7172451 7449672
16113 7449672 7350716 6771677 6722109 6802584 6470098 7133057 7306289 7272169 7372722 7275495
16103 7275495 6693178 6950370 6927161 6572676 6864797 6883832 7673305 8138124 6815345 7108375
16093 7108375 7391377 7564066 7305698 7354478 7848780 8593116 8055951 8170528 8438771 7183982
16083 7183982 6965829 7071271 6920603 7363285 6692970 6816335 6953433 7441773 7379589 7428946
16073 7428946 8072801 7771335 7526108 7110944 7417639 7965068 7309654 7117944 6970533
16064 6970533 7720966 7432779 7282274 7612305 7810406 7676105 7024965 6905577 6776798
16055 6776798 6976620 7012338 7686294 8013361 7238019 7281150 7221064 7156750 7799155 7813228
16045 7813228 6315297 6292135 7009759 7135988 7077851 7201200 7696185 7327271 7342951 7455598
16035 7455598 7155445 6724584 6895212 7546716 7773465 7221215 7748074 7864956 7247148
16026 7247148 7479122 7893698 7716428 7653103 7291973 7823485 7781361 7785773 7549838 7555967
16016 7555967 7333536 7517454 7989842 7280417 7035057 7631515 7473015 7212601 7922779
16007 7922779 7771299 7180614 7178249 7318733 7502175 7434674 7621777 7500658 7639393 8011574
15997 8011574 7834102 7193046 6846336 7091184 7311226 7284554 7668915 7668309 7123497 7286999
15987 7286999 7804142 8396997 8277715 7962069 7965462 7684484 8205184 8290646 7531497 8086453
15977 8086453 7855585 7220656 7644477 7360270 7477537 7462093 7474341 7650133 7760858 7711280
15967 7711280 8075331 7216362 7411689 7339200 7560924 7808094 7563328 7723657 8008800 8209806
15957 8209806 8005275 7683373 7018706 7012812 6787235 7234652 6963173 7049279 6843681 6979360
15947 6979360 7455852 7782673 7510573 8117577 8510326 8282452 7930455 7136133 6942203
15938 6942203 6928976 7363339 7924681 8276198 8224713 7883913 7424840 7303561 7236522 7293714
15928 7293714 7483875 7476184 7889287 8411411 8532510 8406482 7845402 8163475 7873594 7387380
15918 7387380 7554714 7988079 7701052 7481507 7941375 7601260 7786280 8259229 8034431
15909 8034431 7648349 7758509 7621972 7917474 7768942 7484999 7799851 7331535 7804628
15900 7804628 7652120 7886715 7672072 7582939 8024023 7556834 7406805 8182624 8426331 7373276
15890 7373276 7870815 8432123 8402200 7735230 7704477 7674823 7546429 7275977 7434317 7666433
15880 7666433 8531804 7760164 7440499 7320649 7541480 7602252 7179376 7428937 7466892 8100879
15870 8100879 8303678 7891130 7242938 7567954 7560611 7726241 7898919 7917108 8137739 8085123
15860 8085123 8328590 9078700 8567634 8270670 8245594 7782744 7668286 7495153 7798747 7376294
15850 7376294 6988853 7616141 8131476 8270239 7880152 7397812 7375057 8151456 8209195 7744493
15840 7744493 7791638 7564613 7399997 8151511 9000530 7942474 8268378 7717166 7380808
15831 7380808 7989509 7866517 7615825 7826040 8151292 7614327 7107018 7587762 8013802
15822 8013802 8023758 7743853 7603321 8119935 7672271 7657924 8086800 7677752 7903263 8013231
15812 8013231 7542259 7856635 7754813 7386618 7529503 7863533 7917511 7420095 7655677 7506981
15802 7506981 7372381 8049584 8247970 7456536 7587492 7927814 7442911 7991334 7368119
15793 7368119 8016101 8114140 7457772 7616376 7704251 7376334 7959356 8517268 8495330 8483295
15783 8483295 8634243 7947006 7698446 7858845 7969599 8316273 8206661 7268863 7955591
15774 7955591 7688488 7628076 8398900 8468214 8287214 8386878 8227531 7613188 7940811 8472183
15764 8472183 8208848 8108332 7675562 7341263 8103830 7361245 7785439 7294653 7573722
15755 7573722 8085484 8614355 8680461 7887392 7769693 7779793 7906100 7707552 7856608 7880406
15745 7880406 7137540 7243322 7548255 7812763 8277582 7613093 7635956 8219674 7857109 8023662
15735 8023662 7962668 8054978 8039052 7944347 8371706 7695178 7412026 7661133 8471440 7663948
15725 7663948 8030331 8305432 8681535 8239315 8042983 8628416 8645827 8737159 8822501 8539098
15715 8539098 8548635 8285278 8168275 8557987 8156011 8666573 8175572 8361422 8243504 8320295
15705 8320295 8048430 7664855 7552064 7633534 7857755 7894772 7864580 7625434 7970827 7918616
15695 7918616 7837364 7738261 8189402 7867695 7623846 7638103 7547700 7294295 7195950 7702108
15685 7702108 8223547 8417256 7714061 8327354 7942179 7482033 7285817 7658062 7791142
15676 7791142 8400942 8194003 8125792 8040658 8226388 8666991 8181524 7866429 7687424 7827354
15666 7827354 8252133 7949805 8383940 8289014 8142742 7824085 7504478 8267686 8325213 8078059
15656 8078059 7594907 8155514 8012788 8251448 8981188 7915124 7757288 7329535 7841522
15647 7841522 8721754 8467739 8246451 8071346 8344761 8159961 7731175 7965965 7728180
15638 7728180 8275555 8928990 8214128 8094774 8003699 8179699 8193884 8364430 8082174 7831540
15628 7831540 7931998 8740627 7869224 7826769 7501774 8271567 8523693 8843421 8574507 7837494
15618 7837494 7875516 7335374 8101827 8456051 7865112 7960465 8494843 8235957 8295219 8135547
15608 8135547 8052944 8344002 8034671 7597424 7765177 7975906 7481524 7809968 7962875 8184485
15598 8184485 8377191 8238467 8050092 7933240 7968880 8203602 8497944 8259977 8324778 8039736
15588 8039736 8495796 8157238 8192595 8976585 8692878 8472935 8443305 7814796 8033978 7330633
15578 7330633 7833849 8163198 8613273 8528034 8076022 8000085 8116013 7710707 7609903 8122565
15568 8122565 8112905 8225126 8725077 9170436 8949896 8718203 8195108 8351716 7401887 8354176
15558 8354176 8042823 8548504 8339504 7573110 8442794 8294390 8012959 7836760 8381671
15549 8381671 8814879 8091491 7697626 8138332 8385815 7822281 7725317 8406448 8750972 8780361
15539 8780361 8444400 8236512 8182676 8036919 8450236 8521908 8603616 8916933 8124330 8365503
15529 8365503 8505513 8726783 8919344 8121311 7569445 7994679 8417675 7989397 8148027
15520 8148027 8424948 8474902 8559047 8510944 8881673 7595429 7485525 7997797 8000980 8610913
15510 8610913 8192636 8146590 8835269 8815763 8356372 8821360 8606218 8264501 8480547 8174263
15500 8174263 8013664 8068293 8124889 8037744 8762006 8645027 8876177 8472680 8233226 8698794
15490 8698794 8654783 8655871 8393179 8483830 8136359 7909214 7841819 7923703 8786903 9115132
15480 9115132 9152331 8109314 7992800 8391186 8047169 8460638 8366929 7690514 8147530 8102690
15470 8102690 7950670 8082233 8370671 8234374 7928178 7794699 7608580 7901475 8466557
15461 8466557 8331340 7589191 7588719 8316195 8169372 7691127 7530274 7675527 8654596 8451779
15451 8451779 8881590 8903799 8797735 7837560 7419870 8518224 8738086 8445145 8257869
15442 8257869 8106251 8867465 9334512 8910078 7967610 8347004 8696544 8839843 7854162
15433 7854162 7810639 8441935 8747893 7954045 7507202 7317721 7919062 8028914 7720363 7955431
15423 7955431 8916711 8688802 8200841 8140065 7573833 7945328 8024083 8081293 7969880 8433482
15413 8433482 8774461 8143264 7932190 7823677 7740379 7421041 7262515 7676377 7390420 7321048
15403 7321048 7449766 8352780 8457067 8022734 7673776 8556590 8813217 8846200 8566941 8448088
15393 8448088 8527237 8556188 8362558 8133921 8135790 8244201 8506531 8701571 8728634 9098359
15383 9098359 8609646 8758939 8480923 8325794 8257138 8273492 8851134 8704628 8865041 8652440
15373 8652440 8360878 8349423 8372905 8748930 7846950 7872479 8076102 8378471 7970271 7908449
15363 7908449 8359874 8152108 7718063 8197040 8477457 9036214 9096175 8860939 8984436 8344083
15353 8344083 8255123 8534939 8423079 8194800 8864704 9044773 8434078 7899102 8136426 8271963
15343 8271963 8640051 8504863 9310355 8793232 8213658 7723710 8087742 8366225 8131814
15334 8131814 7956791 8007452 7872381 7575899 7817381 8044552 7818675 7819842 7720714 7414839
15324 7414839 6927480 7410702 8240845 8258140 8083227 8269827 8578101 8360341 8117648 7906426
15314 7906426 7836824 8113447 7831039 7829893 7872587 7668221 8058141 7868182 8345592 8487638
15304 8487638 8313950 8393751 8792599 8703951 8586986 8698367 9298044 9080831 9519100 9513422
15294 9513422 8615817 8149259 7728770 7999467 7962645 7679422 8037667 8761165 8577129 8514251
15284 8514251 8140290 8056560 7860825 7318119 8128895 8631036 8538908 8585928 8589385 8603260
15274 8603260 8731811 8491112 8447361 8304145 8447561 8944180 8492924 8068299 8629464 8597339
15264 8597339 8125949 8445149 8571871 8568901 8751139 8985385 8257121 7964120 8433269 8828633
15254 8828633 8959525 8484648 7933595 7941603 7713277 8073525 8420377 8843024 8266081 8297423
15244 8297423 8795903 8658780 8489636 9205591 9182234 8412803 7903562 7796214 8518531 8772306
15234 8772306 7863146 7315693 7838172 8369228 8611429 8626978 8191038 8566747 8492389 7853592
15224 7853592 7958637 8067140 8429595 8480038 8476342 7888479 7587690 8082764 7893700 8491190
15214 8491190 8278544 7895250 8309895 8490829 9092282 8860755 9142343 9184605 8987951 8044481
15204 8044481 8107487 8583223 9141173 8756153 8421596 8792233 8807082 8268702 8576149 8757834
15194 8757834 8975546 9504053 9296323 8979582 8517693 8129058 8387304 8562067 8177337
15185 8177337 8074200 8158772 8222876 8682514 9241750 9173903 8590903 8435236 8616725 8417112
15175 8417112 8507742 8014698 7836699 8192779 8481649 8432120 8500825 9205246 8622610 8143958
15165 8143958 8563717 8939165 9228840 9117594 8978063 8835164 8511879 8395665 7881325
15156 7881325 8077860 8400790 8324413 8261213 8883605 8454032 9102873 9140919 8958322 8514824
15146 8514824 8857220 9045547 8895856 9354682 9177308 8381355 7748443 7910243 8324373
15137 8324373 8698459 8229322 8521946 8414941 9004686 9163252 9155883 8912667 9299028 9017003
15127 9017003 8809051 8038836 8419621 8756936 8283477 7989175 8072816 8378438 8774015 8567972
15117 8567972 8037078 8109015 8138588 8055747 8435602 9215423 9428496 8732972 8595190 8652599
15107 8652599 8732123 8705557 7673288 7671561 8492444 8279435 7986139 8071365 8553443 8837197
15097 8837197 8985512 9132078 8659146 8424973 8991635 9168185 8371550 8206128 8155095 8045779
15087 8045779 8096398 8107752 8732042 9142689 8632070 8662205 8516082 9075662 9060609 8762547
15077 8762547 9087111 8741999 9207730 8855493 9000552 8891246 8863034 8784264 8503542 7928248
15067 7928248 8108823 8307117 8393643 8244183 7526782 7932871 8574748 8632101 8158294 8041572
15057 8041572 8041447 8426121 8988657 8963933 9234721 9297219 8293016 8249630 7612985 8064727
15047 8064727 8246738 8427907 7926165 8446890 8579816 8783486 8843903 9180482 9320330 8553304
15037 8553304 8583376 8383859 9118192 8714186 8199128 8548115 9218337 8529731 8601106 9031893
15027 9031893 8980417 8568249 8517882 7928410 8331450 8491935 8573369 8421950 8210391 8571795
15017 8571795 8785846 8341558 8455045 8625574 8485465 8673737 8426234 8284646 8441695
15008 8441695 9636851 8799520 8221539 8202643 8671195 8702942 8602682 8552154 8300958 8730112
14998 8730112 8823250 9263709 9447101 8627272 8159958 8999379 9306399 8926076 8897518 8333634
14988 8333634 8554698 8723529 8728462 9241496 9537322 9044522 8489804 8036374 7849795 8254855
14978 8254855 8566142 8151052 8775458 8586569 8671840 9130230 9080308 8593436 8467915 8437306
14968 8437306 9356666 8815793 8596779 8773732 8550133 9106787 9605612 8900256 8246584
14959 8246584 8036115 7923117 8767980 8703655 8228211 8630121 8879908 8996293 8752021 9344208
14949 9344208 9437002 9675098 9844939 9235580 9140504 9125947 9642999 9115790 8592280 8372731
14939 8372731 8556602 8162208 8236992 8755891 8789486 8258402 8823940 8863580 9236402 8669618
14929 8669618 8504879 8715617 9390556 9165251 8842281 8476126 8530664 8647515 8129640 8275857
14919 8275857 8783636 8755827 8945363 8874010 8818466 8950437 8843761 8654576 8070688 8457590
14909 8457590 9156993 8738354 8424024 8155065 8376356 9021146 8996736 8562773 8795079 8838091
14899 8838091 9152326 8109221 8931186 9460145 9188970 9019451 8918624 9459315 9159122
14890 9159122 8843442 8673381 8548079 7740884 7770258 8345086 8682047 9007577 8936217 9428010
14880 9428010 8864846 7952339 8393516 8522835 8752764 8593947 8815140 8772798 8987921 9418954
14870 9418954 9170749 9011914 8335099 8307278 8937907 8225714 8424997 8836552 9380719 8976325
14860 8976325 8744827 8861406 8343938 8198942 8779540 9136099 8829339 8694217 9669795
14851 9669795 9414306 8505282 8337414 8192855 8417289 8512118 8318985 8298796 8049926 7946142
14841 7946142 8320738 7972815 8164620 8548159 8146519 8635031 8430842 8130330 8334490
14832 8334490 8470263 8410488 9162588 8748935 8726272 8919118 9058809 8644556 8736863 8106092
14822 8106092 8264515 8357033 8660706 8675359 8585389 8564800 8229371 8435917 8500384 8932082
14812 8932082 8896840 9011425 8794185 8631921 8722578 8883449 9755638 9956894 8744451 8140086
14802 8140086 8113349 8018870 8425165 8940965 9023272 9331780 8718815 8535180 8793508 9119173
14792 9119173 9078651 9053371 8863129 8498650 8849699 9453717 9640842 9641403 9217146 8821322
14782 8821322 9204001 9081364 8761519 8769450 8438762 8404925 8846854 9315109 9006805 8769306
14772 8769306 8507515 8976981 8693993 9380572 9331606 8886207 9699627 9622523 9156142 9227147
14762 9227147 8859374 8957991 8989176 8894628 8671407 8566498 8862312 8632667 9107277 8726142
14752 8726142 9167659 9191627 8874319 8964594 8513298 8548100 8677835 8735499 9310204 9196101
14742 9196101 8756707 8724392 8826647 8609136 8753059 8836812 8517882 8516919 8515093 8919593 8750164
14731 8750164 8759505 8780162 9366217 8485840 8765307 9341445 9102971 9036197 9675191 9622951
14721 9622951 9141462 9329924 9575743 8593115 8838385 9406989 9201303 8875348 8913946 8769271
14711 8769271 8581297 8747135 8373942 8483966 8659261 9086280 9158968 8987543 8305045 8209268
14701 8209268 8777386 8927128 8962645 8479394 8779954 9387282 8727266 8882787 9509737 9584232
14691 9584232 9536469 9529745 9440847 9146048 9124661 10298901 9584621 9403492 9760099 9188906
14681 9188906 8991231 8904102 9165681 9532709 8645978 9463174 9912236 9332600 9321981 9419020
14671 9419020 9383514 9485237 9057230 8851491 9351453 10008334 9550790 8681345 8727461 8632968
14661 8632968 8664750 9330215 9392738 9208238 9257758 8910223 9193135 9294977 9680652 10014604
14651 10014604 9836570 9296766 8913842 8691786 9270876 9254573 9114814 9147984 9500000 8954847
14641 8954847 8548908 8993476 8652097 9091019 9132495 8909790 9061769 9265975 9056311 9449818
14631 9449818 9313677 8867242 8596939 8926172 9378136 8957176 8831554 9073610 9364184
$$ [...]
##END NTUPLES=NMR SPECTRUM
##END=
