##TITLE=1H_CG-1198-x3
 CDCl3
 8 sc, 
 12.4.2024
##JCAMPDX= 6.0         $$ Bruker NMR JCAMP-DX V2.0
##DATA TYPE= NMR SPECTRUM
##DATA CLASS= NTUPLES
##ORIGIN= UXNMR, Bruker Analytische Messtechnik GmbH
##OWNER= root
$$ XWIN-NMR		Version 3.5
$$ Fri Apr 12 14:23:08 2024 Russian Standard Time (UT+4h)  she@DPX200
##.OBSERVE FREQUENCY= 200.1309
##.OBSERVE NUCLEUS= ^1H
##.ACQUISITION MODE= SIMULTANEOUS
##.ACQUISITION SCHEME= undefined
##.AVERAGES= 8
##.DIGITISER RES= 18
##SPECTROMETER/DATA SYSTEM= spect
##.PULSE SEQUENCE= zg30
##.SOLVENT NAME= CDCl3
##.SHIFT REFERENCE= (INTERNAL, CDCl3, 0, 15.5122)
##AUDIT TRAIL= $$ (NUMBER, WHEN, WHO, WHERE, WHAT)
$$ ##TITLE= Audit trail, XWIN-NMR		Version 3.5
$$ ##JCAMPDX= 5.01
$$ ##ORIGIN= Bruker BioSpin GmbH
$$ ##OWNER= she
$$ F:/spectra/data/she/nmr/H-F/1/pdata/1/auditp.txt
$$ ##AUDIT TRAIL=  $$ (NUMBER, WHEN, WHO, WHERE, WHAT)
(   1,<2024-04-12 14:21:58.20 +0400>,<she>,<DPX200>,
      <created by zg, POWCHK disabled, PULCHK disabled
       configuration hash MD5:
       00 E9 B6 7A A2 85 ED C7 34 08 36 98 17 FE 4E 26
       data hash MD5: 16K
       BE 28 F3 C2 3B E4 9F 2D 8B 47 0C CE 1D 8F 5C 13>)
(   2,<2024-04-12 14:22:01.32 +0400>,<she>,<DPX200>,
      <Start of raw data processing
       efp BC_mod = 2 LB = 0.24 FT_mod = 6 PKNL = 1 PHC0 = -25457.48 PHC1 = 8.98731 SI = 16K 
       data hash MD5: 16K
       76 D6 59 32 32 3A 6B B3 C5 6A 8F 81 52 11 53 84>)
(   3,<2024-04-12 14:22:16.76 +0400>,<she>,<DPX200>,
      <pk PHC0 = 156.0896 PHC1 = 3 
       data hash MD5: 16K
       C4 37 8C 87 C8 B4 D4 06 65 E8 E8 66 D8 38 08 E3>)
(   4,<2024-04-12 14:22:20.06 +0400>,<she>,<DPX200>,
      <abs ABSG = 5 
       data hash MD5: 16K
       64 4F 15 61 13 A2 70 54 55 BF 72 7F 73 AD 8B 59>)
$$ ##END=
$$ 
$$ hash MD5
$$ 6F F3 FD D3 00 2A EF 2D 72 B3 D5 31 5A DD 1D F0
##$RELAX= 
##$RELAX= 
##$RELAX= 
##$RELAX= 
##$RELAX= 
##$RELAX= 
$$ Bruker specific parameters
$$ --------------------------
##$DU= <F:/spectra>
##$EXPNO= 1
##$NAME= <H-F>
##$PROCNO= 1
##$TYPE= <nmr>
##$USER= <she>
##$AMP= (0..31)
100 100 100 100 100 100 100 100 100 100 100 100 100 100 100 100 100 100 
100 100 100 100 100 100 100 100 100 100 100 100 100 100 
##$AQSEQ= 0
##$AQ_mod= 1
##$AUNM= <au_zg>
##$AUTOPOS= <>
##$BF1= 200.13
##$BF2= 200.13
##$BF3= 200.13
##$BF4= 200.13
##$BF5= 200.13
##$BF6= 200.13
##$BF7= 200.13
##$BF8= 200.13
##$BYTORDA= 1
##$CFDGTYP= 0
##$CFRGTYP= 5
##$CHEMSTR= <none>
##$CNST= (0..31)
1 1 145 1 1 1 1 1 1 1 1 1 1 1 1 1 1 1 1 1 1 1 1 1 1 1 1 1 1 1 1 1 
##$CPDPRG= <>
##$CPDPRG1= <>
##$CPDPRG2= <>
##$CPDPRG3= <>
##$CPDPRG4= <mlev>
##$CPDPRG5= <mlev>
##$CPDPRG6= <mlev>
##$CPDPRG7= <mlev>
##$CPDPRG8= <mlev>
##$CPDPRGB= <>
##$CPDPRGT= <>
##$D= (0..31)
0 1.2 0 0 0 0 0 0 0 0.06 0 0.03 0 0 0 0 0.0002 0 0 0 0 0 0 0 0 0 0 0 0 
0 0 0 
##$DATE= 1712917317
##$DBL= (0..7)
120 120 120 120 120 120 120 120 
##$DBP= (0..7)
150 150 150 150 150 150 150 150 
##$DBP07= 0
##$DBPNAM0= <>
##$DBPNAM1= <>
##$DBPNAM2= <>
##$DBPNAM3= <>
##$DBPNAM4= <>
##$DBPNAM5= <>
$$ [...]
##$SUBNAM3= <"">
##$SUBNAM4= <"">
##$SUBNAM5= <"">
##$SUBNAM6= <"">
##$SUBNAM7= <"">
##$SUBNAM8= <"">
##$SUBNAM9= <"">
##$SW= 18.0517689322627
##$SWIBOX= (0..15)
0 0 2 0 0 0 0 0 0 0 0 0 0 0 0 0 
##$SW_h= 3612.71676300578
##$TD= 16384
##$TD0= 1
##$TE= 0
##$TE2= 300
##$TE3= 300
##$TEG= 300
##$TL= (0..7)
0 120 120 120 120 120 120 120 
##$TP= (0..7)
150 150 150 150 150 150 150 150 
##$TP07= 0
##$TPNAME0= <>
##$TPNAME1= <>
##$TPNAME2= <>
##$TPNAME3= <>
##$TPNAME4= <>
##$TPNAME5= <>
##$TPNAME6= <>
##$TPNAME7= <>
##$TPOAL= (0..7)
0.5 0.5 0.5 0.5 0.5 0.5 0.5 0.5 
##$TPOFFS= (0..7)
0 0 0 0 0 0 0 0 
##$TUNHIN= 0
##$TUNHOUT= 0
##$TUNXOUT= 0
##$USERA1= <user>
##$USERA2= <user>
##$USERA3= <user>
##$USERA4= <user>
##$USERA5= <user>
##$V9= 5
##$VALIST= <valist>
##$VCLIST= <CCCCCCCCCCCCCCC>
##$VD= 0
##$VDLIST= <DDDDDDDDDDDDDDD>
##$VPLIST= <PPPPPPPPPPPPPPP>
##$VTLIST= <TTTTTTTTTTTTTTT>
##$WBST= 1024
##$WBSW= 4
##$XGAIN= (0..3)
0 0 0 0 
##$XL= 0
##$YL= 0
##$YMAX_a= 75572
##$YMIN_a= -90074
##$ZGOPTNS= <>
##$ZL1= 120
##$ZL2= 120
##$ZL3= 120
##$ZL4= 120
##$ABSF1= 15.57724
##$ABSF2= -2.474648
##$ABSG= 5
##$ABSL= 3
##$ALPHA= 0
##$AQORDER= 0
##$ASSFAC= 0
##$ASSFACI= 0
##$ASSFACX= 0
##$ASSWID= 0
##$AUNMP= <proc_1d>
##$AZFE= 0.1
##$AZFW= 0.1
##$BCFW= 0
##$BC_mod= 2
##$BYTORDP= 0
##$COROFFS= 0
##$CY= -3
##$DATMOD= 1
##$DC= 0
##$DFILT= <>
##$DTYPP= 0
##$F1P= 0
##$F2P= 0
##$FCOR= 1
##$FTSIZE= 16384
##$FT_mod= 6
##$GAMMA= 0
##$GB= 0
##$INTBC= 1
##$INTSCL= 3.70164e-10
##$ISEN= 128
##$LB= 0.24
##$LEV0= 0
##$LPBIN= 0
##$MAXI= 10000
##$MC2= 0
##$MEAN= 0
##$ME_mod= 0
##$MI= 1.114404
##$NCOEF= 0
##$NC_proc= -9
##$NLEV= 6
##$NOISF1= 3.799351
##$NOISF2= 2.8
##$NSP= 0
##$NTH_PI= 0
##$NZP= 0
##$OFFSET= 15.51224
##$PC= 1
##$PHC0= -25301.39
##$PHC1= 11.98731
##$PH_mod= 1
##$PKNL= yes
##$PPARMOD= 0
##$PSCAL= 0
##$PSIGN= 0
##$REVERSE= no
##$SF= 200.129601900232
##$SI= 16384
##$SIGF1= 3
##$SIGF2= 2
##$SINO= 5.538805
##$SIOLD= 16384
##$SREGLST= <1H.CDCl3>
##$SSB= 0
##$STSI= 16384
##$STSR= 0
##$SW_p= 3612.71676300577
##$SYMM= 0
##$S_DEV= 0
##$TDeff= 16384
##$TDoff= 0
##$TI= <>
##$TILT= no
##$TM1= 0
##$TM2= 0
##$TOPLEV= 0
##$USERP1= <user>
##$USERP2= <user>
##$USERP3= <user>
##$USERP4= <user>
##$USERP5= <user>
##$WDW= 1
##$XDIM= 16384
##$YMAX_p= 393665269
##$YMIN_p= -9007299
$$ End of Bruker specific parameters
$$ ---------------------------------
##NTUPLES= NMR SPECTRUM
##VAR_NAME=  FREQUENCY,     SPECTRUM/REAL,   SPECTRUM/IMAG
##SYMBOL=    X,             R,               I
##VAR_TYPE=  INDEPENDENT,   DEPENDENT,       DEPENDENT
##VAR_FORM=  AFFN,          ASDF,            ASDF
##VAR_DIM=   16384,         16384,           16384
##UNITS=     HZ,            ARBITRARY UNITS, ARBITRARY UNITS
##FACTOR=    0.220516191357247, 1,           1
##FIRST=     3104.45849780419, 0,            0
##LAST=      -508.258265201583, 0,           0
##MIN=       -508.258265201583, -9007299,    0
##MAX=       3104.45849780419, 393665269,    0
$$ Real data points
##PAGE= N=1
##DATA TABLE= (X++(R..R)), XYDATA
$$ [...]
7179A182012o66961P13525N50919O89993r32931M80065K64369P68580K2834q39425
$$ 1182012 515051 1228576 1779495 2469488 1536557 2016622 2280991 3049571 3072405 2232980
7169B232980k43332j267494N45929k73207J113514N21820j274417p79034J980699
$$ 2232980 1989648 722154 1268083 994876 2108390 2630210 1355793 576759 2557458
7160B557458m82498q43007O57892J604319k49489j55124k93121M46137m71252
$$ 2557458 2074960 1231953 1889845 3494164 3244675 3089551 2796430 3242567 2771315
7151B771315j550833p78853O29875Q50665L61045m1390q63635J53204l67719K67187
$$ 2771315 1220482 441629 1071504 1922169 2283214 2241824 1378189 1531393 1163674 1430861
7141A430861j322096J315183J333785N49090l56856j431602o87192M18185M04810
$$ 1430861 108765 1423948 2757733 3306823 2949967 1518365 831173 1249358 1654168
7132A654168p08528m9849J527515p14207K62780m30876l58945o48101L93618m44184
$$ 1654168 945640 895791 2423306 1709099 1971879 1541003 1182058 533957 927575 483391
7122D83391K26720O95814r75280J105208L59122n4503l02395K67785n05616o05352
$$ 483391 710111 1405925 430645 1535853 1894975 1840472 1538077 1805862 1300246 694894
7112F94894N43308q77091M48393j33343j04510P58073R71215K37440j234078M61592
$$ 694894 1238202 361111 809504 676161 571651 1329724 2300939 2538379 1304301 1765893
7102A765893O41107L41419K84343j123204L78753o38745j50499j132066R29786
$$ 1765893 2407000 2748419 3032762 1909558 2288311 1649566 1499067 367001 1296787
7093A296787m39022j8559n99267K47173J011563J240836j042246n05466j56928
$$ 1296787 857765 839206 239939 487112 1498675 2739511 1697265 1191799 1034871
7084A034871J14195n61429N38819K44347o73521k30047Q07606Q60877j08766P24694
$$ 1034871 1149066 587637 1126456 1370803 697282 467235 1274841 2135718 2026952 2751646
7074B751646J99094o57908m14247J24087K41891j418825n46396J340834L90992
$$ 2751646 2950740 2292832 1878585 2002672 2244563 825738 279342 1620176 2011168
7065B011168J87405K056Q98525j102098J121906q72118N16497k28840j70019P38247
$$ 2011168 2198573 2200629 3099154 1997056 3118962 2246844 2763341 2534501 2364482 3102729
7055C102729o06754m49155o30637P87431n30040L36526L04602M13038o95214J54077
$$ 3102729 2495975 2046820 1416183 2203614 1673574 2010100 2314702 2727740 2032526 2186603
7045B186603Q75793j202885l52217J360608K6814n76874J80427k35314j54488
$$ 2186603 3062396 1859511 1507294 2867902 2894716 2317842 2498269 2262955 2108467
7036B108467m57258R44460O04205q76566j220912N28057Q85790P11639R5197m49105
$$ 2108467 1651209 2595669 3199874 2323308 1102396 1630453 2516243 3227882 3323079 2873974
7026B873974k094384L80970M32316O60021j28134m84394o28912m15473J433737
$$ 2873974 779590 1160560 1592876 2252897 2124763 1640369 1011457 595984 2029721
7017B029721O84631q37219Q54259j514341n81218J126759p63812M97325J287425
$$ 2029721 2714352 1877133 2731392 1217051 635833 1762592 998780 1496105 2783530
7008B783530q85794n80424J14506J360606Q12536m16767Q52946l99191J31766
$$ 2783530 1897736 1317312 1431818 2792424 3604960 3188193 4041139 3641948 3773714
6999C773714J500320l59582m5321p5117L91268j07202p1835J60262r4278r90506
$$ 3773714 5274034 4914452 4869131 4794014 5185282 5078080 5006245 5166507 5072229 4081723
6989D081723j168424n18299M90138O40022l08990j720352j63681J486460K38650
$$ 4081723 2913299 2395000 2885138 3525160 3216170 1495818 1332137 2818597 3057247
6980C057247l35926J4088k63294n75101l3808M44159j28869j29522P84949J60626
$$ 3057247 2721321 2735409 2472115 1897014 1863206 2307365 2178496 2048974 2833923 2994549
6970B994549q04752L24614R32349J27710l634o58367r0307l25429q5120o98515
$$ 2994549 2189797 2514411 3446760 3574470 3570836 2912469 2822162 2496733 2411613 1713098
6960A713098k65909O8824J826270J222323k408276J02985k87976p16113m03555
$$ 1713098 1447189 1516013 3342283 4564606 2156330 2259315 1971339 1255226 851671
6951H51671M68801M93444L02504P675R05284J25429Q7723j374616l23581J25843
$$ 851671 1320472 1813916 2116420 2124095 3029379 3154808 3242531 1867915 1544334 1670177
6941A670177O84480q73546j153194J297882r08024J463450J07614M56476p6081
$$ 1670177 2354657 1481111 327917 1625799 717775 2181225 2288839 2745315 2669234
6932B669234k58857J091958P86175j370999J40379n37434K22420J90853J0013
$$ 2669234 2410377 3502335 4288510 2917511 3057890 2520456 2742876 2933729 2943742
6923B943742l08501J359984q27333l00496n24428J582163l1077j347198N0313
$$ 2943742 2635241 3995225 3167892 2867396 2342968 3925131 3894054 2546856 2597169
6914B597169K53316r75048j75471p53045j72525J15453J60227K11120l55664N40538
$$ 2597169 2850485 1875437 1699966 946921 774396 889849 1050076 1261196 905532 1446070
6904A446070l98858J327226J144591n73375p26117r71407J83560P46015o07161
$$ 1446070 1047212 2374438 3519029 2945654 2219537 1248130 1431690 2177705 1570544
6895A570544M9991K444954p7011r55450L86964J006276j101341n22198J934215
$$ 1570544 1620535 4065489 3988478 3033028 3419992 4426268 3324927 2802729 4736944
6886D736944j050140k109572J23594J66492m1650Q54523j552997K45523N05324
$$ 4736944 3686804 1577232 1700826 1867318 1825668 2680191 1127194 1372717 1878041
6877A878041J813417o04663o49764J056873J55485k27015m47105J73729j239071
$$ 1878041 3691458 3086795 2437031 3493904 3649389 3422374 2975269 3148998 1909927
6868A909927O68639P59826P64266l55805j560055Q32018P07773n69269q26329
$$ 1909927 2578566 3338392 4102658 3746853 2186798 3018816 3726589 3157320 2330991
6859B330991O59400j148007m96710M61489r9922p25881J5522Q14415J274433M90224
$$ 2330991 2990391 1842384 1345674 1807163 1707241 981360 996882 1811297 3085730 3575954
6849C575954p99255j158844J610134N26029j112601M26320K05509Q37266j389514
$$ 3575954 2776699 1617855 3227989 3754018 2641417 3067737 3273246 4110512 2720998
6840B720998q94026M39733l35352J084759j212560J12738J053136m76110J811799
$$ 2720998 1826972 2266705 1931353 3016112 1803552 1916290 2969426 2493316 4305115
6831D305115J143646j740793r98260M80124J063941j294156l72156k3630p33699
$$ 4305115 5448761 3707968 2709708 3189832 4253773 2959617 2587461 2563831 1830132
6822A830132N32283O77323j86532k23923n21811J67285J05164M25892o3585K32728
$$ 1830132 2362415 3039738 2853206 2629283 2107472 2274757 2379921 2805813 2742228 2974956
6812B974956q72879m28094J968170P95099j06474r8354l98455r2927k57699K03674
$$ 2974956 2102077 1673983 3642153 4437252 4330778 4232424 3833969 3741042 3483343 3687017
6802C687017p8311N64657M36453R34165r12645p36578Q901j072277o53141P36144
$$ 3687017 3608706 4173363 4609816 5543981 4631336 3894758 3903659 2831382 2178241 2914385
6792B914385K01183j235878J585748L63624m10246k01382J492150r91941J31450
$$ 2914385 3115568 1879690 3465438 3829062 3418816 3217434 4709584 3717643 3849093
6783C849093n18749J009548L34049j186262P14580k53141q6373J64919k41856
$$ 3849093 3330344 4339892 4673941 3487679 4202259 3949118 3862745 4027664 3785808
6774C785808n46773L81450l49338j068272N44512N39299L40956j85121m02818
$$ 3785808 3239035 3620485 3271147 2202875 2747387 3286686 3627642 3442521 3039703
6765C039703j220347J245714J004208K20994P00657j213439k02043o45422l17347
$$ 3039703 1819356 3065070 4069278 4290272 4990929 3777490 3575447 2930025 2612678
6756B612678M59549K306193L91628k31665N82174k224910o33554l51643q04190
$$ 2612678 3072227 5378420 5770048 5538383 6120557 3895647 3262093 2910450 2106260
6747B106260J706191J55377n59706N4342o48554q57468K272092k96517L89413
$$ 2106260 3812451 3967828 3408122 3462464 2813910 1956442 4228534 3932017 4321430
6738D321430J97609n67824r311M34539K33583o36035L14113M49345O55024O57285
$$ 4321430 4519039 3951215 3941904 4376443 4610026 3973991 4288104 4737449 5392473 6049758
6728F049758q21009r44455N81443l12359m7966Q6997R550M05673r35117n36189
$$ 6049758 5228749 4284294 4865737 4553378 4505412 4592409 4601959 5007632 4072515 3536326
6718C536326M50456O69356Q57278j160337R18718j421323L41341q13065L98333
$$ 3536326 3986782 4656138 5513416 4353079 5271797 3850474 4191815 3378750 3777083
6709C777083J046191K98395o84844R32732r98570j60631N6151N24665k2820m00022
$$ 3777083 4823274 5121669 4436825 5369557 4370987 4210356 4266507 4791172 4768352 4368330
6699D368330O11631k10026P459n65931J341188J003340j56672n17717q67809L9925
$$ 4368330 4979961 4769935 4777394 4211463 5552651 6555991 6399319 5881602 5013793 5053718
6689E053718R24854r54117o15781p34281J456310J406000n70639r07513N6683
$$ 5053718 5978572 5024455 4408674 3674393 5130703 6536703 5966064 5058551 5115234
6680E115234j68805Q08741p12419r57648N00860K88069j63458P27194r10092n1413
$$ 5115234 4946429 5755170 5042751 4085103 4585963 4874032 4710574 5437768 4527676 4476263
6670D476263J012961L62499L52628J1719p63726P12678k34459O58023O564o8471
$$ 4476263 5489224 5851723 6204351 6216070 5452344 6165022 5930563 6588586 6595150 6526679
6660F526679p28579q65328Q79146M93183k45721O53153k21904l92769o28392P14011
$$ 6526679 5798100 4932772 5811918 6305101 6059380 6712533 6490629 6097860 5469468 6183479
6650F183479m84986k85509m32216o04958J286013M62334q12887k42444J090227
$$ 6183479 5698493 5412984 4980768 4375810 5661823 6124157 5311270 5068826 6159053
6641F159053K73910k87053N64285o80653l36320P17812N26094m58096j098794
$$ 6159053 6432963 6145910 6710195 6029542 5693222 6411034 6937128 6479032 5380238
6632E380238J267051j189052J850047Q35435n34291k9426M4443q51009L93870
$$ 5380238 6647289 5458237 7308284 8143719 7609428 7580002 7624445 6773436 7167306
6623G167306J415620j70001l5584j85703j260903J6481N8570J69794J790692j21662
$$ 7167306 8582926 8412925 8377341 8191638 6930735 6947216 7005786 7175580 8966272 8844610
6613H844610q77921K81657N17245o55740p15723j35117R1734P30766p682J054734
$$ 8844610 7966689 8248346 8765591 8109851 7394128 7259011 7350745 8081511 8073829 9128563
6603I128563K47734M24370j212913K05974J76971o14792N3998M69478n9795K00783
$$ 9128563 9376297 9800667 8587754 8793728 8970699 8355907 8409905 8879383 8819588 9020371
6593I020371l959N01897L43035L1100k09435j10036k49269M34250O92318n56706
$$ 9020371 9016412 9518309 9861344 9892444 9683009 9572973 9323704 9757954 10450272 9893566
6583I893566J02650J86913j4457q7603L38994j333606M51165L64056o19931l27678
$$ 9893566 9996216 10183129 10168672 10081069 10420063 9086457 9537622 9901678 9281747 8954069
6573H954069o6231Q73445Q50123M36227r20929j130136J110469N83475m73585
$$ 8954069 8887838 9761283 10611406 11047633 10126704 8996568 10107037 10690512 10216927
6564A0216927K63920M38656Q14326j15865m36870R56369K04888J76667J146801
$$ 10216927 10480847 10919503 11733829 11617964 11181094 12137463 12342351 12519018 13665819
6555A3665819q90977p91991J746778O14063j604157m21049L71700p57424J126943
$$ 13665819 12774842 11982851 13729629 14343692 12739535 12318486 12690186 11932762 13059705
6546A3059705j54644K67170Q93028j309435P1215N17508m04470J98081m15588
$$ 13059705 12905061 13172231 14065259 12755824 12827039 13344547 12940077 13138158 12722570
6537A2722570R91301j084617J313026L29333q46096k41192J033249J262462p65837
$$ 12722570 13713871 12629254 13942280 14271613 13425517 13184325 14217574 15480036 14714199
6528A4714199O16724K62278n27719M6255N5858O51624j147322R1266n15001K09152
$$ 14714199 15330923 15593201 15065482 15111737 15167595 15819219 14671897 14763163 14248162 14457314
6518A4457314R50393j590420J127862K37464m14550J186125J39712k37716j88791
$$ 14457314 15407707 13817287 14945149 15182613 14768063 15954188 16093900 15856184 15667393
6509A5667393J55751L67245K96844J06384R68677J404084m64768l18884n35185
$$ 15667393 15823144 16190389 16487233 16593617 17562294 18966378 18501610 18182726 17647541
6500A7647541J393274k20513j288390o6701k60570P23713n78517K34205l79233
$$ 17647541 19040815 18820302 17531912 17465211 17204641 17928354 17349837 17584042 17204809
6491A7204809N99810l45540Q49538n27529j26870k90789L35053J517038r35736
$$ 17204809 17804619 17459079 18308617 17781088 17654218 17363429 17698482 19215520 18279784
6482A8279784J092188j086798Q57236L26278l73202J59964M01919p46308J195975
$$ 18279784 19371972 18285174 19142410 19468688 19095486 19255450 19657369 18911061 20107036
6473B0107036r5661m35115l42900M43553J958222n67193r3123n28157j478266
$$ 20107036 20011375 19576260 19233360 19676913 21635135 21067942 20974819 20446662 18968396
6464A8968396N78443J293777Q45598j38023n44951r1670l74251k93291j01289
$$ 18968396 19546839 20840616 21686214 21548191 21003240 20911570 20537319 20244028 20142739
6455B0142739R65045n85042l26674K75224K36379O50780j431768P87521Q90763
$$ 20142739 21107784 20522742 20196068 20471292 20707671 21358451 19926683 20714204 21604967
6446B1604967O23092o09155n75313n13268p93854o26826R06479R11928L9795J94062
$$ 21604967 22228059 21618904 21043591 20530323 19736469 19109643 20016122 20928050 20967845 21161907
6436B1161907l79767P0963p79341J148439N71507k34985j53843j062334O74136
$$ 21161907 20782140 20853103 20073762 21222201 21793708 21558723 21404880 20342546 21016682
6427B1016682L45471L10001J54446p0717j042759l59380J85030K03487j59884
$$ 21016682 21362153 21672154 21826600 21755883 20713124 20353744 20538774 20742261 20582377
6418B0582377m58630J001631J112530j346925o84742R48331l94635n69431J0960
$$ 20582377 20123747 21125378 22237908 20890983 20206241 21154572 20759937 20190506 20201466
6409B0201466n14004l58613Q41001L34467P19572l78622m07934L87004j75701
$$ 20201466 19687462 19328849 20169850 20504317 21223889 20845267 20437333 20824337 20648636
6400B0648636P86554m39778o19571J165090L07075l64807r46765K38764O5730
$$ 20648636 21435190 20995412 20375841 21540931 21848006 21483199 20536434 20775198 20840928
6391B0840928j022323r8624J424796j325888p54607M30875q84105k07959N40774
$$ 20840928 19818605 19719981 21144777 19818889 19064282 19495157 18611052 18403093 18943867
6382A8943867K65074l93816K80888L15961j62396p76914Q16269q20836P22897
$$ 18943867 19208941 18815125 19096013 19411974 19249578 18472664 19288933 18468097 19190994
6373A9190994k36351m70203R32193P8226o60774j070039M11232P8908J056732
$$ 19190994 18954643 18484440 19416633 19494859 18834085 17764046 18175278 18254186 19310918
6364A9310918K72266q85684r54581M96191N12795j7786k00246j63235o2697Q18469
$$ 19310918 19583184 18697500 17742919 18239110 18751905 18734119 18533873 18370638 18307941 19126410
6354A9126410o84028j356369k42100M804n21939P83455L784j10325P87428R3248
$$ 19126410 18442382 17086013 16843913 16848717 16326778 17110233 17114017 17003692 17791120 17884368
6344A7884368j02578k44298K2838p30136p52547J89622j100445n58083R20053
$$ 17884368 17781790 17537492 17560330 16830194 16077647 16267269 15166824 14608741 15528794
6335A5528794J99870j170411l70614L69427O95570M28749M98248M37663j401690
$$ 15528794 15728664 14558253 14187639 14557066 15252636 15681385 16179633 16617296 15215606
6326A5215606q62290J109770Q37517j29082k69413o64597J98552j29376m11828
$$ 15215606 14353316 15463086 16300603 16171521 15902108 15237511 15436063 15306687 14894859
6317A4894859J032773j13999j386090M88468J362052P2556N7301j518241o62881
$$ 14894859 15927632 15813633 14427543 14916011 16278063 16350619 16407920 14889679 14226798
6308A4226798J474880M43009m40069l71457j884743O27628k33127P51218P32244
$$ 14226798 15701678 16144687 15704618 15333161 13448418 14076046 13842919 14594137 15326381
6299A5326381o09902k42400M962P34101q22438n04867k19928L51244p06461L55332
$$ 15326381 14716479 14474079 14479041 15213142 14390704 13885837 13665909 14017153 13310692 13666024
6289A3666024J008446m11215Q49395j78536K12421j095918K75377k78689j45197
$$ 13666024 14674470 14263255 15112650 14934114 15146535 14050617 14325994 14047305 13902108
6280A3902108J077446j052985p76196L1991J195786n11905O60982Q94803o30842
$$ 13902108 14979554 13926569 13150373 13182364 14378150 13866245 14527227 15422030 14791188
6271A4791188k104109O30729l77584J739412q3365j172474L97268o34087k64519
$$ 14791188 12687079 13317808 12940224 14679636 14596271 13423797 13821065 13186978 12922459
6262A2922459L7587L41431L22226Q96882Q68907K98508o74424P18028r15364l02236
$$ 12922459 12960046 13301477 13623703 14520585 15389492 15688000 15013576 15731604 14816240 14514004
6252A4514004j39962r58756N24796M46238K74772P99337n04332j11318M50010
$$ 14514004 14374042 13415286 13940082 14386320 14661092 15460429 14956097 14844779 15294789
6243A5294789m77391Q79701k57698n24404J54760m07335j371149J173007O60103
$$ 15294789 14817398 15697099 15439401 14914997 15069757 14662422 13291273 14464280 15124383
6234A5124383r49432j46660N61538j85460J025648J57568j250295K47520J050992
$$ 15124383 14174951 14028291 14589829 14404369 15430017 15587585 14337290 14584810 15635802
6225A5635802J108200P96128j923521k72291R51887j309072j25617J913463L4775
$$ 15635802 16744002 17540130 15616609 15344318 16296205 14987133 14861516 16774979 16809754
6216A6809754j99062m01423j123160j15518O60326M10792L62742J226528q0801
$$ 16809754 16610692 16209269 15086109 14970591 15630917 16041709 16404451 17630979 17550178
6207A7550178o45138o66963N72785O6348L38913O62298n04333K30217P43321M91014
$$ 17550178 16905040 16238077 16810862 16877210 17216123 17878421 17374088 17604305 18347626 18838640
6197A8838640k51343q20739n92373N35585K42338j65138n40163N46790O9620j53203
$$ 18838640 18587297 17766558 17174185 17709770 17952108 17786970 17246807 17793597 17863217 17710014
6187A7710014N99058R57425n15923L36695N98484r19178j75532l78772O78769
$$ 17710014 18309072 19266497 18750574 19087269 19685753 18766575 18591043 18212271 18891040
6178A8891040j068462j23588N74339k5619K033669J437791j776549k87549J525628
$$ 18891040 17822578 17698990 18273329 18247710 20281379 21719170 19942621 19655072 21180700
6169B1180700L95329k92546N45358N68880j152682j60570O68085o0157J538052
$$ 21180700 21576029 21283483 21828841 22397721 21245039 21084469 21752554 21692397 23230449
6160B3230449K68907Q52891j969392m21813J117790m94606N58686r33406R43921
$$ 23230449 23499356 24352247 22382855 21961042 23078832 22584226 23142912 22209506 23153427
6151B3153427K96721m51218o82647K06204P14858Q11025Q07533o55589J52442
$$ 23153427 23450148 22998930 22316283 22522487 23237345 24048370 24855903 24200314 24352756
6142B4352756p01734N27529J312004M86451q57934o3898J485230L59656l68904
$$ 24352756 23651022 24178551 25490555 25977006 25119072 25055174 26540404 26900060 26531156
6133B6531156L75341j157787R96446J215031M3696M88066M4909N96793n0670R13775
$$ 26531156 26906497 25748710 26745156 27960187 28003883 28491949 28536858 29133651 29082981 29996756
6123B9996756l53596J284633O37911p63369j60351k65834J120840J90240l58805
$$ 29996756 29643160 30927793 31565704 30802335 30641984 30376150 31496990 31687230 31328425
6114C1328425J195072O46192R20670L09304J367611J219840N11698L57379k185780
$$ 31328425 32523497 33169689 34090359 34399663 35767274 36987114 37498812 37856191 35670411
6105C5670411P36095Q60542O5920N79405P49300J93958J853524J164676n00420
$$ 35670411 36406506 37267048 37332968 37912373 38661673 38855631 40709155 41873831 41373411
6096D1373411J353263J204934j397849J11646J513810K60447k84359Q01674k7261
$$ 41373411 42726674 43931608 42533759 42645405 44159215 44419662 44135303 44936977 44909716
6087D4909716J13486O13284P27207L77293N93104J345419J081896P57487K60411
$$ 44909716 45023202 45636486 46363693 46740986 47334090 48679509 49761405 50518892 50779303
6078E0779303P18431P87625M83664J244129N09046N36358J072220J869260J163593
$$ 50779303 51497734 52285359 52769023 54013152 54522198 55058556 56130776 58000036 59163629
6069E9163629O35376Q74497J432933Q81293L0118K141939Q60942K27019J593002
$$ 59163629 59799005 60673502 62106435 62987728 63017846 65159785 66020727 66247746 67840748
6060F7840748J854526M44414M53729R03409K806781J755297P6414Q29792K088450
$$ 67840748 69695274 70139688 70593417 71496826 74303607 76058904 76135318 76965110 79053560
6051G9053560K042689J852042J451952Q12094L41950K158995J895479P28805P68311
$$ 79053560 81096249 82948291 84400243 85212337 85554287 87713282 89608761 90337566 91105877
6042I1105877K13922K283742J388848J94138K754138K521142O60012L06485R21734
$$ 91105877 91319799 93603541 94992389 95186527 97940665 100461807 101121819 101428304 102350038
6033A02350038N77768J195973J091616J394955L060252J820083n76215P4555J313152
$$ 102350038 102927806 104123779 105215395 106610350 109670602 111490685 110914470 110989025 112302177
6024A12302177J232198K072403P5598L80009J04685J700379K88816m7078P87999
$$ 112302177 113534375 115606778 115682376 116062385 116167070 117867449 118156265 118109187 118897186
6015A18897186l0373K082165J920960J016985R85110R92737k431423j120488j919861
$$ 118897186 118866813 120948978 122869938 123886923 124872033 125864770 123433347 122312859 120392998
6006A20392998k841275m942398k586403j669392j566697l799702k554415k912976
$$ 120392998 117551723 112609325 110022922 108353530 106786833 102987131 100432716 97519740
5998I7519740j826514p81892m45415k048413p88617j060465l278394q45644j646966
$$ 97519740 95693226 94911334 94465919 92417506 91628889 90568424 87290030 86444386 84797420
5989H4797420k279988q39871j591204j729925q26576j574305k290944k801339
$$ 84797420 82517432 81677561 80086357 78356432 77529856 75955551 73664607 70863268
5981G0863268n51587j508237k423533k963430n44343j470381j059620k576435
$$ 70863268 70311681 68803444 66379911 63416481 62872138 61401757 60342137 57765702
5973E7765702o69066J002704r44282l185697l76637j086046n25668m67838p02814
$$ 57765702 57096636 58099340 57155058 53969361 53592724 52506678 51981010 51513172 50810358
5964E0810358n33060k046484r60541j057312n41927J57379n4263j368295j616708
$$ 50810358 50277298 48230814 47270273 46212961 45671034 45828413 45774150 44405855 42789147
5955D2789147p0797P09557p44868l08538j165169p40030j392968q35471L23915
$$ 42789147 42718350 43427907 42683039 42374501 41209332 40469302 39076334 38240863 38564778
5946C8564778R56028p05166j92372m62797o58628j85007n58103q28481p09412
$$ 38564778 39520806 38815640 38623268 38160471 37501843 37316836 36758733 35930252 35220840
5937C5220840n208K05366J90150o41113q50644K36258M8749j109561l386R94645
$$ 35220840 35215632 35420998 35611148 34970035 34119391 34355649 34404398 33294837 33291451 34286096
5927C4286096r78598N9211J79895O47999J276757j32460n61773j28325J657704
$$ 34286096 33307498 33366709 33546604 34194603 35471360 35338900 34777127 34648802 36306506
5918C6306506O44610M73317p02303K38895M68150K177195N72508r18023j05862
$$ 36306506 36951116 37424433 36722130 36961025 37429175 39606370 40178878 39260855 39154993
5909C9154993R75044P75971j327674j107904l01759j129712l71923q49805p30602
$$ 39154993 40130037 40906008 39578334 38470430 38168671 37038959 36667036 35817231 35086629
5900C5086629j983174k47230j567906j483518n67928j060744O33526n05938j540500
$$ 35086629 33103455 32856225 31288319 29804801 29236873 28176129 28809655 28303717 26763217
5891B6763217j589983p93336o05789r26435N18289J72698L79239j295444l9216
$$ 26763217 25173234 24379898 23774109 22847674 23365963 23538661 23917900 22622456 22583240
5882B2583240P39834m38761j552384j454111j92915J024517K55999j079941j057841
$$ 22583240 23323074 22884313 21331929 19877818 19684903 20709420 20965419 19885478 18827637
5873A8827637r8033M42479J047325m86444q81154Q80452j420074R12384j06535
$$ 18827637 18729604 19172083 20219408 19732964 18851810 19732262 18312188 19224572 19118037
5864A9118037j57919j04699j80859K71953n97731l04612L39876L77423q93710
$$ 19118037 18960118 18855419 18674560 18946513 18348782 18044170 18384046 18761469 17867759
5855A7867759m66766J04125k05746l68245J094507N44152j11291m79451m74682
$$ 17867759 17400993 17505118 17299372 16931127 18025634 18569786 18458495 17979044 17504362
5846A7504362l65505N70014o11218m89238J302765M35861l945q90341o53380O07869
$$ 17504362 17138857 17708871 17097653 16608415 17911180 18347041 18343096 17452755 16799375 17407244
5836A7407244L17830r55054R1965J33221K2826J01248J276663m2378k38752k40155
$$ 17407244 17725074 16770020 16861985 16995206 17018032 17119280 18395943 18353565 18114813 17874658
5826A7874658M30574j616707J707239J02230p52047j73626K17543J4641J786644
$$ 17874658 18305232 16688525 18395764 18497994 17745947 17572321 17789864 17804505 19591149
5817A9591149q0434n28983n79420q22336M91581k71350L12913j75625P52507N21561
$$ 19591149 19510715 18981732 18402312 17579976 18071557 17800207 18113120 17937495 18690002 19211563
5807A9211563m36102r90358k35142J144324p81627M14485N54955O2881O76615
$$ 19211563 18775461 17785103 17549961 18694285 17912658 18327143 18882098 18944979 19621594
5798A9621594J943171J76658j162615O95679l79394P96540p30856L41079J722750
$$ 19621594 21564765 21741423 20578808 21274487 20895093 21691633 20960777 21301856 23024606
5789B3024606p26716q95536Q25431m26432J161822R88117K06806K89292q45333
$$ 23024606 22297890 21402354 22227785 21801353 22963175 23951292 24158098 24447390 23602057
5780B3602057K26329K61815o63857L32673Q73219N04767J058233J327725J21975
$$ 23602057 23828386 24090201 23426344 23759017 24632236 25137003 26195236 27522961 27644936
5771B7644936O86540M66364J331862K423044J350869J601208K844169L508076
$$ 27644936 28331476 28797840 30129702 32552746 33903615 35504823 38348992 41857068
5763D1857068K953750K882831J557986j606188l660278m315165k655892k224402
$$ 41857068 44810818 47693649 49251635 47645447 43985169 39670004 37014112 34789710
5755C4789710l084280q41551r91849k282822m14191P8935q47810o96899K84097
$$ 34789710 31705430 30863879 29872030 27589208 27175017 27253952 26406142 25709243 25993340
5746B5993340j616668j73322J342759p88321o06492J50448k28829j572746P20338
$$ 25993340 24376672 24203350 25546109 24757788 24151296 24301744 24072915 22500169 23220507
5737B3220507M919l19821J803541J782208J093354m83756O07888J064082J167216
$$ 23220507 23225426 22905605 24709146 26491354 27584708 27100952 27708840 28772922 29940138
5728B9940138j990570n42640L74751r3797j308207j39396j171893J101641J59266
$$ 29940138 27949568 27406928 27781679 27687882 26379675 26240279 25068386 26170027 26329293
5719B6329293j315073k52634j201641R08042K51469k63252J024149j656989N90233
$$ 26329293 25014220 24761586 23559945 24467987 24719456 24456204 25480353 23823364 24413597
5710B4413597R92035k5096L81933P71856p66580M92605P42002l26694n9226M10622
$$ 24413597 25405632 25380536 25762469 26534325 25767745 26260350 27002352 26675658 26616432 27027054
5700B7027054J685562J85135J844349O44837n98494M59321N30618q627p6005p65450
$$ 27027054 28712616 28897751 30742100 31386937 30788443 31247764 31778382 31769755 31693750 30928300
5690C0928300j324524j115061j091531R24439J34258j295827P32882k53792K2459
$$ 30928300 29603776 28488715 27397184 28321623 28455881 27160054 27892936 27639144 27661603
5681B7661603k38409R19388P853L70278N78723J05219K94568l32762m53655J17446
$$ 27661603 27423194 28342582 28350435 28720713 29299436 29404655 29699223 29366461 28912806 29030252
5671B9030252J024548R60756o06455P26704k77994J106767R95177J65953L74122
$$ 29030252 30054800 31015556 30409101 31135805 30857811 31964578 32959755 33125708 33499830
5662C3499830J01240Q12083M73744m26856j69925j276095m45271M42124K14936
$$ 33499830 33601070 34413153 34886897 34460041 34290116 33014021 32568750 33010874 33225810
5653C3225810j42134p02868n52726J040480J58245j53205J029282N64282K08700
$$ 33225810 33083676 32380808 31828082 32868562 33026807 32873602 33902884 34467166 34675866
5644C4675866L01551r77483O21678J371307R55003o81503l70427P50739Q00559
$$ 34675866 34977417 33999934 34621612 35992919 36947922 36266419 35895992 36646731 37447290
5635C7447290J492352M56167K10144l80259N44241R35434r95079K89113j78470
$$ 37447290 38939642 39395809 39605953 39225694 39769935 40705369 39710290 39999403 39820933
5626C9820933j452150q08409J414216K327082o17746r35892J12175p95142Q38628
$$ 39820933 38368783 37560374 38974590 41301672 40683926 39748034 39860209 39065067 39903695
5617C9903695J716701N10522o2960P96368L59105k6725Q91355M56880Q13628J130546
$$ 39903695 41620396 42130918 42067958 42864326 43223431 43196706 44088061 44544941 45358569 46489115
5607D6489115K54152j153411R89693J268753Q36235M54550Q83810j0970J350859
$$ 46489115 46743267 45589856 46579549 47848302 48684537 49139087 50022897 50011927 51362786
5598E1362786L50927J046831N41442R11895M19989p43122j9524K035421J984296
$$ 51362786 51713713 52760544 53301986 54213881 54633870 53890748 53871224 55906645 57890941
5589E7890941J554930k45471P79196J504008L7435J341695J651231L41970J092352
$$ 57890941 59445871 59200400 59979596 61483604 61521039 62862734 64513965 64855935 65948287
5580F5948287R91828R59813J507013Q36695N32603J072791K40252J839363Q48904
$$ 65948287 66940115 67899928 69406941 70243636 70776239 71849030 72089282 73928645 74777549
5571G4777549L044445K664880L29445J546052Q31716K87434J415820K526323J540148
$$ 74777549 77821994 80486874 80816319 82362371 83194087 83481521 84897341 87423664 88963812
5562H8963812K737312o45557Q75885K275128J003161J781011J014153J258322
$$ 88963812 91701124 91055567 91931452 94206580 95209741 96990752 98004905 99263227
5554I9263227J492589J305031J755271J154194M69746r9234M45171J010035R59537
$$ 99263227 100755816 102060847 103816118 104970312 105440058 105340824 105785995 106796030 107755567
5545A07755567N80044Q91847J096465R59403j53795r56123N9795J006590l17071
$$ 107755567 108335611 109227458 110323923 111283326 111129531 110173408 110233203 111239793 110922722
5536A10922722m31266o01860J1093q58275R5820r13580j391282r85026j399027
$$ 110922722 110491456 109889596 109900689 109042414 109138234 108224654 106833372 105848346 104449319
5527A04449319q79615n6856j869899j679931m96966j912606k67309q57875j985436
$$ 104449319 103569704 103512848 101642949 99963018 99466052 97553446 97286137 96428262 94442826
5518I4442826r95517j467345j550197q36555k415496j928788j76099j373983j896138
$$ 94442826 93447309 91979964 90429767 89593212 87177716 85248928 85072829 83698846 81802708
5509H1802708j591937j845533j563322k258040o47839j120459j293183r13239
$$ 81802708 80210771 78365238 76801916 74543876 73896037 72775578 71482395 70569156
5501G0569156n57292j80975k387047p81847j112114q66420j378967j867306j101203
$$ 70569156 70011864 69830889 67443842 66661995 65549881 64683461 63304494 61437188 60335985
5492F0335985L67280k95437j536744r62250j888630J22118j98927k124205l37499
$$ 60335985 60703265 60407828 58871084 57908834 56020204 56142322 55943395 53819190 53481691
5483E3481691l95771r61320p35580j27934j178792j19232K50084j869054l82114
$$ 53481691 53085920 52124600 51389020 51261086 50082294 49963062 50213146 48344092 47961978
5474D7961978Q1308r82781P91455k52721o00388m19697n11556Q04883O23755j332325
$$ 47961978 48043286 47060505 47851960 47599239 46998851 46579154 46067598 46872481 47496236 46163911
5464D6163911p09375J64245M25943J202061J136757Q75825J265795n59979k498226
$$ 46163911 45454536 45618781 46044724 47246785 48383542 49259367 50525162 49965183 47466957
5455D7466957j325525n84158n27488j044829j566641o45522l66657k60026O29019
$$ 47466957 46141432 45557274 45029786 43984957 42418316 41772794 41406137 41146111 41775130
5446D1775130j29595J007806p04169r83227k20572J70470L25155j259714j998226
$$ 41775130 41645535 42653341 41949172 40965945 40745373 40915843 41240998 39981284 37983058
5437C7983058P61978M32555O37659N80103j282431j369523j338061l36058L63138
$$ 37983058 38745036 39177591 39815250 40395353 39112922 37743399 36405338 36069280 36432418
5428C6432418j016141J430895k95537n84160N90670K82279j164646K64994k88653
$$ 36432418 35416277 36847172 36551635 35967475 36558145 36840424 35675778 35940772 35652119
5419C5652119n9171O35226k61072l13735m02566j08123k74314K6223j474785k86398
$$ 35652119 35592948 36228174 35967102 35653367 35250801 35142678 34868364 34894587 33419802 33133404
5409C3133404J019580l51948R32486M95287j253634N83280l86524m72619j702149
$$ 33133404 34152984 33801036 34733522 35228809 33975175 34558455 34171931 33699312 31997163
5400C1997163N26864J404957N0269l55346l94576j12979p7185j79385J099551
$$ 31997163 32524027 33928984 33979253 33623907 33229331 33116352 33039167 32859782 33959333
5391C3959333L63265o60742Q53909l27978j58450l87219J56909j63909n09994
$$ 33959333 34322598 33661856 34515765 34187787 34029337 33642118 33799027 33635118 33125124
5382C3125124O54127k51382J180967J635405j250824m06137k57859O02848o0884
$$ 33125124 33779251 33527869 34708836 36344241 35093417 34687280 34429421 35032269 34971385
5373C4971385L80267j096047j401632m0824K27470J067163k22843N57943l97965
$$ 34971385 35351652 34255605 32853973 32813149 33040619 34107782 33884939 34442882 34044917
5364C4044917l88089q10136N63114j29264Q70931J609198r32719k023422M60615
$$ 34044917 33656828 32846692 33409806 33280542 34151473 35760671 34827952 32804530 33265145
5355C3265145P50518M74301k13524j75590n6099j82373K20946p31335q87825J165826
$$ 33265145 34015663 34489964 34276440 34100850 34044751 33862378 34083324 33351989 32464164 33629990
5345C3629990q0013q47959P67512J490005l16409q17514J87142q4971Q53638q51038
$$ 33629990 33549977 32702018 33469530 34959535 34643126 33825612 34012754 33927783 34781421 33930383
5335C3930383o04307J149193L89041Q1868O9841k31965O36629r96652p9847m38742
$$ 33930383 33326076 34475269 34864310 34946178 35016019 34784054 35420683 34424031 34344184 33905442
5325C3905442o71175N57654q53058j421803K588751J141597o29064J14948k05215
$$ 33905442 33234267 33791921 32938863 31517060 34105811 35247408 34618344 34733292 34528077
5316C4528077J483413l92923n48347n892k11928K81097K9805l17315o39691m61978
$$ 34528077 36011490 35618567 35070220 35064328 34852400 35133497 35163302 34845987 34206296 33744318
5306C3744318J297820R94594r44888k70333k72313j03405P96465k72704R15784
$$ 33744318 35042138 36036732 35091844 34821511 34549198 34445793 35242258 34969554 35885338
5297C5885338N84345r00515K32198M46042O89204M11980r03627l62573N6946K70824
$$ 35885338 36469683 35569168 35801366 36247408 36936612 37348592 36444965 36082392 36139338 36410162
5287C6410162l9089O03308J99172p7985l54931N28574o8351l71449O28749N40912
$$ 36410162 36371073 36974381 37173553 37095568 36740637 37269211 37200860 36829411 37458160 37999072
5277C7999072j180601k47781L59011O87988o81302l22931M19676k67293M38300
$$ 37999072 36818471 36570690 36929701 37617689 36936387 36613456 37033132 36765839 37204139
5268C7204139J630639P48424p60508k90186K853q5465n18971J732692m92379N32474
$$ 37204139 38834778 39583202 38822694 38532508 38535361 38449896 37930925 39663617 39171238 39703712
5258C9703712r18315K65418L11504j63647J25858q25938J021246K20183j320002
$$ 39703712 38785397 39050815 39362319 39198672 39324530 38498592 39519838 39740021 38420019
5249C8420019O83973J475659o72352j022052J395066j49131k1219n17090M12794
$$ 38420019 39103992 40579651 39907299 38885247 40280313 40131182 40109963 39592873 40005667
5240D0005667N85062j70474K26091n38693J204664m90666L3010q6516J70611o17679
$$ 40005667 40590729 40420255 40646346 40107653 41312317 40821651 40854661 40768145 40938756 40321077
5230D0321077n55420J179085k20419j31269R65072K84400j13174L41130R79202
$$ 40321077 39765657 40944742 40724323 40593054 41558126 41842526 41729352 42070482 43049684
5221D3049684l58182q58480j673513K014809J186078L07272J73789p86888J58717
$$ 43049684 42691502 41833022 40159509 42174318 43360396 43667668 43841457 43054569 43213286
5212D3213286J90550l12629j370515K72543N53052K47082J93599K29604M53802
$$ 43213286 43403836 43091207 41720692 41993235 42546287 42793369 42986968 43216572 43670374
5203D3670374M30251l59795k33614P68648n72631l63020k02854n8788m43294O62559
$$ 43670374 44100625 43740830 43507216 44275864 43703233 43340213 43137359 43078571 42635277 43297836
5193D3297836Q06611j20067o41708j189045M98130q87965R79158J551663K1899
$$ 43297836 44104447 43984380 43342672 42153627 42651757 41763792 42742950 44294613 44316512
5184D4316512j383237J888411R31277j859695L40084L74147P59547j18742j361881
$$ 44316512 42933275 44821686 45752963 43893268 44233352 44607499 45367046 45248304 43886423
5175D3886423J49898N92908J12525p8107n69010K37833P80565Q78829j92156j107863
$$ 43886423 44036321 44629229 44741754 44663647 44094637 44332470 45113035 45991864 45799708 44691845
5165D4691845p09318J78465K462524q60952n92003j97968n77282J461908J26145
$$ 44691845 43982527 44160992 46623516 45762564 45170561 44972593 44395311 45857219 45983364
5156D5983364j484252L03529m514L59263j14060M54329l43191r84790P50697K09969
$$ 45983364 44499112 44802641 44798127 45157390 45043330 45497659 45154468 44169678 44920375 45130344
5146D5130344j44527n02530M24016R94414O66870p16117l72019N91865p7503R03300
$$ 45130344 44985817 44483287 44907303 45901717 46568587 45852470 45480451 46072316 45994813 46898113
5136D6898113O23457j529437k6266p3211J062115n88277m99611O28930j176032
$$ 46898113 47521570 45992133 45965867 45892656 46954771 46366494 45866883 46495813 45319781
5127D5319781j6728K62145j2720Q06795N56452l44726J258571j376739M67188
$$ 45319781 45303053 45565198 45552478 46359273 46915725 46570999 47829570 46452831 46920019
5118D6920019l8411j816609K81002J38968J060090J183220n03798l79420Q14249
$$ 46920019 46881608 45064999 45346001 45484969 46545059 47728279 47224481 46845061 47659310
5109D7659310q93848j98337K93481l6689L7905k1680o52281M31507L92866J54014
$$ 47659310 46765462 46567125 46860606 46823917 46861822 46840142 46187861 46619368 47012234 47166248
5099D7166248q3419j74019K00079J47902m5471J21960L67862j392253o31266J280446
$$ 47166248 47082829 46908810 47108889 47256791 47211320 47333280 47701142 46308889 45677623 46958069
5089D6958069j68436K89540O56749o83236K72780k02266o35898J71035P02769
$$ 46958069 46789633 47079173 47735922 47052686 47325466 47123200 46487302 46658337 47361106
5080D7361106J229669j301188l89753N71819J74824j66410m50072J205798j56798
$$ 47361106 48590775 47289587 46899834 47471653 47646477 47480067 47029995 48235793 48078995
5071D8078995j208307J429026O95530L41557k54111K08247J41822Q82788j22384
$$ 48078995 46870688 48299714 48995244 49336801 49082690 49290937 49432759 50315547 50193163
5062E0193163J527499m48702j02686l13322K5198N4535k67853M7031k0193M95109
$$ 50193163 51720662 51271960 51169274 50855952 50881150 50935685 50667832 50714863 50694670 51189779
5052E1189779J481497L15375m74680q76786J363184J434000N14311j228626O06389
$$ 51189779 52671276 52986651 52511971 51635185 52998369 54432369 54946680 53718054 54324443
5043E4324443J541127j383876l5538J530922M85912o0252p56493K97693J654598
$$ 54324443 55865570 54481694 54446156 55977078 56462990 56402738 55646245 55943938 57598536
5034E7598536q4540K42261q04710J893707J322302O02056k77663L16678L71346
$$ 57598536 57513996 57756257 56951547 58845254 60167556 60769612 60491949 60808627 61179973
5025F1179973K90076l4366K019938J041947J07787j6707J295077O94898J086220
$$ 61179973 61470049 61435683 63455621 64497568 64605355 64588648 65883725 66578623 67664843
5016F7664843L07317J636844N94479l20730j28650K087791J100839M65113J241293
$$ 67664843 67972160 69609004 70203483 69882753 69754103 71841894 72942733 73407846 74649139
5007G4649139P13867M25412N96845J385210J760003J279845M96963J052826J043310
$$ 74649139 75363006 75788418 76385263 77770473 79530476 80810321 81307284 82360110 83403420
4998H3403420J53963J205339K044969L64739O26543M11888K189544K634845R19500
$$ 83403420 83557383 84762722 86807691 87172430 87798973 88210861 90400405 93035250 93954750
4989I3954750J545579J611112J395492J397202Q57989J187306J956327O04221
$$ 93954750 95500329 97111441 98506933 99904135 100762124 101949430 103905757 104509978
4981A04509978J178459J554711J872488K084298L283136M04407R24605K106925
$$ 104509978 105688437 107243148 109115636 111199934 114483070 114887477 115812082 117919007
4973A17919007J581865J616154O83314J466141J996491R97694J323578K696045
$$ 117919007 119500872 121117026 121800340 123266481 125262972 126260666 127584244 130280289
4965A30280289J923963J765576j62401J775058J062883K260780K488666K57533
$$ 130280289 132204252 133969828 133807427 135582485 136645368 138906148 141394814 141652347
4957A41652347j72601m47837J865674J024278M03773M08256J44665o39145K61457
$$ 141652347 141479746 141031909 142897583 143921861 144325634 144733890 144878555 144239410 144500867
4948A44500867J770422L44920j542581j824696j134206o61315m79673j481344
$$ 144500867 146271289 146616209 145073628 143248932 142114726 141453411 140973738 139492394
4940A39492394j644932j988976j433022q66087j644332k009419k215072j953199
$$ 139492394 137847462 135858486 134425464 133559377 131915045 129905626 127690554 125737355
4932A25737355k029245j351183j528732j848134q00694l906110j555613j824037
$$ 125737355 123708110 122356927 120828195 118980061 118179367 114273257 112717644 110893607
4924A10893607l159287k196638j419887j494204j450306k870996j738649j210560
$$ 110893607 107734320 105537682 104117795 102623591 101173285 98302289 96563640 95353080
4916I5353080j318539k404155j954591o35584k145285Q3251j077024j854927j708601
$$ 95353080 94034541 91630386 89675795 89040211 86894926 86978177 85901153 84046226 82337625
4907H2337625k823172q72759j877399k012179m87053M32566j642356j528349k28817
$$ 82337625 79514453 78641694 76764295 74752116 74265063 74697629 73055273 71526924 71298107
4898G1298107j548900q07048k592626p18266q55286j063507M61163j078778j002041
$$ 71298107 69749207 68942159 66349533 65631267 64775981 63712474 64173637 63094859 62092818
4889F2092818j306114j767647o19749R8525l55714o83835o27469p15505k33228
$$ 62092818 60786704 59019057 58399308 58497833 58142119 57458284 56830815 56115310 55882082
4880E5882082M63694j286489j361991r54470O873q37130j772919L23789j515704
$$ 55882082 56345776 55059287 53697296 52742826 52749699 51912569 50139650 50463439 48947735
4871D8947735l01957q09409Q1146N73110j167760q25621J0462N65257n87581K17399
$$ 48947735 48645778 47836369 47917515 48490625 47322865 46497244 46507706 47072963 46485382 46702781
4861D6702781j226566j039312q1260J168463j286669j449504r75024j47572l31299
$$ 46702781 45476215 44436903 44355643 45524106 44237437 42787933 41812909 41665337 41334038
4852D1334038K70484q684O64627M23078j041533j092877q10779M55865r87651
$$ 41334038 41604522 41595838 42260465 42683543 41642010 40549133 39738354 40194219 39206568
4843C9206568J47505O91338o94128q05595J0811o73172j595850N30291k60375
$$ 39206568 39354073 40045411 39351283 38545688 38556499 37883327 36287477 36817768 36557393
4834C6557393L48425O93658n26432j53924J183085o87102o64242p2773r48505
$$ 36557393 36905818 37599476 37073044 36919120 38102205 37415103 36750861 36678088 35729583
4825C5729583j312930R1867R22372l38115k253496l30919J246609l83429N34585
$$ 35729583 34416653 34508520 35430892 35092777 32839281 32508362 33754971 33371542 33906127
4816C3906127l77456P65154p85660k30642o64715j70623M0777O2507j158863K28101
$$ 33906127 33528671 34293825 33508165 33277523 32612808 32442185 32482962 32545469 31386606 31614707
4806C1614707K015058O42974j015960j413296O3592O78945j070131P41894k48425
$$ 31614707 33629765 34272739 33256779 31843483 31907075 32586020 31515889 32257783 32009358
4797C2009358K16545m06242N36423n4201q79004q40466J22758J019322j521588
$$ 32009358 32225903 31819661 32356084 32301883 31422879 30582413 30705171 31724493 30202905
4788C0202905j495269K75753L00975l82754o09803K79862n50543o90693J124127
$$ 30202905 28707636 28983389 29284364 28901610 28291807 28571669 28021126 27330433 28454560
4779B8454560O25505q21534p02191M94961N52880j236668N46151k02830m1926
$$ 28454560 29080065 28258531 27556340 28051301 28604181 27367513 27913664 27710834 27668908
4770B7668908k21212j332144q0540L95267l82583J139943j294297q94385n7218
$$ 27668908 27447696 26115552 26035012 26430279 26047696 27187639 25893342 24998957 24941739
4761B4941739m45741M6581j45866k0403M21018J505149j310968j124307j53459
$$ 24941739 24495998 24542579 24396713 24376310 24797328 26302477 24991509 23867202 23713743
4752B3713743K091013l42833k78417m29877J8171k87098N89467m88297l88369
$$ 23713743 25804756 25461923 25183506 24753629 24771800 24484702 25074169 24585872 24197503
4743B4197503p38126j20068k53348J0659J083167J78466j57796p139o26704l16073
$$ 24197503 23459377 23339309 23085961 23096620 24179787 24358253 24200457 24193318 23566614 23250541
4733B3250541k48779O78745M77426j30790m56147L43411n35815j235360p2677
$$ 23250541 23001762 23680507 24157933 24027143 23570996 23914407 23378592 22143232 22070555
4724B2070555J62278J94328Q12317n94545q06835Q70347M37532J372046q40050
$$ 22070555 22232833 22427161 23239478 22644933 21838098 22708445 23145977 24518023 23677973
4715B3677973j531809M31503m31548m67340J85842M12294r76232k05415n44933
$$ 23677973 22146164 22577667 22146119 21678779 21864621 22276915 21300683 21095268 20550335
4706B0550335k46379J250994P4761j54661k00259O52098L88911J288809q02618
$$ 20550335 20303956 21554950 21629711 21475050 21274791 21926889 22315800 23604609 22801991
4697B2801991P88645J026751k17862Q86790j72249m96658n89969O72449N92398
$$ 22801991 23590636 24617387 24399525 25286315 25114066 24617408 24027439 24699888 25292286
4688B5292286j70550j787019j462895M44803J14345j425280j90900N1891m88759
$$ 25292286 25121736 23334717 21871822 22316625 22430970 21005690 20814790 20866681 20377922
4679B0377922N00597j270311K00054J410297M36532p04122P2009p69366o84406
$$ 20377922 20878519 19608208 19808262 21218559 21655091 20950969 21022978 20253612 19569206
4670A9569206J35138l43653P17583q05188L10659L80087n53469Q89125J5302p17762
$$ 19569206 19704344 19360691 20078274 19273086 19583745 19963832 19410363 20299488 20314790 19597028
4660A9597028p0250k76544L15295k64444p96940J351729J376177p72791l74056
$$ 19597028 19526778 19250234 19565529 19301085 18504145 19855874 21232051 20459260 20085204
4651B0085204J89846J3555l61588M99429P52355J149375O9840k36692j660777
$$ 20085204 20275050 20288605 19927017 20426446 21178801 22328176 22398016 22161324 20500547
4642B0500547p84070O08667j87279M58394J26821J378060j518839O53320P89811
$$ 20500547 19716477 20325144 20137865 20596259 20723080 22101140 20582301 21235621 22025432
4633B2025432O0097O22847J06645L28431n05108o20603q4433K76574J22316M6856
$$ 22025432 22085529 22708376 22815021 23143452 22638344 22017741 21933308 22209882 22332198 22379054
4623B2379054J086729k06242j327556j7399l32647J301132O1673J712933M88536
$$ 22379054 23465783 23259541 21931985 21914586 21581939 22883071 22944744 24657677 25146213
4614B5146213j512302k82895J898980L77893p56457k15366Q24927O80503j09929
$$ 25146213 23633911 23351016 25249996 25627889 24871432 24656066 25480993 26161496 26051567
4605B6051567r939J44263J164448Q75900P54854k71691r12992K938J785766n02432
$$ 26051567 26041628 26185891 27350339 28226239 28981093 28709402 27796410 27799348 29585114 29082682
4595B9082682Q11348J29902O61845R3939N24413O78460J616290j97155J069905
$$ 29082682 29894030 30023932 30685777 30779716 31304129 31982589 33598879 33401724 34471629
4586C4471629j308210r08620K392944M73872J299230N44978J547375K76721n94623
$$ 34471629 33163419 32254799 34647743 35121615 36420845 36965823 38513198 38789919 38195296
4577C8195296K16512J583102J460661J038611J202313J729158j130890K096320
$$ 38195296 38411808 39994910 41455571 42494182 43696495 45425653 44294763 46391083
4569D6391083J566242o52437J325087J364144P98930K558170J108466k32491P09942
$$ 46391083 47957325 47304888 48629975 49994119 50793049 53351219 54459685 54227194 54937136
4560E4937136J631373K444028J540799R80389J549077L60201J351502J914203
$$ 54937136 56568509 59012537 60553336 61533725 63082802 63443003 64794505 66708708
4552F6708708R62461K054290K692402J869326J766619L045392J594419K977726
$$ 66708708 67671169 69725459 72417861 74287187 76053806 79099198 80693617 83671343
4544H3671343K101288L611308K909067K855343M215195M292546N228054L269734
$$ 83671343 85772631 89383939 92293006 95148349 99363544 103656090 108884144 112153878
4536A12153878K447670M089222P589858P451604O865732O948134O905297Q845486
$$ 112153878 114601548 118690770 126280628 133732232 140597964 147546098 154451395 163296881
4528A63296881R331943J1987910J0927043J2366471J5283318J6095072J6237024
$$ 163296881 172628824 184616734 195543777 207910248 223193566 239288638 255525662
4521B55525662J8708284J7869958J8868279K1891272J9451818J7696087J4390154
$$ 255525662 274233946 292103904 310972183 332863455 352315273 370011360 384401514
4514C84401514Q203216J060539m057827j1828726j7444187k1023774k1680365
$$ 384401514 392604730 393665269 389607442 377778716 360334529 339310755 317630390
4507C17630390k2644637k0977543k0961802j8058837j5809561j5556409j1557545
$$ 317630390 294985753 274008210 253046408 234987571 219178010 203621601 192064056
4500A92064056j1300035j0541248r279055q144388o009273o548455o564231o212606
$$ 192064056 180764021 170222773 160943718 152799330 146790057 140241602 133677371 127464765
4492A27464765o799314o179051o109641m363821m736200n660615m895841l206633
$$ 127464765 120665451 114486400 108376759 104012938 99276738 93616123 88720282 85513649
4484H5513649l983985m177808l294881k720459q18684k879867k554751j136729
$$ 85513649 81529664 77351856 74056975 71336516 70517832 67637965 65083214 63946485
4476F3946485j253870j212483o19633j108914j770087q70838r93887o0591j31101
$$ 63946485 62692615 61480132 60860499 59751585 57981498 57110660 56116773 56056182 55925081
4467E5925081O45714N68009j402271j047945o15142j146488k345348k265161j890314
$$ 55925081 56570795 57138804 55736533 54688588 54073446 52926958 50581610 48316449 46426135
4458D6426135j923907j760558j261718j312747j597261o58323q1411k552890j973805
$$ 46426135 44502228 42741670 41479952 40167205 38569944 37911621 37830210 35277320 33303515
4449C3303515L62671j74599l02771j370434o76178j471013j983119K69606j79587
$$ 33303515 33666186 33491587 33188816 31818382 31142204 29671191 27688072 27957678 27778091
4440B7778091n33705o58108q43875P58944M15946j409180j198742n30052p57506
$$ 27778091 27244386 26586278 25742403 26501347 26917293 25508113 24309371 23779319 23021813
4431B3021813j066595j52646k50957o79054P63029r36834j811923Q53818L03078
$$ 23021813 21955218 21802572 21551615 20872561 21635590 20698756 18886833 19740651 20043729
4422B0043729J48121j056030j517399k11492m67302O93912J405100P94879j491264
$$ 20043729 20191850 19135820 17618421 17406929 16939627 17633539 19038639 19833518 18342254
4413A8342254l77840k34676N65222j385028m03602P77191L09134L04191j104555
$$ 18342254 17964414 17729738 18294960 16909932 16506330 17283521 17592655 17896846 16792291
4404A6792291n55620o33480M73489m38397P44931j12671M81616Q89033j031493
$$ 16792291 16236671 15603191 16076680 15638283 16383214 16270543 16752159 17641192 16609699
4395A6609699j08387L11868J74169j303223q81433j66321K204510O00596o13300
$$ 16609699 16501312 16813180 16987349 15684126 14802693 14636372 16840882 17441478 16828178
4386A6828178j265892j542448K380317J050760L69865j43693o26909k82750J471086
$$ 16828178 15562286 14019838 16400155 17450915 17820780 17677087 17050178 16767428 18238514
4377A8238514N5143k97052j292722n66496q03983l47589k70049k29681j43164
$$ 18238514 18293657 17996605 16703883 16137387 15333404 14985815 14715766 14486085 14342921
4368A4342921l12657k99894Q12704O56900j636778p56135L34700n3992l28473
$$ 14342921 14030264 13730370 14543074 15199974 13563196 12807061 13141761 13087769 12759296
4359A2759296J032681k86570o8975q32159N7666L67461J49780j72326m55971k24797
$$ 12759296 13791977 13505407 13436432 12604273 12661939 13029400 13179180 13006854 12550883 12326086
4349A2326086J504753o3845j475786M96676Q52259n68433m28825k89062K98357
$$ 12326086 13830839 13766994 12291208 12787884 13640143 13071710 12642885 12353823 12652180
4340A2652180K89571j1244Q83160n90247N43284r93251R08375N19671J91498Q70542
$$ 12652180 12941751 12930507 13813667 13223420 13766704 12773453 13681828 14201499 14392997 15263539
4330A5263539m96156K64917j012715K38913J821746m27413r7623L88946m80513
$$ 15263539 14767383 15032300 14019585 14258498 16080244 15652831 15555208 15944154 15463641
4321A5463641j010811J088182M84333j100658J260526O31454K2070k06322n79914
$$ 15463641 14452830 15541012 16025345 14924687 16185213 16816667 16838737 16632415 16052501
4312A6052501O09978O81579J59488J540327j223764J377129K076810L21249Q4899
$$ 16052501 16662479 17344058 17503546 19043873 17820109 19197238 21274048 21595297 21680196
4303B1680196K87684R98697L62844J099801Q20822L51692J713293J750028L96967
$$ 21680196 21967880 22966577 23329421 24429222 25250044 25601736 27315029 29065057 29462024
4294B9462024J781268K824417J644070L248246K384860L446642L780239M849468
$$ 29462024 31243292 34067709 35711779 38960025 41344885 44791527 48571766 53421234
4286E3421234O513616Q734509R404666J0594472J2890387J4052001J3079076M863538
$$ 53421234 59934850 68669359 78074025 88668497 101558884 115610885 128689961 133553499
4278A33553499m333249j7024749j9979821j5336325j2738869q861026o707002
$$ 133553499 129220250 112195501 92215680 76879355 64140486 55279460 48572458
4271D8572458p199320n032150m543710k416923m5699l203094k143423j929043
$$ 48572458 41373138 36340988 31797278 29380355 29334656 26131562 23988139 22059096
4263B2059096j416521j647108m36598m93372l40625r55511k551235m22710N89406
$$ 22059096 20642575 18995467 18558869 18065497 17724872 16769361 14218126 13795416 14384822
4254A4384822p63845j98061J088090j183138k01896k68140j064604j320649J04146
$$ 14384822 13620977 13422916 14511006 13327868 13125972 12857832 11793228 10472579 10576725
4245A0576725L02339n66454Q5989L55541j04625M88446j571268q87951J894928
$$ 10576725 10879064 10312610 10398599 10754140 10649515 11137961 9566693 8678742 10573670
4236A0573670l10487M50387K90231j436271L34609Q43136N15195k36526j013623
$$ 10573670 10263183 10713570 11003801 9567530 9902139 10745275 11260470 11023944 10010321
4227A0010321l25932j12948j93527K073509o78175j128794l25383N58222J30013
$$ 10010321 9684389 9571441 9377914 11451423 10773248 9644454 9319071 9877293 10007306
4218A0007306j655941K72128R1802n59756p23121m95581j045267k19636O84648
$$ 10007306 8351365 8623493 8715295 8155539 7432418 6936837 5891570 5671934 6356582
4209F356582l93896J082193K50102p37133N3385M33900K08978j399378j720354
$$ 6356582 5962686 7044879 7294981 6557848 6611233 7045133 7254111 5854733 4134379
4200D134379K97071J660397K53358p09116K49556J043273j022087N81250M06848
$$ 4134379 4431450 6091847 6345205 5636089 5885645 6928918 5906831 6488081 6894929
4191F894929l8802k95527m66498L33361j73680L91856L24305l68616j008379j0902
$$ 6894929 6856127 6560600 6094102 6427463 6253783 6645639 6969944 6601328 5592949 5582047
4181E582047R8557K50019J45485P57968K965O39845k95131l32254M56637L54213
$$ 5582047 5680604 5930623 6076108 6834076 6837041 7476886 7181755 6849501 7306138 7660351
4171G660351l42239p29464n45997M54576k7669m68780n13341l23552j015721J087920
$$ 7660351 7318112 6588648 6042651 6497227 6469558 6000778 5487437 5163885 4148164 5236084
4161E236084Q23906j46222J98812m96662J003248O88251O45266j399031l59080
$$ 5236084 6059990 5913768 6112580 5615918 6619166 7307417 7952683 6553652 6194572
4152F194572J469705M67829K48089j19509j193601O85176M16318K98816q1381
$$ 6194572 7664277 8132106 8380195 8260686 7067085 7752261 8168579 8467395 8386014
4143H386014j95066K325400P57326j519057r31655j484038n28399M72501o17469
$$ 8386014 8190948 10516348 11273674 9754617 8822962 7338924 6810525 7283026 6665557
4134F665557j041910l19097j142461J629024m68641n22962M3534j161007M63293
$$ 6665557 5623647 5304550 4162089 5791113 5322472 4799510 4843044 3682037 4145330
4125D145330m80617k43202J23674K72779n45001l15194P19366R9562L34461k76786
$$ 4145330 3664713 3421511 3545185 3817964 3272963 2957769 3677135 3776697 4111158 3834372
4115C834372J51971k02249j767783n18203O15267J378571l06448Q70927J9276
$$ 3834372 3986343 3784094 2016311 1498108 2113375 3491946 3185498 4056425 4075701
4106D075701j158323p52107k42465m11460J078474J79121P98008L09151j712671
$$ 4075701 2917378 2165271 1922806 1511346 2589820 2768941 3566949 3876100 2163429
4097B163429j7236J060259J36269q87557N52550k93760J777362p93386m16816
$$ 2163429 2146193 3206452 3342721 2455164 3007714 2713954 4491316 3697930 3281114
4088C281114n93457j394082P21545M9974N11919j94395M08230Q53071l48640K11292
$$ 3281114 2687657 1293575 2015120 2065094 2577013 2382618 2790848 3643919 3295279 3506571
4078C506571j054447l98016k01175M78654r15115J494450J052390r73387L15482
$$ 3506571 2452124 2054108 1852933 2331587 1416472 2910922 3963312 2989925 3305407
4069C305407o49935j776891q45607P56453M56077J094255N20546q67441r7843
$$ 3305407 2655472 878581 32974 789427 1245504 2339759 2860305 1992864 1895021
4060A895021j12431j29429J301447L75011k18872n50579J69609J02134k5676n07446
$$ 1895021 1782590 1653161 2954608 3329619 3110747 2560168 2729777 2831911 2806235 2298789
4050B298789j69001l22564N77944j160987l17072K69221J131951M62182j337561
$$ 2298789 2129788 1807224 2385168 1224181 907109 1176330 2308281 2770463 1432902
4041A432902N1405r6630o69449o13823J145598J131436o19158j441252J131652
$$ 1432902 1484307 1387677 718228 104405 1250003 2381439 1762281 321029 1452681
4032A452681J071080K28307l12587l45919l77600m37174l2527J96319O69555p53832
$$ 1452681 2523761 2752068 2439481 2093562 1715962 1278788 1246261 1442580 2112135 1358303
4022A358303l61755K399J440588J017213Q55957j829500L96195n06158j302131
$$ 1358303 996548 998947 2439535 3456748 4312705 2483205 2879400 2373242 1071111
4013A071111O49857J027069J021232n00997k189987j179642J112410N98336L67393
$$ 1071111 1720968 2748037 3769269 3268272 1078285 -101357 1011053 1609389 1976782
4004A976782J97495l35041K59412k84167k51567O93570q31912P25030j74972p20612
$$ 1976782 2174277 1839236 2098648 1814481 1562914 2256484 1424572 2149602 1974630 1254018
3994A254018M63291P97798R31033O12325q16610n0179j196552J1525J002572J8682
$$ 1254018 1717309 2515107 3446140 4058465 3241855 3191676 1995124 2006649 3009221 3027903
3984C027903n10038Q14368m06970k38861j853950J165050Q72339p41842j205058
$$ 3027903 2517865 3332233 2925263 2686402 832452 1997502 2869841 2127999 922941
3975I22941j011623Q86541j28603o83991M89130J109460n26197J57197o22322
$$ 922941 -88682 797859 669256 -14735 474395 1583855 1057658 1214855 592533
3966E92533l16579R0838J165053r2086J04158J50061j081058J111401J134953
$$ 592533 275954 366792 1531845 1439759 1543917 1693978 612920 1724321 2859274
3957B859274N97577j442322p67714J246878R29433O4783j626606j000659M40127
$$ 2859274 3456851 2014529 1246815 2493693 3423126 3487909 1861303 860644 1300771
3948A300771R29917o13796k23033m55894m32896k259j75746L115N89663j981035
$$ 1300771 2230688 1616892 1393859 937965 505069 502810 327064 330179 919842 -1061193
3938a061193J190503N96469R05611k60643O52657r41886M15985l04868k95671
$$ -1061193 129310 725779 1631390 1370747 2023404 1081518 1497503 1192635 896964
3929H96964j1886j20191N06789J48094M6318J85537r65831L64795N4992j033563
$$ 896964 885078 764887 1271676 1419770 1466088 1651625 685794 1050589 1105581 72018
3919G2018J349366m39850J35817j86062J005944M53203k78499j036263R0709N1106
$$ 72018 1421384 981534 1117351 931289 1937233 2390436 2111937 1075674 1166383 1217489
3909A217489L98864N72230j63731j386597m02818r3989J090156j75140m3751n35775
$$ 1217489 1616353 2188583 2024852 638255 235437 141448 1231604 1056464 1012713 476938
3899D76938L50593N10594n18085K719k6627O29898L09913J10928j069049J85411
$$ 476938 827531 1338125 820040 822759 796132 1426030 1735943 1846871 777822 963233
3889I63233J101663j68307r90987o1326N91702J496884n75245k63314J426824
$$ 963233 2064896 1896589 905602 844276 1435978 2932862 2357617 2094303 3521127
3880C521127j096239R0483j379282L92852m8776j27325L61646j186105K4028J425405
$$ 3521127 2424888 2515371 1136089 1528941 1480165 1352840 1714486 528381 552409 1977814
3870A977814q63547j676974P63840K47062J21718J13345o8629K86090M30618l12903
$$ 1977814 1114267 -562707 201133 448195 569913 683258 614629 900719 1331337 1018434
3860A018434m21844M4377m95168j213689M82491P77762l80312Q25187R3199N47891
$$ 1018434 596590 640967 145799 -1067890 -585399 192363 -187949 637238 730437 1278328
3850A278328O8263J71920n93056M8819J02640l17833k74155J73211j536685J997
$$ 1278328 1346591 1518511 925455 974274 1076914 759081 484926 658137 -878548 -876551
3840h76551J506100O90702l77496L63416M37961K02501p35505J3386n51837J11782
$$ -876551 629549 1320251 942755 1306171 1744132 1946633 1211128 1224514 672677 784459
3830G84459j92378n76445Q02042q1345M23570N95763N12406o65414l84269j336511
$$ 784459 592081 15636 817678 736333 1159903 1755666 2268072 1602658 1218389 -118122
3820a18122m09897n36201P63008J94854m61569L0275p8258J81424N28618M12147
$$ -118122 -528019 -1064220 -301212 -106358 -567927 -537652 -615910 -434486 94132 506279
3810E06279O52911r68955K71011J273918r84644J126099q97008k36495O71363
$$ 506279 1159190 190235 461246 1735164 750520 1876619 979611 743116 1414479
3801A414479r42759O36445r88064r5286J112828N07350L84118q0401j866594k78852
$$ 1414479 471720 1108165 120101 24815 1137643 1644993 2029111 1948710 82116 -196736
3791a96736J076824Q87755j180073o47501M32326k68193j60565Q79376J051881
$$ -196736 880088 1767843 587770 -59731 372595 104402 -56163 823213 1875094
3782A875094M5304j082334J069977N59135j249620j777283R41240M11448M39719
$$ 1875094 1920398 838064 1908041 2467176 1217556 -559727 381513 792961 1232680
3773A232680n72409q5681P16187l94277n09539N46664j164168J60779J014141
$$ 1232680 660271 574590 1290777 896500 386961 933625 -230543 -69764 944377
3764I44377r43100J32263L49161j236412Q223J070589K866890j072585j278358
$$ 944377 1277 133540 482701 -753711 -745488 325101 3191991 2119406 841048
3755H41048J508616K76560r13777q58266j071937P01408J17351j68595N33408
$$ 841048 2349664 2626224 1712447 854181 -217756 483652 601003 432408 965816
3746I65816j073200N31010n1828M11118j44237J161318l48028L60486m78001j759005
$$ 965816 -107384 423626 371798 782916 638679 1799997 1451969 1812455 1334454 -424551
3736d24551n4544J111088K96570O36175q29834L63229l63018N36917q26942l56613
$$ -424551 -479095 631993 928563 1564738 734904 1098133 735115 1272032 445090 88477
3726H8477N24025n80185p28169l70675M37786M52470j119613k2371N01993J247820
$$ 88477 612502 32317 -695852 -1066527 -628741 -176271 -1295884 -1318255 -816262 431558
3716D31558R92755J63785o45707r24237J004192l4547n8739o97630N02706m64691
$$ 431558 1424313 1588098 942391 18154 1022346 987799 929060 231430 734136 269445
3706B69445O51427O27016q47295j254558k38866M10440L87116p9668j005427M76060
$$ 269445 920872 1547888 700593 -553965 -792831 -382391 4725 -74943 -1080370 -604310
3696f04310Q84338J595464j355906o16696o42072J260361O60175j193747R14726
$$ -604310 280028 1875492 519586 -97110 -739182 521179 1181354 -12393 902333
3687I02333P0107P50099K1946j140092n64388K88809p93077J090816J557057j065045
$$ 902333 972440 1722539 1744485 604393 40005 328814 -464263 626553 2183610 1118565
3677A118565r72834O82219L90249M75536n95223K04914M86498j11358q47581o21347
$$ 1118565 145731 827950 1218199 1693735 1098512 1303426 1789924 1678566 830985 209638
3667B09638R43913J36862n06046n05981o63810O25647l45956m17772Q64324j40957
$$ 209638 1153551 1290413 784367 278386 -385424 240223 -105733 -523505 340819 199862
3657A99862P51857l52148Q35495j45821o87973q31288n92694Q96568Q69295K26419
$$ 199862 951719 599571 1435066 1289245 601272 -230016 -822710 73858 943153 1169572
3647A169572L76784j488687O01295n1835L882J25813k70433R81923j15423l01379
$$ 1169572 1546356 57669 658964 607129 611011 736824 466391 1448314 1332891 1031512
3637A031512m64248J699713p83777j336660k68315m2006J529165N87601N6828
$$ 1031512 567264 2266977 1483200 146540 -121775 -163781 1365384 1952985 2009813
3628B009813j183449Q84503n76872j65901K37964j381767Q16858P45748o48674
$$ 2009813 826364 1710867 1133995 968094 1206058 -175709 641149 1386897 738223
3619G38223q74460R17266k4413P87430o69097m15249P66978J042366N82424n13132
$$ 738223 -136237 781029 756616 1544046 874949 459700 1226678 2269044 2851468 2338336
3609B338336j330738l20169M97060n04659J72591Q09790R38220l59702j49091
$$ 2338336 1007598 687429 1184489 679830 852421 1662211 2600431 2240729 2091638
3600B091638P35446l54711l60010q55093n8144n40039J197346L58098j211782
$$ 2091638 2827084 2472373 2112363 1257270 1199126 659087 1856433 2214531 1002749
3591A002749q15668P32863N37006O95736q2924n05531L78343j223715Q60389J33327
$$ 1002749 187081 919944 1456950 2152686 2069762 1564231 1942574 718859 1579248 1712575
3581A712575J110180M31943j828729R25880n96864J002895J30395J34622j090326
$$ 1712575 2822755 3254698 1425969 2351849 1754985 2757880 2888275 3022897 1932571
3572A932571l18565L54376O08115J19184r71542p0081j024359J57334o83038O61929
$$ 1932571 1614006 1968382 2576497 2695681 1724139 1654058 629699 787033 103995 765924
3562G65924j19869J74093O85267Q67539j78842q77362r21502L54391R67263K34193
$$ 765924 646055 820148 1505415 2372954 2194112 1316750 395248 749639 1716902 1951095
3552A951095k279p32869J069503L90095j43385n73206p58038N74028k95561n51012
$$ 1951095 1948816 1215947 2285450 2675545 2532160 1958954 1200916 1774944 1479383 928371
3542I28371j083753K243739R54502m60661m37606l78941J19735k23363j11694
$$ 928371 -155382 2088357 3042859 2582198 2144592 1765651 1885386 1662023 1550329
3533A550329R25511j01490j110474k74829m7612R64191j39329J452883l03073
$$ 1550329 2475840 2374350 1263876 989047 941435 1905626 1766297 3219180 2916107
3524B916107q64745N28946K68049n46382j069514O09881l84954k69532N14730
$$ 2916107 2051362 2580308 2848357 2301975 1232461 1842342 1457388 1187856 1702586
3515A702586Q325m77265M50592O46149o1102K80490q7582o01421J161951k18807
$$ 1702586 1710911 1233646 1684238 2330387 2269285 2549775 2462193 1860772 3022723 2803916
3505B803916m51104J37710l72550K95511o08285p61976m86827J402874K268931
$$ 2803916 2352812 2490522 2117972 2413483 1805198 1043222 556395 1959269 4228200
3496D228200o25466k71267Q09063N1504N4667o97659k87781m05670p44233Q57567
$$ 4228200 3602734 3331467 4140530 4192034 4246701 3549042 3261261 2855591 2111358 2968925
3486B968925J491146k41630N3667p55541J074421Q1453r33281J80386P36013n3759
$$ 2968925 4460071 4218441 4272108 3516567 4590988 4672441 3739160 3919546 4655559 4601800
3476D601800P42694Q2449K57317l10320n7609l91221m11412P12901P44109l34550
$$ 4601800 5344494 5426943 5684260 5373940 5316331 4925110 4513698 5226599 5970708 5636158
3466E636158J185949J616922Q61523J505424j51213Q28783M22805m50239j46008
$$ 5636158 6822107 8439029 9300552 10805976 10654763 11483546 11906351 11456112 11310104
3457A1310104m60668m95823p87055m87902n49331P57223J837953M99878m68514
$$ 11310104 10849436 10353613 9566558 9078656 8529325 9286548 11124501 11624379 11155865
3448A1155865j03904J727627q68096O55893N97634J90790p07904j394279l04914
$$ 11155865 11051961 12779588 11911492 12567385 13165019 13355809 12647905 11253626 10948712
3439A0948712m88745j40978o51755P42011J130910K01721O40239j59043J470093
$$ 10948712 10459967 10318989 9667234 10409245 11540155 11741876 12382115 12223072 13693165
3430A3693165J390086J084753m62641o23428k551227k40380j750839o79835l98803
$$ 13693165 15083251 16168004 15705363 15081935 12530708 12290328 10539489 9859654 9460851
3421I460851k600297q72873J095024k57108j403044R7513Q05618q74945j414716
$$ 9460851 6860554 5987681 7082705 6825597 5422553 5520066 6325684 5450739 4036023
3412D036023n51934J172223J135758j926200J23114Q49980n5853j149981J153000
$$ 4036023 3484089 4656312 5792070 3865870 3988984 4838964 4783111 3633130 4786130
3403D786130J19566Q46393P62019j61545J36965Q79280J324285P1028L99017j918857
$$ 4786130 4905696 5752089 6514108 6352563 6489528 7368808 8693093 8764121 9163138 7244281
3393G244281p62128j381634r31735J45190N455m14783j56959k75209o96402l52801
$$ 7244281 6482153 5100519 4168784 4313974 4319429 3904646 3747687 3472478 2776076 2423275
3383B423275k75730m99506K26035n8676N20736o72504m56916R3242J167857K96946
$$ 2423275 2147545 1648039 1874074 1815398 2336134 1663630 1206714 1299956 2467813 2764759
3373B764759o52048M30695r95897N18509j73712O0589j205341J701332m21556
$$ 2764759 2112711 2543406 1547509 2066018 1892306 1952895 747554 2448886 2027330
3364B027330j09633q58285l39881p70479M42936K92039j19128q35612J77337Q04250
$$ 2027330 1917697 1059412 719531 -50948 391988 684027 564899 -270713 -93376 710874
3354G10874q0366j9274M07539n83545p40449J040118k12817K61043L00286j64514
$$ 710874 630508 611234 1018773 435228 -305221 734897 522080 783123 1083409 918895
3344I18895j145717l86524R02303P15941j462738R61075J639734J32004p68174
$$ 918895 -226822 -613346 288957 1004898 -457840 503235 2142969 2274973 1506799
3335A506799j743611M96278N430k38842p64300l62585k19436M84579Q42602o11520
$$ 1506799 -236812 259466 264896 26054 -738246 -1100831 -1320267 -835688 6914 -604606
3325f04606M36910L50794J040487L05972j481742R98316L99583M19028o10363
$$ -604606 -167696 183098 1223585 1529557 47815 1046131 1445714 1864742 1254379
3316A254379q28495n47943R37464o67831m0303n74989J234819o5689J61613L08236
$$ 1254379 425884 -122059 815405 147574 107271 -467718 767101 701412 863025 1171261
3306A171261o88463j36959L59037j32845j219448J137648r98756J10681m92751
$$ 1171261 482798 345839 704876 572031 -647417 490231 -508525 -397844 -890595
3297h90595J48958k26787L28465J157990K78608m56048k27577j384886m55079
$$ -890595 -741637 -968424 -639959 518031 796639 340591 113014 -1271872 -1726951
3288a726951J004310J025230j85665J04800L37113O41613j142026j33207N63015
$$ -1726951 -722641 302589 116924 221724 558837 1200450 58424 -74783 488232
3279D88232K51496j264128j346814J176929J025101P63048L0092q76620m40595
$$ 488232 739728 -524400 -1871214 -694285 330816 1093864 1123956 247336 -193259
3270a93259n19900O08190o50674R07062o33703N02609l32671o21767m40546Q30577
$$ -193259 -713159 -104969 -755643 151419 -482284 20325 -312346 -934113 -1374659 -544082
3260e44082L48092p51494L14628J125675M06033q25264L12075l68654m57565n94379
$$ -544082 -195990 -947484 -632856 492819 898852 73588 385663 17009 -440556 -1034935
3250a034935L38737Q9481R97304p99470k18903m2344l02906Q43611m36556r11179
$$ -1034935 -696198 -606717 390587 -408883 -627786 -670130 -973036 -129425 -565981 -1477160
3240a477160K67922J331102k020180q697R65328J373873K92552N62548j744090
$$ -1477160 -1209238 121864 -1898316 -1907013 -941685 432188 724740 1287288 -456802
3231d56802k204219J815114k04019R7266K75288Q13005M92433j071291m13023
$$ -456802 -2661021 -845907 -1049926 -952660 -677372 135633 628066 -443225 -856248
3222h56248l47508R66256k66337M54069j882007p38885R02102J52951R37368k5571
$$ -856248 -1203756 -237500 -503837 -49768 -1931775 -2670660 -1768558 -1615607 -678239 -703810
3212g03810k96554q35875r59025J071180R37126j321858R02736K35242J190266
$$ -703810 -1000364 -1836239 -2795264 -1724084 -786958 -2108816 -1206080 -970838 219428
3203B19428M72176M25150r12814l28957q02810n37074n34166M78562N54755P2383
$$ 219428 691604 1116754 203940 -125017 -927827 -1464901 -1999067 -1520505 -965750 -893367
3193h93367L9649J57045n83824l78748J724740O07021j166339K81332M75340l99409
$$ -893367 -853718 -696673 -1280497 -1659245 65495 672516 -493823 -212491 262849 -136560
3183a36560p90215K82072j301158M37139K0851O45610K28826j23065l61565P10038
$$ -136560 -926775 -644703 -1945861 -1508722 -1487871 -842261 -613435 -736500 -1098065 -388027
3173c88027P85745n38189j183986O61720J234986j070263r48656o6551Q55512
$$ -388027 397718 -140471 -1324457 -662737 572249 -498014 -1446670 -1513221 -657709
3164f57709m83398n70431k49661N90261l7846J089102J651295j368593n46233
$$ -657709 -1141107 -1711538 -1961199 -1370938 -1408784 -319682 1331613 -36980 -583213
3155e83213n76954n37292N92456J867639r03710m24535L19154J81680J037620
$$ -583213 -1160167 -1697459 -1105003 762636 -141074 -565609 -246455 -64775 972845
3146I72845p40474M54443L67313p59368p63429J98411J159724L59204p07542L38639
$$ 972845 232371 686814 1054127 294759 -468670 -270259 889465 1248669 541127 879766
3136H79766j264798J053179n28583r10989R58571O13995l85431p37914q57244
$$ 879766 -385032 668147 139564 -771425 187146 801141 415710 -322204 -1179448
3127a179448K66462Q34032J11510M77281k77283l62886N12992l31115r20915L56146
$$ -1179448 -912986 -78954 32556 509837 232554 -130332 382660 51545 -869370 -513224
3117e13224K87101M03543Q96728K85497K06874n57722j93485j159666k47917m45664
$$ -513224 -226123 177420 1074148 1359645 1566519 1008797 815312 -344354 -592271 -1037935
3107a037935M21951N67970J24938J67337p70603L42698k01847J06467M03019J77272
$$ -1037935 -615984 -48014 76924 244261 -526342 -183644 -385491 -279024 123995 301267
3097C01267L21508o5048j12709N43622K42767j95060j31745q66640O44780p36434
$$ 301267 622775 557727 445018 988640 1231407 1036347 904602 37962 682742 -53692
3087e3692n83249Q78732L75450n88442j90543P54988M80768N17019m91938p61958
$$ -53692 -636941 241791 617241 28799 -161744 593244 1074012 1591031 1099093 337135
3077C37135J065056n38767k58341Q40256o69608m69717R17096o74639J29688j44307
$$ 337135 1402191 863424 605083 1445339 775731 306014 1223110 548471 678159 533852
3067E33852j204472R24947m9923o72362J44139R86920J27982r85032J11986p25308
$$ 533852 -670620 254327 204404 -467958 -323819 663101 791083 -193949 -81963 -807271
3057h07271N49372k64307P61530j08306n95005J24871M95068R50540j052672L75094
$$ -807271 -257899 -522206 239324 131018 -463987 -339116 155952 1106492 53820 428914
3047D28914P07121L2251l86232Q84996q06511n82607k59035j156069r75012Q58638
$$ 428914 1136035 1168286 782054 1667050 860539 277932 18897 -1137172 -2112184 -1253546
3037a253546J087000K46730r68136J015363J6585n35065L72069j78079K374O11450
$$ -1253546 -166546 80184 -887952 127411 143996 -391069 -19000 -197079 -194705 416745
3027D16745O12933p51244K37673N48654r56604m07710M78618P74463j404217j045186
$$ 416745 1029678 278434 516107 1064761 108157 -299553 179065 953528 -450689 -1495875
3017a495875J26754k3197R71556J616473k83875j922161L34173J051711R97325
$$ -1495875 -1369121 -1392318 -420762 1195711 911836 -1010325 -676152 375559 1372884
3008A372884j200565r92437K09180M97491J55677J62062K6584j053531j308622
$$ 1372884 172319 -820118 -610938 -113447 42230 204292 230876 -822655 -2131277
2999b131277K94757J091910j248028L36315P78794Q67374j113080n45140N41612
$$ -2131277 -1836520 -744610 -1992638 -1656323 -877529 -10155 -1123235 -1668375 -1126763
2990a126763O27308M43164O2387J59129q11322o54039m46867k49063o6745p425
$$ -1126763 -499455 -56291 6096 165225 -646097 -1300136 -1747003 -1996066 -2062811 -2070236
2980b070236P23459L16809O75865j182560O21104k93750m13046N15975q40227
$$ -2070236 -1346777 -1029968 -354103 -1536663 -915559 -1209309 -1622355 -1106380 -1946607
2971a946607K75380J206996J454059l25976j669391n83348J19639N59918J22628
$$ -1946607 -1671227 -464231 989828 663852 -1005539 -1588887 -1469248 -909330 -786702
2962g86702j199461k24862N3364o3218m33760J145241K13120M72445k40461k82393
$$ -786702 -1986163 -2211025 -2157661 -2220879 -2654639 -1509398 -1296278 -823833 -1064294 -1346687
2952a346687N11113L01216o49754O47547L33995n79593j421035J15165J639410
$$ -1346687 -835574 -534358 -1184112 -536565 -202570 -782163 -2203198 -2088033 -448623
2943d48623l15941P2296J022023l54374j197986j31653J090481j045717K02502
$$ -448623 -764564 -692268 329755 -24619 -1222605 -1354258 -263777 -1309494 -1106992
2934a106992k27606m66787R19862j09596K61037k27165k31548M37688r18083Q08898
$$ -1106992 -1334598 -1801385 -881523 -991119 -730082 -957247 -1188795 -751107 -1669190 -860292
2924h60292q335o11826j375l64831j00682m14611J117804K0539M24621J620785
$$ -860292 -868627 -1480453 -1481828 -1846659 -1947341 -2361952 -1244148 -1223609 -798988 821797
2914H21797J84693j226507m85633J89666N58524j13980p27378k28841J81314J406859
$$ 821797 1006490 -220017 -705650 -515984 42540 -71440 -798818 -1027659 -846345 560514
2904E60514k88188q68050o87993r35357P15370K16214L89347k66429q7693J839892
$$ 560514 272326 -595724 -1283717 -2219074 -1503704 -1287490 -898143 -1164572 -1252265 587627
2894E87627J49747q94023l42696L04018O26322K97146J48818l24308P06446n0618
$$ 587627 737374 -156649 -499345 -195327 430995 728141 876959 552651 1259097 1208479
2884A208479P74693j017712j525960o46532K73334n00366j72326J247767m08284
$$ 1208479 1983172 965460 -560500 -1207032 -933698 -1434064 -1606390 -358623 -766907
2875g66907K2309L10790p94295p04786K68201J384678K71365q43180p67248K03674
$$ -766907 -744598 -433808 -1228103 -1932889 -1664688 -280010 -8645 -851825 -1619073 -1415399
2865a415399J36692Q87671j642583k00614J449248q62091M80589J097555L22216
$$ -1415399 -1278707 -391036 -2033619 -2234233 -784985 -1647076 -1166487 -68932 253284
2856B53284Q3684j11906j291272J5417n09005J213951r91355o73145N84040k41036
$$ 253284 336968 225062 -1066210 -1050793 -1559798 -345847 -1337202 -2010347 -1426307 -1667343
2846a667343L9843N09846j8062k17295J366506j70087L05097o26849R5741L49175
$$ -1667343 -1627500 -1117654 -1135716 -1353011 13495 -156592 148505 -478344 -382603 -33428
2836c3428j903311L3412j011213J215423J041769k24942n75190o09100k32888
$$ -33428 -1936739 -1903327 -2914540 -1699117 -657348 -882290 -1457480 -2066580 -2299468
2827b299468j3653N74473q81262J027341J381530N54644r37185p61172k00528
$$ -2299468 -2313121 -1738648 -2619910 -1592569 -211039 343605 -593580 -1354752 -1555280
2818a555280J55991j078202J73283J752780N4783L37492q34033Q75395j074532
$$ -1555280 -1399289 -2477491 -2304208 -551428 -496645 -159153 -993186 -117791 -1192323
2809a192323L76330J40959l62962Q05545k004114J34045P38950N42510N76004
$$ -1192323 -815993 -675034 -1037996 -232451 -2236565 -2102520 -1363570 -821060 -245056
2800b45056M89382l46294o93610p0906n68391r85946Q58860k81041J10290o11573
$$ -245056 244326 -101968 -795578 -866484 -1434875 -2420821 -1561961 -1843002 -1732712 -2344285
2790b344285P37231J38360N19369j98587k18221j11690j987862M35121J224311
$$ -2344285 -1607054 -1468694 -949325 -1147912 -1366133 -1477823 -3465685 -3030564 -1806253
2781a806253N05843q58941M53677J368993P34323j552814k57060o33434n48232
$$ -1806253 -1300410 -2159351 -1705674 -336681 397642 -1155172 -1412232 -2045666 -2593898
2772b593898m21773Q1397K303548M19723O41734J096304n1397j356734j268736
$$ -2593898 -3015671 -2934274 -630726 -211003 430731 1527035 1475638 118904 -1149832
2763a149832O62491J571285K78576k102837l99301Q93409j00197N5635K68100
$$ -1149832 -487341 1083944 1362520 -740317 -1139618 -246209 -346406 -290771 -22671
2754b2671o52453k5478k43633K42192O35713l72863j192094l5624J422083j60570
$$ -22671 -675124 -700602 -944235 -702043 -66330 -439193 -1631287 -1666911 -244828 -405398
2744d05398K82490r30105P95573j230479J608034R21344k011864r96941q50419
$$ -405398 -122908 -1053013 -257440 -1487919 120115 1041459 -970405 -1967346 -2817765
2735b817765J256755K52182l04604K40360r80383J316586M70769k97599N39179
$$ -2817765 -1561010 -1308828 -1613432 -1373072 -2353455 -1036869 -566100 -863699 -324520
2726c24520m97683m42727k11422l8973K0894j06329m63853n0449R62046J833377
$$ -324520 -822203 -1264930 -1476352 -1515325 -1494431 -1600760 -2064613 -2115062 -1153016 680361
2716F80361o30143j743596j850069J540992J279304M56315J76196k91745K92079
$$ 680361 50218 -1693378 -3543447 -2002455 -723151 -266836 -90640 -382385 -90306
2707i0306L02606J84262j599462j437931l93769l02634L18737Q34400R38815P42597
$$ -90306 212300 396562 -1202900 -2640831 -3034600 -3337234 -3018497 -2184097 -1245282 -502685
2697e02685J85038l92868O96344m55601N4369N5669Q2941m60712o60092J99427
$$ -502685 -317647 -710515 -14171 -469772 -415403 -359734 -276793 -737505 -1397597 -1198170
2687a198170J061522j204800k405M16079M11017q3849q25568J045028p5580K64306
$$ -1198170 -136648 -1341448 -1343853 -927774 -516757 -600606 -1426174 -381146 -456726 -192420
2677a92420k7795L69894M00002n24649j163424j530376N59896Q49747J24111M40212
$$ -192420 -220215 149679 549681 25032 -1138392 -2668768 -2108872 -1259125 -1135014 -694802
2667f94802n40320m0183J304436m59206l39214l57969K94000k25229J660077Q4042
$$ -694802 -1235122 -1275305 29131 -430075 -769289 -1127258 -833258 -1058487 601590 685632
2657F85632j559114N76107l48966K59269q69219M45381q54624J40725J507958
$$ 685632 -873482 -297375 -646341 -387072 -1256291 -810910 -1665534 -1524809 -16851
2648a6851K05530k47340L65790j87918o11355j589480Q27345O52002K63798J501718
$$ -16851 188679 -58661 307129 119211 -492144 -2081624 -1254279 -602277 -338479 1163239
2638A163239q50386j083749l3698p83158N48586K42815j113232J011606Q3155
$$ 1163239 312853 -770896 -804594 -1587752 -1039166 -796351 -1909583 -897977 -814822
2629h14822L88464J36483n29898J40125M0384q41314Q12111o16642J32993Q33201
$$ -814822 -426358 -289875 -819773 -679648 -639264 -1480578 -668467 -1285109 -1152116 -318915
2619c18915K56225L85041j642190r3516J450313j097331m83673j18306R72978
$$ -318915 -62690 322351 -1319839 -1413355 36958 -1060373 -1544046 -1662352 -689374
2610f89374o7410q97683j4877O20636J833457j494582l66145M74933P61487m31899
$$ -689374 -756784 -1654467 -1669344 -1048708 784749 -709833 -1075978 -601045 160442 -271457
2600b71457N56199K53483j304999j245033k67102q2417J391319J05197O0360Q47241
$$ -271457 284742 538225 -766774 -2011807 -2278909 -2361326 -970007 -864810 -804450 42791
2590D2791o88101N18193r53675M8004K79777O44337j003611o84849J029482k41138
$$ 42791 -645310 -127117 -1080792 -1032788 -753011 -108674 -1112285 -1797134 -767652 -1008790
2580a008790J419552o2162k82682o92761L24476M29230N57662n93345q1016j62725
$$ -1008790 410762 348600 65918 -626843 -302367 126863 684525 91180 10164 -152561
2570a52561M40905Q80023l0818k10172m74690J41315K11934o35297O30820l54013
$$ -152561 288344 1168367 1137549 927377 452687 594002 805936 170639 801459 447446
2560D47446p71473L16719m32452j181999K10584Q05565J484846j27259n22666
$$ 447446 -324027 -7308 -439760 -1621759 -1411175 -605610 879236 751977 229311
2551B29311L34889n96878p2619q2575K47609j273418k46535k98433n7973J072396
$$ 229311 564200 -32678 -105297 -187872 59737 -1213681 -1460216 -1758649 -1816622 -744226
2541g44226M73755j545059K75185M12748J040261L8335P14845J32619k81436p40571
$$ -744226 -270471 -1815530 -1540345 -1127597 -87336 -49001 665844 798463 517027 -223544
2531b23544j526047P93541L63457J112901j33184J09375J80057m83336l7478K78872
$$ -223544 -1749591 -956050 -592593 520308 387124 496499 676556 193220 155742 434614
2521D34614K29819k84723o6052p10338l02776O15726j15285L4874K44081o34977
$$ 434614 664433 379710 313658 -396680 -699456 -83730 -199015 -164141 79940 -555037
2511e55037J17688K98582j23045J67350O09704n90425m10594j140529R7739P57614
$$ -555037 -437349 -138767 -261812 -94462 515242 -75183 -485777 -1626306 -1528567 -770953
2501g70953r96126N47360M91080p79906J082298K07074J67884R84576n38247q40721
$$ -770953 -1767079 -1219719 -728639 -1508545 -426247 -219173 -51289 933287 395040 -445681
2491d45681r1546Q358J573994o40823n96210m02605o9946J35382N59435L36031
$$ -445681 -537227 -528869 1045125 404302 -191908 -594513 -664459 -529077 30358 366389
2481C66389k02267o77592m39452k73519M7170J467133N8218l06467K60221k46960
$$ 366389 164122 -513470 -952922 -1226441 -1179271 287862 346080 39613 299834 52874
2471E2874j110196J576557o27222m88708K83422l12904n18904L50917K084293
$$ 52874 -1057322 519235 -107987 -596695 -313273 -626177 -1145081 -794164 1290129
2462A290129m50912K37834q96217j83486P84713P88501q39700o28489O06263N31390
$$ 1290129 839217 1077051 180834 -2652 782061 1570562 730862 102373 708636 1240026
2452A240026P43346n50944m82952l7205m63375k99462r22846Q00554J198508N0801
$$ 1240026 1983372 1432428 949476 912271 448896 149434 -773412 27142 1225650 1276451
2442A276451m51377q14156J584235l01328q40007J6130L63165j542987o1258R44093
$$ 1276451 825074 10918 1595153 1293825 453818 469948 833113 -709874 -771132 172961
2432A72961J31156J161258J204267p88843j475379P94939M49216o13978N61542
$$ 172961 304117 1465375 2669642 1880799 405420 1200359 1649575 1035597 1597139
2423A597139O90148n33147n85419M73957j91215l91574n0835n5098N46071K80750
$$ 1597139 2287287 1754140 1168721 1642678 1451463 1059889 1009054 953956 1500027 1780777
2413A780777p42550k04924m48521J104374m28834J424178R32214k015137O35462
$$ 1780777 1038227 833303 384782 1489156 1060322 2484500 3416714 1401577 2037039
2404B037039k83232P92205R48611M21456j567582L12436O02776j240367N18964
$$ 2037039 1753807 2546012 3494623 3916079 2348497 2660933 3263709 2023342 2542306
2395B542306L75483L0953r5726J057821j75663o40291n97884K8127Q46333P92250
$$ 2542306 2917789 2948742 2853016 3910837 3735174 3094883 2496999 2525126 3371459 4163709
2385D163709J36286p37981J08501q6861p73728J169408J956075n20771j333758
$$ 4163709 4299995 3562014 3670515 3583654 2809926 3979334 5935409 5414638 4080880
2376D080880p92945Q31778K167300j105898j7486K68202j384519K697230J657495
$$ 4080880 3287935 4119713 6287013 5181115 5163629 5431831 4047312 6744542 8402037
2367H402037k453126J352027m04912L22049M93948J60274J785532J194078j313766
$$ 8402037 5948911 7300938 6896026 7218075 7712023 7872297 9657829 10851907 9538141
2358I538141r9654o86321P0052Q34315J563240R60103k9184K15140J132457k65411
$$ 9538141 9438487 8752166 8822218 9656533 11219773 12179876 12150692 12365832 13498289 13232878
2348A3232878o4566Q18198j184416M11513J333379K34442R67578N94371l83634
$$ 13232878 13168312 13986510 12802094 13213607 14546986 14781428 15749006 16343377 15959743
2339A5959743J051923P35368q1020J023413J576384O4652Q5759Q95338J692906
$$ 15959743 17011666 17747034 17666014 18689427 20265811 20330463 20416222 21311560 23004466
2330B3004466J176777J783827O17149Q24904K133405J464246J048503K706695
$$ 23004466 24181243 25965070 26582219 27407123 29540528 31004774 32053277 34759972
2322C4759972K714070L746509K953915L074607M220697L995330L914993M623038
$$ 34759972 37474042 41220551 44174466 47249073 51469770 55465100 59380093 64003131
2314F4003131N533338P162806Q980749J1591428J1837941J6520407J8533609K3606675
$$ 64003131 69536469 76699275 85680024 97271452 109109393 125629800 144163409 167770084
2306A67770084K4496289K4006682J0454294j0079378k7796998l1413050k8799198
$$ 167770084 192266373 216273055 226727349 216647971 188850973 157437923 128638725
2299A28638725k1182037j6845452j4579157r917979j0136333o397291n681703
$$ 128638725 107456688 90611236 76032079 66114100 55977767 49580476 43898773
2292D3898773k748846m336966k629008q08551k592837k381535j479345j675280
$$ 43898773 41149927 36812961 34183953 33375402 30782565 28401030 26921685 25246405
2284B5246405k940141k020128l045818j344194n44410j104534q32783o35944K1395
$$ 25246405 22306264 20286136 17240318 15896124 15351714 14247180 13414397 12778453 12799848
2275A2799848j034958j066622n82350q25601l94304j202334p38453Q69792l58062
$$ 12799848 11764890 10698268 10115918 9290317 8896013 7693679 6955226 7825018 7466956
2266G466956J685680J45968k225789J42989j29053r2459o16001j012800O98825
$$ 7466956 9152636 9298604 7072815 7215804 7086751 6994292 6378291 5365491 6064316
2257F064316l70781j995752J444989N42702j122492p61453O11030k74589j015979
$$ 6064316 5693535 3697783 5142772 5685474 4562982 3801529 4412559 4137970 3121991
2248C121991n1209L88548O28882j109022J434576K97587k81408q28613N36300
$$ 3121991 3070782 3459330 4088212 2979190 4413766 4711353 4429945 3601332 4137632
2239D137632Q41155r86777j360849P41844n46975j494638J006864o50070m52928
$$ 4137632 4978787 3992010 2631161 3373005 2826030 1331392 2338256 1688186 1235258
2230A235258J564992o93751o0432O96727M0112n71367k37108L71405j09876j07159
$$ 1235258 2800250 2106499 2046067 2742794 2782906 2211539 1974431 2345836 2235960 2128801
2220B128801j48027L00732n89609m36911J368528P71297M86751j948989j158104
$$ 2128801 1980774 2281506 1691897 1254986 2623514 3394811 3881562 1932573 774469
2211G74469j88962Q93423R37625J21429j009867r95454K92148O50418l94532k31363
$$ 774469 585507 1478930 2416555 2537984 1528117 532663 824811 1475229 1080697 849334
2201H49334N77151j18956r99761K76946J59308P62148p55179J90413j38541m12005
$$ 849334 1426485 1307529 307768 584714 744022 1506170 750991 941404 802863 390858
2191C90858M4917J81039p57017O18605K66810r33448k85895J23316R75966J290900
$$ 390858 435775 616814 -140203 478402 745212 -188236 -474131 -350815 625151 1916051
2181A916051M12173n57743J6300P8725j126279K666J508344o76143l83367r22486
$$ 1916051 2328224 1770481 1786781 1865506 739227 741893 2250237 1574094 1190727 268241
2171B68241J26373P97649L55105k09072j506579L02171K61996M54696j606358
$$ 268241 394614 1192263 1547368 1338296 -168283 133888 395884 850580 -755778
2162g55778p42195R07123j57605k86566N4598L94736l7183L56657j035771j71394
$$ -755778 -1497973 -590850 -748455 -1035021 -980423 -585687 -622870 -266213 -1301984 -1473378
2152a473378K01273m75106O10786L74087j12667Q82917l85261k23696R55921M64171
$$ -1473378 -1272105 -1747211 -1136425 -762338 -875005 7912 -377349 -601045 354876 819047
2142H19047r35075l9855q45780K24217J73232L49948j37150J288057J4080j218859
$$ 819047 -116028 -155883 -1001663 -777446 -604214 -254266 -391416 896641 910721 -308138
2132c08138L71955o79052l65558J070333o6464r61971Q24061R55687o63401j151032
$$ -308138 63817 -615235 -980793 89540 23076 -938895 -114834 840853 177452 -973580
2122i73580o53167R99560l97258J649399n45653J92619j478789q44110J593513
$$ -973580 -1626747 -627187 -1024445 624954 79301 271920 -1206869 -2050979 -457466
2113d57466o33554J033534N7915q82780N32486j85275j84411P1222J018772j56605
$$ -457466 -1091020 -57486 429 -882351 -349865 -535140 -719551 -648329 370443 213838
2103B13838p98333K74521Q01836k62184O38326O02110j321351r11082J377047
$$ 213838 -584495 -309974 491862 229678 868004 1470114 148763 -762319 614728
2094F14728M75188r51201O46999M7818j108747k52411P99254P51652R0521Q82757
$$ 614728 1089916 138715 785714 833532 -275215 -527626 271628 1023280 1113801 1996558
2084A996558j904100j560886l69715r75908J787149R16293M52701Q04631r70109
$$ 1996558 92458 -1468428 -1838143 -2814051 -1026902 -110609 342092 1146723 176614
2075A76614o29354J063783j23713K99263j450256j23544N04567n6969p35346k44188
$$ 176614 -452740 611043 487330 786593 -663663 -787207 -282640 -339609 -1074955 -1319143
2065a319143O0068P00458l45556M7330P04637N36468K80579N428p93469o45089
$$ -1319143 -1259075 -558617 -904173 -856843 -152206 384262 664841 670269 -123200 -768289
2055g68289J58516R3960N13518O61727j773141Q62278P82284N41446l59093j161593
$$ -768289 -609773 -515813 -2295 659432 -1113709 -251431 530853 1072299 713206 -448387
2045d48387k65165N67353o20939o72515J162444K38088K7732M34298R50429K22406
$$ -448387 -713552 -146199 -767138 -1439653 -277209 -39121 -11389 422909 1373338 1595744
2035A595744N68991r86430k25449p80064O51270p93198j150998n69445J360918
$$ 1595744 2164735 1178305 952856 172792 824062 30864 -1120134 -1689579 -328661
2026c28661o28195j16460J085472j190989N20847J23158l47499R23515Q81682
$$ -328661 -956856 -1073316 12156 -1178833 -657986 -534828 -882327 41188 922870
2017I22870r97629j029725j033138M39362K24877J112272Q44891o31217J431086
$$ 922870 -74759 -1104484 -2137622 -1698260 -1473383 -361111 483780 -147437 1283649
2008A283649j716610j176605P31850k79824n94057L19245J081589J852592p45578
$$ 1283649 -432961 -1609566 -877716 -1157540 -1751597 -1432352 -350763 1501829 756251
1999G56251j457832p86527O72341J772216p72797r40961n34499K01583l99752
$$ 756251 -701581 -1488108 -815767 956449 183652 -757309 -1291808 -1090225 -1489977
1990a489977p3320N01999P52791o92086J39101k95716j45723P8800j25659M85909
$$ -1489977 -1563297 -1061298 -308507 -1000593 -861492 -1157208 -1302931 -1224131 -1349790 -863881
1980h63881O9363m6877P29442k74502p1522k48410p88821l5811J347388M50335
$$ -863881 -794518 -841395 -111953 -386455 -457977 -706387 -1495208 -1531019 -183631 266704
1970B66704j093035j466178M33946k13169J433208J007071J106165l41204q72698
$$ 266704 -826331 -2292509 -1858563 -2071732 -638524 368547 1474712 1133508 260810
1961B60810q72489J095141o66187j191615k71646l2548m88919Q58512M4156n7368
$$ 260810 -611679 483462 -182725 -1374340 -1645986 -1678534 -2167453 -1308941 -1264785 -1322153
1951a322153m03122q70311k50215J649304N16617j215392P14712Q76027m33836
$$ -1322153 -1725275 -2595586 -2845801 -1196497 -679880 -1895272 -1180560 -304533 -738369
1942g38369l18813k4588Q4712R67664j252598q15466R58000J143088k2346J269660
$$ -738369 -1057182 -1081770 -997058 -29394 -1281992 -2097458 -1139458 3630 -18716 1250944
1932A250944k67555J10618j029817o0892q97162M80081K24538o46634o37790l03268
$$ 1250944 983389 1094007 64190 3298 -893864 -413783 -189245 -835879 -1473669 -1776937
1922a776937J533276l77266k31680J713946l46913j531845n64256R49244k54467
$$ -1776937 -243661 -620927 -852607 861339 514426 -1017419 -1581675 -632431 -886898
1913h86898n43036J430633j50877j643286M47010j68178O44878J88864j647891
$$ -886898 -1429934 699 -150178 -1793464 -1346454 -1514632 -869754 -680890 -2328781
1904b328781Q6213K20947o43706M71070N36346k48875k1101K50453M35015R03180
$$ -2328781 -2242568 -2021621 -2665327 -2194257 -1657911 -1906786 -1927887 -1677434 -1242419 -339239
1894c39239r34568L40379k19774r94453j528212J093344J418419P37213j251725
$$ -339239 -1273807 -933428 -1153202 -2147655 -3675867 -2582523 -1164104 -426891 -1678616
1885a678616R0049P90993J038401l25136m16106p10084p0116J050721L47054l6639
$$ -1678616 -1588567 -797574 240827 -84309 -500415 -1210499 -1280615 -229894 117160 80521
1875H0521k42874j167161m04956O60317J080052j144946L35117O89988M09142
$$ 80521 -162353 -1329514 -1734470 -1074153 5899 -1139047 -803930 -113942 295200
1866B95200l05234o01518O67658q64156m37164P55229K52008J1458q7069P08336
$$ 295200 -10034 -611552 56106 -808050 -1245214 -489985 -237977 -226519 -313588 394748
1856C94748j89882n03262R31302k17476j841457k72368J617861N28476l35497
$$ 394748 204866 -298396 632906 415430 -1426027 -1698395 -80534 447942 112445
1847A12445K24407L76852j513415o24250m17682J077764J519899K97412j446023
$$ 112445 336852 713704 -799711 -1423961 -1841643 -763879 756020 1053432 -392591
1838c92591m54385R15704P19487j124610K27555j09847K29654q221m75129J44565
$$ -392591 -846976 68728 788215 -336395 -108840 -218687 10967 2746 -472383 -327818
1828c27818K19244o26064N43165m09675k600081Q7335J313757J243597J065946
$$ -327818 -108574 -734638 -191473 -601148 -3201229 -3113894 -1800137 -556540 509406
1819E09406j342965l78114K12548Q4918L67785P04666j176417J519894j020499
$$ 509406 -833559 -1211673 -999125 -914207 -546422 158244 -1018173 501721 -518778
1810e18778N80208r08447R3301r96868J430468O00318k75987J451871n57834j360565
$$ -518778 61430 -847017 -753716 -1750584 -320116 280202 4215 1456086 898252 -462313
1800d62313M38692O79733n81669j31390J19110l13211o25877J41026J76370P03138
$$ -462313 -23621 656112 74443 -56947 62163 -251048 -876925 -735899 -559529 143609
1790A43609r08296q49858J500839J624802p48250j029323k230464o40484J471026
$$ 143609 -764687 -1614545 -113706 1511096 762846 -266477 -2496941 -3137425 -1666399
1781a666399N74545M22525l5228j135536R74768J379249j44292l55405k04916
$$ -1666399 -1091854 -669329 -704557 -1840093 -865325 513924 369632 14227 -190689
1772a90689R3599l91824k14034M48757L39584j099370o42397J418378N02412K47049
$$ -190689 -97090 -488914 -702948 -254191 85393 -1013977 -1656374 -237996 264416 511465
$$ [...]
##END NTUPLES=NMR SPECTRUM
##END=
