##TITLE=1H_CG-1198-x1
 CDCl3+DMSO
 8 sc, 
 10.4.2024
##JCAMPDX= 6.0         $$ Bruker NMR JCAMP-DX V2.0
##DATA TYPE= NMR SPECTRUM
##DATA CLASS= NTUPLES
##ORIGIN= UXNMR, Bruker Analytische Messtechnik GmbH
##OWNER= root
$$ XWIN-NMR		Version 3.5
$$ Wed Apr 10 14:04:38 2024 Russian Standard Time (UT+4h)  she@DPX200
##.OBSERVE FREQUENCY= 200.1309
##.OBSERVE NUCLEUS= ^1H
##.ACQUISITION MODE= SIMULTANEOUS
##.ACQUISITION SCHEME= undefined
##.AVERAGES= 8
##.DIGITISER RES= 18
##SPECTROMETER/DATA SYSTEM= spect
##.PULSE SEQUENCE= zg30
##.SOLVENT NAME= CDCl3
##.SHIFT REFERENCE= (INTERNAL, CDCl3, 0, 15.4803)
##AUDIT TRAIL= $$ (NUMBER, WHEN, WHO, WHERE, WHAT)
$$ ##TITLE= Audit trail, XWIN-NMR		Version 3.5
$$ ##JCAMPDX= 5.01
$$ ##ORIGIN= Bruker BioSpin GmbH
$$ ##OWNER= she
$$ F:/spectra/data/she/nmr/H-F/1/pdata/1/auditp.txt
$$ ##AUDIT TRAIL=  $$ (NUMBER, WHEN, WHO, WHERE, WHAT)
(   1,<2024-04-10 14:03:28.21 +0400>,<she>,<DPX200>,
      <created by zg, POWCHK disabled, PULCHK disabled
       configuration hash MD5:
       00 E9 B6 7A A2 85 ED C7 34 08 36 98 17 FE 4E 26
       data hash MD5: 16K
       FE A2 63 C9 2B 64 3B F9 E0 21 D0 79 1F EE 24 93>)
(   2,<2024-04-10 14:03:31.40 +0400>,<she>,<DPX200>,
      <Start of raw data processing
       efp BC_mod = 2 LB = 0.24 FT_mod = 6 PKNL = 1 PHC0 = -25300.94 PHC1 = 12.18731 SI = 16K 
       data hash MD5: 16K
       4B 3E 7C 18 2F 02 0E ED 2E 32 36 94 47 A7 CA D7>)
(   3,<2024-04-10 14:03:48.48 +0400>,<she>,<DPX200>,
      <pk PHC0 = -1.388155 PHC1 = 3.2 
       data hash MD5: 16K
       F5 8E 40 2B 24 10 C9 0B 47 10 83 06 18 48 FE D9>)
(   4,<2024-04-10 14:03:56.78 +0400>,<she>,<DPX200>,
      <abs ABSG = 5 
       data hash MD5: 16K
       B5 5A AC C7 05 63 9D 70 09 57 F2 B8 4F 7F F3 9D>)
$$ ##END=
$$ 
$$ hash MD5
$$ 82 95 ED F6 C3 E6 7E D1 55 2B 1D F3 06 27 C8 0F
##$RELAX= 
##$RELAX= 
##$RELAX= 
##$RELAX= 
##$RELAX= 
##$RELAX= 
$$ Bruker specific parameters
$$ --------------------------
##$DU= <F:/spectra>
##$EXPNO= 1
##$NAME= <H-F>
##$PROCNO= 1
##$TYPE= <nmr>
##$USER= <she>
##$AMP= (0..31)
100 100 100 100 100 100 100 100 100 100 100 100 100 100 100 100 100 100 
100 100 100 100 100 100 100 100 100 100 100 100 100 100 
##$AQSEQ= 0
##$AQ_mod= 1
##$AUNM= <au_zg>
##$AUTOPOS= <>
##$BF1= 200.13
##$BF2= 200.13
##$BF3= 200.13
##$BF4= 200.13
##$BF5= 200.13
##$BF6= 200.13
##$BF7= 200.13
##$BF8= 200.13
##$BYTORDA= 1
##$CFDGTYP= 0
##$CFRGTYP= 5
##$CHEMSTR= <none>
##$CNST= (0..31)
1 1 145 1 1 1 1 1 1 1 1 1 1 1 1 1 1 1 1 1 1 1 1 1 1 1 1 1 1 1 1 1 
##$CPDPRG= <>
##$CPDPRG1= <>
##$CPDPRG2= <>
##$CPDPRG3= <>
##$CPDPRG4= <mlev>
##$CPDPRG5= <mlev>
##$CPDPRG6= <mlev>
##$CPDPRG7= <mlev>
##$CPDPRG8= <mlev>
##$CPDPRGB= <>
##$CPDPRGT= <>
##$D= (0..31)
0 1.2 0 0 0 0 0 0 0 0.06 0 0.03 0 0 0 0 0.0002 0 0 0 0 0 0 0 0 0 0 0 0 
0 0 0 
##$DATE= 1712743407
##$DBL= (0..7)
120 120 120 120 120 120 120 120 
##$DBP= (0..7)
150 150 150 150 150 150 150 150 
##$DBP07= 0
##$DBPNAM0= <>
##$DBPNAM1= <>
##$DBPNAM2= <>
##$DBPNAM3= <>
##$DBPNAM4= <>
$$ [...]
##$SUBNAM3= <"">
##$SUBNAM4= <"">
##$SUBNAM5= <"">
##$SUBNAM6= <"">
##$SUBNAM7= <"">
##$SUBNAM8= <"">
##$SUBNAM9= <"">
##$SW= 18.0517689322627
##$SWIBOX= (0..15)
0 0 2 0 0 0 0 0 0 0 0 0 0 0 0 0 
##$SW_h= 3612.71676300578
##$TD= 16384
##$TD0= 1
##$TE= 0
##$TE2= 300
##$TE3= 300
##$TEG= 300
##$TL= (0..7)
0 120 120 120 120 120 120 120 
##$TP= (0..7)
150 150 150 150 150 150 150 150 
##$TP07= 0
##$TPNAME0= <>
##$TPNAME1= <>
##$TPNAME2= <>
##$TPNAME3= <>
##$TPNAME4= <>
##$TPNAME5= <>
##$TPNAME6= <>
##$TPNAME7= <>
##$TPOAL= (0..7)
0.5 0.5 0.5 0.5 0.5 0.5 0.5 0.5 
##$TPOFFS= (0..7)
0 0 0 0 0 0 0 0 
##$TUNHIN= 0
##$TUNHOUT= 0
##$TUNXOUT= 0
##$USERA1= <user>
##$USERA2= <user>
##$USERA3= <user>
##$USERA4= <user>
##$USERA5= <user>
##$V9= 5
##$VALIST= <valist>
##$VCLIST= <CCCCCCCCCCCCCCC>
##$VD= 0
##$VDLIST= <DDDDDDDDDDDDDDD>
##$VPLIST= <PPPPPPPPPPPPPPP>
##$VTLIST= <TTTTTTTTTTTTTTT>
##$WBST= 1024
##$WBSW= 4
##$XGAIN= (0..3)
0 0 0 0 
##$XL= 0
##$YL= 0
##$YMAX_a= 120497
##$YMIN_a= -132253
##$ZGOPTNS= <>
##$ZL1= 120
##$ZL2= 120
##$ZL3= 120
##$ZL4= 120
##$ABSF1= 15.52987
##$ABSF2= -2.522016
##$ABSG= 5
##$ABSL= 3
##$ALPHA= 0
##$AQORDER= 0
##$ASSFAC= 0
##$ASSFACI= 0
##$ASSFACX= 0
##$ASSWID= 0
##$AUNMP= <proc_1d>
##$AZFE= 0.1
##$AZFW= 0.1
##$BCFW= 0
##$BC_mod= 2
##$BYTORDP= 0
##$COROFFS= 0
##$CY= -3
##$DATMOD= 1
##$DC= 0
##$DFILT= <>
##$DTYPP= 0
##$F1P= 0
##$F2P= 0
##$FCOR= 1
##$FTSIZE= 16384
##$FT_mod= 6
##$GAMMA= 0
##$GB= 0
##$INTBC= 1
##$INTSCL= 3.70164e-10
##$ISEN= 128
##$LB= 0.24
##$LEV0= 0
##$LPBIN= 0
##$MAXI= 10000
##$MC2= 0
##$MEAN= 0
##$ME_mod= 0
##$MI= 1.114404
##$NCOEF= 0
##$NC_proc= -9
##$NLEV= 6
##$NOISF1= 3.799351
##$NOISF2= 2.8
##$NSP= 0
##$NTH_PI= 0
##$NZP= 0
##$OFFSET= 15.48028
##$PC= 1
##$PHC0= -25302.33
##$PHC1= 15.38731
##$PH_mod= 1
##$PKNL= yes
##$PPARMOD= 0
##$PSCAL= 0
##$PSIGN= 0
##$REVERSE= no
##$SF= 200.129608294904
##$SI= 16384
##$SIGF1= 3
##$SIGF2= 2
##$SINO= 5.538805
##$SIOLD= 16384
##$SREGLST= <1H.CDCl3>
##$SSB= 0
##$STSI= 16384
##$STSR= 0
##$SW_p= 3612.71676300577
##$SYMM= 0
##$S_DEV= 0
##$TDeff= 16384
##$TDoff= 0
##$TI= <>
##$TILT= no
##$TM1= 0
##$TM2= 0
##$TOPLEV= 0
##$USERP1= <user>
##$USERP2= <user>
##$USERP3= <user>
##$USERP4= <user>
##$USERP5= <user>
##$WDW= 1
##$XDIM= 16384
##$YMAX_p= 511883243
##$YMIN_p= -8115110
$$ End of Bruker specific parameters
$$ ---------------------------------
##NTUPLES= NMR SPECTRUM
##VAR_NAME=  FREQUENCY,     SPECTRUM/REAL,   SPECTRUM/IMAG
##SYMBOL=    X,             R,               I
##VAR_TYPE=  INDEPENDENT,   DEPENDENT,       DEPENDENT
##VAR_FORM=  AFFN,          ASDF,            ASDF
##VAR_DIM=   16384,         16384,           16384
##UNITS=     HZ,            ARBITRARY UNITS, ARBITRARY UNITS
##FACTOR=    0.220516191357247, 1,           1
##FIRST=     3098.06235718246, 0,            0
##LAST=      -514.65440582331, 0,            0
##MIN=       -514.65440582331, -8115110,     0
##MAX=       3098.06235718246, 511883243,    0
$$ Real data points
##PAGE= N=1
##DATA TABLE= (X++(R..R)), XYDATA
$$ [...]
7198b2161J715297r36048p35142Q67478N81079q43319j51152M39627P11720J65204
7188A792583P1205N57766j557590m27919k1607k42408K69558L18294k53162o16625
7178a09905N6048M77695j08809m32048L19777j41262M4361M82826M83763l90910
7168F81536r9953o51147J91867q6500J132835j029703j06384O85613p02013r25244
7158i09093J021777J024482k56525j061824l99719K88796M39448L85040l99365
7149A33017J12959P15295k8895j91319o54064m82876L33914j47329Q4042k8613
7139a53869L71398Q45760L833l95562R01944l20509q43695L86794O1957j127692
7129b69641J055066M96835l49975l13264m81618R18540r85949m76059J458739
$$ plain form
7198 -22161 1693136 757088 21946 889424 1470503 627184 476032 915659 1627379 1792583
7188 1792583 1863788 2421554 863964 436045 414438 172030 441588 759882 506720 -109905
7178 -109905 -53857 423838 315029 -117019 202758 61496 105857 588683 1072446 681536
7168 681536 581583 -69564 122303 35803 1168638 138935 32551 718164 16151 -909093
7158 -909093 112684 1137166 880641 -181183 -580902 -292106 147342 532382 133017
7149 133017 245976 961271 932376 741057 86993 -395883 -61969 -209298 -125256 -153869
7139 -153869 217529 1063289 1067122 671560 1573504 1252995 409300 796094 858051 -269641
7129 -269641 785425 1282260 932285 619021 137403 1055943 69994 -406065 1052674
7120A052674L26660n15325o09428k7534O6696L7818L95785k8538q86456n06219
7110f93867p2923J109374n90888R56212q3394j183598J43644K26174n9180O44218
7100C95772r98072P1772J631738O38607n43318j439532j86355q15883P68567K062862
7090A586158M43673q2094K07502L275K79938m53685n22646J379600P30646j607870
7080A964497m47361N22434p77949q5273J105897K35979l40172J63303m87819r90506
7070H63030q31824m73403N15356K22230o6572Q85149Q10899K61856p18521m38735
7060A029465O17723k98006m85706p06682R12922O2190p27830K86030l23763J870366
7050B236709q09194q9146M06013k71935p41488O09131P1074L38333j297770k03524
$$ plain form
7120 1052674 1379334 864009 254581 227047 293743 331561 727346 698808 -187648 -693867
7110 -693867 -766790 342584 -248304 707908 624514 -559084 -415440 -189266 -248446 395772
7100 395772 -602300 -530528 1101210 1739817 1196499 -243033 -429388 -1245271 -476704 1586158
7090 1586158 2029831 1947737 2155239 2158514 2438452 1984767 1462121 2841721 3572367 1964497
7080 1964497 1517136 2039570 1261621 1176348 2282245 2518224 2178052 2341355 1853536 863030
7070 863030 31206 -442197 73159 295389 228817 1113966 1924865 2186721 1468200 1029465
7060 1029465 1647188 1349182 863476 156794 1069716 1131906 404076 690106 366343 2236709
7050 2236709 1427515 1338369 1744382 1472447 730959 1340090 1411164 1749497 451727 248203
7040B48203R71755q34756K63717j81619r373j025710Q53661j95720O73808J8947
7030G82913P31262l31420o11346L54130R54254n55366l2389Q8763n28666m4166
7020H07969o704J76709k73483M08485j8247n22138R12815K172410r29787j080413
7010A647616l62609J182Q8296p07919P5747O84903k1500P78029n38954k7522J068824
6999B686093k34596j249966n65716M69013J73745m27815P1300l56797k47759J298214
6989A615716N34723p74533q62590o2566J92497J8883l52875M12743j09948M57111
6979A069161P09289m71394j00655j9224K61269n58048j18517K43296m13519Q96472
6969A498130O3906R6222p66944q6641M76138n28277J94148K59701m7493J129394
$$ plain form
7040 248203 1219958 385202 648919 467300 457927 -567783 285878 90158 763966 782913
7030 782913 1514175 1182755 571409 925539 1879793 1324427 1292038 1380801 852135 807969
7020 807969 801265 977974 704491 1112976 1094729 572591 1485406 3657816 2728029 1647616
7010 1647616 1285007 1286189 1374485 666566 742313 1427216 1405716 2183745 1644791 1617269 2686093
6999 2686093 2451497 1201531 635815 1104828 1278573 850758 922058 565261 317502 1615716
6989 1615716 2150439 1375906 513316 450750 643247 662130 309255 721998 612050 1069161
6979 1069161 1778450 1307056 1206401 1187177 1448446 890398 771881 1015177 601658 1498130
6969 1498130 1562036 1658258 891314 804673 1280811 752534 946682 1206383 1158890 2288284
6959B288284k72137j418134P3109O42463n63689Q70265M82437M59081n56380j98027
6949A807272p28065l5369L30200K31210o43162n5062l6122k26003L9007M59586
6939A143492P95301J86023o13064R46753L73692q88937O74741N3218J34695j552852
6929A253062J7760p9908M44156L53397l45265m24277P17307m32988N36698M90937
6919B530879j37022o06182L80096K28385k32647o32975K23470J06659R74636j53427
6909B681872m5506o39358m61141O51492n06594p52313K22538Q0677j10338L88940
6899A510269j43930J17221j61240l11061k86797M42660M00520R53236n55851k25458
6889A739569K70158o23910O8386L27986j07510N0494J56303j39890p6524R07179
$$ plain form
6959 2288284 2016147 598013 671122 1313585 749896 1620161 2102598 2561679 2005299 1807272
6949 1807272 1079207 1043838 1374038 1605248 962086 907024 870902 644899 683906 1143492
6939 1143492 1938793 2124816 1511752 2458505 2832197 1943260 2618001 2671219 2805914 1253062
6929 1253062 1270822 1190914 1635070 1988467 1643202 1218925 1936232 1503244 2039942 2530879
6919 2530879 2393857 1787675 2167771 2396156 2163509 1530534 1754004 1860663 2835299 2681872
6909 2681872 2636366 1997008 1535867 2187359 1680765 928452 1150990 1231667 1121329 1510269
6899 1510269 1366339 1483560 1322320 1011259 724462 1167122 1567642 2520878 1965027 1739569
6889 1739569 2009727 1385817 1454203 1782189 1674679 1725173 1881476 1741586 1665062 2572241
6879B572241J88034j56405K65242m35288m66488j11840N55907J05857r7084M01318
6869B821494j87261r2086P45252N8023q16663q14579l43355k16427J38723j76121
6859A117000m27635M91233J900410q27108k83500J121728l75014K086m18715k91283
6849B009202o24781M99029J125132J380472k03681p15908j359881K73336J09465
6840B492385j80896l15287r54598N90715Q66688o0982o04919M34635N63617m45003
6830B386355J90038k81707N12084n02513r4865J48387O31913M194p65749l76073
6820A852064m81326J06393O45290O97993j75574l56K06667n34793j63595q95717
6810A257046k79890M74437J00818N11038J095643q09538p64641J390965j66664
$$ plain form
6879 2572241 2760275 2603870 2869112 2433824 1967336 1855496 2411403 2517260 2420176 2821494
6869 2821494 2634233 2542147 3287399 3345422 2528759 1714180 1370825 1154398 1293121 1117000
6859 1117000 689365 1180598 3081008 2253900 1970400 3092128 2717114 2719200 2300485 2009202
6849 2009202 1384421 1883450 3008582 4389054 4185373 3469465 2109584 2382920 2492385
6840 2492385 2311489 1996202 1041604 1632319 2499007 2438025 1833106 2267741 2831358 2386355
6830 2386355 2576393 2294686 2806770 2304257 2209392 2357779 2989692 2993886 2228137 1852064
6820 1852064 1370738 1477131 2122421 2820414 2644840 2644484 2851151 2316358 2152763 1257046
6810 1257046 977156 1451593 1552411 2063449 3159092 2349554 1584913 2975878 2809214
6801B809214r31386J55179M76200q0353K50641R54266J47786j775663j55916l1912
6791A818056Q14145k98834k40483k26177K3895l97441Q28995J42862K33511J558221
6781D256750l08818j067245L6407j76321N72327o88418m46537J004188O94733
6772C877066q03846m77549J106277K3086o99155K60214r4529l71469k64601k13538
6762B341956Q63544P05844Q05837j180958j45579N88503l62099j336550O00871
6753B881369J320971l02358k18967m00153N19390P49700M34965p47986m04590
6744C832341P67872l9094p11889k90345M39747m9130J37143R08214l53556p67717
6734C873586P3042M06643O7454P30621j78928j84777j82801r71766L00145P06458
$$ plain form
6801 2809214 1877828 2033007 2509207 2428854 2679495 3633761 3781547 2005884 1849968 1818056
6791 1818056 2632201 2333367 2092884 1866707 1890602 1493161 2322156 2465018 2698529 4256750
6781 4256750 3947932 2880687 2917094 2740773 3313100 2624682 2178145 3182333 3877066
6772 3877066 3073220 2595671 3701948 3725034 3025879 3286093 3191564 2820095 2555494 2341956
6762 2341956 3205500 3911344 4717181 3536223 3390644 3979147 3617048 2280498 2881369
6753 2881369 4202340 3899982 3681015 3280862 3800252 4549952 4984917 4236931 3832341
6744 3832341 4600213 4561119 3849230 3558885 3998632 3949502 4086645 4994859 4641303 3873586
6734 3873586 3946628 4353271 4420725 5151346 4972418 4787641 4604840 3633074 3933219 4639677
6724D639677J58003m61423J42300m5622o58085m6936j24462N97370M92603r96659
6714C696766R42320o52994j29800j75226N13553Q02805q75720P43424J60844k68745
6704D757227p32723p60479L54961M76878M62525n28144R7835L98099k9919l73513
6694D122747r64358J564726k83668n82948K26433J85447K4322K32597n68374o9662
6684C887262P09021j09032L8252l40936J01518L25637r0244L73849Q29871p45157
6674D980041N95343p7834M01479J093711L06214j188477p55746K32393j80160
6665E406964k36401O84631k34589k57776K50002m20561J03975L12830K8123O11146
6655F248344K84177n80676j85807J544597m17976P62750j61449j090412P5896
$$ plain form
6724 4639677 4797680 4336257 4478557 4432935 3774850 3727914 3603452 4200822 4693425 3696766
6714 3696766 4639086 3986092 3856292 3681066 4194619 4997424 4121704 4865128 5025972 4757227
6704 4757227 4024504 3264025 3618986 4095864 4558389 4030245 4128080 4526179 4496260 4122747
6694 4122747 3158389 4723115 4439447 3856499 4082932 4268379 4292701 4525298 3956924 3887262
6684 3887262 4596283 4487251 4525503 4184567 4286085 4611722 4521478 4895327 5725198 4980041
6674 4980041 5575384 5497550 5899029 6992740 7298954 6110477 5354731 5587124 5406964
6665 5406964 5170563 5855194 5620605 5362829 5612831 5192270 5296245 5609075 5637198 6248344
6655 6248344 6532521 5951845 5766038 7310635 6892659 7655409 7493960 6403548 6479444
6646F479444p0708M61498j235323N04300R77910j70914J8072m21511P66666m58666
6636F850768n00452m35549j29895Q09441M03914n06155M43423J24451m914Q26659
6626G881691L13858N79760o54119L03139j066974j40012l7734L00133R57290k7119
6616H409913K23043n47642N00650n13016k94695O61533p9755j73852L10459N74668
6606I071306K16357O84152n84832J406233q15063k80680R03020n57408n53824
6597I489261J191826k19556L58254L54364R54225k23357O79645J221273N7032
6588A3862967O29888j098069j270313P40298K99081N04166L51023k27944k20565
6579A3570532j05617P1393P32653n06313J60348m20350L01897K144435J40265
$$ plain form
6646 6479444 6408736 6870234 5634911 6139211 7117121 6946207 6964279 6542768 7309434 6850768
6636 6850768 6350316 5914767 5784872 6594313 6998227 6492072 6935495 7059946 7055032 7881691
6626 7881691 8195549 8775309 8121190 8424329 7357355 7217343 7179609 7479742 8437032 8409913
6616 8409913 8632956 8085314 8585964 8072948 7778253 8439786 8360031 8186179 8496638 9071306
6606 9071306 9287663 9971815 9386983 10793216 9978153 9697473 10600493 10043085 9489261
6597 9489261 10681087 10461531 10819785 11174149 12128374 11905017 12584662 13805935 13862967
6588 13862967 14492855 13394786 12124473 12864771 13163852 13668018 14019041 13791097 13570532
6579 13570532 13464915 13536308 14268961 13762648 13922996 13502646 13804543 15948978 16089243
6570A6089243p02954k1073M71185L64441K00073R4647N91268p89015N51417J1542
6560A6860774Q8320N84222L38974j67737J335752M13843M17190K32666K63108
6551B0367112k5187M78395J06451j67973J86241R21054J409130N1480K7071j13959
6541B3239815N7282J449267J162530P72831K04481M17333l61193J689610J679814
6532C0311770m09253K44117l6951J655024J263843p49939Q6346J128150M47575
6523C3940682r2808J82693k78582Q16456p613J84405r03581j38865P97413k09281
6513C4290919L48553l80159m29599L85845m37017k2164M36597J28216j98525j107659
6503C3015007J75669r27650K43609N28465J94036j63970k84989R66280p03229
$$ plain form
6570 16089243 15386289 15365216 15836401 16200842 16400915 16495562 17086830 16297815 16849232 16860774
6560 16860774 16949094 17533316 17872290 17704553 19040305 19454148 19871338 20104004 20367112
6551 20367112 20341925 20820320 20926771 20758798 20945039 21866093 23275223 23326703 23353774 23239815
6541 23239815 23297097 24746364 25908894 26681725 26886206 27303539 26942346 28631956 30311770
6532 30311770 29902517 30146634 30109683 31764707 33028550 32278611 32364957 33493107 33940682
6523 33940682 33847874 34030567 33751985 34568441 34560828 34745233 33841652 33702787 34500200 34290919
6513 34290919 34639472 34259313 33829714 34215559 33778542 33756378 34192975 34321191 34122666 33015007
6503 33015007 33190676 32263026 32506635 33035100 33229136 33065166 32780177 33746457 33043228
6494C3043228m17687J034817J76962K14317O92064J0021Q78892N13979m02429
6485C5744164j56827J358447J127237n40972M09555l11915Q28271J430310m0407
6476C9847863K50912J567727K338704R08618j82412J479983N5546L97882J429946
6467D8094769J305135J32056O69060o59936Q63782O83147M05586K44844p30906
6458E1007537p58761p98890L34968m39989r83208j567602K98151J03918O7452
6449D7263576o51454j935038j463558o52129j190522J57694j652403k052891j39259
6440C7684016r13620K19540l11838j722725l51221r8699j937745l12315R54295
6431C3209688K12931j650818j890812L86872O8349J075264j200544P478l40748
$$ plain form
6494 33043228 32625541 33660358 33837320 34051637 34743701 34753722 35632614 36146593 35744164
6485 35744164 35587337 36945784 38073021 37532049 37941604 37629689 38457960 39888270 39847863
6476 39847863 40098775 41666502 44005206 44913824 44731412 46211395 46266941 46664823 48094769
6467 48094769 49399904 49531960 50201020 49541084 50404866 51088013 51493599 51738443 51007537
6458 51007537 50248776 49449886 49784854 49344865 48361657 46794055 47092206 47196124 47263576
6449 47263576 46612122 44677084 43213526 42561397 41370875 41528569 39876166 37823275 37684016
6440 37684016 36770396 36989936 36678098 34955373 34604152 34505453 32567708 32255393 33209688
6431 33209688 33422619 31771801 29880989 30267861 30336210 31411474 30210930 30218408 29877660
6422B9877660M03238N58038j23826J06703L02679O64145J144834M42528l81903
6413C2994096J32377o841M94804R63627P50560q70907K16535Q92506J414043N81007
6403C7561807M285n66888j144855P48993Q81169k58256j61695m6295p42104j55778
6393C6120383K32515Q7718j347262j860730r13677o03267P80160p61514l90645
6384C1343681k19849r54653j870059l13479l84879j055940n06589j274232l08541
6375B4455460j078576M21327Q18963l69111j617773j633873R03911j032367N2882
6366B0920843j170015r19287K90389q72235r07308N07706j045582q63689R04568
6357A6845390O52107m39585j6690Q4461m73437j99735K16103m74820j033068M00784
$$ plain form
6422 29877660 30280898 30838936 30715110 30821813 31124492 31788637 32933471 33375999 32994096
6413 32994096 33126473 33119632 33614436 34578063 35328623 34457716 34674251 35566757 36980800 37561807
6403 37561807 37566092 36999204 35854349 36603342 37484511 37226255 37064560 37018265 36276161 36120383
6393 36120383 36352898 36440616 35093354 33232624 32318947 31715680 32495840 31734326 31343681
6384 31343681 31123832 30169179 28299120 27985641 27600762 26544822 26038233 24764001 24455460
6375 24455460 23376884 23798211 24617174 24248063 22630290 20996417 21900328 20867961 20920843
6366 20920843 19750828 18831541 19121930 18249695 17342387 17850093 16804511 15940822 16845390
6357 16845390 17497497 17057912 17041222 17125683 16652246 16452511 16668614 16193794 15160726 15561510
6347A5561510K36059k72772p49414l85920m13832P90385P99918j35823m29696
6338A5000415k86691N91950n91210k33913J16029L26198q11367l57180O41661
6329A4395892l48742M94632K54341O34869K22025K73620J25884j170035K78083
6320A5160569J67544Q3501k50758o07091L14320j372779J123009M35239j072365
6311A3981189n39623R21995k75590q11572M28725N30931k03097P03553R41799
6302A5678310n01425j67211R03179k49640j08927N45513J1669L46310M28001M10609
6292A7296388o9335l35792k44472M79593p7371J01082Q48056o50411r6399K46828
6282A7498167P25998M65492p61743M34139k54856J25118J99407L15912l78256
$$ plain form
6347 15561510 15797569 15524797 14775383 14389463 13975631 14766016 15565934 15430111 15000415
6338 15000415 14713724 15305674 14714464 14480551 14596580 14922778 14111411 13754231 14395892
6329 14395892 14047150 14541782 14796123 15430992 15653017 15926637 16052521 14882486 15160569
6320 15160569 15328113 15411614 15160856 14553765 14868085 13495306 14618315 15053554 13981189
6311 13981189 13441566 14363561 14087971 13276399 13705124 14236055 14032958 14736511 15678310
6302 15678310 15176885 15009674 15912853 15663213 15554286 16099799 16111468 16457778 16885779 17296388
6292 17296388 17227053 16891261 16646789 17126382 17049011 17150093 17998149 17347738 17251339 17498167
6282 17498167 18224165 18689657 17927914 18362053 18107197 18232315 18431722 18747634 18369378
6273A8369378l51143N75328O75131J18394J78260N3347J60152N45348l21478k34910
6263A9767807P08238O68489j012448M17469J082972j9190J077431m69068L98776
6254B2620476J50399j420062K38655J167576O01980n21209Q86462n11145K56603
6245B3469735J548615J04128k26957L9810K46009L97698L5144J109491P46870
6236B7470543L23048M65236q13928J156605P05246p5747r9617R1913R75449J090407
6226C1289155O89107K89123J532082L94514P13704p1338l78798N27086O39101
6217C5623736J134152M66015L29273J306862M55411L25679k13352O14265N35221
6208D0577262P94744Q09653m65925L47516Q98036J587119n42331o39563k63941
$$ plain form
6273 18369378 18018235 18593563 19268694 19387088 19565348 19618695 19778847 20324195 20002717 19767807
6263 19767807 20476045 21144534 20132086 20549555 21632527 21613337 22690768 22221700 22620476
6254 22620476 22770875 21350813 21589468 22757044 23359024 22837815 23724277 23213132 23469735
6245 23469735 25018350 25122478 24895521 24935331 25181340 25579038 25614182 26723673 27470543
6236 27470543 27793591 28258827 27444899 28601504 29306750 29231003 29131386 29223299 30198748 31289155
6226 31289155 31978262 32267385 33799467 34193981 34907685 34836347 34457549 34984635 35623736
6217 35623736 36757888 37223903 37553176 38860038 39315449 39641128 39427776 40042041 40577262
6208 40577262 41372006 42181659 41715734 42063250 42961286 44548405 44006074 43366511 43102570
6199D3102570J605014o8648M19252P62796K09898M20770l79560N09594M74579
6190D7056265K46272N67990P79323L70623P48839J094309N93808K0008m23248
6181E1054189r6566L50768J98663J256876M88014P6709j36468l30853J58448J282542
6171E4302322L93886m64941O903Q32066L31884l479L24890j07298j98446L08641
6161E5726428O33829N76902J88623k4879J310506L96063L90652K45260j31281
6152E9312103P2296Q28921J225399k42988N53696n16953J86472R93204Q85197
6143F3297347J089043j96007R46931L41174K07936j61511l7493K16069N76340
6134F6279829r35073K38409J291264J429762L35548O09543P40663P04473K64168
$$ plain form
6199 43102570 44707584 44638936 45058188 45820984 46030882 46451652 46072092 46581686 47056265
6190 47056265 47302537 47870527 48649850 49020473 49769312 50863621 51457429 51477437 51054189
6181 51054189 50957623 51308391 51507054 52763930 53251944 53328653 53192185 52861332 53019780 54302322
6171 54302322 54696208 54231267 54238170 55070236 55402120 55398641 55723531 55616233 55417787 55726428
6161 55726428 56360257 56937159 57125782 57100903 58411409 58807472 59198124 59443384 59312103
6152 59312103 59384399 60213320 61438719 61195731 61749427 61232474 61418946 62412150 63297347
6143 63297347 64386390 64190383 65137314 65478488 65686424 65524913 65487420 65703489 66279829
6134 66279829 65344756 65583165 66874429 68304191 68639739 69249282 69989945 70694418 70958586
6125G0958586P23172R59898J272808J281175J249326P41427K20517J940336J562322
6116H0909567J098372k96071K434704J245567R72742J814987N23733J778974J380750
6107I1863325J710010J757860J595510K226717J198840K234730L451433J644263
6099A07682688K382691J474773K043176K607267K570323J647970J439088K238706
6091A24086682J184682J387650J878097K134858J581957J727757K545982L050523
6083A39578188J19908N15800J816054K439831J491556J089077Q58935J860311
6075A49769660K037490J536799J202127R97305K72547O29108J84241J487446R49799
6066A59066522O32927j343740j352938J302408m59592j819469o85679j297899
$$ plain form
6125 70958586 71681758 72641656 73914464 75195639 76444965 77186392 77406909 79347245 80909567
6116 80909567 82007939 81711868 84146572 85392139 86364881 88179868 88703601 90482575 91863325
6107 91863325 93573335 95331195 96926705 99153422 100352262 102586992 106038425 107682688
6099 107682688 110065379 111540152 113583328 116190595 118760918 120408888 121847976 124086682
6091 124086682 125271364 126659014 128537111 130671969 132253926 133981683 136527665 139578188
6083 139578188 139698096 140213896 142029950 144469781 145961337 147050414 147909349 149769660
6075 149769660 151807150 153343949 154546076 155543381 155815928 156445036 156629277 158116723 159066522
6066 159066522 159699449 158355709 157002771 158305179 157845587 156026118 155340439 154042540
6058A54042540j824330j919149k538797j627639l594984k311345k248331k104465
6050A35873500j740330k183902k959939j761699j828981j851704k630077k765405
6042A18151463k304024k562191k937210k723884k030543l101857k314670k077891
6034I8099193k574372l561340k464401j935338j767254k918740k319983k419951
6026G8137814k243901j178252j754984k305423j570640j253376k186638l77417
6018F5267183j923290k270387o69771j726628o89740J25644j471608j141250j088898
6009E4411255j457215q86655l39269q69212j021864j221929k66293j737326j089357
6000D5522135j015216L92823J27368j746929j4625r49105n06829r06678j595848
$$ plain form
6058 154042540 152218210 150299061 147760264 146132625 142537641 140226296 137977965 135873500
6050 135873500 134133170 131949268 128989329 127227630 125398649 123546945 120916868 118151463
6042 118151463 115847439 113285248 110348038 107624154 105593611 102491754 100177084 98099193
6034 98099193 95524821 91963481 89499080 87563742 85796488 82877748 80557765 78137814
6026 78137814 75893913 74715661 72960677 70655254 69084614 67831238 65644600 65267183
6018 65267183 63343893 61073506 60403735 58677107 57987367 58113011 56641403 55500153 54411255
6009 54411255 52954040 52067385 51728116 50858904 49837040 48615111 48348818 46611492 45522135
6000 45522135 44506919 44899742 45027110 43280181 43265556 42316451 41809622 40902944 39307096
5991C9307096n96384P5690q44301o79969o65789j34750j090554k86037l41868
5982C4743134j000018j11104L00203m0966j180429j765135q31058j24927k67082
5973B9722618J86165j516213Q4428M123k24988n60299n94445P0200J27367q8244
5963B7210712j584410l22882q43870K03178o62605k56473o2056o34477J09886
5954B3157003K60876k17017j01455L88852o57725n62779n54026j20650q38912
5945B0754167N17099P31416m33846k11274j66924k31488m99549M23294n02755
5936B0380140r82703m61109n8197l26126k95045R42434j39582P2958K92710j028888
5926A8396592j56357O11586o3887J83314m09048j15491q98727n42469p8579J24712
$$ plain form
5991 39307096 38710712 38786402 37942101 37262132 36596343 36461593 35371039 35085002 34743134
5982 34743134 33743116 33632012 33932215 33891249 32710820 30945685 30114627 29989700 29722618
5973 29722618 29908783 28392570 28476998 28481121 28256133 27695834 27101389 27171589 27298956 27210712
5963 27210712 25626302 25303420 24459550 24662728 24000123 23743650 23681594 23047117 23157003
5954 23157003 23417879 23200862 23099407 23488259 22830534 22267755 21713729 21593079 20754167
5945 20754167 21271266 22002682 21568836 21357562 21190638 20959150 20459601 20882895 20380140
5936 20380140 19397437 18936328 18878131 18552005 18256960 19199394 19059812 19132770 19425480 18396592
5926 18396592 18240235 18851821 18787934 18971248 18562200 18446709 17547982 17005513 16926934 17051646
5916A7051646R53840M96657M72054p7711k43022M8875p16244M99757j436893j054769
5906A5994190R83838O8810L25686L07054J04693m22502o75528j008339N48590
5897A6226492J453482O46840n83729o75962J60841m00728J68937j11212L95840
5888A7280801L03533l2853r59268k4487R7928k022j05477j74804q75901J431454
5878A6938904Q70844q57654N93098O1786n01132J63175P34580n81504k93410O03624
5868A7732311O73112J81445j3526j401337K53277K02786L82163k25404Q31011
5859A8615838R91201n34754q81964Q2878J204603K32934o30198J88853j17224
5850A9152167J58740N9909j03493K16660Q39269p17679K103M97980p38957M61977
$$ plain form
5916 17051646 18005486 18502143 18974197 18896486 18653464 18702339 17986095 18485852 17048959 15994190
5906 15994190 16978028 17046838 17372524 17679578 17784271 17361769 16686241 15677902 16226492
5897 16226492 17679974 18326814 17743085 17067123 17227964 16827236 16996173 16884961 17280801
5888 17280801 17584334 17551481 16592213 16567726 16665654 16663632 16558155 16383351 15507450 16938904
5878 16938904 17809748 16952094 17545192 17606978 17105846 17269021 18003601 17422097 17128687 17732311
5868 17732311 18405423 18586868 18573342 17172005 17425282 17628068 18010231 17784827 18615838
5859 18615838 19607039 19072285 18190321 18273199 19477802 19710736 19080538 19269391 19152167
5850 19152167 19310907 19370816 19267323 19483983 20323252 19605573 19607676 20105656 19366699 19828676
5840A9828676L51617R4319j70547L67811l29836R94067J36308O83408P21081q00344
5830B1876560J497258k70944o39587j37605P32371l26120J80538L39623K26464
5821B3478558N55483J639778M0142K71693Q22452q84856r9710K76816J82604k88148
5811B5994812J459753M51480k52887P80365K88116O55205O07294K09818N76588
5802C0770544J240274M62379K40746N09045n9997N72192L87726Q17369J393314
5793C6333592P84736j10411P81163O42402j09700M78420M20359j404534N28502
5784C8344529j12027m83629l96399n34801J93455n29219J99827l58959j188600
5775C5134177N67371J294077j87623k77781K29442j50950k19256k17521r950M62765
$$ plain form
5840 19828676 20180293 20274612 20104065 20471876 20142040 21136107 21272415 21955823 22676904 21876560
5830 21876560 23373818 23102874 22463287 22325682 23058053 22731933 22912471 23252094 23478558
5821 23478558 24034041 25673819 25713961 25985654 26808106 25923250 25823540 26100356 26282960 25994812
5811 25994812 27454565 27906045 27653158 28433523 28721639 29376844 29984138 30193956 30770544
5802 30770544 32010818 32473197 32713943 33222988 33162991 33735183 34122909 34940278 36333592
5793 36333592 37118328 37007917 37789080 38431482 38321782 38800202 39220561 37816027 38344529
5784 38344529 38232502 37748873 37352474 36817673 37011128 36481909 36681736 36322777 35134177
5775 35134177 35701548 36995625 36808002 36530221 36759663 36608713 36389457 36171936 36161986 36624751
5765C6624751R95428O62150p08768L17925N15685k18501J276968K5538j179397
5756C8311779k1412j64442J03120J86202r3012L49941P53609o1300r4318j12856
5746C9157311J175674Q94835M32695P48784l69752L78700p85041N31686p3985
5737D2090907P55168L37130m8003J096097J45902p63323J037306Q657O87401Q57759
5727D6205001J438478P03229M5879K2864l88502M83822J602034J956237N02883
5718E2571925j86732J50056J173663k19932j91660l04352O38090J031464P31281
5709E5393803O8151J667164p93916M6370K81806L1174N43345N23775J014991N25491
5699E9302154K65888p0527r87303P44903N5147Q24998L18673J79451K629N73990
$$ plain form
5765 36624751 37620179 38282329 37573561 37891486 38407171 38188670 39465638 39491176 38311779
5756 38311779 38290367 38125925 38229045 38415247 38322235 38672176 39425785 39364485 39270167 39157311
5746 39157311 40332985 41227820 41660515 42409299 42039547 42418247 41633206 42164892 42090907
5737 42090907 42846075 43183205 43135202 44231299 44377201 43613878 44651184 44659841 45347242 46205001
5727 46205001 47643479 48346708 48392587 48415451 48026949 48510771 50112805 52069042 52571925
5718 52571925 52385193 52535249 53708912 53488980 53297320 52992968 53631058 54662522 55393803
5709 55393803 55461954 57129118 56335202 56381572 56663378 56694552 57237897 57761672 58776663 59302154
5699 59302154 59568042 59497515 58510212 59255115 59310262 60135260 60453933 60633384 60636013 61210003
5689F1210003K40935R47829J297154K6886P87720P19315J044725K51257J27053
5680F6652877m08579K99999O30997J17471p67570n9118N22265J305149k14334
5671F8079157N01564R62458K55670N17841Q80954L0936J578921M47067N3248L41510
5661G3649326P55118K07958J069927J276742J15155K269996R24384l98334P09090
5652H0579362J313432J418054J455486K207408R48676J849395J187638q98817
5644I0060634J452818M81695K94053P46995J820865L3474J494413Q62024Q2124
5635I7329095K423196J612291J087310J136516K084290K289996J801109K185778
5627A11949581K562392J544362K884694L383632J148046J871664K435162K847361
$$ plain form
5689 61210003 61450938 62398767 63695921 63722807 64510527 65229842 66274567 66525824 66652877
5680 66652877 66244298 66544297 67175294 67292765 66525195 66466077 66988342 68293491 68079157
5671 68079157 68580721 69543179 69798849 70316690 71197644 71228580 72807501 73254568 73307816 73649326
5661 73649326 74404444 74612402 75682329 76959071 77074226 79344222 80268606 79870272 80579362
5652 80579362 81892794 83310848 84766334 86973742 87922418 89771813 90959451 90060634
5644 90060634 91513452 91995147 92289200 93036195 94857060 94890534 96384947 97246971 97329095
5635 97329095 99752291 101364582 102451892 103588408 105672698 107962694 109763803 111949581
5627 111949581 114511973 116056335 118941029 122324661 123472707 125344371 127779533 130626894
5619A30626894K097414J852846K177542J469002J981858O72982N82629P44110
5611A42205277J258848K041268Q15612K909661J853901Q28720J122799R22585
5603A53958671J153383K051210J397097J693017R25517r6160J292385j73727j702712
5594A60498681n20738L68092j686205j252979j649952k156378k124977j247112
5586A50228432j137153m99518j039007r96048j229056j432125o36263L12812m94324
5577A43077750k207511j331258q08833m01313q17631j738604n25959j340922k957920
5568A30947799j500750k034545j930367j067801k235965k634715k517476p57729
5560A16268451q91153k682263j880134j265660j139585m45257j154318j171351
$$ plain form
5619 130626894 132724308 134577154 136754696 138223698 140205556 140878538 141461167 142205277
5611 142205277 143464125 145505393 146321005 149230666 151084567 151913287 153036086 153958671
5603 153958671 155112054 157163264 158560361 160253378 161178895 161082735 162375120 162201393 160498681
5594 160498681 159977943 160346035 158659830 157406851 155756899 153600521 151475544 150228432
5586 150228432 149091279 148591761 147552754 146556706 145327650 143895525 143259262 143572074 143077750
5577 143077750 140870239 139538981 138730148 138328835 137511204 135772600 135246641 133905719 130947799
5568 130947799 129447049 127412504 125482137 124414336 122178371 119543656 117026180 116268451
5560 116268451 115377298 112695035 110814901 109549241 108409656 107964399 106810081 105638730
5552A05638730j512971o49787j121469j287452j459130p88239n96316p43971k260014
5543I5219381j245846k175478N58656j235089j289906n83772k108130q36219r38307
5534H5365290M16512j184967q89401J38045n70166j148778q93527j961998q1168
5525G9189842l01689p2881l97584M59815r35091n29944o50690N57814p61795j061024
5515G5496773o31797n85847K07273n0088r98565k15334p66290K46903q18929o46092
5505G1238007O10451j41116k93515j75406N65527q16567j263706j53879j69446
5496F9400350k53846R5658j228013j375959j60700l8358J94065m46819j048740
5487F5137638M14877p00502m43350m42117M72102Q03755o9070j396868j11794
$$ plain form
5552 105638730 104125759 103475972 102354503 101067051 99607921 98819682 98223366 97479395 95219381
5543 95219381 93973535 91798057 92356713 91121624 89831718 89247946 87139816 86303597 85365290
5534 85365290 85781802 84596835 83707434 83845479 83275313 82126535 81233008 79271010 79189842
5525 79189842 78888153 78815272 78417688 78877503 77942412 77412468 76761778 77319592 76557797 75496773
5515 75496773 74864976 74279129 74486402 74436314 73437749 73222415 72456125 72703028 71884099 71238007
5505 71238007 71848458 71707342 71413827 71238421 71803948 70987381 69723675 69569796 69400350
5496 69400350 69146504 69242162 68014149 66638190 66477490 66439132 66633197 66186378 65137638
5487 65137638 65552515 64852013 64408663 63966546 64438648 65242403 65173333 63776465 63664671
5478F3664671J509643m10339p71984k07442m88857M61412l21587p25843L96475
5469F3106149l89099M85559K87656q5610L84879L24103L65133l20936m76934q03766
5459F2877134L88485R46331k62571J698244J280634j11021K92860p30766J54387
5450F6533717p95561J7915N27501L80973k40701P7380J622595Q6078m3508K00685
5440F8367074P91588k57838L6895j59290N31913N49046L22280o6171q60397P09712
5430F9964812M27617N95619m20107M99551k63763M30017o95527p3145Q97433k57196
5420G1105311O8568P61359N2592M80449k75520k19767o74217l10078Q71670p7055
5410G1783312M19145r73477r18090j00900J041901R23506M19319Q771l68029k7344
$$ plain form
5478 63664671 65174314 64763975 63991991 63784549 63295692 63757104 63435517 62709674 63106149
5469 63106149 62717050 63202609 63490265 63404655 63789534 64113637 64478770 64157834 63680900 62877134
5459 62877134 63265619 64211950 63949379 65647623 66928257 66817236 67110096 66379330 66533717
5450 66533717 65738156 65756071 66283572 66664545 66423844 66501224 68123819 68209897 68166389 68367074
5440 68367074 69158662 68900824 68937719 68778429 69310342 69859388 70181668 70115497 69255100 69964812
5430 69964812 70392429 70988048 70567941 71067492 70803729 71233746 70538219 70465074 71362507 71105311
5420 71105311 71173879 71935238 71987830 72468279 72192759 71972992 71298775 70988697 71860367 71783312
5410 71783312 72202457 71228980 70310890 70209990 71251891 72175397 72594716 72603487 72235458 72208114
5400G2208114M38619j7476j218704K65578m47134j79114N52312j95818K63630
5391G1670007J35991j621920o77991N52561r08932J039365K24708L35285R39657
5382G1688731p31683Q89839J097622J91868j59668p0070J378253N42228p66241
5373G4060879J99208r90845n33646N0479L26620J196011O52482O73159o55188
5364G4979159k87279J020686P68350L84686j140675j77272O14078P40217L66081
5355G7268031J041252L84905r44572m84804k67121J801760O24370M13318j4495
5346G9822644k41078k39077n00459k70535N02767J44261K85165Q39746M20009
5337H0763443J23828P89443o9726j81642J8322m77033j811986P00169J827666
$$ plain form
5400 72208114 72646733 72629257 71410553 71676131 71228997 71049883 71602195 71406377 71670007
5391 71670007 71805998 70184078 69506087 70058648 69149716 70189081 70413789 70749074 71688731
5382 71688731 70957048 71846887 72944509 73136377 72976709 72906639 74284892 74827120 74060879
5373 74060879 74260087 73269242 72735596 72786075 73112695 74308706 74961188 75634347 74979159
5364 74979159 74691880 75712566 76480916 76865602 75724927 75547655 76161733 76901950 77268031
5355 77268031 78309283 78694188 77749616 77264812 76997691 78799451 79423821 79837139 79822644
5346 79822644 79581566 79342489 78842030 78571495 79074262 79218523 79503688 80343434 80763443
5337 80763443 80887271 81676714 81606988 81425346 81443668 80966635 79154649 79854818 81682484
5328H1682484N47601K96154r70042o36042M92683L23681L97651j52510l83109
5319H1598551r85987P67536q31889L32161J77952P4088K28891K71114j2106j9360
5309H1600951O78783L72171R56325j075260l92834K08638l04835J500343J036590
5300H4580872j03647P09993o5187k76206r66309Q46318J271295J308225N97311
5291H7902665r42978p75382J679638N20721P57119R57022O70969N14584p86407
5282I0497951L31684O72028Q8668J124087N85725J586247M30380q48450M18773
5273I4887093J264064N33714L84581J35424J49457P45568P42207M36556M8382
5264I9327046K53557n8820N62378J713287M92111k55712K08770P29919R74129
$$ plain form
5328 81682484 82230085 82526239 81556197 80920155 81412838 81736519 82134170 81981660 81598551
5319 81598551 80612564 81380100 80548211 80880372 81058324 81132412 81361303 81632417 81620311 81600951
5309 81600951 82279734 82651905 83608230 82532970 82140136 82348774 82043939 83544282 84580872
5300 84580872 84477225 85187218 85122031 84845825 83879516 84725834 85997129 87305354 87902665
5291 87902665 86959687 86184305 87863943 88384664 89141783 90098805 90769774 91284358 90497951
5282 90497951 90829635 91501663 91590331 92714418 93300143 94886390 95316770 94468320 94887093
5273 94887093 96151157 96684871 97069452 97204876 97354333 98099901 98842108 99278664 99327046
5264 99327046 99580603 99521783 100084161 101797448 102289559 102033847 102242617 102972536 103946665
5255A03946665l8160R12418N20883n42774N84161J712741Q88802P59363O95170
5246A09439269J68317J16684N30560R50012M13761J74059J05053o38183J31683
5237A11391215J598819j3908M88824J424558j117183N38829J069131n21597M96964
5228A15355652p42558L3385J417460l50810q50010P24342k87461q62969O94850
5219A15131881J272457p41986l92475k48084P99569n2267k09935M59461P49275
5210A16767896m33827j20893J60682l1850J409721L96284l03063j377033J297354
5201A17765271N64868O68140l22260j19766M66323M25659p2050j70557k36569
5192A18969059L62012j94476q68119o56653Q15497J175804j042798j043812j02627
$$ plain form
5255 103946665 103908505 104820923 105341806 104799032 105383193 107095934 107984736 108744099 109439269
5246 109439269 109607586 109724270 110254830 111204842 111618603 111792662 111897715 111259532 111391215
5237 111391215 112990034 112976126 113464950 114889508 113772325 114311154 115380285 114858688 115355652
5228 115355652 114613094 114646479 116063939 115713129 114863119 115587461 115300000 114437031 115131881
5219 115131881 116404338 115662352 115269877 115021793 115821362 115769095 115559160 116018621 116767896
5210 116767896 116334069 116213176 116373858 116342008 117751729 118148013 117844950 116467917 117765271
5201 117765271 118330139 118998279 118676019 118556253 119022576 119448235 119376185 119205628 118969059
5192 118969059 119331071 119136595 118268476 117611823 118427320 119603124 118560326 117516514 117413887
5183A17413887M49443r03565k21665L69998M04189l57135O81511k4463n47815
5174A17264385q28388q39187m5542r3809p06457k9538l79183p49462j83513m09359
5164A12999947q94025R9193j535311n08272M034j03502p22049n84511Q30140j810288
5154A07775356p7957m13304J72641k118813P4130P46722N44854j328764k85528
5145A05089337j56256k019632m84837m79617K99941q6579k52983p05463J28206
5136A01332117m76337n48832K05121j343554k20329K81499j322356j094108m70052
5127I6343169Q23716O13548m19529R5690J96162p89755p74002l420L89986j94616
5117I6280949R69791J10088L64452n42556j026419q53650j295677M02288J965968
$$ plain form
5183 117413887 117863330 116959765 116738100 117108098 117512287 117155152 117836663 117812200 117264385
5174 117264385 116435997 115596810 115551268 115457459 114751002 114721464 114342281 113592819 113409306 112999947
5164 112999947 112105922 112205115 110669804 110161532 110165566 110062064 109340015 108755504 109585644 107775356
5154 107775356 107697399 107284095 107456736 105337923 105412053 106158775 106703629 105374865 105089337
5145 105089337 104933081 102913449 102428612 101948995 102248936 102162357 101909374 101203911 101332117
5136 101332117 100855780 100306948 100512069 99168515 98948186 99229685 97907329 96813221 96343169
5127 96343169 97166885 97780433 97360904 97456594 97652756 96863001 96088999 96085579 96475565 96280949
5117 96280949 97250740 97360828 97725280 97182724 96156305 95302655 94006978 94409266 96375234
5108I6375234j330036j29455m63751K04459J218035j088058k38580j34158p37775
5099I3675915O89107R11964j007101j279938L70331J827450J875981k152826j752177
5090I3158706K472226M04017P22800P10783J086701P90230K05266q95031k60461
5081I8395237o02465l429r40621m2308N47190l8786K0565j218792K93458J14475
5071I6524524L23903J644847L82200J52342K37635J007568n2627M62591J008105
5062A01691088l68474J157820Q39581N7201j84961L50925J334725K65019J138188
5053A06281112Q56111L8022M66635J770500J46466K44050J976466J451632J075620
5044A14306614J242331J942912J793990J789291J765863K531735J744661J675359
$$ plain form
5108 96375234 95045198 94915743 94451992 94656451 95874486 94786428 94547848 94413690 93675915
5099 93675915 94365022 95276986 94269885 92989947 93360278 95187728 97063709 94910883 93158706
5090 93158706 95630932 96034949 96757749 97468532 98555233 99345463 99550729 98655698 98395237
5081 98395237 97792772 97789343 96848722 96806414 97353604 97314818 97335383 96116591 96410049 96524524
5071 96524524 96848427 98493274 98875474 99027816 99265451 100273019 100220392 100682983 101691088
5062 101691088 101322614 102480434 103320015 103377216 103192255 103543180 104877905 105142924 106281112
5053 106281112 107137223 107175245 107641880 109412380 109558846 109802896 111779362 113230994 114306614
5044 114306614 115548945 117491857 119285847 121075138 122841001 125372736 127117397 128792756
5036A28792756J833488L309446K420533L040887L378971L064214M770112L435798
5028A54046205L487612L512093L746337L084584K936143L077765K206817K424750
5020A78522306J964842J802676K380990J401335J560267K386532R24078J328443
5012A92271469K149465K093969R32605K466397K003108J805687J970232L223967
5004B08916899K095199N62057M151R61584R32418k76020j011987j007281k280803
4995B08896217q41237k557218k636687k658876k788075l012971l048369k117328
4987A89235456k876631k776057k778951k524884j878598l261938k722697j288632
4979A69127068l378732j729142l455452l113284m959529l362602l259193l786516
$$ plain form
5036 128792756 130626244 133935690 136356223 139397110 142776081 145840295 150610407 154046205
5028 154046205 157533817 161045910 164792247 167876831 170812974 173890739 176097556 178522306
5020 178522306 180487148 182289824 184670814 186072149 187632416 190018948 190943026 192271469
5012 192271469 194420934 196514903 197447508 199913905 201917013 203722700 205692932 208916899
5004 208916899 211012098 211574155 211578306 212539890 213472308 213196288 212184301 211177020 208896217
4995 208896217 208054980 205497762 202861075 200202199 197414124 194401153 191352784 189235456
4987 189235456 186358825 183582768 180803817 178278933 176400335 173138397 170415700 169127068
4979 169127068 165748336 164019194 160563742 157450458 152490929 149128327 145869134 142082618
4971A42082618l330978l355135l807200m862891m357394k969404l529348m163760
4963A11706508k942327l131908l742516l378977k867489k862941j661025k358709
4955H8760616k587613j817234k513873j648674j390424j847634j554951r74623
4947G4425590j555811j600603j808227l46051j79628j666171j679386o12617k69319
4938F4707777l46996r29372j245875M23496j040308o16408j436390L20436r92170
4929E8844190o73757M43265P1364m219J75052m27736q33293M42632M719m77160
4919E7565057m29854m2171J007413O0202r66601m30727J68136K55216o75332k92290
4909E6219049N76459J44939j621142j03836n50859o80549P91550o52962L1794
$$ plain form
4971 142082618 138751640 135396505 131589305 126726414 122369020 119399616 115870268 111706508
4963 111706508 108764181 105632273 101889757 98510780 95643291 92780350 91119325 88760616
4955 88760616 86173003 84355769 81841896 80193222 78802798 76955164 75400213 74425590
4947 74425590 72869779 71269176 69460949 69114898 68935270 67269099 65589713 64977096 64707777
4938 64707777 64360781 63431409 62185534 62609030 61568722 60952314 59515924 59836360 58844190
4929 58844190 58170433 58613698 58685062 58680843 58855895 58428159 57594866 58037498 58042217 57565057
4919 57565057 57135203 57093032 58100445 58160647 57194046 56763319 56931455 57186671 56511339 56219049
4909 56219049 56795508 56940447 55319305 55215469 54664610 53984061 54775611 54122649 54154443
4900E4154443J387902k85406m09467P5005K57107j764627p01845J88160l5004
4891E2866268p03298j03311M36586k81053j021617N25768J26963j30964K89965
4882E2005307l19093j74361n35886n22589q4952k74522J63697K35059j508K12192
4872E0703344M80730R2330L63893m86165J82513J295562M76643L66479M89129
4863E3964458L76972n84127r22133J535713J631337k01678j95847N72563j3387
4854E6163871J256609O32169k78216k61480J07320O68361O55090K7914L57232
4845E9328870J36o49820J69535p7139N72797K53110n00488J75479m3367p68565
4835E8460548k9286p66028O12490o87563r39642m16196M3720r55811p299p70987
$$ plain form
4900 54154443 55542345 55256939 54847472 54922477 55179584 53414957 52713112 52901272 52866268
4891 52866268 52162970 52059659 52496245 52215192 51193575 51719343 51846306 51715342 52005307
4882 52005307 51686214 51511853 50975967 50453378 50368426 50093904 50257601 50492660 50491152 50703344
4872 50703344 51184074 51276404 51640297 51154132 51336645 52632207 53108850 53475329 53964458
4863 53964458 54341430 53757303 52835170 54370883 56002220 55800542 55604695 56177258 56163871
4854 56163871 57420480 58052649 57774433 57512953 57620273 58288634 58943724 58971638 59328870
4845 59328870 59329006 58679186 58848721 58771582 59344379 59597489 59097001 59272480 59229113 58460548
4835 58460548 58431262 57665234 58277724 57590161 56650519 56234323 56278043 55322232 55314933 54543946
4825E4543946J82471q60863j693462p31149Q77295j244884j556808N32042j485476
4816D8563112p4748q27814j116924J267049o74808j055369J63451p76764l07686
4807D5159499j63572n79372k48250l13348q37727J84294K23360m51314k22404
4798D2751166o46398N01373p99427m02903p74733q53505m10851n65529q54885
4789C7944308L11670K99345q2870m69844o54258k81859o18064o98184J9240k37783
4779C5531701k5871k8074j091077R74534Q53884m74824j056954N01656k38855
4770C4946120k52346L30172J3971k77423L3094j84624j281272k53763O37999p01151
4760C3010777j0918J13368j25577J224281N78592r23058J161811k1031N3100P61282
$$ plain form
4825 54543946 54726417 53865554 52172092 51440943 52318238 51073354 49516546 50048588 48563112
4816 48563112 48488364 47660550 46543626 47810675 47135867 46080498 46243949 45467185 45159499
4807 45159499 44995927 44416555 44168305 43854957 43017230 43201524 43424884 42973570 42751166
4798 42751166 42104768 42606141 41806714 41403811 40629078 39775573 39364722 38799193 37944308
4789 37944308 38255978 38555323 38472453 38002609 37348351 37066492 36448428 35750244 35769484 35531701
4779 35531701 35505830 35477756 34386679 35361213 36215097 35740273 34683319 35184975 34946120
4770 34946120 34693774 35023946 35037917 34760494 34793588 34608964 33327692 33073929 33711928 33010777
4760 33010777 32999859 33113227 32987650 34211931 34790523 33867465 35029276 35008245 35061345 35822627
4750C5822627O26084n60357m58294k58322n7621P79393K79531P9711l2632J47907
4740C6368027M79149p26648n69850P57080k17163r60583O184o73811L55945n57555
4730C4260775n53493k44125K43930K17016l98944J371625o76176r27062J56J561357
4720C4855059K73950J20296J125706R43685J107035R45166P49881K237191j96163
4711D2161806Q72058J281306J156007J807749L615683L345769L474091K795126
4703F0509595K016440K841742J485415J971987J764333K499414M692139M817256
4695H2598321L478557J962431J110298Q02381L24829Q06134K777085L814855K770208
4686A00445099J342959O090k020252l239873k253078j556477j62855j132830P36332
$$ plain form
4750 35822627 36448711 35888354 35430060 35171738 35114117 35893510 36173041 36252752 36220120 36368027
4740 36368027 36847176 36120528 35550678 36307758 36090595 35130012 35136196 34462385 34818330 34260775
4730 34260775 33707282 33463157 33707087 33924103 33525159 34896784 34220608 33293546 33293702 34855059
4720 34855059 35129009 35249305 36375011 37318696 38425731 39370897 40120778 42357969 42161806
4711 42161806 43033864 44315170 45471177 47278926 50894609 54240378 57714469 60509595
4703 60509595 62526035 65367777 66853192 68825179 70589512 73088926 77781065 82598321
4695 82598321 86076878 88039309 89149607 89951988 90276817 91082951 93860036 97674891 100445099
4686 100445099 101788058 101794148 99773896 96534023 94280945 92724468 92561613 91428783 92165115
4677I2165115j839610l747921l891701m788641l403231l183421k823799k012821
4669F6473970k385740j502020k512181l235903m691539k196405k420698k199976
4661D5329508j244161j637342j340319j593428p43097j159109L38880j215308
4653C6735624j143668q7479q83950J94704p24059o28451N55189j43505m95686
4644C3378719P1335j872438j59691J239643M74110K42651j70751j06221P8418
4635C3175775M91716L52712L94872m29997q8200L60132K23183p3394P63107P05203
4625C5875109O63611M41277N6753M05240M47444l2294J084098K214066N09196
4616D1664500R99640K327j315083N65672J185294J212687J180074Q47245L96502
$$ plain form
4677 92165115 90325505 86577584 82685883 77897242 74494011 71310590 68486791 66473970
4669 66473970 64088230 62586210 60074029 56838126 52146587 49950182 47529484 45329508
4661 45329508 44085347 42448005 41107686 39514258 38771161 37612052 37950932 36735624
4653 36735624 35591956 35504477 34620527 34815231 34091172 33462721 34017910 33874405 33378719
4644 33378719 33450054 31577616 31417925 32657568 33131678 33374329 33203578 33097357 33175775
4635 33175775 33667491 34020203 34415075 33985078 33896878 34257010 34480193 34406799 35169906 35875109
4625 35875109 36538720 36979997 37036750 37441990 37889434 37857140 38941238 41155304 41664500
4616 41664500 42664140 42666467 41351384 41917056 43102350 44315037 45495111 46342356 46738858
4607D6738858J403155K052038o22207k19001J827470J511561P68043R18353Q30448
4598E5208718m85403J194987K600243J621895R19290J888240J114857J320943
4590F5383770J486141K553638R18595J715346K085001J729898J426727J817436
4582G9116552L395975K396825K489745K101446K421495M198038K450422L467345
4574A02037843L146631L185732K925727L433806N642996M673647M007880L696847
4566A32751109M251887M738515N374266O027144M851657O011666O290796P343181
4558A77640221P443390R230766J0881360J0503617J1887988J4822143J8083914
4551B60493399J8749038J9893437K4049469K5895426K8233676K8452518K9115386
$$ plain form
4607 46738858 48142013 50194051 49571844 49352843 51180313 52691874 53459917 54378270 55208718
4598 55208718 54723315 55918302 58518545 60140440 61059730 62947970 64062827 65383770
4590 65383770 66869911 69423549 70342144 72057490 74142491 75872389 77299116 79116552
4582 79116552 82512527 84909352 87399097 89500543 91922038 96120076 98570498 102037843
4574 102037843 105184474 108370206 111295933 114729739 120372735 125046382 129054262 132751109
4566 132751109 137002996 141741511 147115777 153142921 157994578 164006244 170297040 177640221
4558 177640221 185083611 194314377 205195737 215699354 227587342 242409485 260493399
4551 260493399 279242437 299135874 323185343 349080769 377314445 405766963 434882349
4544D34882349K5920791K2675922J6562885Q138688L702608m005223j0113240
4537D97764780j5458207j8954411k2826659k5081917k3598650k2603176k1248389
4530C47993371j9422751j8762707j7423200j6204108j4335637j4103084j3854917
4523B33886967j2532151j2566288j0789278r263251q980969q505865q397687p322772
4515A55528706o725257n351764n578749m938655n924975n444158n851812m779495
4507A10933841l158215m691060m998248m171957l730964k260374k917166k562030
4499H2443827k777798j972115j668647j961024j780794k589973k303807j163521
4491F6226148k494339n03863j835983j471499j283348j759874o62630L44385o58435
$$ plain form
4544 434882349 460803140 483479062 500041947 508180635 511883243 507878020 497764780
4537 497764780 482306573 463352162 440525503 415443586 391844936 369241760 347993371
4530 347993371 328570620 309807913 292384713 276180605 261844968 247741884 233886967
4523 233886967 221354816 208788528 197999250 188735999 179755030 171249165 162851478 155528706
4515 155528706 148803449 143451685 137872936 132934281 127009306 121565148 115713336 110933841
4507 110933841 107775626 103084566 98086318 93914361 90183397 87923023 85005857 82443827
4499 82443827 79666029 77693914 76025267 74064243 72283449 69693476 67389669 66226148
4491 66226148 63731809 63227946 61391963 59920464 58637116 56877242 56214612 56558997 55900562
4482E5900562k019146j910248m06648j020870l25365j112598j026868m64232n32100
4473D7082487j066511j387962k6857n07153j295201l78352p24664j252731O54849
4464D1097905q19630q70596k03675n36039J35427j255419k448082M28828P65047
4455C6293766o61636q86347j8002p39565p85706m07766n17535R0836l51847j241116
4445C0775082n200J716754K36292l94788k0788j212117L8021j417979n8459J198915
4435C0855733k30758o48697P8631P8857o70414j73459O96370j16324P35580J296061
4425C1901580j20294k00858J867267J151756k03827P99711J931870J127874J657589
4416C9912668K26315J643718J116494M41066m78432r4153j2005j838534k278896
$$ plain form
4482 55900562 53881416 51971168 51564520 50543650 50218285 49105687 48078819 47614587 47082487
4473 47082487 46015976 44628014 44601157 44094004 42798803 42420451 41695787 40443056 41097905
4464 41097905 40278275 39407679 39204004 38667965 38803392 37547973 35099891 35528719 36293766
4455 36293766 35632130 34745783 34727781 33988216 33202510 32794744 32277209 32368045 32016198 30775082
4445 30775082 30769882 32486636 32722928 32328140 32307352 31095235 31133256 29715277 29656818 30855733
4435 30855733 30624975 29976278 30054909 30133766 29463352 29289893 29986263 29869939 30605519 31901580
4425 31901580 31781286 31580428 33447695 34599451 34395624 35195335 37127205 38255079 39912668
4416 39912668 40138983 41782701 42899195 43340261 42861829 42767676 42755671 40917137 38638241
4407C8638241r11124j292574j728753j049617j304549j479345m92700N05084Q5549
4398C0970212q92679k209488j070242j019443k84503p23215l79914j023641j23394
4389B3243693K81901r7461j183188o55041J01488N5092j55920l71894q0449j005782
4379B0132439R3617R7417j61357q63264J109132N19928j143797n82135p1789K67677
4369A9397868J62742O74426k42548j563404M8368J127334j09076j32832L00829
4360A9663707q71282L71563R75051M81240p64463R2139J517889m04617r80039
4351B0081188o86864J174556l07548J308773N37489p26777L9677K99311M40854
4342B2160659J89704R7431Q52222K79544K57104J72112J504784o5703N84181N91832
$$ plain form
4407 38638241 37727117 36434543 34705790 33656173 32351624 30872279 30379579 30884663 30970212
4398 30970212 30077533 27868045 26797803 25778360 25493857 24770642 24390728 23367087 23243693
4389 23243693 23525594 23428133 22244945 21589904 21691392 21746484 21590564 21218670 21138221 20132439
4379 20132439 20226056 20323473 20162116 19298852 20407984 20927912 19784115 19201980 19130191 19397868
4369 19397868 19560610 20235036 19992488 18429084 18477452 19604786 19495710 19362878 19663707
4360 19663707 18792425 19163988 20139039 20620279 19855816 19947955 21465844 21061227 20081188
4351 20081188 19394324 20568880 20261332 21570105 22107594 21380817 21420494 21719805 22160659
4342 22160659 22350363 22447794 23300016 23579560 23836664 24008776 25513560 25447857 26032038 26623870
4332B6623870L69595R24803N91156R28801J8492J855506J42654J578663r0468
4323C2943072R06739J955788J883993K721422L069300K451029L168548M097024
4315E3196915M294149N101313P437611Q639277J0609365J2586208J5722475K0033251
4307A37620564K4316373L0475146L2541784j524455k8126469k3085618k5211237
4300A47006088k2125994j7916274j4751889j1471017q831397n978759o707809
4293E9222949o930506l571267m477171l216077k993441k537593j777839l98302
4285C3320753j859049k205436n79216p65061j166145j510977m27802p87180q65167
4276B3154720j486752o09048j02854l59061j09695p84867j659225k54254N34480
$$ plain form
4332 26623870 26993465 27918268 28509424 29438225 29456717 31312223 31454877 33033540 32943072
4323 32943072 33849811 35805599 37689592 40411014 43480314 45931343 49099891 53196915
4315 53196915 57491064 62592377 70029988 78669265 89278630 101864838 117587313 137620564
4307 137620564 161936937 192412083 224953867 223429412 195302943 172217325 147006088
4300 147006088 124880094 106963820 92211931 80740914 71909517 65930758 59222949
4293 59222949 52292443 48721176 44244005 41027928 38034487 35496894 33719055 33320753
4285 33320753 31461704 29256268 28677052 27911991 26745846 25234869 24807067 24019887 23154720
4276 23154720 21667968 21058920 20956066 20597005 20487310 19702443 18043218 17788964 18323444
4267A8323444o17964n36143L19517P54037j004342r93708k57551q85939J63986
4258A5265337M22016j3173M5802n98161j78389N09472L59005n70132N58417r44879
4248A4855315q51547n65823n93206k7663j02203j088653R5430J62745J55046m64236
4238A1575205L36790p16831n00779o90882J25747k55N71216l40583m00109q72518
4228I087001M19357k3607m98345K01496k66519k9394q06963J33676M42043p17059
4218G941686o12198J120830J230567j82635j248243o97832k81756J215233m35374
4209H050278M16308n66301l68534j219941K63652m75960K90008P73722k54254
4200F908978k65866K8556J41327p51531J225543J42940o6539J71066n69256l90263
$$ plain form
4267 18323444 17705480 17169337 17488854 18242891 17238549 16244841 15987290 15101351 15265337
4258 15265337 15687353 15674180 15719982 15121821 14943432 15452904 15811909 15241777 15800194 14855315
4248 14855315 14003768 13437945 12844739 12817076 12714873 11626220 11721650 11884395 12039441 11575205
4238 11575205 11911995 11195164 10694385 10003503 10129250 10128995 10700211 10359628 9959519 9087001
4228 9087001 9506358 9482751 8984406 9185902 8919383 8889989 8083026 8216702 8658745 7941686
4218 7941686 7329488 8450318 9680885 9498250 8250007 7552175 7270419 8485652 8050278
4209 8050278 8466586 7900285 7531751 6311810 6575462 6099502 6389510 7163232 6908978
4200 6908978 6643112 6671668 6812995 6061464 7287007 7429947 7363408 7534474 6965218 6574955
4190F574955k12879K1810j002093J83452n50996K39875R44156R80000j79637j053045
4180E945598k03174L4547l10366L39497o95525Q70834N97256N1285l45950N3484
4170F337486k44383n89604J026810n10061j06462M44032j248095J271775N90909
4161F972407L28927o93875j408320J49968P85736O1152n03723j02956K32506m76365
4151E345457k94004j7812J033424j72713j85108n84541l48918R9793q0867O06647
4141E401358J44556j240704q85654J028031O48810M07337m47926L34031k94147
4132E095692k461m47104n40746m2117L09664J377839K51947j619885o59105M99157
4122D222881P87813n22892l95752R84276J23858j29697q58014Q12597O92435l11014
$$ plain form
4190 6574955 6362076 6383886 5381793 5565245 5014249 5254124 6198280 7178280 6998643 5945598
4180 5945598 5742424 5776971 5466605 5806102 5110577 5981411 6578667 6629952 6284002 6337486
4170 6337486 6093103 5503499 6530309 6020248 5913786 6357818 5109723 6381498 6972407
4161 6972407 7301334 6607459 5199139 5349107 6134843 6195995 5692272 5589316 5821822 5345457
4151 5345457 5051453 5033641 6067065 5894352 5709244 5124703 4775785 4875578 4794711 5401358
4141 5401358 5545914 4305210 3419556 4447587 5096397 5503734 5055808 5389839 5095692
4132 5095692 5093231 4646127 4105381 4063264 4372928 5750767 6002714 4382829 3723724 4222881
4122 4222881 5010694 4487802 4092050 5076326 5200184 5070487 4212473 5025070 5717505 5406491
4112E406491p00787o10598Q45437J98279q24266l41809j97966Q88665P45378o41871
4102D766953j145086J0360M33472K2803Q1688j25393l40575M13937L15534n38154
4092C895539l36413q29518J317166J007210K17908r31637l36614m28856J657093
4083E231878k20450l86352o1459N86614q31993j43997J576704m37404n10875Q29831
4073E632497j460821q06534N7486J931116J50652j208159q64395J203297P9470
4064D714609O16983K12019L82526m10769j071901K23077L4382L09977l65668p68621
4054C876614j35165R43931J717264m80073p66728j51908M88496M5059q82784j37742
4044D516964K6431Q2484j339516Q38130J102257q92458N8748n6444M442L32635
$$ plain form
4112 5406491 4705704 4095106 4940543 5138822 4314556 3972747 3774781 4663446 5408824 4766953
4102 4766953 3621867 3632227 4065699 4088502 4170190 4044797 3704222 4118159 4433693 3895539
4092 3895539 3559126 2729608 4046774 5053984 5271892 4340255 4003641 3574785 5231878
4083 5231878 5011428 4625076 4563617 5150231 4318238 4174241 5750945 5313541 4802666 5632497
4073 5632497 4171676 3365142 3422628 5353744 5504396 4296237 3431842 4635139 4714609
4064 4714609 5331592 5543611 5926137 5515368 4443467 4666544 4700926 5010903 4645235 3876614
4054 3876614 3741449 4685380 6402644 5922571 5155843 5003935 5492431 5537490 4654706 4516964
4044 4516964 4543395 4625879 3286363 4124493 5226750 4334292 4393040 4336596 4341038 4673673
4034D673673L19840M51200l64036n29189J29412Q36400q36176N32171l18255l68089
4024D526951n13785J86134J130450M80899k6088j64297M1695J52187n39479L95042
4014E669709P26977j55893m05883J066701j12410j137394q45638j42544K78347
4005D941972k04134n77432J409094L96991m76676m15590r5263j218392J036553
3996D797123r40749j31704K74157m58397K0617J442293J8363j269417R06488P2231
3986D731005q07333j82339k43911Q20408P10738k12551o45294k20575J1985M82626
3976D444759o8542n69897P87379j43502J88851n01056k67702K603o65869P5832
3966C282856k9903o4429o7733Q42794J95328K29635m62788M77553n9806n84688
$$ plain form
4034 4673673 4993513 5444713 5080677 4551488 4680900 5517300 4681124 5213295 4895040 4526951
4024 4526951 4013166 4199300 5329750 5810649 5784561 5620264 5661959 5814146 5274667 5669709
4014 5669709 6396686 6240793 5834910 6901611 6789201 5651807 4806169 4663625 4941972
4005 4941972 4737838 4160406 5569500 5966491 5489815 5074225 4978962 3760570 4797123
3996 4797123 3856374 3724670 3998827 3540430 3561047 5003340 5021703 3752286 4658774 4731005
3986 4731005 3923672 3741333 3497422 4317830 5028568 4816017 4170723 3950148 3962133 4444759
3976 4444759 4376217 3806320 4593699 4450197 4639048 4137992 3870290 3872893 3207024 3282856
3966 3282856 3252953 3188524 3120791 3963585 4158913 4388548 3925760 4403313 4343507 3758819
3956C758819J227548q07458j219819K33900R93445m64887K11449J02090M82215
3947D517302l81632l85188K31762J17530L13896k62943q82907L79866Q0929m95224
3937C233391q45387N41463Q44230j520510l5076J541299P19617p26441n83661
3928C168925N92186R41131r694n73106p35283m71267K25120J58726j09863O52928
3918C839803r44718k5486L52370J51893L19811k07029j115507N18378K48070Q60164
3908C997749n15933j161865L35429n56471M27592M82445O71763o22696N5552O14722
3898C728287n29246K85097M84882n14415Q36467m85746N74084q24010J53247j81539
3888C527108o41361L89460k86758K82626j025617m65755J063242m66238M39997
$$ plain form
3956 3758819 4986367 4178909 2959090 3192990 4186435 3721548 3932997 4035087 4517302
3947 4517302 4135670 3750482 3982244 4099774 4413670 4150727 3267820 3647686 3728615 3233391
3937 3233391 2388004 2929467 3773697 2253187 2218111 3759410 4479027 3752586 3168925
3928 3168925 3761111 4702242 4692548 4119442 3384159 2912892 3138012 3296738 3186875 3839803
3918 3839803 2895085 2869599 3221969 3373862 3693673 3486644 2371137 2889515 3137585 3997749
3908 3997749 3481816 2319951 2655380 2098909 2526501 3008946 3680709 3058013 3113565 3728287
3898 3728287 3199041 3484138 3969020 3454605 4291072 3805326 4379410 3555400 3708647 3527108
3888 3527108 2885747 3275207 2988449 3271075 2245458 1779703 2842945 2376707 2816704
3879B816704j14489M93612J081736N153j008257o05787q5765Q65289p88752M79375
3869C138819P28113l47030N6227J14564N60020K73288q31241j258534j2628J167190
3859C588788n51513O76856P3356m08453Q69496N02038l65345n61152l26491N2402
3849C549982j90854L77631k28125p04044k14679O77064L90765l34057l78943j162141
3839A782599M40068P78978j33033n58286R08000j162873P01586O10346q42398
3830B524987k49492M37265M74108j36805r8640R46124o03r40210Q81093p58038
3820C079789j158605N72230k10095j51806j57064k25938L94050n4025R31907l31016
3810B689427l46892M87646R71185j234360m07866Q35521O95440m27460p13164
$$ plain form
3879 2816704 2702215 3195827 4277563 4282716 3274459 2668672 2582907 3448196 2659444 3138819
3869 3138819 3866932 3519902 3576129 3690693 4250713 4524001 3692760 2434226 2421598 3588788
3859 3588788 3037275 3714131 3787487 3379034 4248530 4750568 4385223 3824071 3497580 3549982
3849 3549982 3359128 3736759 3508634 2804590 2589911 3266975 3657740 3323683 2944740 1782599
3839 1782599 2222667 3001645 2868612 2310326 3218326 2055453 2757039 3367385 2524987
3830 2524987 2275495 2712760 3186868 3050063 2951423 3897547 3896944 2956734 3837827 3079789
3820 3079789 1921184 2493414 2283319 2131513 1974449 1748511 2142561 2088536 3020443 2689427
3810 2689427 2342535 2830181 3801366 2567006 2159140 2994661 3690101 3262641 2549477
3801B549477K06779p72411O12736P89848k65181m46155O66740J398M46150r52315
3791B837066O5567Q4820l8808k40713o1351L79989j66124n61318p0451K93807
3781B522484O52963k17441k8327o32354n70986k68694Q47003j44225N57799n31660
3771B186562J264719Q55454l66229o68888k65072m4868m15147R56302K63409o37429
3761C128813O84866r31486Q73256L09317j244482o24632L29721n01004J111099
3752C135468p6578j87881M13327p56263M26617J05008L43862k38975n58188O0152
3742B666549Q07561m95473Q83103l94845L69881j8184N81552o58924j95507M10422
3732C956135l02553L49015K81195j008306m41795q22489l9612L87018k9910r82403
$$ plain form
3801 2549477 2756256 1983845 2596581 3386429 3121248 2675093 3341833 3343231 3789381 2837066
3791 2837066 2902633 2987453 2948645 2707932 2646581 3026570 2860446 2299128 2228677 2522484
3781 2522484 3175447 2958006 2929679 2297325 1726339 1457645 2304648 2160423 2718222 2186562
3771 2186562 3451281 4306735 3940506 3271618 3006546 2961678 2546531 3502833 3766242 3128813
3761 3128813 3813679 2882193 3755449 4064766 2820284 2195652 2525373 2024369 3135468
3752 3135468 3058890 2871009 3284336 2528073 2954690 3059698 3403560 3164585 2606397 2666549
3742 2666549 3474110 2978637 3861740 3466895 3836776 3818592 4400144 3741220 3545713 3956135
3732 3956135 3653582 4002597 4283792 3275486 2833691 2011202 1971590 2358608 2328698 1346295
3722A346295M93092J416793l98947K13069L74430j337923M51443J052967p19153
3713B892066L98014n20120K87730P9818j009816M38871Q46393L97845q35323n1905
3703B923573J56519o61410K7572R57479K52380n55623l29269p4209J15956R82766
3693C795734p86967l03783L39328N866p8611j4491j184414P95519L16457m34939
3683B449699j204079J56535J215573Q21789o0372O0672K96844n80445j9504P28856
3673C865568P57920n2507m21798l5461m20453m47953M51202J061J4356K7047O45089
3662D384071m15862k56791J74337n69051K01714O08478k15199j35799k34564L31299
3652C872633N19837o44554O20419l27952j97284J86416L41479J62218m8230M22909
$$ plain form
3722 1346295 1839387 3256180 2857233 3070302 3444732 2106809 2558252 3611219 2892066
3713 2892066 3290080 2769960 3057690 3137508 2127692 2566563 3412956 3810801 2975478 2923573
3703 2923573 3080092 2418682 2446254 3403733 3656113 3100490 2771221 2697012 2812968 3795734
3693 3795734 3008767 2704984 3044312 3050178 2971567 2957076 1772662 2568181 2884638 2449699
3683 2449699 1245620 1402155 2617728 3439517 3379145 3439817 3736661 3156216 3136712 3865568
3673 3865568 4623488 4570981 4149183 4113722 3693269 3245316 3696518 3697579 3711935 3738982 4384071
3662 4384071 3968209 3711418 3885755 3316704 3518418 4126896 3911697 3775898 3541334 3872633
3652 3872633 4392470 3747916 4368335 4040383 3843099 4029515 4370994 4533212 4484982 4907891
3642D907891l33607J66405J163397J433056j157520J65004O75029k70135P08415
3633G457935j25803N00524k4558n63099l01432j567569K05224O20645m29068r49495
3623D823304J32820J39456J90911J191436J679895j069820r83372M23815Q01386
3614G329831o42107K65846m05417J376854k26194q36540J453668J851379K81536
3605A0448856M44719R31619k28860k64885P5968J46569K45411m84604j851088
3596I463705l7023p00979p88510L88177L7550R3305j41512l97314J420680m81252
3586H856827p77953M61042P23212r13845M53602K90128o87292j017214j60099
3577G228408J006729N80681J099348n6626k3910R15251k59748R9916q3524R31294
$$ plain form
3642 4907891 4574284 4740689 5904086 7337142 6179622 6344626 7019655 6749520 7457935
3633 7457935 7332132 7832656 7808098 7244999 6943567 5375998 5581222 6201867 5772799 4823304
3623 4823304 4956124 5095580 5286491 6477927 8157822 7088002 6104630 6528445 7329831
3614 7329831 6687724 6953570 6548153 7925007 7698813 6862273 8315941 10167320 10448856
3605 10448856 10893575 11825194 11596334 11331449 11407417 11553986 11799397 11314793 9463705
3596 9463705 9426682 8725703 7937193 8325370 8362920 8456225 8314713 7917399 9338079 8856827
3586 8856827 8078874 8539916 9263128 8349283 8802885 9093013 8405721 7388507 7228408
3577 7228408 8235137 8815818 9915166 9858540 9834630 10749881 10490133 10590049 10506525 11437819
3567A1437819p4257q3280o39712K98052J32466m34128P71601r09093m62453P72511
3557A0809526O79044m55461J91876Q66254m60751r62179R29918o58338L81143
3548A1321032M78490n78763O95106p34944q77514J666675N52852n25857Q05746
3539A2802823k43076k2360K50903J121223P38710l92652o8429j1716M24772L02588
3529A4902786N36848J445864R30715k9043J009528L68448N40051L44333r35412
3520A9114118K88676r0792K46208J443954l30347O47524p8306J93290J741785
3511B3176110J431818j526658K71139J524190N87653K58688P81108J557382P55504
3502B8816934K36317P12868J229225R5805J306495J655452R68577J519285O86550
$$ plain form
3567 11437819 11363562 11280282 10640570 10938622 11071088 10636960 11408561 10499468 10037015 10809526
3557 10809526 11488570 11033109 11224985 12091239 11630488 10668309 11598227 10939889 11321032
3548 11321032 11799522 11220759 11915865 11180921 10303407 11970082 12522934 11997077 12802823
3539 12802823 12559747 12537387 12788290 13909513 14648223 14255571 14187142 14175426 14600198 14902786
3529 14902786 15439634 16885498 17816213 17787170 18796698 19165146 19705197 20049530 19114118
3520 19114118 19402794 19312002 19558210 21002164 20671817 21319341 21241035 21434325 23176110
3511 23176110 24607928 23081270 23352409 24876599 25464252 25722940 26504048 28061430 28816934
3502 28816934 29053251 29766119 30995344 31091149 32397644 34053096 35021673 36540958 37227508
3493C7227508K112907K867951J951023K488074K086573K853201L281360K270630
3485E7139227J211317J241655K65611N14727O21487j262001j450900k113723j249697
3476E4917703j733045k737365k135729k040444j599916j370544j605199r07927
3468D0787534j471405k920596q26020p33871k383271k495645j422307j14137j192037
3459B7228245r54625k031002n78845K28862j128148p89190O0534o61746n96156
3450B0777929O00420O26851Q074n84616k43263k582283J90187o68894j185319
3441A6939086j624352l83705q10899k55915n01510l36127j28724n24570p74375
3432A1598909p8466P86987j8725o01865m98175Q78725p66248j147471R84320J141116
$$ plain form
3493 37227508 39340415 42208366 44159389 46647463 48734036 51587237 54868597 57139227
3485 57139227 58350544 59592199 59857810 60372537 60994024 59732023 58281123 56167400 54917703
3476 54917703 53184658 50447293 48311564 46271120 44671204 43300660 41695461 40787534
3468 40787534 39316129 36395533 35569513 34835642 32452371 29956726 28534419 28420282 27228245
3459 27228245 26273620 24242618 23663773 23892635 22764487 21975297 22035831 21374085 20777929
3450 20777929 21378349 22005200 22013274 21428658 21185395 18603112 18793299 18124405 16939086
3441 16939086 15314734 14931029 14120130 13864215 13362705 13026578 12897854 12373284 11598909
3432 11598909 11520443 12307430 12288705 11686840 11188665 12067390 11301142 10153671 11137991 12279107
3422A2279107R47184P03879J533840J950728J962208J410267l58635r58168j832668
3413A7637742q63627j000628j250285j349833j667879p97432m99j204546j501770
3404H001243m44856J78064K59839q12032O86106J09621j327005j154527J175277
3395F671730N39470m1554j54059R23420m61404Q9401Q48402J62591J554206J95692
3385A0327895L1545j109294M35884J93433r39277p38901o47364n50068m69354
3376F534499J1234j97613n55990o41152p52133P83189P75284p11451M98207k88970
3366E455104m92774j086783j80467k40780m01501L01876l09209o2309j8920P78613
3356C742850m84385k0076p5716j096930j99849J180215R1634O7118k00454O08475
$$ plain form
3422 12279107 13226291 13930170 15464010 17414738 19376946 20787213 20428578 19470410 17637742
3413 17637742 16774115 15773487 14523202 13173369 11505490 10708058 10707559 9503013 8001243
3404 8001243 7556387 7734451 7994290 7182258 7868364 7977985 6650980 5496453 6671730
3395 6671730 7211200 7169646 7015587 7939007 7477603 7567004 8415406 8577997 10132203 10327895
3385 10327895 10359440 9250146 9686030 9879463 8940186 8201285 7553921 7003853 6534499
3376 6534499 6545733 6348120 5792130 5150978 4398845 5182034 5957318 5245867 5744074 5455104
3366 5455104 4962330 3875547 3695080 3454300 3052799 3354675 3045466 2983157 2964237 3742850
3356 3742850 3258465 3238389 3162673 2065743 1865894 3046109 3137743 3204861 3004407 3612882
3346C612882m00520K82149J38972L17978j392843J65933L59328J00607q44990
3337B339496l2742J102125l24555m30288N02607p43775p73508J034867L3956j082703
3327A625480Q16996K86222n33611P11510p26715p68876J669173L79863p67144
3318B692898k00965K12609N30602k49976o69611k59133m49308J008768J142571
3309C758455n13055p1254o265k94195k17167J205093q70387j540829M35352k25879
3299A659869P6190o01789q36661Q15279P33902l17406Q56717j62316j064337j42585
3289A016863J096870J08467M94807O79707p21761q82140r6404N23820n27386m98422
3279A194421l0850O25050m18191K83708k0944N81877m16949P14448j43189L03039
$$ plain form
3346 3612882 3212362 3494511 3633483 3951461 2558618 2724551 3083879 3184486 2339496
3337 2339496 2306754 3408879 3084324 2654036 3156643 2412868 1639360 2674227 2708183 1625480
3327 1625480 2442476 2728698 2195087 2906597 2179882 1411006 3080179 3460042 2692898
3318 2692898 2491933 2704542 3235144 2985168 2315557 2056424 1607116 2615884 3758455
3309 3758455 3245400 3174146 3167881 2873686 2656519 3861612 2991225 1450396 1885748 1659869
3299 1659869 1736059 1134270 297609 1112888 1846790 1529384 2386101 2223785 1159448 1016863
3289 1016863 2113733 2222200 2717007 3396714 2674953 1792813 1696409 2220229 1692843 1194421
3279 1194421 1163571 1788621 1370430 1654138 1633194 2215071 1798122 2512570 2369381 2672420
3269B672420p78664J128769p13339k32614m68219J58813Q48764n44341K96023
3260B367612L37809K91981o13707Q8905l63716p67370p66136P2893L77681j33750
3250H92202J009829k63789j71496j42512R5859L0980l01997N44640m16090L62501
3240A640127J8851J115066L85361j690918l97088J042143L9870J70100j64000
3231B159512n57207J308789K36544j22603o58156J60998J363529j81247q01279
3222B908880N99298q41207K15293o15123Q23334J410066j076553k55149J1753
3213C180592m30042M67883J026953k39112M01868N29090J91976o760r11692j260942
3203B949814J704579l24553J15458Q67530J06345K62307j087376P1480O43392
$$ plain form
3269 2672420 1893756 3022525 2309186 2076572 1608353 1767166 2615930 2071589 2367612
3260 2367612 2705421 2997402 2383695 2472600 2108884 1341514 575378 648271 1025952 892202
3250 892202 1902031 1638242 1466746 1324234 1420093 1451073 1149076 1693716 1277626 1640127
3240 1640127 1658978 2774044 3159405 1468487 1071399 2113542 2153412 2323512 2159512
3231 2159512 1602305 2911094 3147638 3025035 2366879 2527877 3891406 3710159 2908880
3222 2908880 3508178 2666971 2882264 2267141 3090475 4500541 3423988 3168839 3180592
3213 3180592 2750550 3218433 4245386 4006274 4408142 4937232 5129208 5122448 4210756 2949814
3203 2949814 4654393 4329840 4445298 5312828 5419173 5681480 4594104 4665584 5308976
3194E308976K57476L91199j032014l17896R81114J212048P13609j14020J04305
3185G504797M85573m27902J03029r4163J107378J76669Q53921j36417l7898M93688
3175A0028675O49187J523341O03273K51420J025875J042593K35693J463291M31794
3166A7255142M37731K031522J435622J07480R25787n9228J9380K49465n06549
3157B1896352J028226L59161o04728j88171L13557N52848N8972o2031l71303k57505
3147B2725378R36528P60772N87888P43165M07878L63627R33487Q38979K414360
3138C0712062K176448L407370L445585K241174J431788j025904k484983k516830
3130C7386710k895253l045964j168486k054124j071116k358880k105905M27379
$$ plain form
3194 5308976 5566452 5957651 4925637 4607741 5588855 6800903 7514512 7400492 7504797
3185 7504797 7990370 7562468 7665497 7571334 8678712 8855381 9709302 9572885 9534987 10028675
3175 10028675 10677862 12201203 12804476 13055896 14081771 15124364 15360057 16823348 17255142
3166 17255142 17692873 19724395 21160017 21267497 22193284 22134056 22153436 22402901 21896352
3157 21896352 22924578 23283739 22679011 22490840 22804397 23357245 23416217 23354186 22982883 22725378
3147 22725378 23661906 24422678 25010566 25753731 26161609 26525236 27458723 28297702 30712062
3138 30712062 32888510 36295880 39741465 41982639 43414427 42388523 39903540 37386710
3130 37386710 34491457 31445493 30277007 28222883 27151767 24792887 22686982 23114361
3122B3114361j259736k56284j165315o96574M32679j033461p91822j57442P8892
3113A8265298O218m23406q64247K08131N28222J251687J416927N79417l00960
3104B0667287n32463n08721p59499j232826l94515j173279p40775j084592j159792
3095A3080825J50377j905644m42881l48202L79760j58866r66096m30218j073867
3086H285188p86180n09545P2169n40357J73436J49371p36121k33476n14391l08991
3076E051103l0678k86568o17756L67146Q31003p44069K80963p32993J79387j108227
3066C189311O45337o02183l9124J243924j498301j202158Q53627P22760j083827
3057B229366k04149l07117K91874J93063P37447j77458n52142p53394J07076L18552
$$ plain form
3122 23114361 21854625 21598341 20433026 19736452 20169131 19135670 18343848 18186406 18265298
3113 18265298 18271516 17848110 16983863 17191994 17720216 18971903 20388830 20968247 20667287
3104 20667287 20134824 19626103 18866604 17633778 17239263 16065984 15325209 14240617 13080825
3095 13080825 13231202 11325558 10882677 10534475 10914235 10755369 9789273 9359055 8285188
3086 8285188 7499008 6989463 7061632 6521275 6694711 6844082 6107961 5874485 5360094 5051103
3076 5051103 5020425 4733857 4116101 4483247 5314250 4570181 4851144 4118151 4297538 3189311
3066 3189311 3834648 3232465 3193341 4437265 2938964 1736806 2590433 3313193 2229366
3057 2229366 2025217 1718100 2009974 2203037 2940484 2763026 2210884 1457490 1564566 1883118
3047A883118N47787N40993k91967j36554p09780P2244J43749N72885o90399n10292
3037A421784L5319j21564M20895p46490K35108l59542l93517J012956R05187K17238
3027B627374j388657o71187O23569l87850l15301Q48585N91397q15641M45964
3018A558253m07946r46984m25867M09774p7798n77418O83294n61486J050137p92646
3008h8687q2342M75262N70393K06366Q2353J9566l37434k84336J68273R4682p59228
2997F4868p29042k27476R75246M06737N63990p55280O60124m24435o87850k03517
2987c56635K04785J470175j53910j013784N32615M15883J43224K78681r97633
2978E23401J557J352427n73513r90110l57832K84403n54981L39647N43132l72937
$$ plain form
3047 1883118 2430905 2971898 2679931 2543377 1833597 1905841 2049590 2622475 1932076 1421784
3037 1421784 1457103 1335539 1756434 1009944 1245052 885510 491993 1504949 2410136 2627374
3027 2627374 1238717 567530 1191099 803249 487948 1336533 1927930 1112289 1558253
3018 1558253 1150307 203323 -222544 187230 109432 -467986 215308 -346178 703959 -88687
3008 -88687 -171029 304233 874626 1080992 1163345 1182911 845477 561141 729414 824096 64868
2997 64868 -664174 -891650 83596 490333 1054323 299043 959167 534732 -153118 -356635
2987 -356635 -151850 1318325 1164415 150631 683246 1099129 1242353 1521034 523401
2978 523401 524958 1877385 1303872 313762 -44070 240333 -314648 24999 568131 195194
2968A95194K76521k19604j67501P47499R1670n98426k90249M3154P44901K96289
2958A119448j273212J62892Q11707q90811M60567m24854P21839q5757l93996j23251
2948H4572l44728N78929J55943J2566L00587k11056q33052M01629l03377Q32557
2938F74570M41894l01439n3662k96215m92257K15835j44225J21943m1973Q38750
2928I63221j85196l37303M37010k46045k60692L98979L05723J06144j080528m00579
2918b99266O39102K60622O336O91618m49864j93911L2377k18317L62470k93275
2908E37892L79874j75455O60692p36645j013249j21170M11849J053606L08172
2899A305566r83458J493227j24917l58703k19060M29032m31329o306N65039j160926
$$ plain form
2968 195194 471715 252111 84610 832109 923779 325353 35104 78258 823159 1119448
2958 1119448 -153764 9128 820835 -69976 390591 -34263 687576 601819 207823 84572
2948 84572 -260156 318773 474716 487282 787869 576813 -256239 145390 -157987 674570
2938 674570 1116464 815025 761363 465148 -27109 188726 44501 166444 124471 963221
2928 963221 778025 440722 877732 631687 370995 769974 1075697 1181841 101313 -299266
2918 -299266 339836 600458 606794 1298412 848548 654637 687014 468697 831167 537892
2908 537892 917766 742311 1403003 666358 -346891 -468061 -56212 997394 1305566
2899 1305566 322108 1815335 1690418 1331715 1112655 1541687 1110358 1104052 1669091 508165
2889E08165p6172P5449n6278J079352o03910n18794n64770N98640K68030o24154
2879H5558L7924m65648l82185q89019N64551J321749o74250m6372O92794Q47478
2869A092580k23531j41239r103m74735K30705L69644n38242j543910m73396J94987
2859a516240P90811n99380J033242J231080n68938p76862J92799M4592J116656
2850I47760l20544n2573P78678k04898n62762L40706Q23155p79057q86342L42363
2840D26486k04064J079458N75006q01055k34694J08870J64463l59490l93292k41150
2830A20538J3107j51483J129394R69294j05221M78627j302744j209439L88201
2821C30274P03052n51942k91431k33384M0963j65974o00883L57814m5318k51495
$$ plain form
2889 508165 431993 507442 451164 1530516 926606 407812 -156958 441682 709712 85558
2879 85558 123482 -342166 -724351 -1613370 -1048819 272930 -401320 -447692 245102 1092580
2869 1092580 869049 727810 718707 243972 474677 844321 306079 -1237831 -1711227 -1516240
2859 -1516240 -725429 -1324809 -291567 939513 370575 -406287 -213488 -168896 947760
2850 947760 627216 574643 1353321 1148423 585661 926367 1749522 970465 84123 426486
2840 426486 222422 1301880 1876886 1075831 841137 950007 1114470 754980 361688 120538
2830 120538 133645 -17838 1111556 2080850 1975629 2454256 1151512 -57927 330274
2821 330274 1033326 481384 189953 -43431 -2468 -168442 -769325 -411511 -456829 -708324
2811g08324K20141L56690p2081n99694K93814J73322O08654l76795n84829P74595
2801H5493O62199L82639o81586o72254J135104Q3186p15170n81815o11326k83309
2791a196839K78442J386218J54187J255224j278821n67682L09358p23689j145854
2782a529456O85788L70638K55145L72943k93993n21153K176513o40089j098n07682
2772C67556J58285O96611j153903m18581J68073m29630q41688J997438M69711
2763A013872k50632j425667J509462M34852n12133j48188q76446j59190R43986
2754E29916J04073o71938K25072O56603o6868L97589k65676o94752j0234N89924
2744G93709L82367j281503k08656L95690l18645L67211j69519P3552m38k00617
$$ plain form
2811 -708324 -488183 -131493 -203574 -803268 -509454 -336132 272522 -104273 -689102 85493
2801 85493 747692 1130331 448745 -223509 911595 994781 279611 -302204 -913530 -1196839
2791 -1196839 -918397 467821 622008 1877232 598411 30729 340087 -383602 -1529456
2782 -1529456 -843668 -473030 -217885 155058 -138935 -660088 1516425 876336 875238 367556
2772 367556 525841 1222452 68549 -350032 -181959 -611589 -1453277 544161 1013872
2763 1013872 763240 -662427 847035 1281887 769754 621566 -254880 -414070 529916
2754 529916 633989 -37949 187123 843726 776858 1174447 908771 214019 203785 793709
2744 793709 1176076 -105427 -314083 81607 -237038 130173 -39346 34206 33768 -166849
2734a66849r97699L72421M58554K98746o92469P2430P42571k14626L20266m31077
2724b37732k41060J96258K88936J75058O44250j78357r28596N92111n56254j014536
2714a259922J462180k34449p29415J6612J097940m20330q75921J83857N14733
2705b44715O22788k27154l82282p68162J3393O09319j93165J68023N09735q10603
2695g02823K86208R44988J74801M2140m03673M83592m79444m72389M16345j44675
2685A45070o24676N92572N69602O2764J1643o66949j046718J93980l84417L12612
2675h34517K68074L2355j48945r4156J030640o304m63041n40630r3728l70348
2665a220600K21283O12501k70395q8524P68939K05836K26571l77103m67618N77539
$$ plain form
2734 -166849 -1164548 -792127 -333573 -34827 -727296 -654866 87705 -126921 193345 -237732
2724 -237732 -478792 -282534 6402 181460 825710 647353 -281243 310868 -245386 -1259922
2714 -1259922 202258 -32191 -761606 -744994 352946 -67384 -943305 -759448 -244715
2705 -244715 378073 150919 -231363 -999525 -986132 -376813 -569978 -401955 107780 -702823
2695 -702823 -416615 528373 703174 745314 341641 825233 345789 -126600 289745 145070
2685 145070 -479606 112966 682568 745332 756975 90026 -956692 -762712 -1147129 -834517
2675 -834517 -566443 -534088 -683033 -777189 253451 247147 -215894 -756524 -850252 -1220600
2665 -1220600 -999317 -386816 -657211 -745735 23204 229040 455611 78508 -389110 188429
2655A88429Q04306l74179K24471p1986K72185P2829k27930o36272j335261R61614
2645a21794M8332K81030j05857k92104j65173m94855M15325l01636m85917M7319
2635a175330J94270L03440Q62808n11028R82503K50615k26415l66771J27843r90365
2625e48430P21695K74882j003091r49376O61399J179337l57810J26972j77511
2616g1933K24927j22129K88084p89039l35340l60279J575518L24566O04214k63913
2606A074676j025854l72135o12250J461207j06348J87376J083167j526549L29521
2597D92811p55404j51858O06123q5312J204901o14389k75032L70050j8253m83207
2587B90430m44728L93006k07566J62055j85479L65891L62602k5238M7816Q1983
$$ plain form
2655 188429 992735 618556 843027 771041 1043226 1116055 888125 251853 -1083408 -121794
2645 -121794 -73462 207568 101711 -190393 -355566 -850421 -435096 -736732 -1222649 -1175330
2635 -1175330 -981060 -677620 185188 -325840 656663 907278 680863 314092 441935 -548430
2625 -548430 173265 448147 -554944 -1504320 -842921 336416 -21394 105578 -71933
2616 -71933 152994 30865 318949 -470090 -805430 -1165709 409809 734375 1338589 1074676
2606 1074676 48822 -323313 -935563 525644 419296 606672 1689839 163290 492811
2597 492811 -262593 -414451 191672 106360 1311261 696872 421840 791890 773637 290430
2587 290430 -154298 238708 31142 193197 7718 373609 736211 710973 758789 840772
2577H40772l45214Q280N84713o2356r51631k85305L49866O9241Q9963q5087K13093
2566D26335N39143N57563j046528l58041n23632P68541K68327j093409J82964
2557b78737O08232K26594m68146L2642M69044q2501K71264j96299q70235P35472
2547D47330R23704j481168o53308Q97108J34730R1238p05904m29928k18828J74335
2537h20691J00451K06086n0320l17632J9024K64854Q26709l29481Q01125K09145
2527I09270q62914p16590J062388p9403k74603p13403k55522P1591N46479j16832
2517d29539j99211R43724j44306o88038M85079K5483O56302L41740j027372q20973
2507h57111l99274J233334K7031p02997j26861J62563J122856r65807J72854N90330
$$ plain form
2577 840772 495558 503838 1088551 1026195 74564 -210741 139125 208366 298329 213242 426335
2566 426335 965478 1523041 476513 118472 -405160 363381 631708 -461701 -278737
2557 -278737 329495 556089 87943 120585 589629 507128 778392 582093 -288142 447330
2547 447330 1371034 -110134 -763442 133666 268396 359634 -346270 -776198 -995026 -820691
2537 -820691 -720240 -514154 -564474 -882106 -863082 -598228 228481 -101000 700125 909270
2527 909270 46356 -670234 392154 312751 38148 -675255 -930777 -859186 -312707 -429539
2517 -429539 -628750 314974 170668 -517370 -32291 -6808 649494 991234 -36138 -857111
2507 -857111 -1256385 -23051 3980 -699017 -825878 -663315 459541 -506266 -333412 256918
2497B56918j33530N00049K90961j96285j7392n75984o80425K48298m80330Q36682
2487D8962n38496P21600n4206J89672j133375l7626K39300J76708J8809O93242
2477C24590k29773l69272J80548Q25775J22605J58909O6101O64842n57083j545854
2467c58612N63044o03532K79544Q61622q1967K15187m25806J87908J79398m62077
2457C54709O55354K92123M3307q33322m84694J374896K41164j47209q0823j050594
2447C64911P65948R5851j056758R55135J73298l99504k73576n32266p4402n86302
2437e67665J349489R63815N65041j241781O64368K9400L23691L72139p35264K5101
2427A748334J27508n32389k27560M0911k75038M02143K97772k04227R12596q01217
$$ plain form
2497 256918 123388 623437 914398 718113 700721 124737 -555688 -307390 -787720 48962
2487 48962 -489534 232066 177860 367532 -765843 -803469 -564169 -387461 -368652 324590
2477 324590 94817 -274455 -93907 731868 854473 1013382 1079483 1744325 1187242 -358612
2467 -358612 204432 -399100 -119556 742066 660099 875286 449480 637388 816786 354709
2457 354709 1010063 1302186 1345493 512171 27477 1402373 1643537 1496328 1415505 364911
2447 364911 1130859 1226710 169952 1125087 1298385 898881 625305 93039 18637 -567665
2437 -567665 781824 1745639 2310680 1068899 1733267 1762667 2086358 2458497 1723233 1748334
2427 1748334 1875842 1343453 1115893 1156804 881766 1283909 1581681 1377454 2290050 1488833
2417A488833l19804J029389K15910Q66703m75533r07355L7459N90646P75535L22849
2407C624632o28995J147136p3422n35113p06073J063834J75926j0876n98445P48748
2397D207352L92166k7645N79172k86341m03701M27672K59139j49559J566073N67630
2387G131958K5533M08045l22444n11627j08872Q32479P78586q94165P57297j63580
2377G933210J178311O09844l92505J82053N82529J83599J116274Q96786K28225
2368A2518326J74688J74451K52995P63413M1902P45236J047404J463281k63785
2359A6917911N44098J740587J059747L38377J311488J351888J343625J701784
2351B6309505L500857L859464K510731J107232K598992L169125L672336N052122
$$ plain form
2417 1488833 1169029 2198418 2414328 3281031 2805498 1898143 1935602 2526248 3301783 3624632
2407 3624632 2995637 4142773 4069351 3534238 2828165 3891999 4067925 4057049 3458604 4207352
2397 4207352 4599518 4571873 5151045 4864704 4461003 4888675 5147814 4998255 6564328 7131958
2387 7131958 7157491 7565536 7243092 6731465 6622593 7455072 8233658 7339493 8096790 7933210
2377 7933210 9111521 9721365 9328860 9510913 10093442 10277041 11393315 12290101 12518326
2368 12518326 12693014 12867465 13120460 13883873 13925775 14671011 15718415 17181696 16917911
2359 16917911 17462009 19202596 20262343 20600720 21912208 23264096 24607721 26309505
2351 26309505 29810362 33669826 36180557 37287789 39886781 43055906 46728242 51780364
2343E1780364N691465R105308J0605528J3344206J5029757J8049440K2923738
2336A46529806K6068998K8760993R156985k9166171l4384021k6225117j8057546
2329A02683927j5435479j1816090q573070p517808o364608n806524k735662l515371
2321D0919315l846218j964473p11583l567228l771923j599033j180251j694863
2313B2583743j876405k189298j257568o23569m74222m3413p85112q27072j455712
2304A3051372j045734m58675j76009N04991j737703J7907q98870n32916p53830
2295G970533j032579Q11653O70902l88107r34586M73331j085944L60713m4709
2286F801207q87674o11612J89991l04625M21182p04357l5613M66150r0966k50860
$$ plain form
2343 51780364 57471829 66577137 77182665 90526871 105556628 123606068 146529806
2336 146529806 172598804 201359797 210516782 181350611 146966590 120741473 102683927
2329 102683927 87248448 75432358 66859288 59341480 52976872 47170348 44434686 40919315
2321 40919315 37073097 35108624 34397041 30829813 27057890 25458857 24278606 22583743
2313 22583743 20707338 18518040 17260472 16636903 16162681 16119268 15334156 14507084 13051372
2304 13051372 12005638 11546963 11370954 11875945 10138242 10156149 9257279 8724363 7970533
2295 7970533 6937954 7749607 8420509 8032402 7097816 7571147 6485203 6845916 6801207
2286 6801207 5913533 5301921 5491912 5187287 5608469 4904112 4868499 5334649 5243683 4992823
2276D992823J01996j85723r18947P33498n63705k97735P55668k35652n89449k7901
2266C764873j449970m71204P70584P15265j23578N37841L50490q04399q40659
2257B449243N73085o79346j136495J94458J222052k01169j87320K03700j73207
2248B265001K41083K52763j74165q56558o1526R00327K5620q97154j7225j274070
2238D04096l27552L47160k16372l31076J037443Q65932n65337N37440N95907M91315
2228B838956n88424q90044l42018p5764j00578J66158J298132Q97366j79201q93883
2218B130700j096728r72068J099789r15116J16151p33087Q81218R67681K25463
2209A704003L61763r16685Q48720p74469n13930M79523j33258j213811P35385
$$ plain form
2276 4992823 5094819 4909096 3990149 4723647 4159942 3862207 4617875 4382223 3792774 3764873
2266 3764873 2314903 1843699 2614283 3329548 3205970 3743811 4094301 3289902 2449243
2257 2449243 3022328 2342982 1206487 1400945 2622997 2421828 2234508 2438208 2265001
2248 2265001 2506084 2758847 2584682 1728124 1666598 2566925 2592545 1695391 1678166 404096
2238 404096 76544 423704 207332 -123744 913699 1779631 1214294 1751734 2347641 2838956
2228 2838956 2250532 1360488 1018470 942706 842128 1008286 2306418 3203784 3024583 2130700
2218 2130700 1033972 61904 1161693 246577 362728 -370359 510859 1478540 1704003
2209 1704003 2065766 1149081 1997801 1223332 709402 1188925 1055667 -158144 577241
2200E77241L05261k25818M56342K29243o16273O59785k99868K71784K59492m09742
2190A207447l48517j12297K36107l98853k43114K22172M16139M10639j00113o78959
2180F10651j475459L53537J296631J68258p89557N55849O94474k57380p46609
2171D10395l14882K22791J28622n72369l1056J383033N0866r0054m82004j32733
2161E72609j75134n82260N29288K94559K0806q3721l015k39917k67100j425442
2151a359327k82834J761172K98606R3725n16495j51258J98491O52276p52032R05008
2141H47332m75682o66847J05011j79083L39373M43342j59587n30513L81784R98933
2131A104063O65832j24754o1872K03872j56073j297025L46702l63635L01305m70
$$ plain form
2200 577241 882502 656684 1113026 1342269 725996 1385781 1085913 1357697 1617189 1207447
2190 1207447 858930 746633 982740 583887 340773 562945 979084 1389723 1289610 610651
2180 610651 -864808 -511271 785360 953618 164061 719910 1414384 1157004 410395
2171 410395 95513 318304 446926 -125443 -156499 1226534 1277400 1187346 705342 572609
2161 572609 397475 -184785 344503 639062 659868 576147 573132 333215 66115 -1359327
2151 -1359327 -1642161 119011 417617 511342 -5153 -156411 42080 694356 -57676 847332
2141 847332 371650 -295197 -190186 -369269 -29896 413446 253859 -276654 105130 1104063
2131 1104063 1769895 1645141 1583269 1787141 1631068 334043 680745 317110 618415 617945
2121F17945J62077n5646L09113J025018l89919j075201j50524M51677J92914J11012
2111A198466j152229l13263j044632J180989Q30758k9200l30224L70876P98618
2102A510159n22358q37443j446017L70907O08714K55668M64467l57257o80379
2093f33539J53438J188750n22352L94990M90010k80953n03184m83516O55383k77888
2083A81139K16284j408179m27655J423514K49084Q1419J79205P88919o81845n07157
2073I4728O16149N71816n84435j218000O1323k32358J180486O17009J01395p31495
2063D76618O18063o03444K2968j17367n65725j5834L25354l72458P82238M28570
2053I78983p09945l33550J91256J278871p77639m7379o01695m38170p0400n36034
$$ plain form
2121 617945 780022 724376 1033489 2058507 1668588 593387 442863 894540 1087454 1198466
2111 1198466 46237 -267026 -1311658 -130669 700089 670889 340665 711541 1510159
2102 1510159 987801 150358 -1295659 -924752 -316038 -60370 404097 46840 -633539
2093 -633539 -480101 708649 186297 581287 1071297 790344 287160 -196356 459027 181139
2083 181139 397423 -1010756 -1438411 -14897 234187 315606 494811 1283730 601885 94728
2073 94728 710877 1282693 698258 -519742 -458419 -690777 489709 1106718 1208113 476618
2063 476618 1094681 491237 514205 396838 -168887 -184721 140633 -231825 550413 978983
2053 978983 269038 -64512 126744 1405615 627976 580597 -21098 -459268 -529668 -1065702
2043a065702P82565l72106P43090L51991q34267n51353L67714P38804l57020J058624
2033H62340j091002j79404J98201P19585O37419M59526q9717j78765r54036J27665
2023E11812j050724L31631J11802k66686M26225L40916k03830Q9439p26429k53377
2013f89221P57373p37484R23009j72351N56464K31867N71661o80671j509033O27761
2003a20625P09960p08595J9648J393471p12428p80040P20784N09833j80520r5345
1993G56143L91778p47967j54662m32947P50506n1487r26563O55729M76069R59403
1983A676002l65243p91047j08483n26210o99453M41659n2954M88767N1161M36727
1973E50926K97886k99385n01748j69393K57771o71430J23382R4504k26318l38544
$$ plain form
2043 -1065702 -283137 -655243 87847 439838 -394429 -945782 -578068 160736 -196284 862340
2033 862340 -228662 -408066 -209865 509720 1147139 1606665 1516948 1338183 384147 511812
2023 511812 -538912 -207281 -95479 -362165 64060 404976 201146 290585 -435844 -689221
2013 -689221 68152 -669332 253677 81326 637790 869657 1441318 760647 -748386 -120625
2003 -120625 589335 -119260 -99612 1293859 581431 -198609 522175 1032008 851488 756143
1993 756143 1147921 399954 245292 -187655 562851 511364 -415199 240530 716599 1676002
1983 1676002 1310759 519712 411229 -114981 -814434 -372775 -425729 63038 114199 550926
1973 550926 848812 549427 47679 -121714 136057 -535373 -411991 -317487 -543805 -882349
1963h82349O51045j00218J46304p60656Q33305P36462j023490L18843l53610R416
1953d24948L97597l91850L13729l97414M61361q87734J142733O8965Q55450l17698
1943H20191j029683J105421k54133q17917R89335L54170q77291q12599o09858
1934a132364K45736R92451M76706n66670N90476Q845L14754k45585j077359q15692
1924a208702M38301R24931j24214j005783m66520Q75239k50565L01798P27009
1915B11494r20542N02899j13934L79525n64297O27374j018535M8638Q86843m01676
1905c62211l29482j23239J70891p6314Q13709n07681l03902p0142k98567N66592
1895e20346j78102k4028J137275m58652k08756J185748q66281p50098l395M7349
$$ plain form
1963 -882349 -231304 -331522 -185218 -945874 -112569 623893 -399597 -80754 -434364 -424948
1953 -424948 -27351 -419201 -105472 -502886 -41525 -929259 213474 282439 1137889 820191
1943 820191 -209492 895929 641796 -176121 813214 1167384 290093 -522506 -1132364
1934 -1132364 -886628 105823 582529 15859 606335 615180 929934 684349 -393010 -1208702
1924 -1208702 -770401 154530 30316 -975467 -1441987 -566748 -817313 -515515 211494
1915 211494 -709048 -206149 -320083 59442 -504855 122519 -896016 -847378 39465 -362211
1905 -362211 -691693 -814932 -644041 -720355 93354 -414327 -718229 -788371 -1086938 -520346
1895 -520346 -698448 -722476 414799 -43853 -252609 933139 66858 -683240 -686635 -639286
1885f39286M44653j62930r94345J38727M13375L54858j708970O49898J665948
1876A61928R3466J082425k35158r56284m00553l39465j282267J078682O28221
1867a69005o04907L47158P71286Q92n59498J93353O97233M44755j594864N06400
1857C2803J441369j614548m2761P5425o3049l44841j62764R64640m6797n8076
1847A81401j644323N31756P92903J70637M29592k34489l75514j0646L05258r21337
1837g74762q1306M69069K93535n05500J000351O11483j411275L05803M07382n40091
1827b25311k10093m7212l47552K48552N30594P29206L45233l84747m28557j177445
1817i67332j11324O93538K65778l16115K44695L5647J376959p06456j568296J739859
$$ plain form
1885 -639286 -194633 -357563 -1351908 -1213181 -799806 -444948 -2153918 -1504020 161928
1876 161928 255394 1337819 1102661 146377 -254176 -593641 -1875908 -797226 -169005
1867 -169005 -773912 -426754 344532 345424 -214074 -20721 676512 1121267 -473597 32803
1857 32803 1474172 -140376 -183137 -107712 -170761 -515602 -678366 286274 239477 181401
1847 181401 -1462922 -931166 -138263 32374 461966 227477 -148037 -158683 146575 -774762
1837 -774762 -856068 -386999 -93464 -598964 401387 1012870 -398405 -92602 314780 -225311
1827 -225311 -435404 -482616 -830168 -581616 -51022 678184 1023417 638670 210113 -967332
1817 -967332 -1078656 -385118 -119340 -435455 -190760 -155113 1221846 515390 -1052906 686953
1807F86953J71828j403289j44925J038271P5499M51572K37885j070897j100050
1798a057153j44021M74364o13137K09741O82134l10379K64970K85334m5491R84656
1788G31018M82684l43043k72932N79729m50557n08405p67577K79628N81353K34945
$$ plain form
1807 686953 858781 -544508 -689433 348838 424337 875909 1113794 42897 -1057153
1798 -1057153 -1201174 -726810 -1339947 -1130206 -448072 -758451 -493481 -208147 -253638 731018
1788 731018 1213702 870659 597727 1177456 726899 218494 -549083 -269455 311898 546843
$$ [...]
##END NTUPLES=NMR SPECTRUM
##END=
