##TITLE=1H_CG-1198-X2
 CDCl3
 8 sc, 
 11.4.2024
##JCAMPDX= 6.0         $$ Bruker NMR JCAMP-DX V2.0
##DATA TYPE= NMR SPECTRUM
##DATA CLASS= NTUPLES
##ORIGIN= UXNMR, Bruker Analytische Messtechnik GmbH
##OWNER= root
$$ XWIN-NMR		Version 3.5
$$ Thu Apr 11 13:51:28 2024 Russian Standard Time (UT+4h)  she@DPX200
##.OBSERVE FREQUENCY= 200.1309
##.OBSERVE NUCLEUS= ^1H
##.ACQUISITION MODE= SIMULTANEOUS
##.ACQUISITION SCHEME= undefined
##.AVERAGES= 8
##.DIGITISER RES= 18
##SPECTROMETER/DATA SYSTEM= spect
##.PULSE SEQUENCE= zg30
##.SOLVENT NAME= CDCl3
##.SHIFT REFERENCE= (INTERNAL, CDCl3, 0, 15.5089)
##AUDIT TRAIL= $$ (NUMBER, WHEN, WHO, WHERE, WHAT)
$$ ##TITLE= Audit trail, XWIN-NMR		Version 3.5
$$ ##JCAMPDX= 5.01
$$ ##ORIGIN= Bruker BioSpin GmbH
$$ ##OWNER= she
$$ F:/spectra/data/she/nmr/H-F/1/pdata/1/auditp.txt
$$ ##AUDIT TRAIL=  $$ (NUMBER, WHEN, WHO, WHERE, WHAT)
(   1,<2024-04-11 13:49:57.62 +0400>,<she>,<DPX200>,
      <created by zg, POWCHK disabled, PULCHK disabled
       configuration hash MD5:
       00 E9 B6 7A A2 85 ED C7 34 08 36 98 17 FE 4E 26
       data hash MD5: 16K
       3E 2A F5 7B 84 B9 05 83 9C 0B 81 A1 F3 00 F6 1E>)
(   2,<2024-04-11 13:50:16.17 +0400>,<she>,<DPX200>,
      <Start of raw data processing
       efp BC_mod = 2 LB = 0.24 FT_mod = 6 PKNL = 1 PHC0 = -25300.05 PHC1 = 8.78731 SI = 16K 
       data hash MD5: 16K
       56 C6 96 13 3B 53 F3 D1 E9 E9 83 00 9D 1E 41 C4>)
(   3,<2024-04-11 13:50:31.29 +0400>,<she>,<DPX200>,
      <pk PHC0 = 0.7958739 PHC1 = 0 
       data hash MD5: 16K
       F6 7D 7B DB 2E 42 64 F3 FE 03 D4 D2 AF A7 12 2D>)
(   4,<2024-04-11 13:50:35.18 +0400>,<she>,<DPX200>,
      <abs ABSG = 5 
       data hash MD5: 16K
       41 A1 55 22 3E 66 48 42 9D 88 50 F4 B0 6D 0E 19>)
$$ ##END=
$$ 
$$ hash MD5
$$ 48 DA AF ED 85 74 36 09 9D 64 79 BF 24 8C 6A 58
##$RELAX= 
##$RELAX= 
##$RELAX= 
##$RELAX= 
##$RELAX= 
##$RELAX= 
$$ Bruker specific parameters
$$ --------------------------
##$DU= <F:/spectra>
##$EXPNO= 1
##$NAME= <H-F>
##$PROCNO= 1
##$TYPE= <nmr>
##$USER= <she>
##$AMP= (0..31)
100 100 100 100 100 100 100 100 100 100 100 100 100 100 100 100 100 100 
100 100 100 100 100 100 100 100 100 100 100 100 100 100 
##$AQSEQ= 0
##$AQ_mod= 1
##$AUNM= <au_zg>
##$AUTOPOS= <>
##$BF1= 200.13
##$BF2= 200.13
##$BF3= 200.13
##$BF4= 200.13
##$BF5= 200.13
##$BF6= 200.13
##$BF7= 200.13
##$BF8= 200.13
##$BYTORDA= 1
##$CFDGTYP= 0
##$CFRGTYP= 5
##$CHEMSTR= <none>
##$CNST= (0..31)
1 1 145 1 1 1 1 1 1 1 1 1 1 1 1 1 1 1 1 1 1 1 1 1 1 1 1 1 1 1 1 1 
##$CPDPRG= <>
##$CPDPRG1= <>
##$CPDPRG2= <>
##$CPDPRG3= <>
##$CPDPRG4= <mlev>
##$CPDPRG5= <mlev>
##$CPDPRG6= <mlev>
##$CPDPRG7= <mlev>
##$CPDPRG8= <mlev>
##$CPDPRGB= <>
##$CPDPRGT= <>
##$D= (0..31)
0 1.2 0 0 0 0 0 0 0 0.06 0 0.03 0 0 0 0 0.0002 0 0 0 0 0 0 0 0 0 0 0 0 
0 0 0 
##$DATE= 1712828997
##$DBL= (0..7)
120 120 120 120 120 120 120 120 
##$DBP= (0..7)
150 150 150 150 150 150 150 150 
##$DBP07= 0
##$DBPNAM0= <>
##$DBPNAM1= <>
##$DBPNAM2= <>
##$DBPNAM3= <>
##$DBPNAM4= <>
##$DBPNAM5= <>
$$ [...]
##$SUBNAM3= <"">
##$SUBNAM4= <"">
##$SUBNAM5= <"">
##$SUBNAM6= <"">
##$SUBNAM7= <"">
##$SUBNAM8= <"">
##$SUBNAM9= <"">
##$SW= 18.0517689322627
##$SWIBOX= (0..15)
0 0 2 0 0 0 0 0 0 0 0 0 0 0 0 0 
##$SW_h= 3612.71676300578
##$TD= 16384
##$TD0= 1
##$TE= 0
##$TE2= 300
##$TE3= 300
##$TEG= 300
##$TL= (0..7)
0 120 120 120 120 120 120 120 
##$TP= (0..7)
150 150 150 150 150 150 150 150 
##$TP07= 0
##$TPNAME0= <>
##$TPNAME1= <>
##$TPNAME2= <>
##$TPNAME3= <>
##$TPNAME4= <>
##$TPNAME5= <>
##$TPNAME6= <>
##$TPNAME7= <>
##$TPOAL= (0..7)
0.5 0.5 0.5 0.5 0.5 0.5 0.5 0.5 
##$TPOFFS= (0..7)
0 0 0 0 0 0 0 0 
##$TUNHIN= 0
##$TUNHOUT= 0
##$TUNXOUT= 0
##$USERA1= <user>
##$USERA2= <user>
##$USERA3= <user>
##$USERA4= <user>
##$USERA5= <user>
##$V9= 5
##$VALIST= <valist>
##$VCLIST= <CCCCCCCCCCCCCCC>
##$VD= 0
##$VDLIST= <DDDDDDDDDDDDDDD>
##$VPLIST= <PPPPPPPPPPPPPPP>
##$VTLIST= <TTTTTTTTTTTTTTT>
##$WBST= 1024
##$WBSW= 4
##$XGAIN= (0..3)
0 0 0 0 
##$XL= 0
##$YL= 0
##$YMAX_a= 218385
##$YMIN_a= -243788
##$ZGOPTNS= <>
##$ZL1= 120
##$ZL2= 120
##$ZL3= 120
##$ZL4= 120
##$ABSF1= 15.52987
##$ABSF2= -2.522016
##$ABSG= 5
##$ABSL= 3
##$ALPHA= 0
##$AQORDER= 0
##$ASSFAC= 0
##$ASSFACI= 0
##$ASSFACX= 0
##$ASSWID= 0
##$AUNMP= <proc_1d>
##$AZFE= 0.1
##$AZFW= 0.1
##$BCFW= 0
##$BC_mod= 2
##$BYTORDP= 0
##$COROFFS= 0
##$CY= -3
##$DATMOD= 1
##$DC= 0
##$DFILT= <>
##$DTYPP= 0
##$F1P= 0
##$F2P= 0
##$FCOR= 1
##$FTSIZE= 16384
##$FT_mod= 6
##$GAMMA= 0
##$GB= 0
##$INTBC= 1
##$INTSCL= 3.70164e-10
##$ISEN= 128
##$LB= 0.24
##$LEV0= 0
##$LPBIN= 0
##$MAXI= 10000
##$MC2= 0
##$MEAN= 0
##$ME_mod= 0
##$MI= 1.114404
##$NCOEF= 0
##$NC_proc= -8
##$NLEV= 6
##$NOISF1= 3.799351
##$NOISF2= 2.8
##$NSP= 0
##$NTH_PI= 0
##$NZP= 0
##$OFFSET= 15.50893
##$PC= 1
##$PHC0= -25299.26
##$PHC1= 8.78731
##$PH_mod= 1
##$PKNL= yes
##$PPARMOD= 0
##$PSCAL= 0
##$PSIGN= 0
##$REVERSE= no
##$SF= 200.129602562767
##$SI= 16384
##$SIGF1= 3
##$SIGF2= 2
##$SINO= 5.538805
##$SIOLD= 16384
##$SREGLST= <1H.CDCl3>
##$SSB= 0
##$STSI= 16384
##$STSR= 0
##$SW_p= 3612.71676300577
##$SYMM= 0
##$S_DEV= 0
##$TDeff= 16384
##$TDoff= 0
##$TI= <>
##$TILT= no
##$TM1= 0
##$TM2= 0
##$TOPLEV= 0
##$USERP1= <user>
##$USERP2= <user>
##$USERP3= <user>
##$USERP4= <user>
##$USERP5= <user>
##$WDW= 1
##$XDIM= 16384
##$YMAX_p= 473370468
##$YMIN_p= -2678451
$$ End of Bruker specific parameters
$$ ---------------------------------
##NTUPLES= NMR SPECTRUM
##VAR_NAME=  FREQUENCY,     SPECTRUM/REAL,   SPECTRUM/IMAG
##SYMBOL=    X,             R,               I
##VAR_TYPE=  INDEPENDENT,   DEPENDENT,       DEPENDENT
##VAR_FORM=  AFFN,          ASDF,            ASDF
##VAR_DIM=   16384,         16384,           16384
##UNITS=     HZ,            ARBITRARY UNITS, ARBITRARY UNITS
##FACTOR=    0.220516191357247, 1,           1
##FIRST=     3103.79603836028, 0,            0
##LAST=      -508.920724645494, 0,           0
##MIN=       -508.920724645494, -2678451,    0
##MAX=       3103.79603836028, 473370468,    0
$$ Real data points
##PAGE= N=1
##DATA TABLE= (X++(R..R)), XYDATA
$$ [...]
$$ plain form
7180 -249601 -713335 -410105 -256495 -92826 -95934 123760 22296 -5346 -145029 48722
7170 48722 101699 -25567 -82620 55967 574176 403069 300546 301896 275413 788420 681736
7159 681736 790032 369540 256914 448101 334271 270416 434186 322910 539766 512798
7149 512798 240511 180312 -231722 121626 274586 -61056 104157 362400 212319 450767
7139 450767 -103014 -290587 -1970 387979 34633 165591 390810 300921 612694 918473
7129 918473 718035 671910 424712 468083 667968 493930 525444 451012 886503 943985 825751
7118 825751 785744 815473 984791 1086688 1273657 984552 1077370 1248499 1169108 1059988
7108 1059988 1033059 1300152 1151442 1450778 1380279 1373048 1393033 1185148 1472944 1337302
$$ packed form
7180b49601m63734L03230J53610J63669l108K19694j01464k7642j39683J93751
7170D8722N2977j27266n7053J38587N18209j71107j02523J350k6483N13007j06684
7159F81736J08296m20492j12626J91187j13830o3855J63770j11276K16856k6968
7149E12798k72287o0199m12034L53348J52960l35642J65213K58243j50081K38448
7139D50767n53781j87573K88617L89949l53346J30958K25219q9889L11773L05779
7129I18473k00438m6125k47198M3371J99885j74038L1514p4432M35491N7482j18234
7118H25751m0007K9729J69318J01897J86969k89105R2818J71129p9391j09120
7108A059988k6929K67093j48710K99336p0499p231J9985k07885K87796j35642
$$ plain form
7098 1337302 1340635 1388511 1070239 1381977 1600484 1861341 1630775 1650763 1546139 1277903
7088 1277903 1563673 1959461 1923377 1288426 1374676 1683274 1681339 1908806 2071628 1711905
7078 1711905 1594547 1801405 2207346 1929572 1409069 1684310 2146569 2362183 2310872 2589411
7068 2589411 2336962 2110320 2297180 2602181 2569412 2460326 2438767 2355164 2583713 2626006
7058 2626006 2785879 2475405 2161550 2053199 1758135 1786221 2224687 2056215 2197238 2690935
7048 2690935 2730592 2832290 2979795 2995775 2549733 2586644 2772245 2733779 2722866 2728100 2985589
7037 2985589 2711708 3015614 3128779 3342391 3451114 3444478 3606788 3914899 3985037 4062683
7027 4062683 3905711 3631656 3851473 3713323 3993017 4213242 3848964 3515096 3749696 3695003
$$ packed form
7098A337302L333M7876l18272L11738K18507K60857k30566J9988j04624k68236
7088A277903K85770L95788l6084o34951Q6250L08598j935K27467J62822l59723
7078A711905j17358K06858M05941k77774n20503K75241M62259K15614n1311K78539
7068B589411k52449k26642J86860L05001l2769j09086k1559q3603K28549M2293
7058B626006J59873l10474l13855j08351k95064K8086M38466j68472J41023M93697
7048B690935L9657J01698J47505J5980m46042L6911J85601l8466j0913N234K57489
7037B985589k73881L03906J13165K13612J08723o636J62310L08111P0138P7646
7027D062683j56972k74055K19817j38150K79694K20225l64278l33868K34600n4693
$$ plain form
7017 3695003 4052251 4339897 4626868 4562262 4093917 4031496 4001888 4314519 4418057 4640222
7007 4640222 4377886 4478078 4318847 4354376 3999974 4349531 4554152 4345379 4316905 4122107
6997 4122107 4374569 4580954 4509572 4949976 4830667 5042447 4895036 4776307 4675186 4659069
6987 4659069 5095084 4664707 4460628 4414384 4541964 4407077 4409495 4529764 4533030 4666296
6977 4666296 4913655 4501787 4318361 4463220 4895771 4849024 4780074 4765173 4855860 4489612
6967 4489612 4393120 4773124 5312094 4898126 4541995 4746875 4672140 4445353 4432380 4896530
6957 4896530 4820294 4584066 4738168 5103820 5253059 5429527 5812620 5849428 5662417 5112741
6947 5112741 5183762 5166806 5090293 5390323 5479705 5232564 5245735 4977226 5093200 4709913
$$ packed form
7017C695003L57248K87646K86971o4606m68345o2421k9608L12631J03538K22165
7007D640222k62336J00192j59231L5529l54402L49557K04621k08773k8474j94798
6997D122107K52462K06385p1382M40404j19309K11780j47411j18729j01121j6117
6987D659069M36015m30377k04079m6244J27580j34887K418J20269L266J33266
6977D666296K47359m11868j83426J44859M32551m6747o8950j4901R0687l66248
6967D489612r6492L80004N38970m13968l56131K04880p4735k26787j2973M64150
6957D896530p6236k36228J54102L65652J49239J76468L83093L6808j87011n49676
6947E112741P1021j6956p6513L00030Q9382k47141J3171k68509J15974l83287
$$ plain form
6937 4709913 5180190 5421585 5107321 5475971 5183823 4821559 5281089 5138605 4991069 5393567
6927 5393567 5531250 5195497 4975368 5100326 5349408 5337116 4719434 4451197 4745965 4998246
6917 4998246 5229891 4864044 4812940 4665661 4589500 5652081 5787547 5500356 5309368 5409921
6907 5409921 4943371 5586236 5899107 5729661 6226377 5927800 6280557 6315345 6138979 6347104
6897 6347104 6586801 6758243 6951201 6926339 6602861 7077668 7327665 7137449 6698759 6746636
6887 6746636 6992933 7210712 6948776 6614231 6566414 6667842 6611523 7126718 7545950 7434556
6877 7434556 7462793 7444050 7214620 7430830 7412777 7413362 7608221 7194991 7650515 7935134 7988123
6866 7988123 7891385 7698503 7922422 8184650 8345493 8205427 8246790 8359296 8650824 8895296
$$ packed form
6937D709913M70277K41395l14264L68650k92148l62264M59530j42484j47536M02498
6927E393567J37683l35753k20129J24958K49082j2292o17682k68237K94768K52281
6917D998246K31645l65847n1104j47279p6161J062581J35466k87191j90988J00553
6907E409921m66550O42865L12871j69446M96716k98577L52757L4788j76366K08125
6897F347104K39697J71442J92958k4862l23478M74807K49997j90216m38690M7877
6887F746636K46297K17779k61936l34545m7817J01428n6319N15195M19232j11394
6877G434556K8237j8743k29430K16210j8053N85J94859m13230M55524K84619N2989
6866G988123r6738j92882K23919K62228J60843j40066M1363J12506K91528K44472
$$ plain form
6856 8895296 8762779 8846512 8339614 8040877 8377029 8357698 8404321 8052226 8268749 7883032
6846 7883032 8132634 8668591 8175763 8499400 8918523 8911390 9166715 9181976 9419427 9378980
6836 9378980 9384778 9591958 9976109 10317208 10939796 11135712 11072770 10750287 10734578 10974032
6826 10974032 10718389 10932889 10833881 10903696 11229471 11286155 10913560 10757692 10331583 9877627
6816 9877627 9779824 9855517 9696989 9646704 9596873 9297224 9465069 9388707 9265545 9374593
6806 9374593 9142933 8776635 8729081 8778680 8788006 8855689 9153500 9627692 9771323 9624413
6796 9624413 9827999 9860404 10020671 10034982 10366167 10343784 10191328 10295239 10843576 10987569
6786 10987569 10520315 10863057 10987642 10858260 10985029 11369857 11548008 11438064 11384596 11522673
$$ packed form
6856H895296j32517Q3733n06898k98737L36152j9331M6623l52095K16523l85717
6846G883032K49602N35957m92828L23637M19123p133K55325J5261K37451m0447
6836I378980N798K07180L84151L41099O22588J95916o2942l22483j5709K39454
6826A0974032k55643K14500r9008O9815L25775N6684l72595j55868m26109m53956
6816I877627r7803P5693j58528n0285m9831k99649J67845p6362j23162J09048
6806I374593k31660l66298m7554M9599R326O7683K97811M74192J43631j46910
6796I624413K03586L2405J60267J4311L31185k2383j52456J03911N48337J43993
6786A0987569m67254L42742J24585j29382J26769L84828J78151j09944n3468J38077
$$ plain form
6776 11522673 11228634 11457495 11082772 10618830 10288539 9866629 9424758 9136707 9330745
6767 9330745 10089604 9708460 9272949 8954209 8376035 8210354 8052616 8301608 8077728 7520350
6757 7520350 7028041 7204279 6882227 6900069 7045140 6639822 6484768 6467504 6666644 6349565
6747 6349565 6397044 6724278 6574022 6104853 6047909 6259352 6142482 6171934 6435930 6138371
6737 6138371 5654674 5641022 5908705 5775344 5791200 5451750 5637712 5502147 5839559 6081946
6727 6081946 5659781 5865890 6202811 6163042 6080595 5925421 5983219 6250799 6537951 6290544
6717 6290544 5951823 5818788 5861330 6401614 6460457 6372597 6598530 6600299 6504464 6782857 6482419
6706 6482419 6620468 6836616 6975270 6969279 7040487 6825633 6188813 5876366 6098900 6342441
$$ packed form
6776A1522673k94039K28861l74723m63942l30291m21910m41871k88051J94038
6767I330745P58859l81144m35511l18740n78174j65681j57738K48992k23880n57378
6757G520350m92309J76238l22052J7842J45071m05318j55054j7264J99140l17079
6747F349565M7479L27234j50256m69169n6944K11443j16870K9452K63996k97559
6737F138371m83697j3652K67683j33361J5856l39450J85962j35565L37412K42387
6727F081946m22165K06109L36921l9769q2447j55174N7798K67580K87152k47407
6717F290544l38721j33035M2542N40284N8843q7860K25933J769r5835K78393l00438
6706F482419J38049K16148J38654n991P1208k14854o36820l12447K22534K43541
$$ plain form
6696 6342441 6291371 6244617 5958898 6251095 6571748 6849326 6828435 6420612 6640319 6623351
6686 6623351 6834233 6448014 6255272 6755125 6700690 6687843 6855332 6823209 7347538 7316399
6676 7316399 7415863 7881414 7973530 7838005 8068274 8319751 8645284 8975638 9227228 9308645
6666 9308645 9048216 9499103 9407934 9881709 10338008 10672148 10601685 9911626 9444294 9540098
6656 9540098 9860817 9398282 9142819 9104850 9264703 8896964 8558508 8937848 9041944 8834154
6646 8834154 8590087 8710163 8825023 8909645 9311143 9222462 9188829 9393871 9105121 9417789
6636 9417789 9667221 9543742 9851931 9895698 9378013 9203660 9514346 9680946 9523097 9079709
6626 9079709 8862484 8717033 8435963 8222591 7657367 7287470 7254355 7148165 6849275 7119822
$$ packed form
6696F342441n1070m6754k85719K92197L20653K77578k0891m07823K19707j6968
6686F623351K10882l86219j92742M99853n4435j2847J67489l2123N24329l1139
6676G316399R9464M65551R2116j35525K30269K51477L25533L30354K51590Q1417
6666I308645k60429M50887r1169M73775M56299L34140p0463o90059m67332R5804
6656I540098L20719m62535k55463l7969J59853l67739l38456L79340J04096k07790
6646H834154k44067J20076J14860Q4622M01498q8681l3633K05042k88750L12668
6636I417789K49432j23479L08189M3767n17685j74353L10686J66600j57849m43388
6626I079709k17225j45451k81070k13372n65224l69897l3115j06190k98890K70547
$$ plain form
6616 7119822 7358811 7331293 7264426 6861810 6649146 6635639 6754736 7023469 6896717 6486765
6606 6486765 6734324 7194714 7311182 6831841 7125554 7446406 7613543 7506413 8053702 8299679
6596 8299679 7943063 7772700 7362045 7271087 7558255 7729083 7295859 7023396 7312396 6866692
6586 6866692 6748904 6615757 6232306 5827817 6209690 6616544 6204854 6165753 6266639 5895793
6576 5895793 5754485 5492394 5797597 6146259 5533037 5377651 5974633 6150741 6145293 6155739
6566 6155739 5988525 5937049 5700023 5762598 6363213 6366193 6105346 6657613 6940856 7034626
6556 7034626 6758825 6654070 6463943 6602531 6207118 6018837 6021516 5958466 5729513 5249224
6546 5249224 5396643 5590980 5285890 5090089 5342940 5125668 5200747 5344250 5053558 5165991
$$ packed form
6616G119822K38989k7518o6867m02616k12664j3507J19097K68733j26752m09952
6606F486765K47559M60390J16468m79341K93713L20852J67137j07130N47289K45977
6596H299679l56616j70363m10655r0958K87168J70828m33224k72463K89000m45704
6586F866692j17788j33147l83451m04489L81873M06854m11690l9101J00886l70846
6576E895793j41308k62091L05203L48662o13222j55386N96982J76108n448J0446
6566F155739j67214n1476k37026O2575O00615K980k60847N52267K83243R3770
6556G034626k75801j04755j90127J38588l95413j88281K679o3050k28953m80289
6546E249224J47419J94337l05090j95801K52851k17272P5079J43503k90692J12433
$$ plain form
6536 5165991 5214390 5219849 4998913 4718884 4810446 5114661 4787158 4786696 4825272 4865527 5065272
6525 5065272 4842581 4598028 4707201 4578269 4646195 5084497 4996201 4963765 5013998 5174860
6515 5174860 5533678 5932137 5468918 5606532 5460224 5315688 5598400 5677134 5630320 5697694
6505 5697694 5756549 5476664 5531159 5713259 5522944 5004186 5456966 5633749 5714600 5651208
6495 5651208 5708754 5596877 5661043 6021792 5675775 5411596 5744792 5776681 5769659 5475090
6485 5475090 5566003 5303234 5102823 5360068 6053432 6111707 6271598 6039720 5868231 5958840
6475 5958840 5551644 5491446 5961242 5739353 5615546 5500556 5368713 5563167 5967679 6069106
6465 6069106 5865970 5993145 5880017 5993040 6214824 6378683 6405879 6071910 6139536 6432193
$$ packed form
6536E165991M8399N459k20936k80029R1562L04215l27503m62L8576M0255J99745
6525E065272k22691k44553J09173j28932O7926M38302q8296l2436N0233J60862
6515E174860L58818L98459m63219J37614j46308j44536K82712P8734m6814O7374
6505E697694N8855k79885N4495J82100j90315n18758M52780J76783Q0851o3392
6495E651208N7546j11877O4166L60749l46017k64179L33196L1889p022k94569
6485E475090R0913k62769k00411K57245O93364N8275J59891k31878j71489R0609
6475E958840m07196o0198M69796k21889j23807j14990j31843J94454M04512J01427
6465F069106k03136J27175j13128J13023K21784J63859K7196l33969O7626K92657
$$ plain form
6455 6432193 6216910 6029421 6401556 6657391 6362650 6577724 6532900 6793279 6879128 6637464
6445 6637464 6847495 6551853 6296844 6800774 6919221 6742580 6572508 7365074 7437980 7334652
6435 7334652 7587617 7361031 7613525 7538412 7413698 7985604 8226504 8025495 7609050 7761128
6425 7761128 7633217 7847732 7740622 7645893 8016935 8161172 8029262 8149110 7949279 7866470
6415 7866470 7748335 8421160 8483665 7987996 8114234 8219399 8123358 8024147 8158345 8348570
6405 8348570 8365658 8450682 8325306 8284531 8450687 8802432 8461861 8385991 8263849 8530021
6395 8530021 8868795 9128158 8981016 8870619 9533022 9731793 9761188 9420495 9343614 9731919
6385 9731919 10000778 10453150 10830417 10822208 10505665 10342638 10171160 10208225 10252737 9728717
$$ packed form
6455F432193k15283j87489L72135K55835k94741K15074m4824K60379Q5849k41664
6445F637464K10031k95642k55009N03930J18447j76641j70072P92566P2906j03328
6435G334652K52965k26586K52494p5113j24714N71906K40900k01009m16445J52078
6425G761128j27911K14515j07110r4729L71042J44237j31910J19848j99831q2809
6415G866470j18135O72825O2505m95669J26238J05165r6041r9211J34198J90225
6405H348570J7088Q5024j25376m0775J66156L51745l40571p5870j22142K66172
6395H530021L38774K59363j47142j10397O62403J98771K9395l40693p6881L88305
6385I731919K68859M52372L77267q209l16543j63027j71478L7065M4512n24020
$$ plain form
6375 9728717 10145299 10406506 10379072 10768115 10736725 10554519 10294729 10187393 10635470 10905015
6365 10905015 10836121 10834190 10594952 10784213 10536856 10752754 10832372 10976261 11679953 11785886
6355 11785886 11569153 11719590 11966579 11970734 11750136 11628301 12009216 12203890 12883395 12731124
6345 12731124 12611400 12654637 12761796 12884018 13452332 13573159 13150607 13283806 13718016 13898332
6335 13898332 14468434 14937919 15092874 15122077 15683418 15775423 16151938 16242012 16965632 17133754
6325 17133754 17005151 17630357 17945048 17755348 18426420 18653400 18539792 18453328 18847377 19057587
6315 19057587 19032397 19506036 19456081 19037866 18739782 18916762 19045523 19041188 19071580 18900115
6305 18900115 19002455 19193309 19272491 19393418 19645807 19219169 19407045 19534768 19737903 19792818
$$ packed form
6375I728717M16582K61207k7434L89043l1390j82206k59790j07336M48077K69545
6365A0905015o8894j931k39238J89261k47357K15898P9618J43889P03692J05933
6355A1785886k16733J50437K46989M155k20598j21835L80915J94674O79505j52271
6345A2731124j19724M3237J07159J22222N68314J20827m22552J33199M34210J80316
6335A3898332N70102M69485J54955K9203N61341R2005L76515R0074P23620J68122
6325A7133754j28603O25206L14691j89700O71072K26980j13608q6464L94049K10210
6315A9057587k5190M73639m9955m18215k98084J76980J28761m335L0392j71465
6305A8900115J02340J90854P9182J20927K52389m26638J87876J27723K03135N4915
$$ plain form
6295 19792818 19540686 19849193 19933032 20672517 20686464 20766712 21205321 21330199 21736464 22095304
6285 22095304 22054784 21890362 22701508 22902361 23094191 23519784 23798656 24207911 24235423 24839764
6275 24839764 24916107 24984910 24925342 25365295 25248311 24728516 24821188 24852128 24755179 24499274
6265 24499274 24284972 24479035 24646037 24746465 25134261 25239317 25237445 25233678 25528209 25323318
6255 25323318 25142580 25206628 25530083 25916115 25857987 26282086 26410826 26360525 26604668 27371589
6245 27371589 27744148 28242690 28534722 29029446 29410312 29771875 30129086 31270786 31551840
6236 31551840 31633254 32333615 32787493 33136303 34122138 35283876 35717894 35925882 36761143
6227 36761143 37634797 38494582 39437120 40230170 40988552 42565464 43469307 44650276 46198017
$$ packed form
6295A9792818k52132L08507Q3839P39485J3947Q0248M38609J24878M06265L58840
6285B2095304m0520j64422Q11146K00853J91830M25593K78872M09255K7512O04341
6275B4839764P6343O8803n9568M39953j16984n19795R2672L0940r6949k55905
6265B4499274k14302J94063J67002J00428L87796J05056j872l767K94531k04891
6255B5323318j80738O4048L23455L86032n8128M24099J28740n0301K44143P66921
6245B7371589L72559M98542K92032M94724L80866L61563L57211J141700K81054
6236C1551840Q1414P00361M53878L48810R85835J161738M34018K07988Q35261
6227C6761143Q73654Q59785R42538P93050P58382J576912R03843J180969J547741
$$ plain form
6218 46198017 47445591 48733138 49677287 50730341 52163312 53379533 54667529 56328032
6210 56328032 57985958 59459730 60692908 61852728 63296644 64738337 66265991 67780305
6202 67780305 69235016 70711879 71847642 73268289 74548717 76257631 77571445 78746897
6194 78746897 80197190 81691373 83097467 84333058 85227852 86316760 87163409 87788930 88337964
6185 88337964 88890344 89603943 90342901 90780344 90878124 91048329 91115376 91253811 91274211 91161762
6175 91161762 90877416 90609905 90150291 89481706 88596456 87658582 87046911 86717233 86042911
6166 86042911 85419823 84672613 84693240 85419000 86125514 86573384 87339540 88512213 89809227
6157 89809227 91852016 93725398 95500677 98092449 100953300 104219703 107527305 110364214
$$ packed form
6218D6198017J247574J287547R44149J053054J432971J216221J287996J660503
6210E6328032J657926J473772J233178J159820J443916J441693J527654J514314
6202F7780305J454711J476863J135763J420647J280428J708914J313814J175452
6194G8746897J450293J494183J406094J235591Q94794J088908Q46649O25521N49034
6185H8337964N52380P13599P38958M37443R7780J70205O7047J38435K0400j12449
6175I1161762k84346k67511m59614o68585q85250r37874o11671l29678o74322
6166H6042911o23088p47210K0627P25760P06514M47870P66156J172673J297014
6157H9809227K042789J873382J775279K591772K860851L266403L307602K836909
$$ plain form
6149 110364214 114062111 117627241 120919802 123528322 125606118 127362427 129235858 129908900
6141 129908900 129931969 129410535 128254888 126282175 123813315 120756354 117431967 113148255
6133 113148255 109010092 105152282 101169646 96949298 93092813 89483221 85689398 82292141
6125 82292141 78524548 75653113 72918007 70782739 68948711 66369279 64506213 62841656
6117 62841656 61300695 60144977 58889998 57690355 56651575 56223289 55785859 55173070 54935576
6108 54935576 54637366 54585338 54453181 54099030 54116919 53991063 53916350 54507840 54824309 55136084
6098 55136084 55460741 55831518 55919092 55994308 56518913 57066131 56868883 57542365 58067119 58163143
6088 58163143 58158819 58476736 59446057 59812386 59545621 59644755 60511711 61222617 62169880 62935382
$$ packed form
6149A10364214L697897L565130L292561K608520K077796J756309J873431O73042
6141A29908900K3069n21434j155647j972713k468860l056961l324387m283712
6133A13148255m138163l857810l982636m220348l856485l609592l793823l397257
6125H2292141l767593k871435k735106k135268j834028k579432j863066j664557
6117F2841656j540961j155718j254979j199643j038780m28286m37430o12789k37494
6108E4935576k98210n2028j32157l54151J7889j25856p4713N91490L16469L11775
6098E5136084L24657L70777Q7574P5216N24605N47218j97248O73482N24754R6024
6088E8163143m324L17917R69321L66329k66765R9134Q66956P10906R47263P65502
$$ plain form
6078 62935382 63592597 64355883 65393695 66210291 66861671 67600782 68178790 68757397 69176100
6069 69176100 69610076 69487040 69201080 69492854 69267781 69240727 68630054 68026384 67628870 67298466
6059 67298466 66889080 66721706 66527889 66598099 66687447 66704514 67031810 67643838 68398558 68987491
6049 68987491 69731133 70276768 70401215 70733442 71505498 71445620 71437904 71307644 70440236 70091034
6039 70091034 69554151 69094169 68509675 68056539 67573851 67303458 66997732 67063436 67134150 67225027
6029 67225027 67385315 67997806 68525539 69140879 70066472 71485178 72209827 73057059 73879060
6020 73879060 74466694 75704646 76924106 78639194 79815798 81704950 84033338 87026036
6012 87026036 91084124 95166230 99387658 102640203 104856823 105743540 105423566 104361833
$$ packed form
6078F2935382O57215P63286J037812Q16596O51380P39111N78008N78607M18703
6069F9176100M33976j23036k85960K91774k25073k7054o10673o03670l97514l30404
6059F7298466m09386j67374j93817P0210Q9348J7067L27296O12028P54720N88933
6049F8987491P43642N45635J24447L32227P72056n9878p716j30260q67408l49202
6039G0091034n36883m59982n84494m53136m82688k70393l05726O5704P0714R0877
6029F7225027J60288O12491N27733O15340R25593J418706P24649Q47232Q22001
6020G3879060N87634J237952J219460J715088J176604J889152K328388K992698
6012H7026036M058088M082106M221428L252545K216620Q86717l19974j061733
$$ plain form
6004 104361833 102656377 101262577 100574938 100414730 100408040 101022824 102047740 102521906 103509060
5995 103509060 104303345 104403961 105335361 106150060 106547631 107016861 107831833 108262745 109185735
5986 109185735 110372725 111844389 114125124 116562863 118973604 121319070 122879874 124028106
5978 124028106 124480329 124614625 124094406 123402861 122414623 121053644 119216914 117068863 114692081
5969 114692081 112366326 109471303 106581484 103840429 101209822 98767075 96113521 93835649
5961 93835649 91900846 90327421 88542873 87206291 85765604 84440495 83480320 82361385
5953 82361385 81241248 79952253 78800438 77191609 75154291 73307939 70789544 68221078
5945 68221078 66220917 63723453 61424091 58913279 56352872 54361226 52097610 49871584
$$ packed form
6004A04361833j705456j393800o87639j60208o690O14784J024916M74166R87154
5995A03509060P94285J00616R31400Q14699L97571M69230Q14972M30912R22990
5986A09185735J186990J471664K280735K437739K410741K345466J560804J148232
5978A24028106M52223J34296n20219o91545r88238j360979j836730k148051k376782
5969A14692081k325755k895023k889819k741055k630607k442747k653554k277872
5961I3835649j934803j573425j784548j336582j440687j325109r60175j118935
5953H2361385j120137j288995j151815j608829k037318j846352k518395k568466
5945F8221078k000161k497464k299362k510812k560407j991646k263616k226026
$$ plain form
5937 49871584 48033044 46150434 43859829 42485964 41453004 40180095 38928225 38271017
5929 38271017 37609131 36571440 35447732 34778765 33801836 33383395 32677293 32216872 31929986
5920 31929986 31332203 30689446 30304129 30208964 29610729 29245789 28825427 28577128 28026889 27840850
5910 27840850 27672015 27424874 27373894 27299857 27094817 26857936 26834561 26759432 26971830 26886880
5900 26886880 27095181 27254125 26986601 27068442 26998267 26999301 27509168 28063910 28798204 29230231
5890 29230231 29827583 31042774 31778567 32392245 33129391 33784981 33659487 33862919 33083551
5881 33083551 31749538 30683106 28996206 27738136 26439258 25429232 25184232 24908565
5873 24908565 24594220 23993929 23263460 23177363 23121572 22953750 22881019 22635945 22787752 22483932
$$ packed form
5937D9871584j838540j882610k290605j373865j032960j272909j251870o57208
5929C8271017o61886j037691j123708o68967r76929m18441p06102m60421k86886
5920C1929986n97783o42757l85317r5165n98235l64940m20362k48299n50239j86039
5910B7840850j68835k47141n0980p4037k05040k36881k3375p5129K12398q4950
5900B6886880K08301J58944k67524Q1841p0175J034N09867N54742P34294M32027
5890B9230231N97352J215191P35793O13678P37146O55590j25494K03432p79368
5881C3083551j334013j066432j686900j258070j298878j010026k45000k75667
5873B4908565l14345o00291p30469q6097n5791j67822p2731k45074J51807l03820
$$ plain form
5863 22483932 22164661 22280466 22142805 22123224 21940985 21865807 22075398 22006883 21984421 21810714
5853 21810714 22066988 22175977 22354294 22323195 22063278 21923736 22286662 22296770 22396400 22411778
5843 22411778 22330501 22442967 22700130 23125810 23235042 22912911 22526739 22335396 22409965 22256166
5833 22256166 21963229 21767884 21886275 21996468 21517265 21925173 21770744 21747664 21884630 22189988
5823 22189988 22588217 22501205 22537621 22557020 22458881 22513352 22386563 22598096 22959700 22669586
5813 22669586 22918836 23012785 22966572 22887004 23248657 23460020 23146341 22988857 23316402 23736598
5803 23736598 23707038 23604947 23726866 23822733 23298022 23685691 24015816 24551977 24618463 24500576
5793 24500576 24915127 25521674 25547214 25661242 25829386 25847214 26419302 26892038 27167834 27478227
$$ packed form
5863B2483932l19271J15805j37661j9581j82239p5178K09591o8515k2462j73707
5853B1810714K56274J08989J78317l1099k59917j39542L62926J0108R9630J5378
5843B2411778q1277J12466K57163M25680J09232l22131l86172j91343P4569j53799
5833B2256166k92937j95345J18391J10193m79203M07908j54429k3080J36966L05358
5823B2189988L98229q7012L6416J9399r8139N4471j26789K11533L61604k90114
5813B2669586K49250R3949m6213p9568L61653K11363l13679j57484L27545M20196
5803B3736598k9560j02091J21919R5867n24711L87669L30125N36161O6486j17887
5793B4500576M14551O06547K5540J14028J68144J7828N72088M72736K75796L10393
$$ plain form
5783 27478227 27311190 27667246 28152047 28467011 29042397 29600400 30215119 30396732 30725535
5774 30725535 31440862 32200919 32653214 32830336 33735825 34438817 35543403 36530999 37539477
5765 37539477 38693140 39621115 41140398 42582748 44720547 47532719 50440369 53804985
5757 53804985 58745016 64190220 68210143 71448440 73757311 74485680 72929477 70119230
5749 70119230 66273702 62476263 59708936 57771240 56699866 56278110 55666034 55191633 55164883
5740 55164883 55540055 56191473 56761739 56857506 57215103 57407585 57659765 58439650 59138311 60026320
5730 60026320 61555191 63427546 65530263 67883750 70127881 72152024 72526083 73050006
5722 73050006 72990973 72321557 71418836 71005142 70685330 71060048 71362474 71579351 72187300 72899621
$$ packed form
5783B7478227j67037L56056M84801L14964N75386N58003O14719J81613L28803
5774C0725535P15327P60057M52295J77122R05489P02992J104586R87596J008478
5765C7539477J153663R27975J519283J442350K137799K812172K907650L364616
5757E3804985M940031N445204M019923L238297K308871P28369j556203k810247
5749G0119230l845528l797439k767327j937696j071374m21756o12076m74401k6750
5740E5164883L75172O51418N70266R5767L57597J92482K52180P79885O98661Q88009
5730F0026320J528871J872355K102717K353487K244131K024143L74059N23923
5722G3050006n9033o69416r02721m13694l19812L74718L02426K16877O07949P12321
$$ plain form
5712 72899621 73496950 74187659 74942175 76037123 76577798 76562758 76627151 76391980 76109414 75160337
5702 75160337 74794510 74303820 73799327 73213143 72347023 71637644 70950515 70556604 70010118
5693 70010118 69675022 69080401 68889788 68718995 68087325 67301547 67331236 67030867 66833387 66616634
5683 66616634 67129158 67729539 68244523 69296089 70901249 72366312 73998493 76341509 79055761
5674 79055761 81870503 85341310 88683877 91270986 93180720 94238507 94589011 94117768
5666 94117768 92893589 90393312 87617319 85115429 83185101 81398887 80220933 79425237
5658 79425237 79057561 78558778 78155965 77544061 77406224 77083807 77439363 77644971 76906405
5649 76906405 76300623 75021376 74679381 74468688 73672379 73584293 73695933 73414678 73241407
$$ packed form
5712G2899621N97329O90709P54516J094948N40675j5040O4393k35171k82566r49077
5702G5160337l65827m90690n04493n86184q66120p09379o87129l93911n46486
5693G0010118l35096n94621j90613j70793o31670p85778K9689l00369j97480k16753
5683F6616634N12524O00381N14984J051566J605160J465063J632181K343016K714252
5674G9055761K814742L470807L342567K587109J909734J057787L50504m71243
5666I4117768j224179k500277k775993k501890j930328j786214j177954p95696
5658G9425237l67676m98783m02813o11904j37837l22417L55556K05608p38566
5649G6906405o05782j279247l41995k10693p96309q8086J11640k81255j73271
$$ plain form
5640 73241407 73468134 73737875 74080671 74681702 75832723 76070845 76597944 76678619 77328101
5631 77328101 78475215 78505444 78624879 79279450 80070406 80435400 80541538 80467517 80426203 80551147
5621 80551147 80928105 81172876 80707394 79781367 78911132 78336296 77886916 77234802 76599470
5612 76599470 76257876 76093981 76459290 76214040 75917099 76241946 76414919 76506562 76862167 77424789
5602 77424789 78247011 79225427 79784076 80170851 80342777 81443756 82268208 82986225 83359772
5593 83359772 82927618 83364561 83172939 83166623 82956791 82628248 82083363 81466747 81410684 81240422
5583 81240422 80767585 80679330 80548935 80636852 81652588 81954379 81984687 82537064 83518485 84297880
5573 84297880 84917660 86397125 87491536 88333836 89951477 91094993 92647393 93756527
$$ packed form
5640G3241407K26727K69741L42796O01031J151021K38122N27099Q0675O49482
5631G7328101J147114L0229J19435O54571P90956L64994J06138p4021m1314J24944
5621H0551147L76958K44771m65482r26027q70235n74836m49380o52114o35332
5612G6599470l41594j63895L65309k45250k96941L24847J72973R1643L55605N62622
5602G7424789Q22222R78416N58649L86775J71926J100979Q24452P18017L73547
5593H3359772m32154M36943j91622o316k09832l28543n44885o16616n6063j70262
5583H1240422m72837q8255j30395Q7917J015736L01791L0308N52377R81421P79395
5573H4297880O19780J479465J094411Q42300J617641J143516J552400J109134
$$ plain form
5565 93756527 94187657 95247816 96412943 96922729 97557684 97992609 98009151 98059148 98520575
5556 98520575 99044750 99733228 100703838 101572736 102458371 103308490 104588465 105537692 106362110
5547 106362110 108168135 109406812 110673840 112276839 113323980 114704187 116635155 118080198
5539 118080198 119295763 121286107 123584205 124792950 126168783 127251113 128635647 129568716
5531 129568716 129501685 129407187 129622601 129280309 128256890 127060937 125965641 125525440 124982267
5522 124982267 124574617 124240808 124426758 124757224 125313196 126415396 128105623 129763220 131520566
5513 131520566 133505908 135637121 137058199 138319603 138731075 138552726 137700963 136331270
5505 136331270 133958855 131084531 127971354 124838339 121552023 117941639 114310873 111314652
$$ packed form
5565I3756527M31130J060159J165127N09786O34955M34925J6542M9997M61427
5556I8520575N24175O88478R70610Q68898Q85635Q50119J279975R49227Q24418
5547A06362110J806025J238677J267028J602999J047141J380207J930968J445043
5539A18080198J215565J990344K298098J208745J375833J082330J384534R33069
5531A29568716o7031r4498K15414l42292j023419j195953j095296m40201n43173
5522A24982267m07650l33809J85950L30466N55972J102200J690227J657597J757346
5513A31520566J985342K131213J421078J261404M11472j78349q51763j369693
5505A36331270k372415k874324l113177l133015l286316l610384l630766k996221
$$ plain form
5497 111314652 108717314 106153681 104395078 102747586 100679462 99480008 98250413 97231527
5489 97231527 96338294 95519021 95152652 93987759 93138593 91776124 90207678 89097609 87620473
5480 87620473 86329607 84802063 82959085 81756438 80200059 79040731 77826579 76763569
5472 76763569 75705239 74664824 73988581 73143909 72544805 72401272 72082164 71784688 71499213
5463 71499213 71263935 70886811 70795818 70695504 70778963 71111182 71184403 71580480 72081569 72473392
5453 72473392 72918548 73331067 73446473 73809427 74541518 75148888 75866001 76503069 77280782
5444 77280782 77701562 78493333 79564161 81095021 82526451 84408632 86409507 88015345
5436 88015345 89039366 89545484 89603529 88212878 86224171 84080296 82127875 80867227 79987953
$$ packed form
5497A11314652k597338k563633j758603j647492k068124j199454j229595j018886
5489I7231527q93233q19273l66369j164893q49166j362469j568446j110069j477136
5480H7620473j290866j527544j842978j202647j556379j159328j214152j063010
5472G6763569j058330j040415o76243q44672n99104j43533l19108k97476k85475
5463G1499213k35278l77124r0993j00314Q3459L32219P3221L96077N01089L91823
5453G2473392M45156M12519J15406L62954P32091O07370P17113O37068P77713
5444G7280782M20780P91771J070828J530860J431430J882181K000875J605838
5436H8015345J024021N06118N8045j390651j988707k143875j952421j260648q79274
$$ plain form
5427 79987953 79550284 79138085 78930689 79220642 79344791 78995014 79157738 79438098 79974434
5418 79974434 80145576 80519452 80844790 80752393 80886735 81038111 81106441 81443776 82026818 82205247
5408 82205247 82233645 82361965 83342511 83632568 84378602 84720379 84846936 85571106 86219407 86683304
5398 86683304 87108159 87603675 87948564 88377645 89592013 90431377 91216090 91991255 92481670
5389 92481670 93301401 93821160 94141012 94552475 94644006 94811485 94887556 94912740 94237981 94153798
5379 94153798 94075555 94415187 94325865 94247749 94764711 95194720 95291727 95445731 95792617 96219112
5369 96219112 96529941 96937425 97907640 98639599 100030268 101639803 104231849 105983483 108001802
5360 108001802 110135563 111911808 113632488 115205252 116026470 115795867 115068309 113585186
$$ packed form
5427G9987953m37669m12199k07396K89953J24149l49777J62724K80360N36336
5418G9974434J71142L73876L25338r2397J34342J51376O8330L37335N83042J78429
5408H2205247K8398J28320R80546K90057P46034L41777J26557P24170O48301M63897
5398H6683304M24855M95516L44889M29081J214368Q39364P84713P75165M90415
5389I2481670Q19731N19759L19852M11463R1531J67479P6071K5184o74759q4183
5379I4153798p8243L39632q9322p8116N16962M30009R7007J54004L46886M26495
5369I6219112L10829M07484R70215P31959J390669J609535K592046J751634K018319
5360A08001802K133761J776245J720680J572764Q21218k30603p27558j483123
$$ plain form
5352 113585186 112168553 109644674 107301814 104868146 101905812 99284250 96838547 93950909
5344 93950909 91283270 88968153 86914327 84963008 83283715 81504308 80144989 78878288
5336 78878288 78073816 77160183 76310294 75223627 74481690 74092822 73836031 73316583 72768931
5327 72768931 72529709 71580830 71075819 70600703 70008527 69440347 69070577 68655397 67885585
5318 67885585 67358113 67784440 68235283 68381546 68082498 67937811 67259827 66522303 65717176
5309 65717176 65424805 64731148 64119683 64045631 63732627 62923116 62655553 62363609 61754477 61437996
5299 61437996 61584730 61347569 61159056 60865605 60717654 60965289 61242622 61051409 61225202
5290 61225202 61649802 61732784 61753933 61646304 62000331 62198554 62329036 62423711 62447040 62184701
$$ packed form
5352A13585186j416633k523879k342860k433668k962334k621562k445703k887638
5344I3950909k667639k315117k053826j951319j679293j779407j359319j266701
5336G8878288q04472r13633q49889j086667p41937l88868k56791n19448n47652
5327G2768931k39222r48879n05011m75116n92176n68180l69770m15180p69812
5318F7885585n27472M26327M50843J46263k99048j44687o77984p37524q05127
5309F5717176k92371o93657o11465p4052l13004q09511k67563k91944o09132l16481
5299F1437996J46734k37161j88513k93451j47951K47635K77333j91213J73793
5290F1225202M24600Q2982K1149j07629L54027J98223J30482R4675K3329k62339
$$ plain form
5280 62184701 62047391 61470396 60905774 60413096 59778878 59054465 58358330 58135766 57862990
5271 57862990 57985706 57379125 57024267 56833152 56644897 56984459 57336282 57624762 57921155
5262 57921155 57883996 58246080 59182352 59239791 59924539 61031359 61405392 61653960 62277564 62614222
5252 62614222 63829634 64717639 64959351 65794969 66702570 67165351 67945589 68316336 68625239
5243 68625239 69528281 70015913 70498510 71008627 71561293 71758559 72610571 73316522 73934626
5234 73934626 74544508 75366238 76766906 77688300 78025411 79041508 80249382 81252903 82943447
5225 82943447 84101797 84801000 85935140 86796926 87480737 88275411 88733579 89089764 89700640
5216 89700640 90335610 90548727 90548986 91040655 91714073 91821888 92053003 93005651 93953690 94733971
$$ packed form
5280F2184701j37310n76995n64622m92678o34218p24413o96135k22564k72776
5271E7862990J22716o06581l54858j91115j88255L39562L51823K88480K96393
5262E7921155l7159L62084R36272N7439O84748J106820L74033K48568O23604L36658
5252F2614222J215412Q88005K41712Q35618R07601M62781P80238L70747L08903
5243F8625239R03042M87632M82597N10117N52666J97266Q52012P05951O18104
5234G3934626O09882Q21730J400668R21394L37111J016097J207874J003521J690544
5225H2943447J158350O99203J134140Q61786O83811P94674M58168L56185O10876
5216H9700640O34970K13117K59M91669O73418J07815K31115R52648R48039P80281
$$ plain form
5206 94733971 95466903 96587383 97547949 98675309 100314802 101860087 102918840 103631045 104877368
5197 104877368 105402557 105448069 105336057 105085193 104303387 103424582 101870686 100107042 98217152
5188 98217152 96532633 94820890 93336406 91654271 89745954 88119801 86908250 85757235
5180 85757235 84766619 84540865 83669328 82640329 82004805 81658668 81466599 81204316 80825207
5171 80825207 80342199 79821677 78975163 77790382 76565992 75608944 74326904 72598040 70933588
5162 70933588 68967892 67167424 65413620 63866090 61958597 59784163 58180063 56588498
5154 56588498 55583417 54280322 53153661 51884934 51127870 50323686 49311902 48637349 48491753
5145 48491753 47881866 46834382 46508708 46137692 46127838 45609738 44568290 43910540 43694533
$$ packed form
5206I4733971P32932J120480R60566J127360J639493J545285J058753P12205J246323
5197A04877368N25189M5512j12012k50864p81806q78805j553896j763644j889890
5188I8217152j684519j711743j484484j682135j908317j626153j211551j151015
5180H5757235r90616k25754q71537j028999o35524l46137j92069k62283l79109
5171H0825207m83008n20522q46514j184781j224390r57048j282040j728864j664452
5162G0933588j965696j800468j753804j547530j907493k174434j604100j591565
5154E6588498j005081j303095j126661j268727p57064q04184j011784o74553j45596
5145D8491753o09887j047484l25674l71016r854n18100j041448o57750k16007
$$ plain form
5136 43694533 42996930 42640732 42596728 41723382 41245092 40893335 40126849 40003167 39892636 39560639
5126 39560639 39448029 39072233 38950097 38820354 38893883 38844219 38751051 39343042 39183668 39240390
5116 39240390 39667933 39912459 40723930 41663367 42296342 43247298 43973408 44213041 44793974
5107 44793974 45082430 45056312 44720372 44213165 43393198 42397004 41983704 41735691 41059719 40548450
5097 40548450 40463924 40441730 40763093 40621402 40924380 41113478 41546179 41780717 41961251 41899923
5087 41899923 42352115 43157909 44180782 44756780 45407616 46322303 47479288 48570028 49694379
5078 49694379 50959095 52198798 53591382 54547113 55252819 55935776 56142955 56330396 56081457
5069 56081457 55319353 54710357 54545199 54861272 55121408 55034991 55242274 55829337 55894028 56695942
$$ packed form
5136D3694533o97603l56198m4004q73346m78290l51757p66486j23682j10531l31997
5126C9560639j12610l75796j22136j29743P3529m9664r3168N91991j59374N6722
5116C9240390M27543K44526Q11471R39437O32975R50956P26110K39633N80933
5107D4793974K88456k6118l35940n07207q19967r96194m13300k48013o75972n11269
5097D0548450q4526k2194L21363j41691L02978J89098M32701K34538J80534o1328
5087D1899923M52192Q05794J022873N75998O50836R14687J156985J090740J124351
5078D9694379J264716J239703J392584R55731P05706O82957K07179J87441k48939
5069E6081457p62104o08996j65158L16073K60136q6417K07283N87063O4691Q01914
$$ plain form
5059 56695942 57443970 57840688 58236596 58703360 59292676 59834104 60395808 60963324 61242048
5050 61242048 61546517 61591296 62560596 63308650 64092112 64790379 65392563 65485995 65588596 66046865
5040 66046865 66558481 66797328 67128951 67215029 66974172 67557659 67627718 68040029 68124338 68642850
5030 68642850 69417374 69643577 70153299 70655899 70699235 71188447 72184996 73037337 73747553 74850096
5020 74850096 75996899 76743631 77909006 79309101 80333712 82001910 83234806 83904541
5012 83904541 85170048 87025947 88892746 90114876 90935031 92013957 93189550 94023585
5004 94023585 94896115 95703668 97281370 98584999 99726096 100993102 102072207 103471501
4996 103471501 105289891 107050705 109346217 111882539 114462391 116893714 119613691 122360044
$$ packed form
5059E6695942P48028L96718L95908M66764N89316N41428N61704N67516K78724
5050F1242048L04469M4779R69300P48054P83462O98267O02184R3432J02601M58269
5040F6046865N11616K38847L31623Q6078k40857N83487P0059M12311Q4309N18512
5030F8642850P74524K26203N09722N02600M3336M89212R96549Q52341P10216J102543
5020G4850096J146803P46732J165375J400095J024611J668198J232896O69735
5012H3904541J265507J855899J866799J222130Q20155J078926J175593Q34035
5004I4023585Q72530Q07553J577702J303629J141097J267006J079105J399294
4996A03471501J818390J760814K295512K536322K579852K431323K719977K746353
$$ plain form
4988 122360044 124813958 127537312 129735451 131597903 132593074 133356849 133759464 133267296 132600724
4979 132600724 131655526 130146236 128606208 126462058 124884995 123207843 121570511 120201769
4971 120201769 119029063 117729618 117184748 117071670 116577902 116711767 116510186 116845363 117069126
4962 117069126 117706873 118720398 119961376 120972762 122161317 123196757 124309521 125101078
4954 125101078 125451744 125731386 125897176 125380725 125810931 125620948 125823050 126689935 128186595
4945 128186595 130142226 132028799 134154132 134605636 134544005 133866235 132279238 128953141 124467498
4936 124467498 119584773 114094431 108886398 104840258 100665848 97612414 94855824 92332160
4928 92332160 90509261 89168582 88185739 87280454 86188705 85217474 84758172 84332583 84281878
$$ packed form
4988A22360044K453914K723354K198139J862452R95171P63775M02615m92168o66572
4979A32600724r45198j509290j540028k144150j577063j677152j637332j368742
4971A20201769j172706j299445n44870j13078m93768J33865k01581L35177K23763
4962A17069126O37747J013525J240978J011386J188555J035440J112764P91557
4954A25101078L50666K79642J65790n16451M30206j89983K02102Q66885J496660
4945A28186595J955631J886573K125333M51504o1631o77770j586997l326097m485643
4936A24467498m882725n490342n208033m046140m174410l053434k756590k523664
4928I2332160j822899j340679r82843r05285j091749r71231m59302m25589n0705
$$ plain form
4919 84281878 83919976 83657825 83942552 84700140 85602469 86375541 87649306 89039402 90242237
4910 90242237 91606882 93135502 94759425 96159025 97598441 99054383 100370184 101957737
4902 101957737 103487688 105153360 107448902 110069363 113339255 117148096 121430413 126502962
4894 126502962 132548172 139428141 147710802 157220753 167546912 178374587 189990799 201886260
4886 201886260 214154547 226907896 239937413 252571946 264089456 273818674 280767742
4879 280767742 283901050 282091591 275498329 264086693 248943219 230743747 212326645
4872 212326645 194855757 178837290 164444439 152526010 142362032 133471874 126244800
4865 126244800 120151604 115586263 111567247 108646343 106766479 104297334 101538506 99176839
$$ packed form
4919H4281878l61902k62151K84727P57588R02329P73072J273765J390096J202835
4910I0242237J364645J528620J623923J399600J439416J455942J315801J587553
4902A01957737J529951J665672K295542K620461L269892L808841M282317N072549
4894A26502962O045210O879969Q282661R509951J0326159J0827675J1616212J1895461
4886B01886260J2268287J2753349J3029517J2634533J1517510R729218O949068
4879B80767742L133308j809459o593262j1411636j5143474j8199472j8417102
4872B12326645j7470888j6018467j4392851j1918429j0163978q890158p227074
4865A26244800o093196m565341m019016k920904j879864k469145k758828k361667
$$ plain form
4857 99176839 96420346 93002623 89237944 84928738 80319848 75933327 71771955 67986313
4849 67986313 64770818 61769041 59241659 57186900 55451716 53494556 52098773 50847462
4841 50847462 49199092 47708962 46703491 45423675 44449948 43257879 42163749 41531037
4833 41531037 40642762 40061025 39222908 38490561 38077046 37507498 36971019 35732488 35118482
4824 35118482 34683373 33771210 33587703 33475713 33174179 32768313 32250333 31761441 31768765 31238384
4814 31238384 30931606 30556439 30282752 29642393 29131220 28721462 28054562 27432372 27043739
4805 27043739 26744525 26451110 26195169 25697004 25287940 25048366 24957338 25007402 24528556 23868896
4795 23868896 23980264 23992357 23921329 23814880 23880261 23710618 23833574 23788773 23446256 23505788
$$ packed form
4857I9176839k756493l417723l764679m309206m608890m386521m161372l785642
4849F7986313l215495l001777k527382k054759j735184j957160j395783j251311
4841E0847462j648370j490130j005471j279816r73727j192069j094130o32712
4833D1531037q88275n81737q38117p32347m13515n69548n36479j238531o14006
4824C5118482m35109r12163j83507j11990l01534m05866n17980m88892P324n30381
4814C1238384l06778l75167k73687o40359n11173m09758o66900o22190l88633
4805B7043739k99214k93415k55941m98165m09064k39574r1028N0064m78846o59660
4795B3868896J11368J2093p1028j06449O5381j69643J22956m4801l42517N9532
$$ plain form
4785 23505788 23851238 23570788 23212153 22831729 22760770 22663442 22529494 22669133 22766365 22634477
4775 22634477 22178860 21372102 21246466 21190830 21029085 21062581 20943843 20941274 20859771 20829547
4765 20829547 20815762 20833948 21063801 21093672 21087831 21056602 20729180 21111091 20900028 20545245
4755 20545245 19662060 19543720 18995587 18851284 19055108 18747244 18672139 18814221 18498400 18324450
4745 18324450 18204221 18279111 18526419 18581072 18552209 18417958 18191436 18260254 17888043 17548608
4735 17548608 17823109 18360053 18434759 18442159 18522820 18255737 18035474 17833133 18107617 18434582
4725 18434582 18795697 18866597 19213601 18740184 19110352 19665991 19480606 19520021 19363883 19966887
4715 19966887 20115709 20490267 20580448 20485989 20821636 21108562 21409709 21458331 21635712 22261102
$$ packed form
4785B3505788L45450k80450l58635l80424p0959r7328j33948J39639R7232j31888
4775B2634477m55617q06758j25636n5636j61745L3496j18738k569q1503l0224
4765B0829547j3785J8186K29853K9871n841l1229l27422L81911k11063l54783
4755B0545245q83185j18340n48133j44303K03824l07864p5105J42082l15821j73950
4745A8324450j20229P4890K47308N4653k8863j34251k26522O8818l72211l39435
4735A7548608K74501N36944P4706P400Q0661k67083k20263k02341K74484L26965
4725A8434582L61115P0900L47004m73417L70168N55639j85385L9415j56138O03004
4715A9966887J48822L74558R0181r4459L35647K86926L01147M8622J77381O25390
$$ plain form
4705 22261102 22196465 22383907 22824351 23289934 23472757 23717664 24074608 24232117 24619933 25236298
4695 25236298 25227248 24935852 25632688 25362291 25441387 26007820 26065671 26162180 26374527 25916519
4685 25916519 26380312 26938934 27501174 27615900 28124904 28599885 28827114 29154255 29707879
4676 29707879 30525112 31378224 31818032 32539983 32667282 32576939 32910150 32838531 32396200 31769976
4666 31769976 31238160 30756803 30350319 31017727 31416742 32039356 32424445 32859692 33905706
4657 33905706 34924035 36113411 37507927 39349566 40844190 42886810 45505940 48641092
4649 48641092 51839342 55519794 58717105 61858978 64841897 66788511 68687675 69852780
4641 69852780 69093110 67997642 65348732 62385290 58649117 54599054 50505308 47084370
$$ packed form
4705B2261102o4637J87442M40444M65583J82823K44907L56944J57509L87816O16365
4695B5236298r050k91396O96836k70397P9096N66433N7851R6509K12347m58008
4685B5916519M63793N58622N62240J14726N09004M74981K27229L27141N53624
4676B9707879Q17233Q53112M39808P21951J27299r0343L33211p1619m42331o26224
4666C1769976n31816m81357m06484O67408L99015O22614L85089M35247J046014
4657C3905706J018329J189376J394516J841639J494624K042620K619130L135152
4649D8641092L198250L680452L197311L141873K982919J946614J899164J165105
4641F9852780p59670j095468k648910k963442l736173m050063m093746l420938
$$ plain form
4633 47084370 44535542 42073779 40481175 39209378 37667165 36337639 35437808 34574186
4625 34574186 33761123 33105184 32853944 32627891 32568930 32370825 32587076 32998098 32563354 31932228
4615 31932228 32147406 32141855 31809316 31813164 31720962 31567394 31420976 31371714 31360444 31734486 32039213
4604 32039213 31610706 31956434 32269847 32365695 32339652 32412778 32412998 32699683 33707008 34157092
4594 34157092 34671366 35388229 35159300 35444581 35684160 35925188 35970994 36386879 36962787 37223258
4584 37223258 37566205 37846113 38385095 39019744 39665252 40694349 40972180 41292731 42067872
4575 42067872 42718737 43137691 43712253 44351398 45017668 46261484 46824775 47349126 47737685
4566 47737685 48783664 49591025 50477347 51274586 51973341 53342440 54381274 55421533 56529251
$$ packed form
4633D7084370k548828k461763j592604j271797j542213j329526q99831q63622
4625C4574186q13063o55939k51240k26053n8961j98105K16251M11022m34744o31126
4615C1932228K15178n551l32539L848r2202j53568j46418m9262j1270L74042L04727
4604C2039213m28507L45728L13413R5848k6043P3126K20K86685J007325M50084
4594C4157092N14274P16863k28929K85281K39579K41028M5806M15885N75908K60471
4584C7223258L42947K79908N38982O34649O45508J029097K77831L20551P75141
4575D2067872O50865M18954N74562O39145O66270J243816N63291N24351L88559
4566D7737685J045979Q07361Q86322P97239O98755J369099J038834J040259J107718
$$ plain form
4557 56529251 57600876 58913396 59791448 61301434 62459448 63640997 65704406 67079096
4549 67079096 68441345 70061973 71228485 72453310 74029629 74695920 75179107 76244232
4541 76244232 77234392 78201294 79539097 81005150 82531795 84315837 86138340 88149044
4533 88149044 90051305 92184675 94863030 97318276 99879439 102815920 105489903 108255459
4525 108255459 110903234 114012233 117097181 120422525 123154160 126727747 130941787 135552461
4517 135552461 140554465 146113368 152583012 159799199 168650640 178640969 189696255 201263733
4509 201263733 215058662 231435537 249374709 269922580 292770971 317743294 344258690
4502 344258690 371313871 397608766 421834358 443279435 459288029 469181477 473370468
$$ packed form
4557E6529251J071625J312520Q78052J509986J158014J181549K063409J374690
4549F7079096J362249J620628J166512J224825J576319O66291M83187J065125
4541G6244232R90160R66902J337803J466053J526645J784042J822503K010704
4533H8149044J902261K133370K678355K455246K561163K936481K673983K765556
4525A08255459K647775L108999L084948L325344K731635L573587M214040M610674
4517A35552461N002004N558903O469644P216187Q851441R990329J1055286J1567478
4509B01263733J3794929J6376875J7939172K0547871K2848391K4972323K6515396
4502C44258690K7055181K6294895K4225592K1445077J6008594R893448M188991
$$ plain form
4495 473370468 471266675 463983570 452586534 438091016 421327671 403544715 385436155
4488 385436155 367347356 349387738 331961595 314955988 297633574 280921593 264551752
4481 264551752 248811729 232865014 217612035 203426543 189609129 176749245 165477549
4474 165477549 155351641 145948351 137488674 130315250 124466851 118948101 114270747 109863797
4466 109863797 106229250 102820652 98939526 94966240 91320003 88188804 84429467 80652809
4458 80652809 76682687 73095392 70081828 67320544 64568627 62088278 59899307 58205750
4450 58205750 56660441 54813941 53447478 52286897 50433847 49812348 49005034 47994908
4442 47994908 47425043 46223653 45343358 44711820 44233620 43525690 42808282 41943127 41178460
$$ packed form
4495D73370468k103793p283105j1397036j4495518j6763345j7782956j8108560
4488C85436155j8088799j7959618j7426143j7005607j7322414j6711981j6369841
4481B64551752j5740023j5946715j5252979j4185492j3817414j2859884j1271696
4474A65477549j0125908r403290q459677p173424n848399n518750m677354m406950
4466A09863797l634547l408598l881126l973286l646237l131199l759337l776658
4458H0652809l970122l587295l013564k761284k751917k480349k188971j693557
4450E8205750j545309j846500j366463j160581j853050o21499q07314j010126
4442D7994908n69865j201390q80295o31538m78200p07930p17408q65155p64667
$$ plain form
4433 41178460 40538188 40468276 39944336 39102298 38871968 38281495 37907339 37100269 36459791 36234616
4423 36234616 36070249 35721401 35319405 34875290 35083713 35028393 34739160 34649466 34791075 34736380
4413 34736380 34624291 34753567 34725667 34670880 34611701 34931893 35398314 35432937 35372570 35443989
4403 35443989 35741618 35818479 35323896 35478207 35882282 35306210 35445532 35568107 35242558 35761600
4393 35761600 36126998 35677685 35933754 36435446 36793722 37128100 37517765 38279739 39277212
4384 39277212 40609092 41719500 43315809 44575491 46042392 47907119 50475823 52836369
4376 52836369 56452175 60467741 64537298 69089961 73157478 77285973 81790616 85090916
4368 85090916 86747144 86869572 85323376 82419453 78702215 74243958 69190150 64735976
$$ packed form
4433D1178460o40272o9912n23940q42038k30330n90473l74156q07070o40478k25175
4423C6234616j64367l48848m01996m44115K08423n5320k89233q9694J41609n4695
4413C4736380j12089J29276k7900n4787n9179L20192M66421L4623o0367P1419
4403C5443989K97629P6861m94583J54311M04075n76072J39322J22575l25549N19042
4393C5761600L65398m49313K56069N01692L58276L34378L89665P61974R97473
4384C9277212J331880J110408J596309J259682J466901J864727K568704K360546
4376E2836369L615806M015566M069557M552663M067517M128495M504643L300300
4368H5090916J656228J22428j546196k903923l717238m458257n053808m454174
$$ plain form
4360 64735976 60336794 56626178 53081083 50035486 47462651 44541890 42337124 40386737
4352 40386737 38369920 36301172 35006418 33573220 31853950 30400874 28992929 28143798
4344 28143798 27162780 26171263 25769422 24997845 24009652 23356474 22880933 22671573 22292388
4335 22292388 21781200 21197040 20286730 20238135 19911566 19218356 18686682 18589989 19104585 19144191
4325 19144191 19313340 18628797 18562650 18679192 18610329 18625061 18122961 18177921 17863836 17603442
4315 17603442 17682242 17647533 17196903 16994770 16511549 16158423 15847294 15128201 14880944 14952710
4305 14952710 14646996 15025696 15001640 14621086 14622771 14430994 14434638 14669738 14759928 14450297
4295 14450297 14767426 14220384 14156983 14154005 13875525 13365609 13061967 12816130 12675950 12879646
$$ packed form
4360F4735976m399182l710616l545095l045597k572835k920761k204766j950387
4352D0386737k016817k068748j294754j433198j719270j453076j407945q49131
4344B8143798r81018r91517m01841p71577r88193o53178m75541k09360l79185
4335B2292388n11188n84160r10310m8595l26569o93210n31674r6693N14596L9606
4325A9144191J69149o84543o6147J16542o8863J4732n02100N4960l14085k60394
4315A7603442P8800l4709m50630k02133m83221l53126l11129p19093k47257P1766
4305A4952710l05714L78700k4056l80554J685j91777L644K35100R0190l09631
4295A4450297L17129n47042o3401k978k78480n09916l03642k45837j40180K03696
$$ plain form
4285 12879646 12470733 12442604 11996341 11882969 12253679 12248686 11740190 11608027 11902967 11688615
4275 11688615 11597498 11247469 10947507 11044140 10991488 11016579 10739294 10466329 10646055 10743830
4265 10743830 10676723 10672117 10751212 10688147 10825623 10528900 10519418 10020414 9791872 10091836 9958755
4254 9958755 9812322 9756505 9397419 9187592 9238717 8773670 8588122 8518384 8377983 8301305
4244 8301305 8362958 8381247 8563810 8216392 7995041 8325840 8084959 7710697 8102774 8075118
4234 8075118 8496789 8159891 8137350 7997256 8075706 8065867 7728348 8014201 7837399 7749578
4224 7749578 7615044 7667079 7705230 7567132 7756596 7792872 7488743 8036296 7925176 7904580
4214 7904580 7716791 7937318 7966853 7820987 7737517 7849030 7574069 7537301 7699535 7788898
$$ packed form
4285A2879646m08913k8129m46263j13372L70710m993n08496j32163K94940k14352
4275A1688615r1117l50029k99962R6633n2652K5091k77285k72965J79726R7775
4265A0743830o7107m606P9095o3065J37476k96723r482m99004k28542K99964j33081
4254I958755j46433n5817l59086k09827N1125m65047j85548o9738j40401p6678
4244H301305O1653J8289J82563l47418k21351L30799k40881l74262L92077k7656
4234H075118M21671l36898k2541j40094P8450r839l37519K85853j76802q7821
4224G749578j34534N2035L8151j38098J89464L6276l04129N47553j11120k0596
4214G904580j87789K20527K9535j45866q3470J11513k74961l6768J62234Q9363
$$ plain form
4204 7788898 7782926 7639522 7375905 7249896 7088527 6908973 6739518 6673855 6463437 6416959
4194 6416959 6563665 6380856 6134153 6172113 6488446 6176210 5743502 5682425 5676881 5595781
4184 5595781 5406105 5300227 5384963 5218258 5628508 6078566 6092946 5910004 6210252 6342432
4174 6342432 6137345 6271254 6521926 6073775 5729202 5024781 5286567 5679371 5733617 5585225
4164 5585225 5458392 5363780 5518783 5624863 5415668 5245158 5329821 5429296 5198176 5191070
4154 5191070 5038467 4989586 4785989 4975060 4976350 4997206 5045165 4772975 4625327 4720462 4614660
4143 4614660 4339558 4554637 4763555 4710471 4954046 4818472 4468123 4173808 4648913 4925986
4133 4925986 4615311 4511853 4642817 4304579 4643303 4625497 4254446 4730161 4941337 4972371
$$ packed form
4204G788898n972j43404k63617j26009j61369j79554j69455o5663k10418m6478
4194F416959J46706j82809k46703L7960L16333l12236m32708o1077n544q1100
4184E595781j89676j05878Q4736j66705M10250M50058J4380j82942L00248J32180
4174F342432k05087J33909K50672m48151l44573p04421K61786L92804N4246j48392
4164E585225j26833r4612J55003J06080k09195j70510Q4663R9475k31120p106
4154E191070j52603m8881k03597J89071J290K0856M7959k72190j47648R5135j05802
4143D614660k75102K15079K08918n3084K43575j35574l50349k94315M75105K77073
4133D925986l10675j03458J30964l38238L38724j7806l71051M75715K11176L1034
$$ plain form
4123 4972371 5079852 4868236 4705619 4400475 3969287 4031511 4676937 4734779 4420165 4430603
4113 4430603 4535677 4672638 4524700 4686714 4610937 5107242 5132464 4642500 4619165 4647324
4103 4647324 4666610 5043247 4811637 5081994 5201754 5244114 5134000 5400013 5259724 4844702
4093 4844702 4922591 5322240 5220931 5332883 5301612 4981800 5040127 4680024 4555701 4915033
4083 4915033 5090639 5013091 4945283 4970880 5402205 5091304 5281514 6174019 6481133 6278921
4073 6278921 5882483 5757250 5840694 5868114 6308552 6037616 6428252 6539405 6886993 7677300
4063 7677300 8284589 8724895 9079384 9103049 9426856 10004649 9933029 9407022 9308892 8835659
4053 8835659 8563366 8320978 8223053 8072062 7845227 7645171 7748310 7620409 7279138 7759213
$$ packed form
4123D972371J07481k11616j62617l05144m31188O2224O45426N7842l14614J0438
4113D430603J05074J36961j47938J62014p5777M96305K5222m89964k3335K8159
4103D647324J9286L76637k31610K70357J19760M2360j10114K66013j40289m15022
4093D844702P7889L99649j01309J11952l1271l19812N8327l60103j24323L59332
4083D915033J75606p7548o7808K5597M31325l10901J90210Q92505L07114k02212
4073F278921l96438j25233Q3444K7420M40438k70936L90636J11153L47588P90307
4063G677300O07289M40306L54489K3665L23807N77793p1620n26007r8130m73233
4053H835659k72293k42388r7925j50991k26835k00056J03139j27901l41271M80075
$$ plain form
4043 7759213 7650032 8098429 8405038 8356538 8313565 8308635 7988635 7858407 7413108 7493729
4033 7493729 7405901 7408619 7315078 6837101 6635103 6688748 6743708 6689601 6611824 6528684 6539067
4022 6539067 6377631 6531158 6889488 7566117 7816458 7800607 7883190 8241475 8136631 8016650
4012 8016650 7905701 7826221 7788153 7527580 7823115 7486479 6911214 6914585 6709791 6461618
4002 6461618 6007206 6125791 6010617 5629704 5887975 5658064 5683990 5581419 5678113 5575723
3992 5575723 5814712 6310748 6237899 5937648 6036155 5933549 5682570 5950978 6082437 6115600
3982 6115600 6063792 6480018 6771190 6273595 6364237 6618029 6803787 7003021 6527444 6368516
3972 6368516 6267740 5979652 5561534 5270890 5247991 5175871 5227249 4601948 5179339 5214905
$$ packed form
4043G759213j09181M48397L06609m8500m2973m930l20000j30228m45299Q0621
4033G493729q7828K718r3541m77977k01998N3645N4960n4107p7777q3140J0383
4022F539067j61436J53527L58330O76629K50341j5851Q2583L58285j04844j19981
4012H016650j10949p9480l8068k60573K95535l36636n75265L371k04794k48173
4002F461618m54412J18585j15174l80913K58271k29911K5926j02571R6694j02390
3992E575723K38989M96036p2849l00251R8507j02606k50979K68408J31459L3163
3982F115600n1808M16226K91172m97595R0642K53792J85758J99234m75577j58928
3972F368516j00776k88088m18118k90644k2899p2120N1378o25301N77391L5566
$$ plain form
3962 5214905 4651225 4450418 4380639 4678924 5003647 4995392 5121962 5421299 5181977 5109565
3952 5109565 5456954 5493747 5305103 5231916 5366853 5514022 4565214 4506225 4189233 4556031
3942 4556031 4565173 4050081 3896191 3881582 3553099 3261606 3270462 3516960 3241377 3006812
3932 3006812 2475272 2447498 2768663 2816079 2731034 2677386 2988479 3104635 3213717 2776012
3922 2776012 2626243 2621621 2815284 2716797 2463669 2525467 2488264 2785463 2609297 2747028
3912 2747028 2799776 2504911 2503115 3099560 2785510 2987545 2573333 2239295 2559503 2711826
3902 2711826 2825914 2823961 2794076 2788208 2829000 2547098 2323173 2363379 2652532 2528849 2554203
3891 2554203 2393037 2266195 1836236 1994470 2147347 2564767 2413826 2045694 1808609 2065065
$$ packed form
3962E214905n63680k00807o9779K98285L24723q255J26570K99337k39322p2412
3952E109565L47389L6793j88644p3187J34937J47169r48808n8989l16992L66798
3942D556031R142n15092j53890j4609l28483k91493Q856K46498k75583k34565
3932C006812n31540k7774L21165M7416q5045n3648L11093J16156J09082m37705
3922B776012j49769m622J93663r8487k53128O1798l7203K97199j76166J37731
3912B747028N2748k94865j796N96445l14050K02035m14212l34038L20208J52323
3902B711826J14088j953k9885n868M0792k81902k23925M0206K89153j23683K5354
3891B554203j61166j26842m29959J58234J52877M17420j50941l68132k37085K56456
$$ plain form
3881 2065065 2285536 2436467 2152517 2406354 2276849 2471188 2449473 2315262 2273038 2225997
3871 2225997 1958021 2018175 2356442 2267146 2042264 2067444 2096112 2206571 2287471 2337837 2746490
3860 2746490 2618577 2940841 2913768 2724330 2557030 2247594 2392291 2780918 2879790 2263557
3850 2263557 2364724 2466505 2197194 2131613 2432284 1910751 2000312 2426785 2375225 2587553
3840 2587553 2342488 2468604 1986052 1818704 2134429 1843107 1776791 1816134 2216982 1986612
3830 1986612 2193000 2543178 2426222 2367959 2131831 2096211 2453600 2519781 2314085 2595788
3820 2595788 2372241 2312722 2146477 2154802 2192986 1822641 1637524 1954125 1862566 1700100
3810 1700100 1849562 1798868 1877903 2271202 2285270 2324670 2198397 2266598 2017802 2137976
$$ packed form
3881B065065K20471J50931k83950K53837j29505J94339k1715j34211m2224m7041
3871B225997k67976O0154L38267q9296k24882K5180K8668J10459Q0900N0366M08653
3860B746490j27913L22264k7073j89438j67300l09436J44697L88627R8872o16233
3850B263557J01167J01781k69311o5581L00671n21533Q9561M26473n1560K12328
3840B587553k45065J26116m82552j67348L15725k91322o6316L9343M00848k30370
3830A986612K06388L50178j16956n8263k36128l5620L57389O6181k05696K81703
3820B595788k23547n9519j66245Q325L8184l70345j85117L16601r1559j62466
3810A700100J49462n0694P9035L93299J4068L9400j26273O8201k48796J20174
$$ plain form
3800 2137976 2077378 2150447 2011057 2326573 2248444 2233198 2140158 2109177 2127322 1916663 1889163
3789 1889163 1973308 2148575 2383051 2599204 2628167 2606008 2396054 2382052 2105838 1875978
3779 1875978 1746833 1756784 2038377 2303655 2691629 2552613 2087678 2083859 2179489 2284503
3769 2284503 1814339 1718227 2095618 2305201 2496865 2249937 2063677 2204233 2177605 2347343
3759 2347343 1968710 2028281 2417490 2752642 2486707 2684772 2221328 2199093 2205059 1902943
3749 1902943 2277561 2347688 2296227 2268713 2390441 2526502 2773228 2825761 2944165 2538332
3739 2538332 2338214 2316697 2757150 2913806 2875652 2458120 2071444 1925568 2439301 2679107
3729 2679107 2753698 2799155 2495756 2647801 2688708 2176569 2342148 2561739 2516035 2438519
$$ packed form
3800B137976o0598P3069j39390L15516p8129j5246r3040l0981J8145k10659k7500
3789A889163Q4145J75267K34476K16153K8963k2159k09954j4002k76214k29860
3779A875978j29145R951K81593K65278L87974j39016m64935l819R5630J05014
3769B284503m70164r6112L77391K09583J91664k46928j86260J40556k6628J69738
3759B347343l78633N9571L89209L35152k65935J98065m63444k2235N966l02116
3749A902943L74618P0127n1461k7514J21728J36061K46726N2533J18404m05833
3739B538332k00118k1517M40453J56656l8154m17532l86676j45876N13733K39806
3729B679107P4591M5457l03399J52045M0907n12139J65579K19591m5704p7516
$$ plain form
3719 2438519 2651837 2485167 2303443 2570451 2360106 2592999 2621859 2578786 2498690 2199978
3709 2199978 2221227 2187893 2355752 2600872 2141566 2192960 2349600 2258338 2389345 2550561
3699 2550561 2544831 2584657 2839368 3082689 2942305 3022269 2565603 2486591 2334169 2289860 2343717
3688 2343717 2352497 2431821 2633019 2529550 2430794 2085554 2132284 2401375 2511454 2350170
3678 2350170 2325982 2447323 2312197 2232860 2211588 2255054 2277465 2454008 2545531 2509550 2707031
3667 2707031 2673873 2566692 2766570 2607639 2800753 2933884 3061092 2526792 2134502 2119299
3657 2119299 2557472 2784467 2770900 2700235 2515177 2401972 2336587 2330006 2364445 2524653 2531598
3646 2531598 2695179 2808625 2649599 2820537 2894615 2856289 2912014 2817013 2586128 2624817
$$ packed form
3719B438519K13318j66670j81724K67008k10345K32893K8860m3073q0096k98712
3709B199978K1249l3334J67859K45120m59306N1394J56640r1262J31007J61216
3699B550561n730L9826K54711K43321j40384P9964m56666p9012j52422m4309N3857
3688B343717Q780P9324K01198j03469r8756l45240M6730K69091J10079j61284
3678B350170k4188J21341j35126p9337k1272M3466K2411J76543R1523l5981J97481
3667B707031l3158j07181J99878j58931J93114J33131J27208n34300l92290j5203
3657B119299M38173K26995j3567p0665j85058j13205o5385o581L4439J60208O945
3646B531598J63581J13446j59026J70938P4078l8326N5725r5001k30885L8689
$$ plain form
3636 2624817 2823092 2750467 2914462 2536270 2235704 2735513 3062596 2870644 2844176 2606584
3626 2606584 2834879 3153326 3066585 2986229 3351095 3277322 2927895 2929090 2992878 3460677 3422614
3615 3422614 3312628 3542859 3472025 3616232 3485583 3691837 3603325 3535140 3699668 3806385
3605 3806385 4179999 4571131 4621895 4646650 4589282 4310435 4471324 4542740 4591515 4462312
3595 4462312 4726574 4826204 5090760 5138303 5564128 5662353 5947934 6284599 6495134 6494936 7109151
3584 7109151 7439191 8000473 8355957 8466223 9820376 10595183 11288557 12326607 13344717
3575 13344717 13897044 13863204 14309284 14618803 14121689 13391725 12690507 11832792 11279425 10891065
3565 10891065 10272659 9063845 8692651 8518429 8435748 8498492 8354936 8366266 8460931 8712392
$$ packed form
3636B624817J98275p2625J63995l78192l00566M99809L27083j91952k6468k37592
3626B606584K28295L18447q6741q0356L64866p3773l49427J195O3788M67799l8063
3615C422614j09986K30231p0834J44207j30649K06254q8512o8185J64528J06717
3605C806385L73614L91132N0764K4755n7368k78847J60889P1416M8775j29203
3595D462312K64262R9630K64556M7543M25825R8225K85581L36665K10535j98O14215
3584G109151L30040N61282L55484J10266J354153P74807O93374J038050J018110
3575A3344717N52327l3840M46080L09519m97114p29964p01218q57715n53367l88360
3565A0891065o18406j208814l71194j74222q2681O2744j43556J1330R4665K51461
$$ plain form
3555 8712392 8859068 9120809 9288652 9607104 10285743 11150387 12014600 12866611 14287297
3546 14287297 16391912 18159417 19538058 20826315 21636820 22149170 22532790 22986312 23205721
3537 23205721 22324282 20231596 18289818 16097902 14036617 13062406 11911339 11211025 10138916
3528 10138916 9779646 9399495 9392209 9848646 9865353 9156763 8999751 8801256 8802544 9102939
3518 9102939 9141831 9160492 9684947 9973832 10574273 11288177 11979954 13051370 13889725 14186355
3508 14186355 14316469 14313723 14218897 14659288 14641645 13734162 12777399 11968258 11135883 10723249
3498 10723249 10172127 9976234 10060232 9922071 9844787 9815796 10171846 10024540 9973122 10124404
3488 10124404 9743631 9879153 9876614 9911248 9995976 9983723 9935742 9667891 9686911 9763574 9905413
$$ packed form
3555H712392J46676K61741J67843L18452O78639Q64644Q64213Q52011J420686
3546A4287297K104615J767505J378641J288257Q10505N12350L83620M53522K19409
3537B3205721q81439k092686j941778k191916k061285r74211j151067p00314j072109
3528A0138916l59270l80151p286M56437J6707p08590j57012j98495J288L00395
3518I102939L8892J8661N24455K88885O00441P13904O91777J071416Q38355K96630
3508A4186355J30114k746r4826M40391j7643r07483r56763q09141q32375m12634
3498A0723249n51122j95893Q3998j38161p7284k8991L56050j47306n1418J51282
3488A0124404l80773J35522k539L4634Q4728j2253m7981k67851J9020P6663J41839
$$ plain form
3477 9905413 9915622 10071416 10010394 9991055 9909535 10072917 9873670 9788572 9862722 10080311 10512443
3466 10512443 10563391 11168144 11279926 11921401 12661290 12179276 12547566 12977452 13358329 13769346
3456 13769346 13685137 13848085 14510175 15260981 16546890 17176415 17666717 18296138 18983855
3447 18983855 19457469 18952648 18737956 17889276 17505467 16816187 16026702 15095912 15128784 14887809
3437 14887809 14483906 14542385 14953302 15171585 15090908 14891966 14956965 14600513 14844454 15056378
3427 15056378 14907386 13656153 12947547 12397690 11772180 11464181 11124188 10858505 10735651
3418 10735651 10427158 10129905 10197493 10156282 9586369 10023797 10231793 9934093 10037539 9690743
3408 9690743 9710339 9813815 10187825 10558600 11727008 12860548 14172510 15109937 15670256
$$ packed form
3477I905413J0209J55794o1022j9339q1520J63382j99247q5098P4150K17589M32132
3466A0512443N0948O04753J11782O41475P39889m82014L68290M29886L80877M11017
3456A3769346q4209J62948O62090P50806J285909O29525M90302O29421O87717
3447A8983855M73614n04821k14692q48680l83809o89280p89485r30790L2872k40975
3437A4887809m03903N8479M10917K18283q0677j98942O4999l56452K43941K11924
3427A5056378j48992j251233p08606n49857o25510l07999l39993k65683j22854
3418A0735651l08493k97253O7588m1211n69913M37428K07996k97700J03446l46796
3408I690743J9596J03476L74010L70775J168408J133540J311962R37427N60319
$$ plain form
3399 15670256 16187761 16230513 16319562 16263724 16004936 14852377 12362337 10977789 9836049
3390 9836049 9085305 8282138 7581961 7330157 7169219 6997496 6542919 6201805 5975654 5785797
3380 5785797 5699808 6166665 6139305 6313388 6759096 6584820 6657672 6786580 7210745 7790633
3370 7790633 8592210 8876057 8879705 8728396 8718853 9078238 8810553 8421533 7924203 6612748
3360 6612748 5612171 5315582 5064762 4454289 3852939 3681311 3537100 3047626 3197352
3351 3197352 2977324 2840663 2795608 2781810 2579077 2729201 2573115 2559062 2345794 2298653
3341 2298653 2470799 2304329 2283453 2875670 2465440 2196899 2325309 1986698 1771940 1932472
3331 1932472 2461655 2006462 2164386 2191342 2139205 2225950 1937280 1879120 2096119 2357133
$$ packed form
3399A5670256N17505M2752Q9049n5838k58788j152559k490040j384548j141740
3390I836049p50744q03167p00177k51804j60938j71723m54577l41114k26151j89857
3380E785797q5989M66857k7360J74083M45708j74276P2852J28908M24165N79888
3370G790633Q01577K83847L648j51309r543L59385k67685l89020m97330j311455
3360F612748j000577k96589k50820o10473o01350j71628j44211m89474J49726
3351C197352k20028j36661m5055j3798k02733J50124j56086j4053k13268m7141
3341B298653J72146j66470k0876N92217m10230k68541J28410l38611k14758J60532
3331A932472N29183m55193J57924K6956n2137Q6745k88670n8160K16999K61014
$$ plain form
3321 2357133 1800144 1990176 2104216 1912203 2052494 2014398 2288048 2328531 2302529 1955820
3311 1955820 1867588 2158757 2562228 2353794 2188518 1836095 1846152 1826554 1800446 2180322
3301 2180322 1720290 1579313 1804154 1538616 1798145 1924927 1908791 1708582 2051698 2189867
3291 2189867 1933923 1583353 1641219 1905651 1680659 1654752 1804200 2244482 2140277 1936649
3281 1936649 1760026 1760174 1814641 1593288 1569576 1267608 1740717 1904616 2132770 1616396
3271 1616396 1460140 1684846 1585122 1620165 1300276 1221068 1607263 1693927 1121794 1262066
3261 1262066 1498583 1599062 1596381 1772928 1447557 1010210 1146233 1140019 1492692 1216645
3251 1216645 830255 1404616 1552241 1288052 1128359 931277 1150230 1400855 1330682 1399260
$$ packed form
3321B357133n56989J90032J14040j92013J40291l8096K73650M0483k6002l46709
3311A955820q8232K91169M03471k08434j65276l52423J0057j9598k6108L79876
3301B180322m60032j40977K24841k65538K59529J26782j6136k00209L43116J38169
3291B189867k55944l50570N7866K64432k24992k5907J49448M40282j04205k03628
3281A936649j76623J48N4467k21353k3712l01968M73109J63899K28154n16374
3271A616396j56256K24706r9724L5043l19889p9208L86195Q6664n72133J40272
3261A262066K36517J00479k681J76547l25371m37347J36023o214L52673k76047
3251A216645l86390N74361J47625k64189j59693j97082K18953K50625p0173O8578
$$ plain form
3241 1399260 1638684 1684383 1554671 1744656 1411271 1018824 1010443 587788 575391 844161
3231 844161 745416 807471 1099323 1045108 866976 889517 1041056 1242473 1491213 1514865 1388960
3220 1388960 1031519 760014 1006033 1134913 937358 1090412 1158341 1038178 1106132 1068999
3210 1068999 772413 866110 874743 577922 588772 572200 720714 831383 997797 1296960
3200 1296960 1271156 1453408 1326331 1250604 855249 875556 1236862 1072827 979210 1322676
3190 1322676 1187056 1117686 959963 495936 461365 422536 672281 302722 439413 1060296
3180 1060296 1165094 930439 913333 809946 1701358 1793816 1683544 1533577 883579 829031
3170 829031 1072150 1085395 1170846 1101369 807267 1012757 449054 641585 1402963 1615184
$$ packed form
3241A399260K39424M5699j29712J89985l33385l92447q381m22655j2397K68770
3231H44161r8745O2055K91852n4215j78132K2541J51539K01417K48740K3652j25905
3220A388960l57441k71505K46019J28880j97555J53054O7929j20163O7954l7133
3210A068999k96586R3697Q633k96821J0850j6572J48514J10669J66414K99163
3200A296960k5804J82252j27077p5727l95355K0307L61306j64035r3617L43466
3190A322676j35620o9370j57723m64027l4571l8829K49745l69559J36691O20883
3180A060296J04798k34655j7106j03387Q91412R2458j10272j49967o49998n4548
3170H29031K43119J3245Q5451o9477k94102K05490n63703J92531P61378K12221
$$ plain form
3160 1615184 1478857 1581997 2111631 1760725 1360687 1313302 1268308 1475035 1222057 966761
3150 966761 1429097 1293532 1279466 1557306 1212523 1176927 1638869 2004042 2010610 1972654 2119216
3139 2119216 1909373 1214160 1428511 1560349 1543026 2111835 1921253 2106251 2162487 2083553
3129 2083553 2013810 2002915 1717955 2116862 2209348 1884885 1692230 2290358 2434839 2076794
3119 2076794 2032296 2279806 2639015 2701805 2585518 2687747 2539604 2671250 2721843 2244256
3109 2244256 2234836 2628056 3022389 3082043 2628176 2269682 2304959 3132570 3299651 3409098
3099 3409098 3150441 2778025 2917847 2646827 2796997 2579247 2482180 2297173 2260330 2268775
3089 2268775 2632257 2767181 2630747 2367106 2731967 2861337 2569918 2539738 2848635 2971974
$$ packed form
3160A615184j36327J03140N29634l50906m00038m7385m4994K06727k52978k55296
3150I66761M62336j35565j4066K77840l44783l5596M61942L65173O568l7956J46562
3139B119216k09843o95213K14351J31838j7323N68809j90582J84998N6236p8934
3129B083553o9743j0895k84960L98907R2486l24463j92655N98128J44481l58045
3119B076794m4498K47510L59209O2790j16287J02229j48143J31646N0593m77587
3109B244256r420L93220L94333N9654m53867l58494L5277Q27611J67081J09447
3099C409098k58657l72416J39822k71020J50170k17750r7067j85007l6843Q445
3089B268775L63482J34924j36434k63641L64861J29370k91419l0180L08897J23339
$$ plain form
3079 2971974 2821709 2780468 2936903 3036879 2580052 2556083 2965750 2622784 2387812 2815374
3069 2815374 2492975 2210168 2435123 1942295 2109401 1739792 1690356 1649905 1768256 1954034
3059 1954034 1998709 2038617 2048900 1630810 1841955 2201679 1847926 1539521 1798013 1721583
3049 1721583 1523935 1370008 1664324 1579978 1304477 1415313 1153309 612649 703260 1042648
3039 1042648 1102463 1321196 1191158 1210209 1298827 978011 865177 969272 961371 629459
3029 629459 988509 764767 909716 990985 810776 885564 654834 698339 565662 382230
3019 382230 434115 401348 161065 375289 446102 436742 153922 305698 660723 497308 51495
3008 51495 164866 233869 687947 354819 -182042 301171 74900 -19247 619994 657018
$$ packed form
3079B971974j50265m1241J56435R9976m56827k3969M09667l42966k34972M27562
3069B815374l22399k82807K24955m92828J67106l69609m9436m0451J18351J85778
3059A954034M4675L9908J0283m18090K11145L59724l53753l08405K58492p6430
3049A721583j97648j53927K94316q4346k75501J10836k62004n40660R0611L39388
3039A042648N9815K18733j30038J9051Q8618l20816j12834J04095p901l31912
3029F29459L59050k23742J44949Q1269j80209P4788k30730M3505j32677j83432
3019C82230N1885l2767k40283K14224P0813r360k82820J51776L55025j63415m45813
3008E1495J13371O9003M54078l33128n36861M83213k26271r4147O39241L7024
$$ plain form
2998 657018 705541 428356 502092 330671 612656 328722 565019 518796 150463 523028
2988 523028 736211 633736 325598 178853 127276 -140677 32807 -39723 289213 478600
2978 478600 -181862 -131026 -114132 -32909 212210 453403 530061 85268 -69303 160431
2968 160431 -199611 -70565 73588 -32876 -262420 -389660 -85780 -176975 36591 -197242
2958 -197242 -425679 19815 -95125 285567 102566 -71384 201413 283414 178187 158245
2948 158245 166724 300883 155431 61022 189182 234951 461915 182854 -155143 -229596 -192319
2937 -192319 -417298 -506526 -3611 357115 100176 -133645 -160246 -299054 -213409 -401062
2927 -401062 -464256 -323359 -213460 -221696 -390972 -94842 -223327 118307 296547 340414
$$ packed form
2998F57018M8523k77185P3736j71421K81985k83934K36297m6223l68333L72565
2988E23028K13183j02475l08138j46745n1577k67953J73484p2530L28936J89387
2978D78600o60462N0836J6894Q1223K45119K41193P6658m44793j54571K29734
2968A60431l60042J29046J44153j06464k29544j27240L03880r1195K13566k33833
2958a97242k28437M45494j14940L80692j83001j73950K72797Q2001j05227j9942
2948A58245Q479J34159j45452r4409J28160M5769K26964k79061l37997p4453L7277
2937a92319k24979q9228N02915L60726k56939k33821k6601j38808Q5645j87653
2927d01062o3194J40897J09899q236j69276K96130j28485L41634J78240M3867
$$ plain form
2917 340414 -103730 -506973 -422617 -267646 -195874 -127414 -420677 -517918 -604509 -617394 -479855
2906 -479855 -354155 -314115 -459812 -177165 76210 -310711 38178 -3689 -156849 -41132
2896 -41132 -496765 -523944 -306604 -420233 -244356 -199178 -353313 -42891 -300507 -234918
2886 -234918 -48654 100027 -109230 -82032 -59658 -237410 -21140 -54645 -307758 217059
2876 217059 90454 80774 -175269 -172825 42528 -158354 -291903 -498708 -386788 -178911
2866 -178911 -257961 58592 50256 -239247 -202585 -515039 -332269 -568770 -285078 -27040
2856 -27040 75982 111826 -271858 -155258 -357160 30883 101 -168736 -19285 -249257
2846 -249257 -156877 285604 -48920 90877 265682 235489 -59093 -593616 -773344 -450689
$$ packed form
2917C40414m44144m03243Q4356J54971P1772O8460k93263r7241q6591j2885J37539
2906d79855J25700M0040j45697K82647K53375l86921L48889m1867j53160J15717
2896d1132m55633k7179K17340j13629J75877M5178j54135L10422k57616O5589
2886b34918J86264J48681k09257K7198K2374j77752K16270l3505k53113N24817
2876B17059j26605r680k56043K444K15353k00882j33549k06805J11920K07877
2866a78911p9050L16553q336k89503L6662l12454J82770k36501K83692K58038
2856b7040J03022L5844l83684J16600k01902L88043l0782j68837J49451k29972
2846b49257R2380M42481l34524J39797J74805l0193k94582n34523j79728L22655
$$ plain form
2836 -450689 -456793 -405691 17985 -11832 -294110 125911 306867 196296 47452 -347501
2826 -347501 -326969 -285755 -390317 -10392 175700 -254230 -328020 -138802 -91469 -563525
2816 -563525 -241895 -294151 -287871 -360767 -301076 -57827 -448399 -452793 -290046 -342935 -463798
2805 -463798 -435877 -458866 -314554 -239704 -227216 -438437 -301054 -1641 110234 -451998
2795 -451998 -308132 -189290 42903 -22633 -226122 -270378 -278340 -165547 -346358 -356104 -496470
2784 -496470 -293149 -365581 -435184 -309609 -217716 -251656 226952 134409 -156203 -703118 -573714
2773 -573714 -290025 -531247 -384470 104663 121671 -316838 -325221 -55731 -308037 -319026
2763 -319026 -411400 -774263 -745788 -469627 -745747 -580253 -455587 -451386 -146979 -377133
$$ packed form
2836d50689o104N1102M23676k9817k82278M20021J80956j10571j48844l94953
2826c47501K0532M1214j04562L79925J86092m29930p3790J89218M7333m72056
2816e63525L21630n2256O280p2896N9691K43249l90572m394J62747n2889j20863
2805d63798K7921k2989J44312P4850J2488k11221J37383K99413J11875n62232
2795d51998J43866J18842K32193o5536k03489m4256p962J12793j80811r746j40366
2784d96470K03321p2432o9603J25575R1893l3940M78608r2543k90612n46915J29404
2773e73714K83689k41222J46777M89133J7008m38509q383K69490k52306j0989
2763c19026r2374l62863K8475K76161k76120J65494J24666M201L04407k30154
$$ plain form
2753 -377133 -176185 -213030 -208328 -429537 -392458 132796 -271975 -70688 205219 -1281
2743 -1281 -470756 -293680 202957 -33560 -422835 -184275 -106681 -630572 -858694 -550114
2733 -550114 -217193 -286288 -2763 -580661 -662974 -41752 -235896 -429755 -699525 -644317
2723 -644317 -334201 -246159 -509039 96512 219219 270408 -54569 -451291 -478815 -500550
2713 -500550 -299356 -367337 -414834 -492626 -329410 63851 -123116 -345361 103342 -345039
2703 -345039 -292983 -5040 -52111 -356552 -326063 -95051 53380 283052 -94358 20155
2693 20155 -73710 -279778 -496939 -285542 -224683 -285149 -23035 421418 172037 -115070
2683 -115070 -323346 -370204 -74717 -107311 26731 -87589 106993 -178007 -120348 33091
$$ packed form
2753c77133K00948l6845M702k21209L7079N25254m04771K01287K75907k06500
2743a281m69475J77076M96637k36517l89275K38560P7594n23891k28122L08580
2733e50114L32921o9095K83525n77898q2313O21222j94144j93859k69770N5208
2723f44317L10116Q8042k62880O05551J22707N1189l24977l96722k7524k1735
2713e00550K01194o7981m7497p7792J63216L93261j86967k22245M48703m48381
2703c45039N2056K87943m7071l04441L0489K31012J48431K29672l77410J14513
2693B0155r3865k06068k17161K11397O0859o0466K62114M44453k49381k87107
2683a15070k08276m6858K95487l2594J34042j14320J94582k85000N7659J53439
$$ plain form
2673 33091 19120 -153393 -191528 -7213 -73288 -208216 -223542 -230995 -213475 -252837 -350935
2662 -350935 -553770 -633904 -623746 -179483 167848 269983 195853 328864 -248853 -320122
2652 -320122 -108952 -179660 -472727 57553 231890 221119 403166 402073 -211451 -363607
2642 -363607 -279399 -24093 -91640 -698954 -282907 -112684 -90121 -317337 -371578 -267202
2632 -267202 -21453 312170 -14715 -31703 103123 -261559 -181856 -392441 207717 -63015
2622 -63015 90557 -65371 -363467 -292912 -281239 -392939 175531 395625 155718 -474457
2612 -474457 -243278 -207831 -793571 -252569 -166284 -357115 -280016 -278118 -585380 -14565 130373
2601 130373 -26210 -234500 286834 281100 -82771 -403636 -761453 -485532 -182668 -269439
$$ packed form
2673C3091j3971j72513l8135J84315o6075j34928j5326p453J7520l9362r8098
2662c50935k02835q0134J0158M44263L47331J02135p4130J33011n77717p1269
2652c20122K11170p0708k93067N30280J74337j0771J82047j093o13524j52156
2642c63607Q4208K55306o7547o07314M16047J70223K2563k27216n4241J04376
2632b67202K45749L33623l26885j6988J34826l64682P9703k10585O00158k70732
2622f3015J53572j55928k98096P0555J1673j11700N68470K20094k39907o30175
2612d74457K31179L5447n85740N41002Q6285j90831P7099J898l07262N70815J44938
2601A30373j56583k08290N21334n734l63871l20865l57817K75921L02864q6771
$$ plain form
2591 -269439 -396045 -538883 -617931 -271902 -214344 -792960 -816707 -671565 -775254 -506906
2581 -506906 47878 69958 7581 -103530 290417 293751 441101 177093 -212317 -411904
2571 -411904 -210093 148441 -70694 15864 -247743 -433690 -534547 -68033 22380 -89128
2561 -89128 -95053 -311297 -394608 -153886 -371301 -460387 -212487 -76767 240645 215010 302995
2550 302995 160859 137046 7819 110955 343738 -69984 -249454 46433 -47598 -92154
2540 -92154 174020 -324897 -71604 -39268 -458453 -595658 -233060 -188488 -435003 -475722
2530 -475722 -327756 -466624 -123716 -126507 -301900 -66432 -98144 -65095 49710 130514 -175148
2519 -175148 -331963 9246 -326452 -441681 25288 783097 668533 5465 59497 -59429
$$ packed form
2591b69439j26606j42838p9048L46029N7558n78616k3747J45142j03689K68348
2581e06906N54784K2080o2377j11111L93947L334J47350k64008l89410j99587
2571d11904K01811L58534k19135Q6558k63607j85947j00857M66514R0413j11508
2561h9128n925k16244q3311K40722k17415q9086K47900J35720L17412k5635Q7985
2550C02995j42136k3813j29227J03136K32783m13722j79470K95887r4031m4556
2540i2154K66174m98917K53293L2336m19185j37205L62598M4572k46515m0719
2530d75722J47966j38868L42908k791j75393K35468l1712L3049J14805Q0804l05662
2519a75148j56815L41209l35698j15229M66969P57809j14564o63068N4032j18926
$$ plain form
2509 -59429 150202 150426 -357122 -133370 284691 2203 -10605 200452 -241307 -87582 -46370
2498 -46370 -169121 136029 284510 403495 -216557 -46116 276143 -5215 50736 -135336
2488 -135336 -299261 -384113 -76213 -74987 -75135 229233 120352 118758 -244242 -534768 -160725
2477 -160725 78832 9595 115889 -14629 -147616 353516 -15543 32603 115457 19744
2467 19744 -85725 -448338 -98472 213952 241282 118974 84495 -167412 -354377 170489
2457 170489 730715 642665 835085 626632 231750 9456 -14246 58088 73096 -271228
2447 -271228 91312 206812 107847 346142 280553 444181 94633 168640 334716 -5144
2437 -5144 83411 -267471 -48267 -126011 113709 363712 256547 2841 -18031 -115725 244705
$$ packed form
2509e9429K09631K24n07548K23752M18061k82488j2808K11057m41759J53725M1212
2498d6370j22751L05150J48481J18985o20052J70441L22259k81358N5951j86072
2488a35336j63925q4852L07900J226j48L04368j08881j594l63000k90526L74043
2477a60725K39557o9237J06294j30518j32987N01132l69059M8146Q2854r5713
2467A9744j05469l62613L49866L12424K7330j22308l4479k51907j86965N24866
2457A70489N60226q8050J92420k08453l94882k22294k3702P2334J5008l44324
2447b71228L62540J15500r8965K38295o5589J63628l49548P4007J66076l39860
2437e144Q8555l50882K19204p7744K39720K50003j07165k53706k0872r7694L60430
$$ plain form
2426 244705 84419 -233863 360609 476578 526174 282266 -63483 -33245 102270 124514
2416 124514 450778 436104 577113 334922 382379 273845 -82299 -237260 17219 230646
2406 230646 312966 292042 244557 599582 461744 482542 516223 336469 567721 615177 374995
2395 374995 521837 616173 618560 451458 786076 798841 795468 706847 598278 569503 859332
2384 859332 1084310 717438 397382 735926 954069 845891 757521 925027 1161510 1037145
2374 1037145 1235998 1188081 1125684 1389920 1568406 1587335 1449432 1570167 1492338 1402744
2364 1402744 1570272 1286193 1674178 1956509 2100478 2252777 2051106 1669798 1462409 1138813
2354 1138813 1718660 1996702 1937590 1708594 1790374 1963410 2126262 1949114 2388491 2374182
$$ packed form
2426B44705j60286l18282N94472J15969M9596k43908l45749L0238J35515K2244
2416A24514L26264j4674J41009k42191M7457j08534l56144j54961K54479K13427
2406B30646Q2320k0924m7485L55025j37838K0798L3681j79754K31252M7456k40182
2395C74995J46842R4336K387j67102L34618J2765l373q8621j08569k8775K89829
2384H59332K24978l66872l20056L38544K18143j08178q8370J67506K36483j24365
2374A037145J98853m7917o2397K64236J78486J8929j37903J20735p7829q9594
2364A402744J67528k84079L87985K82331J43969J52299k01671l81308k07389l23596
2354A138813N79847K78042n9112k28996Q1780J73036J62852j77148M39377j4309
$$ plain form
2344 2374182 2053833 2286946 2674339 2362916 2643000 3258719 3537046 3237233 2963800 2972940
2334 2972940 3119689 3550040 3450088 3787092 3542487 4183151 4824451 4965881 4826643 4865212
2324 4865212 5655134 6528516 7030556 7340557 7940695 8812867 9024993 9829031 10797412 12094152
2314 12094152 13858627 16309002 18658879 21855771 26824325 33960641 39567032 41846518
2306 41846518 41646355 38541923 34320212 27975986 21992557 18285973 15158246 12577163
2298 12577163 10667993 8834571 7296327 6544964 6338022 6056414 5611291 5421168 5277660
2289 5277660 4061289 3416417 3551279 3322612 2953590 2653837 2558478 2606756 2186984 1748612
2279 1748612 1610707 1538245 1543891 1824233 1417905 1040559 1162215 1150687 1254592 1526261
$$ packed form
2344B374182l20349K33113L87393l11423K80084O15719K78327k99813k73433R140
2334B972940J46749M30351r9952L37004k44605O40664O41300J41430j39238L8569
2324D865212P89922Q73382N02040L10001O00138Q72172K12126Q04038R68381J296740
2314A2094152J764475K450375K349877L196892M968554P136316N606391K279486
2306D1846518k00163l104432m221711o344226n983429l706584l127727k581083
2298A2577163j909170j833422j538244p51363k06942k81608m45123j90123j43508
2289E277660j216371o44872J34862k28667l69022k99753r5359M8278m19772m38372
2279A748612j37905p2462N646K80342m06328l77346J21656j1528J03905K71669
$$ plain form
2269 1526261 1507814 1163698 1006039 914566 1235895 1274097 861660 695599 435713 163144
2259 163144 616606 731068 621802 539813 165490 302993 419770 319779 568674 489523
2249 489523 569545 513417 550917 620989 790821 509530 504393 740315 250714 199614 331620
2238 331620 211293 79984 310192 361772 265731 92749 210182 215009 1176 -3985 280397
2227 280397 162468 233938 290328 -354427 -438284 -247087 -481418 -184248 98430 -54285
2217 -54285 89430 257375 57112 596422 320597 -267459 -150861 77562 -54766 -330330
2207 -330330 255748 -134025 -572614 -511046 -594239 -520623 -474956 -208538 -150297 -143697 -283623
2196 -283623 -616068 -326538 -376088 -16951 27890 -139401 -51483 -248931 -518240 -449382
$$ packed form
2269A526261j8447l44116j57659r1473L21329L8202m12437j66061k59886k72569
2259A63144M53462J14462j09266q1989l74323J37503J16777r9991K48895p9151
2249D89523Q0022n6128L7500P0072J69832k81291n137K35922m89601n1100J32006
2238C31620j20327j31309K30208N1580r6041j72982J17433M827k13833n161K84382
2227B80397j17929P1470N6390o44755q3857J91197k34331K97170K82678j52715
2217e4285J43715J67945k00263N39310k75825n88056J16598K28423j32328k75564
2207c30330N86078l89773m38589O1568q3193P3616M5667K66418N8241O600j39926
2196b83623l32445K89530m9550L59137M4841j67291Q7918j97448k69309O8858
$$ plain form
2186 -449382 -263735 4046 141818 -391099 -596285 -44118 291284 186242 228076 78299
2176 78299 -50428 -104028 -165681 -227379 -223206 15211 -73943 -212037 -300364 -40221 -123052
2165 -123052 109227 657067 228711 69896 -31174 -275856 89997 105197 478374 -55439
2155 -55439 -189947 49890 -106697 150246 478855 136253 -95847 259271 209364 12691
2145 12691 -408744 -35445 -196657 79753 -116211 -134191 -230534 -19395 274380 634928
2135 634928 383071 61814 114442 250504 -64188 -329241 -199282 -166785 -127655 -135851 -481216
2124 -481216 -701663 -352830 -327022 -605676 -133317 -289035 -442944 -151812 -145563 -88795
2114 -88795 239911 393886 347228 482203 179099 266272 274749 273350 66064 -339417 -461656
$$ packed form
2186d49382J85647K67781J37772n32917k05186N52167L35402j05042M1834j49777
2176G8299j28727n3600o1653o1698M173K38417q9154j38094q8327K60143q2831
2165a23052K32279N47840m28356j58815j01070k44682L65853J5200L73177n33813
2155e5439j34508K39837j56587K56943L28609l42602k32100L55118m9907j96673
2145A2691m21435L73299j61212K76410j95964j7980r6343K11139K93775L60548
2135F34928k51857l21257N2628J36062l14692k65053J29959L2497L9130q196l45365
2124d81216k20447L48833K5808k78654M72359j55718j53909K91132O249N6768
2114h8795L28706J53975m6658J34975l03104Q7173Q477j399k07286m05481j22239
$$ plain form
2103 -461656 -321474 -442884 -74254 -164654 -60230 -307463 -498246 -112093 156503 -123294
2093 -123294 217735 30460 -189711 -558804 -86158 237297 90813 166041 263025 -286281
2083 -286281 -33792 -209908 -105623 210591 -50102 251812 229958 -315734 -260453 175952
2073 175952 -44392 268236 28787 57541 59143 -273843 -163413 127618 36214 -11222 -297137
2062 -297137 -431172 -97262 239770 165064 77703 147187 305313 191000 282729 175144
2052 175144 142243 -3706 31335 -110930 75698 -93384 -195091 97184 509444 415207
2042 415207 49684 50684 11610 -1415 581218 -22722 11710 -56919 -600939 -103059 1375
2031 1375 39619 -36691 -143610 47501 192377 19155 98874 98026 111430 164277 167855 -105496
$$ packed form
2103d61656J40182j21410L68630r0400J04424k47233j90783L86153K68596k79797
2093a23294L41029j87275k20171l69093M72646L23455j46484P5228R6984n49306
2083b86281K52489j76116J04285L16214k60693L01914k1854n45692N5281M36405
2073A75952k20344L12628k39449K8754J602l32986J10430K91031r1404m7436k85915
2062b97137j34035L33910L37032p4706q7361O9484J58126j14313R1729j07585
2052A75144l2901j45949L5041j42265J86628j69082j01707K92275M12260r4237
2042D15207l65523J000l9074j3025N82633o03940L4432o8629n44020M97880J04434
2031A375L8244p6310j06919J91111J44876j73222P9719q48J3404N2847L578k73351
$$ plain form
2019 -105496 -346773 -88942 -48204 9213 341580 232116 -35556 226106 491934 -289031
2009 -289031 -290794 24490 -222677 -288358 -88447 -53028 -344622 -420977 -334187 -201894 -394849
1998 -394849 -256806 69391 -113902 -323344 -469262 -201234 -174216 33532 -71122 -470211
1988 -470211 -291354 -183451 -18965 117882 -33000 215580 21765 -186852 150940 426499
1978 426499 27817 -142354 -13912 -183553 349340 285167 -94886 -136202 -379521 -524002
1968 -524002 -397243 -235236 -175707 172881 279228 -50715 15449 83987 83781 -184529 -610365
1957 -610365 -437893 -260715 -79977 -164226 -376250 -429914 -811117 -397224 -208269 -381438
1947 -381438 43343 234909 12574 -138385 70119 -223641 -314960 -475774 -372627 -395299
$$ packed form
2019a05496k41277K57831M0738N7417L32367j09464k67672K61662K65828p80965
2009b89031j763L15284k47167o5681J99911L5419k91594p6355Q6790J32293j92955
1998c94849J38043L26197j83293k09442j45918K68028K7018K07748j04654l99089
1988d70211J78857J07903J64486J36847j50882K48580j93815k08617L37792K75559
1978D26499l98682j70171J28442j69641N32893o4173l80053m1316k43319j44481
1968e24002J26759J62007N9529L48588J06347l29943O6164O8538k06k68310m25836
1957f10365J72472J77178J80738q4249k12024n3664l81203M13893J88955j73169
1947c81438M24781J91566k22335j50959K08504k93760r1319j60814J03147k2672
$$ plain form
1937 -395299 -288599 -305210 -388551 -118566 -22569 -78997 100254 47939 27248 -11386 -311854
1926 -311854 -185445 -275360 -509387 -430782 -80255 -333174 -284682 137310 74363 -14284 248450
1915 248450 261662 223038 177421 156342 287451 -67946 -372474 -209154 -288111 23548 -684096
1904 -684096 -830367 -265378 226908 478840 766698 486209 -76098 -273944 -175396 -70857
1894 -70857 143254 103113 -416654 -400851 -333390 -132244 -256473 -158239 -452305 -455824 -210332
1883 -210332 -389879 -102694 -146885 -428552 -1842 -416911 -759142 -528863 -820369 -770804
1873 -770804 -581629 -260695 -4329 -27775 132847 -228865 28380 -244639 -272342 164963
1863 164963 -80992 -244008 -70995 8161 49130 298540 -343672 -338896 -167679 -121968 81508
$$ packed form
1937c95299J06700j6611q3341K69985R5997n6428J79251n2315k0691l8634l00468
1926c11854J26409q9915k34027P8605L50527k52919M8492M21992o2947q8647K62734
1915B48450J3212l8624m5617k1079J31109l55397l04528J63320p8957L11659p07644
1904f84096j46271N64989M92286K51932K87858k80489n62307j97846R8548J04539
1894g0857K14111m0141n19767J5803O7461K01146j24229R8234k94066l519K45492
1883b10332j79547K87185m4191k81667M26710m15069l42231K30279k91506M9565
1873g70804J89175L20934K56366k3446J60622l61712K57245k73019k7703M37305
1863A64963k45955j63016J73013P9156M0969K49410o42212M776J71217M5711K03476
$$ plain form
1852 81508 -143212 -405099 -360489 272517 202070 63885 227032 228744 -120527 -220278 -311449
1841 -311449 -195273 -470090 -299483 -165640 204133 -104896 -213600 -255094 -483830 -141301
1831 -141301 59246 -60265 -34483 78899 -241492 -374912 -450678 -282120 -427144 -435403
1821 -435403 -395339 -436368 -5914 195771 125568 156868 126857 26892 -130250 394143 130759
1810 130759 204632 85801 -91329 271393 460839 464990 280462 -225458 304074 143263
1800 143263 333569 -278865 -551421 -73128 -177864 -106068 -136356 120853 263885 240787
1790 240787 130302 131681 304779 69202 -385456 -420241 -538849 -234775 -134076 -209919
1780 -209919 -356818 -104576 159340 -263684 -440966 -235507 -210613 -376198 -49403 -544634
$$ packed form
1852H1508k24720k61887M4610O33006p0447j38185J63147J712l49271r9751r1171
1841c11449J16176k74817J70607J33843L69773l09029j08704m1494k28736L42529
1831a41301K00547j19511K5782J13382l20391j33420p5766J68558j45024q259
1821d35403M0064m1029M30454K01685p0203L1300l0011r9965j57142N24393k63384
1810A30759P3873j18831j77130L62722J89446M151j84528n05920N29532j60811
1800A43263J90306o12434k72556M78293j04736P1796l0288K57209J43032k3098
1790B40787j10485J379J73098k35577m54658l4785j18608L04074J00699p5843
1780b09919j46899K52242K63916m23024j77282K05459K4894j65585L26795m95231
$$ plain form
1770 -544634 -499038 209285 275158 230938 182690 277162 245849 -228561 -198247 -63687 67962
1759 67962 371002 -31863 2343 295780 235106 4341 -28309 -204916 -225127 27334 -131549
1748 -131549 -266362 -208135 -68500 -144364 -178601 142117 -492372 -547131 -626904 -579362 -533334
1737 -533334 -660812 -161639 32312 -21599 90825 7047 -127312 112890 212019 -102388
1727 -102388 50552 -339445 -379190 245193 -92604 -85846 458632 510507 305375 133070
1717 133070 -98695 -230663 -342395 -307799 -310038 -400000 -304815 -93120 -46391 -104128 -373459
1706 -373459 -8989 35666 -90868 127425 249284 140151 -81587 -308090 -485952 -358186
1696 -358186 -205559 -514878 -637374 -199181 20963 399307 -31012 -195212 -27974 111633
$$ packed form
1770e44634M5596P08323O5873m4220m8248R4472l1313m74410L0314J34560J31649
1759F7962L03040m02865L4206K93437o0674k30765l2650j76607k0211K52461j58883
1748a31549j34813N8227J39635p5864l4237L20718o34489n4759p9773M7542M6028
1737e33334j27478M99173J93951n3911J12424q3778j34359K40202R9129l14407
1727a02388J52940l89997l9745O24383l37797O758N44478N1875k05132j72305
1717A33070k31765j31968j11732L4596k239q9962R5185K11695M6729n7737k69331
1706c73459L64470M4655j26534K18293J21859j09133k21738k26503j77862J27766
1696c58186J52627l09319j22496M38193K20144L78344m30319j64200J67238J39607
$$ plain form
1686 111633 119578 28984 236219 -27775 -139618 -402333 -230340 956 -271069 -194714
1676 -194714 -200064 146501 10454 -82013 -258858 -625665 -422865 -176198 -498223 -204939
1666 -204939 -45333 -51996 -75568 -30232 172828 44824 -392335 -123188 -379693 -324079 -348327
1655 -348327 -376406 -174626 272309 187748 -118109 86981 156256 445156 313539 -170473
1645 -170473 -399351 -498315 309583 411671 -151711 -129819 -443760 -338982 -779604 -618069
1635 -618069 -535621 -289557 -96379 140973 -191161 -57173 -399597 -286452 436609 178323
1625 178323 -14657 -47381 -127322 138653 215264 -37029 -85653 49932 6282 -34037 -228816
1614 -228816 -303842 -302270 -216490 -66602 -109587 -94083 383266 -253145 -226020 -164925 52513
$$ packed form
1686A11633P945r0594K07235k63994j11843k62715J71993K31296k72025P6355
1676a94714n350L46565j36047r2467j76845l66807K02800K46667l22025K93284
1666b04939J59606o663k3572M5336K03060j28004m37159K69147k56505N5614k4248
1655c48327k8079K01780M46935q4561l05857K05090O9275K88900j31617m84012
1645a70473k28878r8964Q07898J02088n63382K1892l13941J04778m40622J61535
1635f18069Q2448K46064J93178K37352l32134J33988l42424J13145P23061k58286
1625A78323j92980l2724p9941K65975P6611k52293m8624J35585m3650m0319j94779
1614b28816p5026J572Q5780J49888m2985J5504M77349o36411K7125O1095K17438
$$ plain form
1603 52513 202961 214738 334480 280067 -176172 -353432 -172923 -358947 -544182 -188556
$$ packed form
1603E2513J50448J1777J19742n4413m56239j77260J80509j86024j85235L55626
$$ [...]
##END NTUPLES=NMR SPECTRUM
##END=
