##TITLE=1H_CG-1198-X1
 CDCl3+DMSO
 8 sc, 
 1.4.2024
##JCAMPDX= 6.0         $$ Bruker NMR JCAMP-DX V2.0
##DATA TYPE= NMR SPECTRUM
##DATA CLASS= NTUPLES
##ORIGIN= UXNMR, Bruker Analytische Messtechnik GmbH
##OWNER= root
$$ XWIN-NMR		Version 3.5
$$ Mon Apr  1 16:21:05 2024 Russian Standard Time (UT+4h)  she@DPX200
##.OBSERVE FREQUENCY= 200.1311
##.OBSERVE NUCLEUS= ^1H
##.ACQUISITION MODE= SIMULTANEOUS
##.ACQUISITION SCHEME= undefined
##.AVERAGES= 8
##.DIGITISER RES= 18
##SPECTROMETER/DATA SYSTEM= spect
##.PULSE SEQUENCE= zg30
##.SOLVENT NAME= D2O
##.SHIFT REFERENCE= (INTERNAL, D2O, 0, 16.7397)
##AUDIT TRAIL= $$ (NUMBER, WHEN, WHO, WHERE, WHAT)
$$ ##TITLE= Audit trail, XWIN-NMR		Version 3.5
$$ ##JCAMPDX= 5.01
$$ ##ORIGIN= Bruker BioSpin GmbH
$$ ##OWNER= she
$$ F:/spectra/data/she/nmr/H-F/1/pdata/1/auditp.txt
$$ ##AUDIT TRAIL=  $$ (NUMBER, WHEN, WHO, WHERE, WHAT)
(   1,<2024-04-01 16:20:02.71 +0400>,<she>,<DPX200>,
      <created by zg, POWCHK disabled, PULCHK disabled
       configuration hash MD5:
       00 E9 B6 7A A2 85 ED C7 34 08 36 98 17 FE 4E 26
       data hash MD5: 16K
       2F 1B 57 7E A8 E3 03 55 4E 86 C2 DA 30 34 40 4B>)
(   2,<2024-04-01 16:20:06.51 +0400>,<she>,<DPX200>,
      <Start of raw data processing
       efp BC_mod = 2 LB = 0.24 FT_mod = 6 PKNL = 1 PHC0 = -25297.63 PHC1 = 8.187312 SI = 16K 
       data hash MD5: 16K
       57 5E FF C6 F7 5D B8 7F 31 8F 6A 19 0A A2 4E 07>)
(   3,<2024-04-01 16:20:22.92 +0400>,<she>,<DPX200>,
      <pk PHC0 = -7.765489 PHC1 = 10.6 
       data hash MD5: 16K
       38 A0 34 BF EE DA 65 3A 99 2A 4D 8C 1C E8 1C 7A>)
(   4,<2024-04-01 16:20:25.93 +0400>,<she>,<DPX200>,
      <abs ABSG = 5 
       data hash MD5: 16K
       F0 FC 01 32 05 49 C4 0F E2 9A 41 CF C4 1F 31 76>)
$$ ##END=
$$ 
$$ hash MD5
$$ 3D A6 76 88 0C 8A 11 75 46 A8 19 03 CE 69 44 0F
##$RELAX= 
##$RELAX= 
##$RELAX= 
##$RELAX= 
##$RELAX= 
##$RELAX= 
$$ Bruker specific parameters
$$ --------------------------
##$DU= <F:/spectra>
##$EXPNO= 1
##$NAME= <H-F>
##$PROCNO= 1
##$TYPE= <nmr>
##$USER= <she>
##$AMP= (0..31)
100 100 100 100 100 100 100 100 100 100 100 100 100 100 100 100 100 100 
100 100 100 100 100 100 100 100 100 100 100 100 100 100 
##$AQSEQ= 0
##$AQ_mod= 1
##$AUNM= <au_zg>
##$AUTOPOS= <>
##$BF1= 200.13
##$BF2= 200.13
##$BF3= 200.13
##$BF4= 200.13
##$BF5= 200.13
##$BF6= 200.13
##$BF7= 200.13
##$BF8= 200.13
##$BYTORDA= 1
##$CFDGTYP= 0
##$CFRGTYP= 5
##$CHEMSTR= <none>
##$CNST= (0..31)
1 1 145 1 1 1 1 1 1 1 1 1 1 1 1 1 1 1 1 1 1 1 1 1 1 1 1 1 1 1 1 1 
##$CPDPRG= <>
##$CPDPRG1= <>
##$CPDPRG2= <>
##$CPDPRG3= <>
##$CPDPRG4= <mlev>
##$CPDPRG5= <mlev>
##$CPDPRG6= <mlev>
##$CPDPRG7= <mlev>
##$CPDPRG8= <mlev>
##$CPDPRGB= <>
##$CPDPRGT= <>
##$D= (0..31)
0 1.2 0 0 0 0 0 0 0 0.06 0 0.03 0 0 0 0 0.0002 0 0 0 0 0 0 0 0 0 0 0 0 
0 0 0 
##$DATE= 1711974002
##$DBL= (0..7)
120 120 120 120 120 120 120 120 
##$DBP= (0..7)
150 150 150 150 150 150 150 150 
##$DBP07= 0
##$DBPNAM0= <>
##$DBPNAM1= <>
##$DBPNAM2= <>
##$DBPNAM3= <>
##$DBPNAM4= <>
$$ [...]
##$SUBNAM3= <"">
##$SUBNAM4= <"">
##$SUBNAM5= <"">
##$SUBNAM6= <"">
##$SUBNAM7= <"">
##$SUBNAM8= <"">
##$SUBNAM9= <"">
##$SW= 18.051750892319
##$SWIBOX= (0..15)
0 0 2 0 0 0 0 0 0 0 0 0 0 0 0 0 
##$SW_h= 3612.71676300578
##$TD= 16384
##$TD0= 1
##$TE= 0
##$TE2= 300
##$TE3= 300
##$TEG= 300
##$TL= (0..7)
0 120 120 120 120 120 120 120 
##$TP= (0..7)
150 150 150 150 150 150 150 150 
##$TP07= 0
##$TPNAME0= <>
##$TPNAME1= <>
##$TPNAME2= <>
##$TPNAME3= <>
##$TPNAME4= <>
##$TPNAME5= <>
##$TPNAME6= <>
##$TPNAME7= <>
##$TPOAL= (0..7)
0.5 0.5 0.5 0.5 0.5 0.5 0.5 0.5 
##$TPOFFS= (0..7)
0 0 0 0 0 0 0 0 
##$TUNHIN= 0
##$TUNHOUT= 0
##$TUNXOUT= 0
##$USERA1= <user>
##$USERA2= <user>
##$USERA3= <user>
##$USERA4= <user>
##$USERA5= <user>
##$V9= 5
##$VALIST= <valist>
##$VCLIST= <CCCCCCCCCCCCCCC>
##$VD= 0
##$VDLIST= <DDDDDDDDDDDDDDD>
##$VPLIST= <PPPPPPPPPPPPPPP>
##$VTLIST= <TTTTTTTTTTTTTTT>
##$WBST= 1024
##$WBSW= 4
##$XGAIN= (0..3)
0 0 0 0 
##$XL= 0
##$YL= 0
##$YMAX_a= 142037
##$YMIN_a= -165462
##$ZGOPTNS= <>
##$ZL1= 120
##$ZL2= 120
##$ZL3= 120
##$ZL4= 120
##$ABSF1= 16.79033
##$ABSF2= -1.26156
##$ABSG= 5
##$ABSL= 3
##$ALPHA= 0
##$AQORDER= 0
##$ASSFAC= 0
##$ASSFACI= 0
##$ASSFACX= 0
##$ASSWID= 0
##$AUNMP= <proc_1d>
##$AZFE= 0.1
##$AZFW= 0.1
##$BCFW= 0
##$BC_mod= 2
##$BYTORDP= 0
##$COROFFS= 0
##$CY= -3
##$DATMOD= 1
##$DC= 0
##$DFILT= <>
##$DTYPP= 0
##$F1P= 0
##$F2P= 0
##$FCOR= 1
##$FTSIZE= 16384
##$FT_mod= 6
##$GAMMA= 0
##$GB= 0
##$INTBC= 1
##$INTSCL= 3.70164e-10
##$ISEN= 128
##$LB= 0.24
##$LEV0= 0
##$LPBIN= 0
##$MAXI= 10000
##$MC2= 0
##$MEAN= 0
##$ME_mod= 0
##$MI= 1.114404
##$NCOEF= 0
##$NC_proc= -8
##$NLEV= 6
##$NOISF1= 3.799351
##$NOISF2= 2.8
##$NSP= 0
##$NTH_PI= 0
##$NZP= 0
##$OFFSET= 16.73965
##$PC= 1
##$PHC0= -25305.4
##$PHC1= 18.78731
##$PH_mod= 1
##$PKNL= yes
##$PPARMOD= 0
##$PSCAL= 0
##$PSIGN= 0
##$REVERSE= no
##$SF= 200.129556260225
##$SI= 16384
##$SIGF1= 3
##$SIGF2= 2
##$SINO= 5.538805
##$SIOLD= 16384
##$SREGLST= <1H.CDCl3>
##$SSB= 0
##$STSI= 16384
##$STSR= 0
##$SW_p= 3612.71676300578
##$SYMM= 0
##$S_DEV= 0
##$TDeff= 16384
##$TDoff= 0
##$TI= <>
##$TILT= no
##$TM1= 0
##$TM2= 0
##$TOPLEV= 0
##$USERP1= <user>
##$USERP2= <user>
##$USERP3= <user>
##$USERP4= <user>
##$USERP5= <user>
##$WDW= 1
##$XDIM= 16384
##$YMAX_p= 357434359
##$YMIN_p= -1301700
$$ End of Bruker specific parameters
$$ ---------------------------------
##NTUPLES= NMR SPECTRUM
##VAR_NAME=  FREQUENCY,     SPECTRUM/REAL,   SPECTRUM/IMAG
##SYMBOL=    X,             R,               I
##VAR_TYPE=  INDEPENDENT,   DEPENDENT,       DEPENDENT
##VAR_FORM=  AFFN,          ASDF,            ASDF
##VAR_DIM=   16384,         16384,           16384
##UNITS=     HZ,            ARBITRARY UNITS, ARBITRARY UNITS
##FACTOR=    0.220516191357247, 1,           1
##FIRST=     3350.09887180925, 0,            0
##LAST=      -262.617891196534, 0,           0
##MIN=       -262.617891196534, -1301700,    0
##MAX=       3350.09887180925, 357434359,    0
$$ Real data points
##PAGE= N=1
##DATA TABLE= (X++(R..R)), XYDATA
$$ [...]
$$ plain form
6201 310683 -245978 -143667 305775 -207082 -197099 28964 -133177 -104616 289710 187661
6191 187661 230011 135711 685167 401932 453971 105509 528803 435614 534487 496793 554120
6180 554120 319093 260213 118200 347844 -397016 -143560 168859 251620 443829 494053
6170 494053 271531 -146929 342717 596608 50286 -146826 -75999 -200653 -406600 -230583
6160 -230583 -264432 -408045 97770 370389 280312 467191 388380 78938 2731 -373869
6150 -373869 -38413 360895 221892 -21167 12770 -257002 -452488 -246139 -344924 -115960
6140 -115960 49270 188149 233958 69492 -259387 79128 -7231 -550379 281594 585922
6130 585922 488106 158670 156162 -320869 36210 28097 -363383 227023 730165 483937 -137523
$$ packed form
6201C10683n56661J02311M49442n12857R983K26063j62141K8561L94326j02049
6191A87661M2350r4300N49456k83235N2039l48462M23294r3189R8873l7694N7327
6180E54120k35027n8880j42013K29644p44860K53456L12419Q2761J92209N0224
6170D94053k22522m18460M89646K53891n46322j97112P0827j24654k05947J76017
6160b30583l3849j43613N05815K72619r0077J86879p8811l09442p6207l76600
6150c73869L35456L99308j39003k43059L3937k69772j95486K06349r8785K28964
6140a15960J65230J38879M5809j64466l28879L38515q6359n43148Q31973L04328
6130E85922r7816l29436k508m77031L57079q113l91480N90406N03142k46228o21460
$$ plain form
6119 -137523 103215 525626 513855 322182 -81510 579023 552988 69216 35627 -3480
6109 -3480 28507 -36046 -315160 -457303 -341522 -11893 -41440 160769 185963 386114 565813
6098 565813 -80769 -302869 266720 181019 339990 443478 189458 76170 55002 -173059
6088 -173059 -193221 -136438 71997 59654 123367 -225961 21369 -69270 -7631 -115666 -288132
6077 -288132 -435599 -416068 -445030 -75825 96680 184949 -45685 158407 -13842 -600962
6067 -600962 -214550 319954 -250435 -101576 -212452 -167651 73096 155382 653380 278284
6057 278284 -120732 -409327 45546 13332 158644 394131 684720 286149 603712 389494
6047 389494 484749 -74380 284782 653551 320169 411901 -188741 82982 708741 728131
$$ packed form
6119a37523K40738M22411j1771j91673m03692O60533k6035m83772l3589l9107
6109c480L1987o4553k79114j42143J15781L29629k9547K02209K5194K00151J79699
6098E65813o46582k22100N69589q5701J58971J03488k54020j13288k1168k28061
6088a73059k0162N6783K08435j2343O3713l49328K47330r0639O1639j08035j72466
6077b88132j47467J9531k8962L69205J72505Q8269k30634K04092j72249n87120
6067f00962L86412N34504n70389J48859j10876M4801K40747Q2286M97998l75096
6057B78284l99016k88595M54873l2214J45312K35487K90589l98571L17563k14218
6047C89494R5255n59129L59162L68769l33382R1732o00642K71723O25759J9390
$$ plain form
6037 728131 533644 216195 -46381 11536 132100 203719 -332371 -236835 -60414 168359
6027 168359 1007801 898794 780877 648899 856582 244356 362129 359965 61291 -522656
6017 -522656 -436193 492777 497168 373561 103252 54247 220035 644109 761879 64842
6007 64842 242471 533152 505495 -24960 -171304 175716 428444 213416 389554 617115
5997 617115 638845 533862 626829 417466 33348 94135 717 348541 444157 207707 363148
5986 363148 330995 325725 351636 76161 -39987 -36617 19852 245783 322241 875548 662059
5975 662059 131863 81577 286221 471143 432342 214596 -71799 178276 141392 374927
5965 374927 550391 458613 -177007 -36863 -60344 112450 305250 355164 202786 -339512
$$ packed form
6037G28131j94487l17449k62576N7917J20564P1619n36090R5536J76421K28773
6027A68359Q39442j09007j17917j31978K07683o12226J17773k164k98674n83947
6017e22656Q6463R28970M391j23607k70309m9005J65788M24074J17770o97037
6007F4842J77629K90681k7657n30455j46344L47020K52728k15028J76138K27561
5997F17115K1730j04983R2967k09363l84118O0787r3418L47824R5616k36450J55441
5986C63148l2153n270K5911k75475j16148L370N6469K25931P6458N53307k13489
5975F62059n30196n0286K04644J84922l8801k17746k86395K50075l6884K33535
5965C74927J75464r1778o35620J40144k3481J72794J92800M9914j52378n42298
$$ plain form
5955 -339512 126882 660865 357099 397363 337638 129207 394512 348442 648114 609615
5945 609615 558342 505586 -63213 270366 478440 406075 239174 529433 164132 -28230
5935 -28230 506288 577201 183284 297111 396576 492883 904993 717581 978863 1306199
5925 1306199 933952 1102540 1386580 1545751 1329523 1262891 793878 594724 676902 763695
5915 763695 937854 1168697 903964 376095 194911 528588 473235 168253 460988 451834
5905 451834 622956 215594 350005 292991 376317 437666 354030 501542 853568 -52963
5895 -52963 501710 666498 921709 1092874 481556 1571 273905 308857 321683 824786
5885 824786 71097 42353 588438 365714 267025 158918 187118 896816 322702 391581
$$ packed form
5955c39512M66394N33983l03766M0264n9725k08431K65305m6070K99672l8499
5945F09615n1273n2756n68799L33579K08074p2365j66901K90259l65301j92362
5935b8230N34518P0913l93917J13827R9465R6307M12110j87412K61282L27336
5925A306199l72247J68588K84040J59171k16228o6632m69013j99154Q2178Q6793
5915G63695J74159K30843k64733n27869j81184L33677n5353l04982K92735r154
5905D51834J71122m07362J34411n7014Q3326O1349q3636J47512L52026r06531
5895e2963N54673J64788K55211J71165o11318m79985K72334L4952J2826N03103
5885H24786p53689k8744N46085k22724r8689j08107K8200P09698n74114O8879
$$ plain form
5875 391581 338950 712834 976440 1142570 1121717 846533 799960 911638 1133861 982399
5865 982399 988391 623811 438466 795101 473942 -58509 -316264 186465 459643 544600
5855 544600 139455 519981 1028989 804650 802379 602849 199266 191328 470342 266988
5845 266988 235004 666522 601273 992929 147790 205387 581039 333643 535368 153052
5835 153052 -141331 102481 188852 641294 1258564 1493010 907650 945288 733017 150333
5825 150333 -149989 59149 166074 377378 814756 1072385 1471087 1063785 988535 1206618
5815 1206618 1324348 1015707 810071 331940 878830 261261 152144 678073 797720 636487
5805 636487 1092688 1303307 563902 531232 569440 450204 851587 800019 432814 995621
$$ packed form
5875C91581n2631L73884K63606J66130k0853k75184m6573J11678K22223j51462
5865I82399N992l64580j85345L56635l21159n32451k57755N02729K73178Q4957
5855E44600m05145L80526N09008k24339k271j99530m03583p938K79014k03354
5845B66988l1984M31518o5249L91656q45139N7597L75652k47396K01725l82316
5835A53052k94383K43812Q6371M52442O17270K34446n85360L7638k12271n82684
5825A50333l00322K09138J06925K11304M37378K57629L98702m07302p5250K18083
5815A206618J17730l08641k05636m78131N46890o17569j09117N25929J19647j61233
5805F36487M56201K10619p39405l2670L8208j19236M01383n1568l67205N62807
$$ plain form
5795 995621 1171289 801268 417654 414185 579095 851349 552276 527173 947300 1000771
5785 1000771 1189625 745853 667557 721675 1149765 924811 542595 689992 734171 629819
5775 629819 652187 461304 307581 363036 628792 888862 1089437 517320 767084 448802
5765 448802 734819 1140658 935477 897174 955732 628412 503580 670846 494717 502699
5755 502699 1050134 1019078 689857 220370 215226 1091438 925820 704983 326862 1160228
5745 1160228 1187637 789781 1217167 1165644 1355378 1310040 1212639 1029725 972775 854435
5735 854435 1558091 1445294 994283 1150613 1119404 1170518 1018586 1411480 1405288 1603462
5725 1603462 1286691 1219536 1208971 1480367 1076443 958536 1220662 1111425 1742599 1349957
$$ packed form
5795I95621J75668l70021l83614l469J64910K72254k99073k5103M20127N3471
5785A000771J88854m43772p8296N4118M28090k24954l82216J47397M4179j04352
5775F29819K2368j90883j53723N5455K65756K60070K00575n72117K49764l18282
5765D48802K86017M05839k05181l8303N8558l27320j24832J67266j76129P982
5755E02699N47435l1056l29221m69487n144Q76212j65618k20837l78121Q33366
5745A160228K7409l97856M27386n1523J89734m5338r7401j82914n6950j18340
5735H54435P03656j12797m51011J56330l1209N1114j51932L92894o192J98174
5725A603462l16771o7155j0565K71396m03924j17907K62126j09237O31174l92642
$$ plain form
5715 1349957 1024167 1275261 1170209 1147306 958939 958110 654810 993996 1468720 1301223
5705 1301223 1327373 1840576 1326170 1121090 1331669 1428575 1474020 1914858 1612462 1182935
5695 1182935 1692124 1145967 991465 1156811 801681 880966 1243384 1416817 1533332 1200709
5685 1200709 1234924 1461589 1624323 1226363 1012592 1406027 1131439 1385438 1644699 1533682
5675 1533682 1651697 1597734 1159257 1363191 1485503 1602015 1134832 1299240 1556304 1401002
5665 1401002 1802299 1583813 1209743 994926 1211015 1347582 1542975 1097908 1118381 1144127
5655 1144127 1180091 1451909 1462790 1416587 1365671 1341080 1551653 1916219 1957136 1962835 1742659
5644 1742659 1488744 1290535 1586342 1418288 2156801 1548138 1558016 1498640 1038861 1052620
$$ packed form
5715A349957l25790K51094j05052k2903j88367q29l03300L39186M74724j67497
5705A301223K6150N13203n14406k05080K10579R6906M5445M40838l02396m29527
5695A182935N09189n46157j54502J65346l55130P9285L62418J73433J16515l32623
5685A200709L4215K26665J62734l97960k13771L93435k74588K53999K59261j11017
5675A533682J18015n3963m38477K03934J22312J16512m67183J64408K57064j55302
5665A401002M01297k18486l74070k14817K16089J36567J95393m45067K0473K5746
5655A144127L5964K71818J0881m6203n0916k4591K10573L64566M0917N699k20176
5644A742659k53915j98209K95807j68054P38513o08663R878n9376m59779J3759
$$ plain form
5634 1052620 1620004 2131391 2130994 1667066 1452116 1749915 1461686 1770922 1653820 1513850
5624 1513850 1387202 1120015 1422515 1761676 1620841 1346278 1531020 1412714 1543321 1594992
5614 1594992 1328275 1383727 1537213 1701783 2218761 2477947 2580941 2371413 1338430 1970935
5604 1970935 1665043 1745010 1893694 2123554 1642401 1588225 1618274 1944939 2157578 2289560
5594 2289560 2224859 1570646 1590744 1578552 1861580 1943169 1997073 1892581 1323316 1770752
5584 1770752 2002777 2016884 2123133 2694888 2541661 1883806 2044851 2553774 2683453 2405517
5574 2405517 2452557 2362462 2111151 2342503 2386663 2429387 2293039 2471569 2731582 2398745
5564 2398745 2592521 2653172 2507475 2298031 2085853 2091871 2512993 2546631 2487402 2262922
$$ packed form
5634A052620N67384N11387l97m63928k14950K97799k88229L09236j17102j39970
5624A513850j26648k67187L02500L39161j40835k74563J84742j18306J30607N1671
5614A594992k66717N5452J53486J64570N16978K59186J02994k09528j032983O32505
5604A970935l05892P9967J48684K29860m81153n4176L0049L26665K12639J31982
5594B289560o4701o54213K0098j2192K83028Q1589N3904j04492n69265M47436
5584A770752K32025J4107J06249N71755j53227o57855J61045N08923J29679k77936
5574B405517M7040r0095k51311K31352M4160M2724j36348J78530K60013l32837
5564B398745J93776O0651j45697k09444k12178O018M21122L3638n9229k24480
$$ plain form
5554 2262922 2683278 2888640 2607902 2434428 2201684 2372207 2562726 2612133 2780802 2751314
5544 2751314 2547781 2920101 2810272 2817193 3258954 3243057 3144950 3246908 3467074 3184434
5534 3184434 2904212 2747645 2581461 2715705 2903644 2742986 2195559 2239482 2450487 3436624
5524 3436624 3235108 3062877 3690598 3351449 3612013 3467442 2994287 3040322 3347741 3520410
5514 3520410 3213642 2971616 3391831 3255160 3037367 3380874 3753934 3332650 3319671 3419545
5504 3419545 3809162 3813353 3733224 3556992 3650569 3536852 3402066 3739948 3422705 3676536
5494 3676536 3801162 3840983 3675625 3625006 3819958 3436730 3377396 3668556 4228194 3905126
5484 3905126 4095487 3793324 4223985 5130506 4871082 4669990 4265099 4266557 4053532 4159473
$$ packed form
5554B262922M20356K05362k80738j73474k32744J70523J90519M9407J68669k9488
5544B751314k03533L72320j09829O921M41761j5897r8107J01958K20166k82640
5534C184434k80222j56567j66184J34244J87939j60658n47427M3923K11005R86137
5524C436624k01516j72231O27721l39149K60564j44571m73155M6035L07419J72669
5514C520410l06768k42026M20215j36671k17793L43507L73060m21284j2979R9874
5504C419545L89617M191q0129j76232R3577j13717j34786L37882l17243K53831
5494C676536J24626L9821j65358n0619J94952l83228n9334K91160N59638l23068
5484C905126J90361l02163M30661R06521k59424k01092m04891J458k13025J05941
$$ plain form
5474 4159473 4442305 4462661 4786781 4545442 4676394 5022592 4892352 4953595 5110196 5187818
5464 5187818 5022663 5602072 5376149 5481814 5593247 5239841 5722683 5628427 5401551 5644422
5454 5644422 5629003 5758388 6096303 6377690 6668212 6616982 6577663 6554218 6884626 7090236
5444 7090236 7283432 7078687 6638035 6819771 6880534 6424804 6872445 6928750 7030674 7835187
5434 7835187 7954020 8043188 7805057 7836127 8246920 8595400 8965271 9173447 8831097 9093792
5424 9093792 9317078 9140539 9720260 10006424 10006184 9881990 10026936 10662894 10905434 10636006
5414 10636006 10969277 11640324 11902021 11585299 12000196 12330617 11941809 12325316 12644957
5405 12644957 13091862 13023750 13630672 14081185 14352014 15219824 15286891 14433499 14883010 15036967
$$ packed form
5474D159473K82832K0356L24120k41339J30952L46198j30240O1243J56601P7622
5464E187818j65155N79409k25923J05665J11433l53406M82842r4256k26876K42871
5454E644422j5419J29385L37915K81387K90522n1230l9319k3445L30408K05610
5444G090236J93196k04745m40652J81736O0763m55730M47641N6305J01924Q04513
5434G835187J18833Q9168k38131L1070M10793L48480L69871K08176l42350K62695
5424I093792K23286j76539N79721K86164k40j24194J44946O35958K42540k69428
5414A0636006L33271O71047K61697l16722M14897L30421l88808L83507L19641
5405A2644957M46905o8112O06922M50513K70829Q67810O7067q53392M49511J53957
$$ plain form
5395 15036967 15666965 16515396 16739647 16158194 15760405 16464969 16652829 16308124 16250180 16219387
5385 16219387 16532421 16813908 17249670 17332261 16726199 16906803 16371060 16600995 16489877 16254344
5375 16254344 16412721 16348966 16261172 16133744 15859756 15958819 16278158 16156086 15966161 15837739
5365 15837739 15771592 15893703 16011552 16101197 16000374 15594127 15733192 15918151 16062525 16321630
5355 16321630 16573018 16748283 17262189 17464095 17112547 17452594 17525040 17621901 18124014 18844120
5345 18844120 18804571 18835324 19259776 19708675 20200599 20229487 20561665 21168963 21467256 22215810
5335 22215810 22195518 22345871 22576759 22816857 23153311 23407659 23759419 24303619 24294885 24080670
5325 24080670 24436222 24650984 24515884 24120763 23760246 23724032 23446915 22754475 22593707 22623847
$$ packed form
5395A5036967O29998Q48431K24251n81453l97789P04564J87860l44705n7944l0793
5385A6219387L13034K81487M35762Q2591o06062J80604n35743K29935j11118k35533
5375A6254344J58377o3755q7794j27428k73988R9063L19339j22072j89925j28422
5365A5837739o6147J22111J17849Q9645j00823m06247J39065J84959J44374K59105
5355A6321630K51388J75265N13906K01906l51548L40047P2446R6861N02113P20106
5345A8844120l9549L0753M24452M48899M91924K8888L32178O07298K98293P48554
5335B2215810k0292J50353K30888K40098L36454K54348L51760N44200q734k14215
5325B4080670L55552K14762j35100l95121l60517l6214k77117o92440j60768L0140
$$ plain form
5315 22623847 22451383 21681077 21666873 21304937 21186512 20142894 19397310 18841224 18303165
5306 18303165 18460034 18072451 17749736 17398749 17066259 16708182 16040139 15826256 15554611
5297 15554611 15475248 15580678 15124546 15143678 15154827 14842750 14785166 13803197 13611873 13929741
5287 13929741 13795647 13945467 13895268 14392296 14469309 14221260 14166109 13901497 14221795 14721432
5277 14721432 14893736 14898615 15288283 15285742 15520665 15673803 16010199 16919838 16723207 16903664
5267 16903664 17415481 18004453 17912501 17815766 18166751 18024416 18169450 17933558 17586671 17987225
5257 17987225 17612103 17549053 17032997 16859872 17442477 17376618 17190134 16316860 15726871 15230626
5247 15230626 15400107 14978105 14099561 13696076 13360921 13152493 12769219 12678646 12415195 12004365
$$ packed form
5315B2623847j72464p70306j4204l61936j18425j043618p45584n56086n38059
5306A8303165J56869l87583l22715l50987l32490l58077o68043k13883k71645
5297A5554611p9363J05430m56132J9132J1149l12077n7584r81969j91324L17868
5287A3929741j34094J49820n0199M97028P7013k48049n5151k64612L20298M99637
5277A4721432J72304M879L89668k541K34923J53138L36396R09639j96631J80457
5267A6903664N11817N88972r1952r6735L50985j42335J45034k35892l46887M00554
5257A7987225l75122o3050n16056j73125N82605o5859j86484q73274n89989m96245
5247A5230626J69481m22002q78544m03485l35155k08428l83274r0573k63451m10830
$$ plain form
5237 12004365 11759567 11127360 10783655 10719236 10716341 10563214 10144780 9741411 9505174 9399235
5227 9399235 8973562 8818999 8606738 8900514 9361075 8705914 8192789 8509351 8172709 7892439
5217 7892439 7566036 7221925 7033970 7230472 6902134 6761952 7140326 7314282 7840353 8066472
5207 8066472 7651327 7435456 7125745 6568269 6719493 7117719 6828336 6750174 6180713 6209820
5197 6209820 6769915 6883133 7152399 7113381 7070622 6496541 6315198 5671195 5503270 6188849
5187 6188849 6156706 6307727 6453019 6080885 6073750 6208358 6207067 6504564 6552010 6651767 6641822
5176 6641822 6978080 7104695 6957245 7048275 7369277 6902263 6782129 7081405 7208190 7332880
5166 7332880 7480444 7167095 6749087 7033440 6929584 7096301 7374580 7309038 7110615 7122094
$$ packed form
5237A2004365k44798o32207l43705o4419k895j53127m18434m03369k36237j05939
5227I399235m25673j54563k12261K93776M60561o55161n13125L16562l36642k80270
5217G892439l26403l44111j87955J96502l28338j40182L78374J73956N26071K26119
5207H066472m15145k15871l09711n57476J51224L98226k89383p8162n69461K9107
5197F209820N60095J13218K69266l9018m2759n74081j81343o44003j67925O85579
5187F188849l2143J51021J45292l72134p135J34608j291K97497M7446R9757r945
5176F641822L36258J26615j47450R1030L21002m67014j20134K99276J26785J24690
5166G332880J47564l13349m18008K84353j03856J66717K78279o5542j98423J1479
$$ plain form
5156 7122094 6933045 6975522 7051180 6821549 7252212 7424098 7388181 7461023 7581648 7843595
5146 7843595 7671683 7599301 7930810 8207608 8388685 7891484 7910335 8083761 7836007 8312842
5136 8312842 8175547 8232138 8658597 8854070 8127875 8357267 8680674 8591702 9062665 8646682
5126 8646682 8467440 9059948 9099042 9483451 9739738 9587453 10018102 9996533 9822465 9384223
5116 9384223 9494067 9643826 9534829 9926020 10099532 10525874 10895014 10551816 10759733 10818603
5106 10818603 10426721 10088347 10723649 11571046 11476991 11599345 11289117 10934678 11371812 11587957
5096 11587957 11557364 11456095 11840560 12132813 12392688 12587080 12614340 13308591 13328911 13587092
5086 13587092 13191152 13465438 14231422 14543448 14586583 14730607 14501557 14531118 14768676 15042097
$$ packed form
5156G122094j89049M2477P5658k29631M30663J71886l5917P2842J20625K61947
5146G843595j71912p2382L31509K76798J81077m97201J8851J73426k47754M76835
5136H312842j37295N6591M26459J95473p26195K29392L23407q8972M70963m15983
5126H646682j79242N92508L9094L84409K56287j52285M30649k1569j74068m38242
5116I384223J09844J49759j08997L91191J73512M26342L69140l43198K07917N8870
5106A0818603l91882l38374O35302Q47397r4055J22354l10228l54439M37134K16145
5096A1587957l0593j01269L84465K92253K59875J94392K7260O94251K0320K58181
5086A3587092l95940K74286P65984L12026M3135J44024k29050K9561K37558K73421
$$ plain form
5076 15042097 15146362 15835078 16156309 16329186 16825084 16840190 17133060 17568148 17728317 17972645
5066 17972645 18261267 18584364 18726543 18841688 19443404 19941040 20056712 20429079 20816577
5057 20816577 20780512 20684403 21292585 22199903 22583861 22476722 22634615 22530379 22642098 22933016
5047 22933016 23143948 23943583 24325164 24460986 24757254 24615452 25158746 25422821 25118473
5038 25118473 25125834 25854050 26356586 25654411 25605076 26112150 26588796 26460777 27184045 27190559
5028 27190559 27465238 27696026 28285635 28295746 28669758 29131543 29098418 29251764 29108992 29368395
5018 29368395 29431286 29801259 30154867 30162989 30177157 29937478 29938914 30102039 30253605 30046875
5008 30046875 30139115 30048560 30185822 30383496 31123285 31277469 30968792 30845554 31629252 32234683
$$ packed form
5076A5042097J04265O88716L21231J72877M95898J5106K92870M35088J60169K44328
5066A7972645K88622L23097J42179J15145O01716M97636J15672L72367L87498
5057B0816577l6065r6109O08182R07318L83958j07139J57893j04236J11719K90918
5047B2933016K10932P99635L81581J35822K96268j41802N43294K64075l04348
5038B5118473P361P28216N02536p02175m9335N07074M76646j28019P23268O514
5028B7190559K74679K30788N89609J0111L74012M61785l3125J53346j42772K59403
5018B9368395O2891L69973L53608Q122J4168k39679J436J63125J51566k06730
5008C0046875R2240r0555J37262J97674P39789J54184l08677j23238P83698O05431
$$ plain form
4998 32234683 32199102 32310010 32454484 32783345 33514223 34170360 34301431 34259630 33644887 34287901
4988 34287901 34855051 35058626 35406204 35883821 36236705 36046236 36366750 36746707 37398944
4979 37398944 37718048 38213333 38661695 39404427 39543406 39182625 39676307 40283534 40443982
4970 40443982 41383515 42642667 42833312 43075696 44115036 44965348 45263938 46454601 47303307
4961 47303307 48053002 48899389 49909744 50869086 51444229 52316834 53840180 54832178 55479124
4952 55479124 56205486 57247786 57985878 59920247 61145075 61464678 62597944 63279582 64201524
4943 64201524 65630739 66245251 66940966 68221781 68885985 69937084 70963212 71729195 72651128
4934 72651128 72902622 73865408 75001034 75975130 76317739 76715415 77218925 77598815 78000055
$$ packed form
4998C2234683l5581J10908J44474L28861P30878O56137J31071m1801o14743O43014
4988C4287901N67150K03575L47578M77617L52884j90469L20514L79957O52237
4979C7398944L19104M95285M48362P42732J38979l60781M93682O07227J60448
4970D0443982R39533J259152J90645K42384J039340Q50312K98590J190663Q48706
4961D7303307P49695Q46387J010355R59342N75143Q72605J523346R91998O46946
4952E5479124P26362J042300P38092J934369J224828L19603J133266O81638R21942
4943F4201524J429215O14512O95715J280815O64204J051099J026128P65983R21933
4934G2651128K51494R62786J135626R74096L42609L97676N03510L79890M01240
$$ plain form
4925 78000055 77974108 78467969 78240032 78575281 78597940 78135544 78653502 78388023 77845512 77821928
4915 77821928 77369867 76698075 75949005 75438690 74635517 73435971 72426557 71688040 70250373
4906 70250373 68631864 67457886 66121625 64845768 63187925 62336634 61030862 59714589
4898 59714589 58269267 57216274 56350451 55006879 53920350 52814036 51368162 50055996
4890 50055996 48677513 47956588 47154304 45545173 44251121 43018616 41719856 40404377
4882 40404377 39465874 38140985 37438900 37009944 36033657 34776807 33643853 32727270 31882086
4873 31882086 31007615 30614957 30037322 29484738 28838095 28125461 27473426 26909439 26720704
4864 26720704 26101236 25485645 25003974 24550037 24265459 24088095 23783295 23459586 23062134
$$ packed form
4925G8000055k5947M93861k27937L35249K2659m62396N17958k65479n42511k3584
4915G7821928m52061o71792p49070n10315q03173j199546j009414p38517j437667
4906G0250373j618509j173978j336261j275857j657843q51291j305772j316273
4898E9714589j445322j052993q65823j343572j086529j106314j445874j312166
4890E0055996j378483p20925q02284j609131j294052j232505j298760j315479
4882D0404377r38503j324889p02085m28956r76287j256850j132954r16583q45184
4873C1882086q74471l92658n77635n52584o46643p12634o52035n63987j88735
4864B6720704o19468o15591m81671m53937k84578j77364l04800l23709l97452
$$ plain form
4855 23062134 22510075 21815702 21334341 20525166 20642531 20867569 20483093 20229799 20246920 20003798
4845 20003798 19964830 19324442 18534680 18691091 18528389 17921813 17455854 17300640 17031646 16846430
4835 16846430 16446334 16114684 15836352 15718756 15637585 15708664 15421452 14557529 14562744 14466395
4825 14466395 14015544 13865525 13879406 13540623 13162565 12994904 13233966 12971560 12519305 12199225
4815 12199225 11959628 11990486 11405746 11506946 10967787 11022620 11441342 11319237 11326951 10823901
4805 10823901 10803132 11034404 10387060 10221597 10019667 10440419 10467721 10653079 10641677 10265020
4795 10265020 10055067 9725732 9881768 9930626 9947399 9707350 9547293 9361900 9263588 9355536
4785 9355536 8896545 9002294 9681518 9116031 9483458 9414904 9064031 9182860 8582213 8699979
$$ packed form
4855B3062134n52059o94373m81361q09175J17365K25038l84476k53294J7121k43122
4845B0003798l8968o40388p89762J56411j62702o06576m65959j55214k68994j85216
4835A6846430m00096l31650k78332j17596q1171P1079k87212q63923N215r6349
4825A4466395m50851j50019J3881l38783l78058j67661K39062k62406m52255l20080
4815A2199225k39597L0858n84740J01200n39159N4833M18722j22105P714n03050
4805A0823901k0769K31272o47344j65463k01930M20752K7302J85358j1402l76657
4795A0265020k09953l29335J56036M8858J6773k40049j60057j85393r8312R1948
4785I355536m58991J05749O79224n65487L67427o8554l50873J18829o00647J17766
$$ plain form
4775 8699979 9020451 9092467 8830463 8822455 8445777 8628667 8637641 8444429 8566401 8673584
4765 8673584 8853832 8999967 8669966 8746237 8996462 9142884 8819266 8626554 8350539 7939963
4755 7939963 8140537 8915259 8897034 8773483 8642984 8591721 9183611 9016622 8728310 8481971
4745 8481971 8654980 8142958 7727617 8329372 8579720 8502131 8599346 8510381 8519616 8371865
4735 8371865 8476003 8713604 9121254 9111113 8994866 8535094 8488704 8725864 9053705 8768977
4725 8768977 8857694 8873629 8897276 8895667 9238722 8900848 9212523 9009692 8826562 8797967 8915391
4714 8915391 8993063 8774060 9480107 9300651 9033187 9178699 9302778 9283051 10193741 9852631
4704 9852631 9828960 9979071 9736204 9471876 9537391 9685662 10069193 10155614 10153306 10100713 10475621
$$ packed form
4775H699979L20472P2016k62004q008l76678J82890Q974j93212J21972J07183
4765H673584J80248J46135l30001P6271K50225J46422l23618j92712k76015m10576
4755G939963K00574P74722j8225j23551j30499n1263N91890j66989k88312k46339
4745H481971J73009n12022m15341O01755K50348p7589R7215q8965R235j47751
4735H371865J04138K37601M07650j0141j16247m59772m6390K37160L27841k84728
4725H768977Q8717J5935K3647j609L43055l37874L11675k02831j83130k8595J17424
4714H915391P7672k19003P06047j79456k67464J45512J24079j9727R10690l41110
4704I852631k3671J50111k42867k64328O5515J48271L83531Q6421k308n2593L74908
$$ plain form
4693 10475621 10495145 10714357 11134845 11197061 10976788 10458427 10805865 10635875 11358928 11404135
4683 11404135 11469258 11985891 11748510 11789602 11853692 12308471 12200123 12545653 12952740 12566732
4673 12566732 12721678 13270947 13306042 13324799 13677258 14116535 13593628 13680054 14087797 14307066
4663 14307066 14532933 14892808 14978892 15121854 15467513 15381621 15372219 15514901 16502163 16731772
4653 16731772 16788785 17264620 17311947 17343790 17456524 17629875 18209085 18218314 18639514 18701202
4643 18701202 18884872 18912904 18825707 19118998 19486768 18893838 18677442 18845651 18686836 18308533
4633 18308533 18522355 18326869 18188938 18223443 18335887 18087345 18111654 18262723 18083740 18216037
4623 18216037 18254231 18183372 18522731 18716711 18443914 18704629 18024200 18002458 18297968 18471353
$$ packed form
4693A0475621J9524K19212M20488O2216k20273n18361L47438j69990P23053M5207
4683A1404135O5123N16633k37381M1092O4090M54779j08348L45530M07087l86008
4673A2566732J54946N49269L5095J8757L52459M39277n22907Q6426M07743K19269
4663A4307066K25867L59875Q6084J42962L45659q5892r402J42682R87262K29609
4653A6731772N7013M75835M7327L1843J12734J73351N79210R229M21200O1688
4643A8701202J83670K8032q7197K93291L67770n92930k16396J68209j58815l78303
4633A8308533K13822j95486j37931L4505J12444k48542K4309J51069j78983J32297
4623A8216037L8194p0859L39359J93980k72797K60715o80429k1742K95510J73385
$$ plain form
4613 18471353 18489823 19086660 18678410 18046524 18529757 18918812 19716616 19777471 19667863 19588796
4603 19588796 20113340 20314339 20024067 20227611 20627428 20785857 20792562 20587107 20726604 20720074
4593 20720074 20433829 21126485 22350799 22364231 21829050 21944479 22156858 22378928 22197916
4584 22197916 22410351 23369100 23492443 23541670 23618210 23783800 25423817 24958962 24939401 25042125
4574 25042125 25549673 26133540 26324225 26560072 26712502 26575285 26729654 27343057 28058255
4565 28058255 28441289 28166153 27943831 28608413 28744256 28401960 28835983 29086278 29007118 29645735
4555 29645735 29760551 29865534 29857032 30230742 29892565 29859492 30256546 30533044 30643381 30608083
4545 30608083 30846325 30574928 31141848 31540350 31410382 31586972 31859212 32266311 32671453
$$ packed form
4613A8471353J8470N96837m08250o31886M83233L89055P97804O0855j09608p9067
4603A9588796N24544K00999k90272K03544L99817J58429O705k05455J39497o530
4593B0720074k86245O92656J224314J3432n35181J15429K12379K22070j81012
4584B2197916K12435R58749J23343M9227P6540J65590J640017m64855j9561J02724
4574B5042125N07548N83867J90685K35847J52430j37217J54369O13403P15198
4565B8058255L83034k75136k22322O64582J35843l42296M34023K50295p9160O38617
4555B9645735J14816J04983q502L73710l38177l3073L97054K76498J10337l5298
4545C0608083K38242k71397N66920L98502j29968J76590K72240M07099M05142
$$ plain form
4536 32671453 32722549 32763775 32959496 33231912 33220493 33838348 33729139 34033060 34324938 34394135
4526 34394135 35051060 34941533 34823989 35410127 36188848 36982523 37401078 36947953 37599881
4517 37599881 37982311 37930779 37790106 38038263 38852235 39188838 39251983 39131912 39469800 40250250
4507 40250250 41244969 41466292 41255596 41518871 42372631 42746261 43412337 43935724 43988069 44510003
4497 44510003 45268977 45898759 47130354 47254621 47711442 48394775 49245896 49695161 50813927
4488 50813927 52479423 53197755 53932984 55399536 56088972 57193956 57532389 59108535 60875561
4479 60875561 61588556 62753765 64340939 65653616 66100241 66953664 68018670 68750424 70282544
4470 70282544 70696131 71350321 72070231 72552383 73231560 74089934 75184920 76353084 77297857
$$ packed form
4536C2671453N1096M1226J95721K72416j1419O17855j09209L03921K91878O9197
4526C4394135O56925j09527j17544N86138P78721P93675M18555m53125O51928
4517C7599881L82430n1532j40673K48157Q13972L36603O3145j20071L37888P80450
4507D0250250R94719K21323k10696K63275Q53760L73630O66076N23387N2345N21934
4497D4510003P58974O29782J231595J24267M56821O83333Q51121M49265J118766
4488E0813927J665496P18332P35229J466552O89436J104984L38433J576146J767026
4479F0875561P12995J165209J587174J312677M46625Q53423J065006P31754J532120
4470G0282544M13587O54190P19910M82152O79177Q58374J094986J168164R44773
$$ plain form
4461 77297857 78077962 79353873 80563281 81642888 82607684 83527343 84408030 85189220 85585693
4452 85585693 85419595 85472240 85515977 85454265 84758594 84314549 83971640 83332239 83405461 82606336
4442 82606336 81475556 80022350 80087105 79397767 79673305 79097203 78638419 77803003 77560874
4433 77560874 77235983 76715371 76130658 75435109 75066788 73805641 72848977 72393503 72247831
4424 72247831 71566212 70666241 69650997 68475885 67656692 66997924 66515709 65147531 64810205
4415 64810205 63772178 62997197 62268968 61887354 61049942 60705185 60046882 59385084 59250770
4406 59250770 58591673 58640262 58256128 57744096 57214063 57024974 56709038 56331635 55854964 55801220
4396 55801220 55866612 56379414 55806970 55173954 54369991 54558444 54527546 54371293 54586541 54561556
$$ packed form
4461G7297857P80105J275911J209408J079607R64796R19659Q80687P81190L96473
4452H5585693j66098N2645M3737o1712o95671m44045l42909o39401P3222p99125
4442H2606336j130780j453206O4755o89338K75538n76102m58784q35416k42129
4433G7560874l24891n20612n84713o95549l68321j261147r56664m55474j45672
4424G2247831o81619q99971j015244j175112q19193o58768m82215j368178l37326
4415F4810205j038027p74981p28229l81614q37412l44757o58303o61798j34314
4406E9250770o59097M8589l84134n12032n30033j89089l15936l77403m76671n3744
4396E5801220O5392N12802n72444o33016q03963J88453l0898j56253K15248k4985
$$ plain form
4386 54561556 54493006 54460038 54474359 54099845 54505263 54996813 54632505 54485719 54522018 54668135
4376 54668135 54534475 54890492 55364791 55263400 55433420 55679574 55991864 55849896 55699930
4367 55699930 56274264 56945502 56996294 57041470 57568655 57797672 58051066 58434168 58445596 58243314
4357 58243314 58692087 59325717 59604471 60361418 60629006 61190139 62116032 62239044 63038337
4348 63038337 63705591 64370947 65211348 65726667 66384150 67474803 67880913 67901713 68960166
4339 68960166 69846809 70411638 71414132 72326106 73291621 73876573 74715516 75784927 77267300
4330 77267300 78230878 79320760 80703126 81205650 82188874 83732148 85007670 86266356 86854280
4321 86854280 87415520 88983723 90582396 91623073 92394441 93749162 95064798 96015522 97230879
$$ packed form
4386E4561556o8550l2968J4321l74514M05418M91550l64308j46786L6299J46117
4376E4668135j33660L56017M74299j01391J70020K46154L12290j41968j49966
4367E5699930N74334O71238N0792M5176N27185K29017K53394L83102J1428k02282
4357E8243314M48773O33630K78754P56947K67588N61133R25893J23012P99293
4348F3038337O67254O65356Q40401N15319O57483J090653M06110K0800J058453
4339F8960166Q86643N64829J002494R11974R65515N84952Q38943J069411J482373
4330G7267300R63578J089882J382366N02524R83224J543274J275522J258686N87924
4321H6854280N61240J568203J598673J040677P71368J354721J315636R50724J215357
$$ plain form
4312 97230879 98158424 99071380 99791688 100610703 101233255 101918928 102345605 102911339 103640151
4303 103640151 103731957 103884487 103910524 103724074 103780365 103566039 103596830 103027672 102905864 102359327
4293 102359327 101199286 100418472 99760114 98901945 97606306 96772276 95702424 95094817 94121276
4284 94121276 92832360 91542148 90329103 88799209 88244488 87582317 86342078 85130847
4276 85130847 83321498 82122390 81403458 79865342 78429316 76990842 76052521 74906188
4268 74906188 73960422 72784420 71832644 70315020 69175319 68072133 67213116 66366201 65440157
4259 65440157 64612193 63828354 62576712 61246652 60313731 59404176 58725684 57720213 56758114
4250 56758114 56117062 55484735 54787689 54556291 53713356 53144720 52618116 52180038 51654513
$$ packed form
4312I7230879R27545R12956P20308Q19015O22552O85673M26677N65734P28812
4303A03640151R1806J52530K6037j86450N6291k14326L0791n69158j21808n46537
4293A02359327j160041p80814o58358q58169j295639q34030j069852o07607r73541
4284I4121276j288916j290212j213045j529894n54721o62171j240239j211231
4276H5130847j809349j199108p18932j538116j436026j438474r38321j146333
4268G4906188r45766j176002r51776j517624j139701j103186q59017q46915r26044
4259F5440157q27964p83839j251642j330060r32921r09555o78492j005471r62099
4250E6758114o41052o32327o97046k31398q42935n68636n26604m38078n25525
$$ plain form
4241 51654513 51241248 51078639 50412885 49677314 49128932 48539168 48529892 47995688 47357824 47253414
4231 47253414 46914444 46664604 46148817 46062482 45778475 45622214 45118455 44650771 44886292 44226593
4221 44226593 43952502 43294187 43019843 42605376 42443276 42400023 42115268 42125968 41907212 41323966
4211 41323966 40971672 41147114 41150416 40643844 40105672 39960882 39536084 39483186 38674355 38323297
4201 38323297 37999494 38003500 37644719 37262875 37459356 37085139 37200557 37051408 37016446 37300350
4191 37300350 36374508 35628356 35576585 35523791 35542557 35031281 35188490 35224890 34742442 34500763
4181 34500763 34490631 34437405 34273083 33535477 33254279 33410136 33117281 32680625 32570434 32631406
4171 32631406 32950324 32732122 32289679 31968636 31753571 31759599 31483223 31341993 31554576 31562333
$$ packed form
4241E1654513m13265j62609o65754p35571n48382n89764r276n34204o37864j04410
4231D7253414l38970k49840n15787q6335k84007j56261n03759m67684K35521o59699
4221D4226593k74091o58315k74344m14467j62100m3253k84755J0700k18756n83246
4211D1323966l52294J75442L302n06572n38172j44790m24798n2898q08831l51058
4201C8323297l23803M006l58781l81844J96481l74217J15418j49149l4962K83904
4191C7300350r25842p46152n1771n2794J8766n11276J57209L6400m82448k41679
4181C4500763j0132n3226j64322p37606k81198J55857k92855m36656j10191O0972
4171C2631406L18918k18202m42443l21043k15065O028k76376j41230K12583P757
$$ plain form
4161 31562333 31555015 31273264 31611274 31616034 31450428 31335503 31101257 30574773 30345466 30610673
4151 30610673 31096976 31061805 30896054 31281098 31171802 30970296 31289028 30865501 30725079 31625784
4141 31625784 31895928 31597874 31683319 31356300 31503647 31747777 31672874 31998426 32062641 32639765
4131 32639765 32438269 31879032 31815737 31988480 32291930 32112446 31979515 32059645 32330182 32532568
4121 32532568 31988485 32094395 32712978 32977184 32565261 32580530 32927031 32595425 32671846 32273949
4111 32273949 31958330 32730807 33173716 33085435 33006633 33627441 33615044 33373434 33681657 34309201
4101 34309201 33823477 33424341 33525209 33478699 33691347 33950021 34039513 34178011 33957810 33694317
4091 33694317 33796768 33672786 33384433 33102722 32774968 32770468 32985721 33160110 33168464 32717006
$$ packed form
4161C1562333p318k81751L38010M760j65606j14925k34246n26484k29307K65207
4151C0610673M86303l5171j65751L85044j09296k01506L18732m23527j40422R00705
4141C1625784K70144k98054Q5445l27019J47347K44130p4903L25552O4215N77124
4131C2639765k01496n59237o3295J72743L03450j79484j32931Q0130K70537K02386
4121C2532568n44083J05910O18583K64206m11923J5269L46501l31606P6421l97897
4111C2273949l15619P72477M42909q8281p8802O20808j2397k41610L08223O27544
4101C4309201m85724l99136J00868m6510K12648K58674Q9492J38498k20201k63493
4091C3694317J02451j23982k88353k81711l27754m500K15253J74389Q354m51458
$$ plain form
4081 32717006 32560605 32986280 32940628 33139126 32435930 32376434 32388636 32053727 32446772 32431795
4071 32431795 32340383 32495334 32180775 32759310 32713000 32953619 33627801 33568991 33158191 32846345
4061 32846345 33719861 33749331 33605763 33647464 33626449 33896980 33810890 33368757 33489193 33543534
4051 33543534 33664513 34241727 34403287 34504327 34483000 34720307 35003401 35143280 35088197 34744965
4041 34744965 34966674 35229760 35082722 35339990 35621114 35618603 34950973 34742087 35041501 34199803
4031 34199803 34055823 33974589 34220672 34147161 34284952 33909544 33753681 33878122 33371390 32990247
4021 32990247 32826751 32640523 32788950 32780444 32981785 32888858 33272259 33528273 33593872 33432399
4011 33432399 33188223 33176371 32881199 32512765 32589575 32623381 32599491 32550357 32429423 32506945
$$ packed form
4081C2717006j56401M25675m5652J98498p03196n9496J2202l34909L93045j4977
4071C2431795r1412J54951l14559N78535m6310K40619O74182n8810m10800l11846
4061C2846345Q73516K9470j43568M1701k1015K70531q6090m42133J20436N4341
4051C3543534J20979N77214J61560J01040k1327K37307K83094J39879n5083l43232
4041C4744965K21709K63086j47038K57268K81124k511o67630k08886K99414q41698
4031C4199803j43980q1234K46083p3511J37791l75408j55863J24441n06732l81143
4021C2990247j63496j86228J48427q506K01341r2927L83401K56014O5599j61473
4011C3432399k44176j1852k95172l68434P6810L3806k3890m9134j20934P7522
$$ plain form
4001 32506945 31677248 31539682 31622585 32366984 32672310 32482213 32595690 32860778 32781023 32652242
3991 32652242 32395432 32331934 32785450 32857125 32566724 32256196 32499786 32395785 32424025 32714732
3981 32714732 33149532 32826478 32791916 33007188 33226040 32927474 32849407 32754619 32811911 33213144
3971 33213144 33409811 33106086 33050708 33504372 33687261 33494311 34036654 34015059 34107308 34305359
3961 34305359 34404754 34873836 34900997 34878064 34868427 35699974 35316892 35405646 35510008 35475280 35835339
3950 35835339 36066886 36500647 36864038 37171641 37710037 37771130 37796904 38372545 38929417 38421366
3940 38421366 38177701 37675611 37458066 37659672 37608866 37386232 37422787 37644876 37842338 37715252
3930 37715252 37627752 38374943 39172484 38382990 38232066 38435272 38688507 39432520 40267265 40564848
$$ packed form
4001C2506945q29697j37566Q2903P44399L05326j90097J13477K65088p9755j28781
3991C2652242k56810o3498M53516P1675k90401l10528K43590j04001K8240K90707
3981C2714732M34800l23054l4562K15272K18852k98566p8067r4788N7292M01233
3971C3213144J96667l03725n5378M53664J82889j92950N42343k1595R2249J98051
3961C4305359R9395M69082K7161k2933r637Q31547l83082Q8754J04362l4728L60059
3950C5835339K31547M33761L63391L07603N38396O1093K5774N75641N56872n08051
3940C8421366k43665n02090k17545K01606n0806k22634L6555K22089J97462j27086
3930C7715252q7500P47191P97541p89494j50924K03206K53235P44013Q34745K97583
$$ plain form
3920 40564848 40518684 41146987 41283796 41737424 41899957 42573370 43024160 43219457 43867116 43825585
3910 43825585 44043036 44432244 45284865 45574429 46010995 46327173 46626849 47558928 48416827
3901 48416827 48906902 49578882 49840404 50172088 51442419 52349938 53028189 54056507 56037797
3892 56037797 57119304 57948697 59283188 60684687 62108956 63311482 64681277 66573308
3884 66573308 68198987 70226331 72024861 73577597 75669598 77562884 79424366 81778311
3876 81778311 83477059 85617716 86528788 87693170 89062666 90102849 91207123 91946555
3868 91946555 92598746 93428325 94602304 95212326 95739231 97119272 98173860 98976159 99986562
3859 99986562 100778538 101579164 102420419 103110389 102591090 102487423 103497760 103998570 103181222
$$ packed form
3920D0564848m6164O28303J36809M53628J62533O73413M50790J95297O47659m1531
3910D3825585K17451L89208Q52621K89564M36566L16178K99676R32079Q57899
3901D8416827M90075O71980K61522L31684J270331R07519O78251J028318J981290
3892E6037797J081507Q29393J334491J401499J424269J202526J369795J892031
3884F6573308J625679K027344J798530J552736K092001J893286J861482K353945
3876H1778311J698748K140657R11072J164382J369496J040183J104274P39432
3868I1946555O52191Q29579J173979O10022N26905J380041J054588Q02299J010403
3859I9986562P91976Q00626Q41255O89970n19299j03667J010337N00810q17348
$$ plain form
3850 103181222 102735625 101806605 100828228 99360856 97702945 96217361 95037661 93617518
3842 93617518 92688937 91050291 89527925 87549256 86127715 84872260 83236537 81785810
3834 81785810 80093647 78845171 77443817 75875875 74090577 72808706 70834729 69082803
3826 69082803 67212879 65447617 63641698 61693042 59536173 57896668 55572595 53794447
3818 53794447 52365196 51082637 49423670 47852329 46917498 45437345 44473589 43386005
3810 43386005 42506940 41015313 40045712 39249668 37457915 36700443 35795109 35779016 34832695
3801 34832695 33751164 33439598 33254681 32786862 31550818 31465217 31024733 30299022 30386434
3792 30386434 30355178 30151687 29818200 29476144 29365710 28784323 28605675 28708161 28577141 28158917
$$ packed form
3850A03181222m45597r29020r78377j467372j657911j485584j179700j420143
3842I3617518r28581j638646j522366j978669j421541j255455j635723j450727
3834H1785810j692163j248476j401354j567942j785298j281871j973977j751926
3826F9082803j869924j765262j805919j948656k156869j639505k324073j778148
3818E3794447j429251j282559j658967j571341r34831j480153r63756j087584
3810D3386005q79065j491627r69601p96044j791753p57472r05334j6093r46321
3801C4832695j081531l11566j84917m67819j236044q5601m40484p25711Q7412
3792C0386434l1256k03491l33487l42056j10434n81387j78648J02486j31020m18224
$$ plain form
3782 28158917 28188752 28316107 28049459 28458412 28300916 28039241 28146162 27546914 27284250 27760886
3772 27760886 27931840 27524700 27147986 27102236 26794227 26357885 26892762 26748271 26492261 26207286
3762 26207286 26482578 26099667 25759322 24759722 24390022 25274235 25401880 24505887 24179990
3753 24179990 24172400 24084615 23723694 23161047 23258198 23402653 23291852 23181165 23340184 23331391
3743 23331391 23494687 23437824 23297502 23077621 22815630 22460583 22895502 23323958 23450764 22976079
3733 22976079 22852179 22850806 23470416 23828801 24114642 23984155 23633514 23905873 24769990 24731614
3723 24731614 24227961 24624359 24636836 25127371 25550748 25696308 26253325 26390029 26393242 26054635
3713 26054635 26250983 26858731 26750188 26781965 26864752 26701324 26961408 27104009 26983194 27761021
$$ packed form
3782B8158917K9835J27355k66648M08953j57496k61675J06921n99248k62664M76636
3772B7760886J70954m07140l76714m5750l08009m36342N34877j44491k56010k84975
3762B6207286K75292l82911l40345r99600l69700Q84213J27645q95993l25897
3753B4179990p590q7785l60921n62647R7151J44455j10801j10687J59019q793
3743B3331391J63296n6863j40322k19881k61991l55047M34919M28456J26806m74685
3733B2976079j23900j373O19610L58385K85841j30487l50641K72359Q64117l8376
3723B4731614n03653L96398J2477M90535M23377J45560N57017J36704L213l38607
3713B6054635J96348O07748j08543L1777Q2787j63428K60084J42601j20815P77827
$$ plain form
3703 27761021 28102249 27808066 27765018 28459294 28895235 28429937 28250534 28198778 27836598 27953296
3693 27953296 27906119 27556386 27770466 27481449 26536128 26057968 26238336 25755213 25488460 25013460
3683 25013460 24974147 24961003 24243463 24561152 23911052 23720680 24208385 23806137 23345038 22948595
3673 22948595 22411402 22228001 21968577 21679381 21579059 21061535 21172281 21298007 20820337
3664 20820337 20273225 20140614 20232083 20064238 19903438 19787266 19818020 20106846 19987367 19820098
3654 19820098 19955464 19686555 19844435 19647938 19589004 19754682 20607223 20239300 20320499 20549357
3644 20549357 20705182 20332207 20771622 20927939 20820750 20874574 20274271 20423244 19509952 18676238
3634 18676238 18524432 18303789 18387484 17993462 17378441 17260672 16961962 16909636 16582090 15717895
$$ packed form
3703B7761021L41228k94183m3048O94276M35941m65298j79403n1756l62180J16698
3693B7953296m7177l49733K14080k89017r45321m78160J80368m83123k66753m75000
3683B5013460l9313j3144p17540L17689o50100j90372M87705m02248m61099l96443
3673B2948595n37193j83401k59424k89196j00322n17524J10746J25726m77670
3664B0820337n47112j32611R1469j67845j60800j16172L0754K88826j19479j67269
3654A9820098J35366k68909J57880j96497n8934J65678Q52541l67923Q1199K28858
3644B0549357J55825l72975M39415J56317j07189N3824o00303J48973r13292q33714
3634A8676238j51806k20643Q3695l94022o15021j17769k98710n2326l27546q64195
$$ plain form
3624 15717895 15414501 15392891 15294910 15802230 15612116 15438724 14911567 15094215 14946671 14696830
3614 14696830 14507710 14471449 14523404 14426180 14248343 13781592 13716259 13698381 13480148 13270196
3604 13270196 12732927 12894507 12875888 12760208 13116149 12708745 12758894 13023932 13215023 13413619
3594 13413619 13398457 13429494 12983599 13571889 13986956 14097991 13963443 14377358 13962050 14016598
3584 14016598 14134130 14009992 14497244 14858605 14412739 14747542 15166686 15204341 15787495 15626069
3574 15626069 15573035 16466314 16791232 16648862 17413398 17404142 18164773 19047775 19385121 20060786
3564 20060786 21489110 22293023 23934299 25296325 26018364 27035086 27630159 28259360 28896253
3555 28896253 29868795 31604586 33245092 34677770 35139978 35054675 35210441 35485400 35857794
$$ packed form
3624A5717895l03394k1610r7981N07320j90114j73392n27157J82648j47544k49841
3614A4696830j89120l6261N1955r7224j77837m66751o5333j7878k18233k09952
3604A3270196n37269J61580j8619j15680L55941m07404N0149K65038J91091J98596
3594A3413619j5162L1037m45895N88290M15067J11035j34548M13915m15308N4548
3584A4016598J17532j24138M87252L61361m45866L34803M19144L7655N83154j61426
3574A5626069n3034Q93279L24918j42370P64536r256P60631Q83002L37346O75665
3564B0060786J428324Q03913J641276J362026P22039J016722N95073O29201O36893
3555B8896253R72542J735791J640506J432678M62208q5303J55766K74959L72394
$$ plain form
3546 35857794 36821267 38405849 39978359 40370166 39725709 38238129 36562821 35192590 34852986
3537 34852986 34969438 34827473 34637285 33876515 32947845 31334213 29790407 28787269 27773798
3528 27773798 26884755 25943830 25204103 24515770 23030954 22046334 20817438 19639720 18979898
3519 18979898 18188515 17741268 17035277 16713687 16116411 15889075 15729034 15874047 15729959
3510 15729959 15716661 15575266 15634146 15889327 15301175 15187454 15243831 15034225 15380594 15563321
3500 15563321 15510145 15082751 15271343 15096011 15113256 15931588 16002218 16306076 16436738 16401696
3490 16401696 16101538 15961519 16350698 16957310 17569391 17578865 17982748 18627910 18782744 18868796
3480 18868796 19111646 19137553 19517310 19918737 19598215 20323853 20747601 20715565 20960227 21260846
$$ packed form
3546C5857794R63473J584582J572510L91807o44457j487580j675308j370231l39604
3537C4852986J16452j41965j90188p60770r28670j613632j543806j003138j013471
3528B7773798q89043r40925p39727o88333j484816r84620j228896j177718o59822
3519A8979898p91383m47247p05991l21590n97276k27336j60041J45013j44088
3510A5729959j3298j41395N8880K55181n88152j13721N6377k09606L46369J82727
3500A5563321n3176m27394J88592j75332J7245Q18332P0630L03858J30662l5042
3490A6401696l00158j40019L89179O06612O12081R474M03883O45162J54834Q6052
3480A8868796K42850K5907L79757M01427l20522P25638M23748l2036K44662L00619
$$ plain form
3470 21260846 21823982 21985813 22524069 22889414 23156961 24141620 24599146 25157185 25964067
3461 25964067 26539249 26685530 27202504 27620100 28509689 29012071 29435796 30226262 31024159
3452 31024159 31583854 32472854 33481087 34340371 34531138 34810123 35614852 36776948 37523210
3443 37523210 38322420 39069363 40278697 40996852 41720948 43020469 44216188 45158673 46256401
3434 46256401 47497649 48499770 50269560 51639282 53256133 55327303 56681151 58610967
3426 58610967 61303582 63369667 65756871 68746698 71483592 74678435 77589863 80726848
3418 80726848 84149804 87523655 91518370 95279643 99846476 105147184 111056859 118238289
3410 118238289 126361345 135243603 144778152 156388957 169559015 183567107 197879672
$$ packed form
3470B1260846N63136J61831N38256L65345K67547R84659M57526N58039Q06882
3461B5964067N75182J46281N16974M17596Q89589N02382M23725P90466P97897
3452C1024159N59695Q89000J008233Q59284J90767K78985Q04729J162096P46262
3443C7523210P99210P46943J209334P18155P24096J299521J195719R42485J097728
3434D6256401J241248J002121J769790J369722J616851K071170J353848J929816
3426E8610967K692615K066085K387204K989827K736894L194843K911428L136985
3418H0726848L422956L373851L994715L761273M566833N300708N909675P181430
3410A18238289Q123056Q882258R534549J1610805J3170058J4008092J4312565
$$ plain form
3403 197879672 211224297 223896635 234224868 242066497 246002805 247315993 246996829 245061798
3395 245061798 240384766 233572827 224835354 214441199 202583156 189611622 177593738
3388 177593738 166789823 156714160 147102741 138334232 130460908 122836062 115203934 108046289
3380 108046289 101516831 95634799 90184625 85136559 81106087 77061314 73475600 70183899
3372 70183899 66550006 63860504 61601378 58764412 56730595 54725614 52666930 50469481
3364 50469481 48502006 46635020 43952397 42312205 40923569 39740239 37954595 36600275
3356 36600275 35567952 35050038 33930971 32577202 32128291 31319832 30523906 29499210 28799381
3347 28799381 27634416 27309238 27307024 26720323 26240222 25580908 24909743 24210852 23971309 22804574
$$ packed form
3403A97879672J3344625J2672338J0328233P841629L936308J313188l19164j935031
3395B45061798m677032o811939q737473j0394155j1858043j2971534j2017884
3388A77593738j0803915j0075663r611419q768509p873324p624846p632128p157645
3380A08046289o529458n882032n450174n048066m030472m044773l585714l291701
3372G0183899l633893k689502k259126k836966k033817k004981k058684k197449
3364E0469481j967475j866986k682623j640192j388636j183330j785644j354320
3356C6600275j032323n17914j119067j353769m48911q08459p95926j024696o99829
3347B8799381j164965l25178k214n86701m80101o59314o71165o98891k39543j166735
$$ plain form
3337 22804574 22419430 22497954 21900485 21379305 20916081 20572010 20038538 19656446 19554016 19373317
3327 19373317 18884189 18989743 19006352 18419225 17680952 17442378 17304945 16895641 16314060 16167651
3317 16167651 15673857 15719056 15606571 15243794 15520899 15593422 15659294 15081671 15245665 15419598
3307 15419598 15037194 14443771 14382918 14337344 14229890 14214252 14119511 14415431 14102438 14410365
3297 14410365 14412805 13863866 13653642 13850245 13804564 13786079 13867985 14129277 13794612 13809116
3287 13809116 14068829 14311187 14976677 15360766 15428110 15625478 15670973 15731335 16360551 17136359
3277 17136359 17577630 17702965 18322367 19324858 20177760 20539187 20922551 21356527 21754389
3268 21754389 21488499 21390180 20637943 20106190 19544865 18850409 18672979 17650625 16944224
$$ packed form
3337B2804574l85144P8524n97469n21180m63224l44071n33472l82092j02430j80699
3327A9373317m89128J05554J6609n87127p38273k38574j37433m09304n81581j46409
3317A6167651m93794M5199j12485l62777K77105P2523O5872n77623J63994J73933
3307A5419598l82404n93423o0853m5574j07454j5638r4741K95920l12993L07927
3297A4410365K440n48939k10224J96603m5681j8485Q1906K61292l34665J4504
3287A3809116K59713K42358O65490L84089O7344J97368M5495O0362O29216P75808
3277A7136359M41271J25335O19402J002491Q52902L61427L83364M33976L97862
3268B1754389k65890r8319p52237n31753n61325o94456j77430j022354p06401
$$ plain form
3259 16944224 16564923 16277286 15749696 15098643 14796742 14957639 14539604 14369358 14346164 13829006
3249 13829006 14122227 13810742 13604271 13209662 13640496 13557016 13492716 13320339 13902195 14367938
3239 14367938 14389414 14261947 13595463 13397435 13556437 13774161 13910166 14040278 13962496 14200618
3229 14200618 14427737 14831345 14743618 15015954 15272576 15244231 15799919 16078986 15833764 15882880
3219 15882880 16055973 16398332 16844775 17450774 18185111 19029857 20028385 20201059 20221818 20349807
3209 20349807 20481198 20814732 21463278 21504168 22023612 22491001 23157429 24131021 24360180 24617580
3199 24617580 25542039 26284272 26575250 27460154 28215494 28335730 28902912 30134511 31069939
3190 31069939 32460445 33669262 34587906 36207813 37410047 38777025 40431680 42101737
$$ packed form
3259A6944224l79301k87637n27590o51053l01901J60897m18035j70246k3194n17158
3249A3829006K93221l11485k06471l94609M30834q3480o4300j72377N81856M65743
3239A4367938K1476j27467o66484j98028J59002K17724J36005J30112p7782K38122
3229A4200618K27119M03608q7727K72336K56622k8345N55688K79067k45222M9116
3219A5882880J73093L42359M46443O05999P34337Q44746R98528J72674K0759J27989
3209B0349807J31391L33534O48546M0890N19444M67389O66428R73592K29159K57400
3199B4617580R24459P42233K90978Q84904P55340J20236N67182J231599R35428
3190C1069939J390506J208817R18644J619907J202234J366978J654655J670057
$$ plain form
3182 42101737 44749421 47159682 49942235 52993829 56383732 60780708 65523722 70688832
3174 70688832 76858374 84459668 93566164 104866674 118560685 135810429 156563784 183405883
3166 183405883 219530655 269872339 327192043 357434359 337819409 277393195 220063388
3159 220063388 180334994 150027414 126425307 107038796 91630087 79309337 70083345
3152 70083345 62509636 56326491 52390854 48528047 43728379 40454760 37637211 34739894
3144 34739894 32288066 30606005 28794122 27353140 25921121 25083823 23873563 22548269
3136 22548269 21780072 21246147 20416030 19241231 18434723 17821002 17810828 16880557 15702156
3127 15702156 15712057 15423965 15037785 14641532 13592202 12657713 13120270 13257693 13254028 12644156
$$ packed form
3182D2101737K647684K410261K782553L051594L389903M396976M743014N165110
3174G0688832O169542P601294R106496J1300510J3694011J7249744K0753355K6842099
3166A83405883L6124772N0341684N7319704L0242316j9614950o0426214n7329807
3159B20063388l9728394l0307580k3602107j9386511j5408709j2320750r225992
3152G0083345p573709o183145l935637l862807m799668l273619k817549k897317
3144C4739894k451828j682061j811883j440982j432019q37298j210260j325294
3136B2548269p68197n33925q30117j174799q06508o13721j0174r30271j178401
3127A5702156R901k88092l86180l96253j049330r34489M62557J37423l665o09872
$$ plain form
3117 12644156 12275305 11850477 11667707 11278295 11336622 11404983 10647231 10217563 10038316 9785942
3107 9785942 9478799 9787633 9818317 9654446 9271011 8996329 8717953 8385804 8262794 8288518
3097 8288518 8439614 7414241 6907637 7075192 6856888 6429218 6410354 6449519 6315636 6013231
3087 6013231 5611332 5925005 5508007 5444275 5390052 4956938 5438823 4961888 5443407 5344915
3077 5344915 4756424 4282680 4071753 3830480 3786524 3666307 4047650 4166555 4472933 3914914
3067 3914914 3820266 4056286 3510136 3671389 4013781 4332679 3802437 3492580 3519129 3551725
3057 3551725 3212743 3464936 3798179 3966932 3794686 3544102 3237928 3161995 3244346 3171415
3047 3171415 2906467 2763642 2654521 2374318 3011641 3152296 2955101 3453755 3414237 3302626
$$ packed form
3117A2644156l68851m24828j82770l89412N8327O8361p57752m29668j79247k52374
3107I785942l07143L08834L0684j63871l83435k74682k78376l32149j23010K5724
3097H288518J51096j025373n06604J67555k18304m27670j8864L9165j33883l02405
3087F013231m01899L13673m16998o3732n4223m33114M81885m76935M81519r8492
3077E344915n88491m73744k10927k41273m3956j20217L81343J18905L06378n58019
3067C914914r4648K36020n46150J61253L42392L18898n30242l09857K6549L2596
3057C551725l38982K52193L33243J68753j72246k50584l06174p5933Q2351p2931
3047C171415k64948j42825j09121k80203O37323J40655j97195M98654l9518j11611
$$ plain form
3037 3302626 3105281 2719970 2533628 2967777 2849587 2629452 3288984 3638699 3233661 2875951
3027 2875951 2974859 3272634 2937987 2421069 2164311 2321018 2665902 2940262 2636702 2723754
3017 2723754 2649072 2405211 2217928 2669852 3038618 2699470 2603650 2767460 2521771 2519041
3007 2519041 2390566 2469525 2199523 2172013 2369064 2688764 2747907 2630782 2240980 2083088
2997 2083088 2328876 2058799 1944810 2099130 2100853 2306474 2109166 2204677 2475210 2001647
2987 2001647 1549557 1919239 1717407 2171763 2085855 1755798 2295137 2670656 2470624 2097515
2977 2097515 2051951 2064696 2206477 1932594 1895166 1808710 1686663 2033026 1635979 1292031
2967 1292031 1389126 1641181 1484730 1317456 1574240 1940813 2047159 1519274 1617161 1431162
$$ packed form
3037C302626j97345l85311j86342M34149j18190k20135O59532L49715m05038l57710
3027B875951R8908K97775l34647n16918k56758J56707L44884K74360l03560Q7052
3017B723754p4682k43861j87283M51924L68766l39148r5820J63810k45689k730
3007B519041j28475P8959k70002k7510J97051L19700N9143j17125l89802j57892
2997B083088K45788k70077j13989J54320J723K05621j97308R5511K70533m73563
2987B001647m52090L69682k01832M54356q5908l30057N39339L75519k00032l73109
2977B097515m5564J2745J41781k73883l7428q6456j22047L46363l97047l43948
2967A292031R7095K52055j56451j67274K56784L66573J06346n27885R7887j85999
$$ plain form
2957 1431162 1827017 1908662 1903695 2084124 1922524 2083662 2299970 2359068 1652179 1554629
2947 1554629 1767977 1930317 2459917 1870354 1956459 1653792 1767454 1983206 2233449 2480363
2937 2480363 2449353 2106355 2238726 1300999 1617845 1583651 1599853 1594865 1800160 2008573
2927 2008573 2176682 1808384 1668002 1932436 1998351 2167939 1943034 1994502 1914570 2118429
2917 2118429 2649554 2570304 2489980 2335148 2092561 1944180 2217641 2211823 2382124 2236039
2907 2236039 2046954 2093387 1890676 1592625 1422795 1718311 2039542 1993102 2252276 2175601
2897 2175601 1831288 2116913 2165820 1965456 2231559 2453462 1343276 1809752 2110602 2075084
2887 2075084 2205642 2359355 2161128 2429665 2653695 2770594 1882483 2306702 3409299
$$ packed form
2957A431162L95855Q1645m967J80429j61600J61138K16308N9098p06889r7550
2947A554629K13348J62340N29600n89563Q6105l02667J13662K15752K50243K46914
2937B480363l1010l42998J32371r37727L16846l4194J6202m988K05295K08413
2927B008573J68109l68298j40382K64434O5915J69588k24905N1468p9932K03859
2917B118429N31125p9250q0324j54832k42587j48381K73461n818J70301j46085
2907B236039j89085M6433k02711k98051j69830K95516L21231m6440K59174p6675
2897B175601l44313K85625M8907k00364K66103K21903j110186M66476L00850l5518
2887B075084J30558J53713j98227K68537K24030J16899q88111M24219J102597
$$ plain form
2878 3409299 3478959 3158911 3308427 3650807 3789438 3660332 2804493 2570396 2811038 2826720
2868 2826720 2599016 2442331 2533550 2623389 2653077 2174153 2449376 2182923 2037671 2308616
2858 2308616 2525588 2208498 2105566 1683914 1795430 1897260 1809945 1802330 1916933 1647721
2848 1647721 1476592 1304219 1721430 1832275 1612443 1294389 1251994 1506482 1527000 1698002
2838 1698002 1114208 1289853 1899706 2093338 2328552 1743507 1532596 1516306 1560570 1580528
2828 1580528 811528 993318 1276112 1574821 922068 917292 919091 922912 1266979 1414073 1658181
2817 1658181 1342276 1167180 1580056 1445828 1681870 1583437 1596590 1751853 1091597 722920
2807 722920 1071890 1411956 1695824 1561163 1230511 1237760 1216699 1307228 1193622 1185123 1360002
$$ packed form
2878C409299O9660l20048J49516L42380J38631j29106q55839k34097K40642J5682
2868B826720k27704j56685R1219Q9839K9688m78924K75223k66453j45252K70945
2858B308616K16972l17090j02932m21652J11516J01830q7315p615J14603k69212
2848A647721j71129j72373M17211J10845k19832l18054m2395K54488K0518J71002
2838A698002n83794J75645O09853J93632K35214n85045k10911j6290M4264J9958
2828A580528p69000J81790K82794K98709o52753m776J799L821L44067J47094K44108
2817A658181l15905j75096M12876j34228K36042r8433J3153J55263o60256l68677
2807G22920L48970L40066K83868j34661l30652P249k1061R0529j13606q499J74879
$$ plain form
2796 1360002 807086 776741 1297882 1340389 641253 524582 1013045 979348 672971 702360
2786 702360 996471 686286 901889 1145165 893552 959875 1060210 646070 587323 865088
2776 865088 1005491 1118741 1214453 802449 665217 787568 840595 633312 255098 373238
2766 373238 475148 1042078 1088876 561233 519426 486485 396661 674585 824870 1053612
2756 1053612 614614 942656 484656 124437 -9245 218006 414783 677783 850406 733458
2746 733458 903562 804582 1093698 1147522 903391 820830 1095317 997976 676809 1045923
2736 1045923 715195 545055 445877 423440 944894 762380 4889 21575 551324 426046
2726 426046 940755 1423964 1228322 1416049 1033333 993894 765921 1123889 1393335 892074
$$ packed form
2796A360002n52916l0345N21141M2507o99136j16671M88463l3697l06377K9389
2786G02360K94111l10185K15603K43276k51613O6323J00335m14140n8747K77765
2776H65088J40403J13250R5712m12004j37232J22351N3027k07283l78214J18140
2766C73238J01910N66930M6798n27643m1807l2941q9824K77924J50285K28742
2756A053612m38998L28042m58000l60219j33682K27251J96777K63000J72623j16948
2746G33458J70104r8980K89116N3824k44131q2561K74487r7341l21167L69114
2736A045923l30728j70140r9178k2437N21454j82514p57491J6686N29749j25278
2726D26046N14709M83209j95642J87727l82716l9439k27973L57968K69446n01261
$$ plain form
2716 892074 745018 564384 1060045 1358137 1083962 1482282 1192134 667848 1028271 967210
2706 967210 1134274 1198778 1165842 633971 628671 571045 1121891 1055562 956415 1203322 1122930
2695 1122930 1148536 1263900 1157660 916328 1107562 1350850 823509 813491 642671 887944
2685 887944 985694 826121 843894 379329 116747 441268 354720 320811 300047 425910 1044042
2674 1044042 920518 833930 647228 733334 1193789 841821 824662 729564 590799 367098
2664 367098 754139 931610 422132 493739 544660 548002 802891 1400350 1105056 693272
2654 693272 342440 137283 540809 595080 112636 425316 794099 860679 618808 823783
2644 823783 597423 424633 416223 24795 -229918 316410 636846 749225 811382 471327
$$ packed form
2716H92074j47056j80634M95661K98092k74175L98320k90148n24286L60423o1061
2706I67210J67064O4504l2936n31871n300n7626N50846o6329r9147K46907q0392
2695A122930K5606J15364j06240k41332J91234K43288n27341j0018j70820K45273
2685H87944R7750j59573J7773m64565k62582L24521q6548l3909k0764J25863O18132
2674A044042j23524q6588j86702Q6106M60455l51968j7159r5098j38765k23701
2664C67098L87041J77471n09478P1607N0921L342K54889N97459k95294m11784
2654F93272l50832k05157M03526N4271m82444L12680L68783O6580k41871K04975
2644H23783k26360j72790q410l91428k54713N46328L20436J12379O2157l40055
$$ plain form
2634 471327 455884 124710 92101 127117 683611 437855 123114 255604 224644 242805 450061
2623 450061 445245 322502 319347 328761 553019 345499 45934 -133475 -496339 17279 301585
2612 301585 355600 171152 243151 287046 767272 838104 632793 508256 553799 584649 416836
2601 416836 488393 506325 348088 339691 816092 956116 936260 392925 630326 509866 286211
2590 286211 428320 344606 150676 235969 259606 608899 320814 107586 178965 330953
2580 330953 707551 648036 206795 -94642 -135999 184470 488837 439817 1126 177635
2570 177635 346682 386092 723258 625335 344380 104523 651455 937920 780463 608227
2560 608227 639880 955260 729396 441740 319395 535676 439245 807505 830526 680545
$$ packed form
2634D71327j5443l31174l2609L5016N56494k45756l14741J32490l0960J8161K07256
2623D50061m816j22743l155R414K24258k07520k99565j79409l62864N13618K84306
2612C01585N4015j84448P1999M3895M80226P0832k05311j24537M5543L0850j67813
2601D16836P1557J7932j58237q397M76401J40024j9856n43335K37401j20460k23655
2590B86211J42109q3714j93930Q5293K3637L49293k88085k13228P1379J51988
2580C30953L76598n9515m41241l01437m1357L20469L04367m9020m38691J76509
2570A77635J69047L9410L37166r7923k80955k39857N46932K86465j57457j72236
2560F08227L1653L15380k25864k87656j22345K16281r6431L68260K3021j49981
$$ plain form
2550 680545 746869 507052 594212 383993 -235584 -84313 314023 454889 170110 100391
2540 100391 287953 433242 350784 594351 945817 839173 762751 705761 993359 1072329
2530 1072329 578738 745989 926839 600010 881168 1161848 1123120 1292822 1040433 1131943
2520 1131943 947364 1141031 1069729 1078583 894456 835870 836054 602176 1239655 1151563 1139230
2509 1139230 1300910 1664908 1511577 1567143 2130277 2296077 1722116 1587547 1735643 2022612
2499 2022612 2022175 1974574 2273798 2815897 2734249 3173465 3208683 3431484 2831655 2680118 3093366
2488 3093366 2475859 2264447 2467532 2473529 2574976 2473735 2149381 2013015 2370109 2083290
2478 2083290 1768098 1907725 2176470 2202516 2544290 2845766 3455827 3558866 3362632 2902300
$$ packed form
2550F80545O6324k39817Q7160k10219o19577J51271L98336J40866k84779o9719
2540A00391J87562J45289q2458K43567L51466j06644p6422n6990K87598P8970
2530A072329m93591J67251J80850l26829K81158K80680l8728J69702k52389R1510
2520A131943j84579J93667p1302Q854j84127n8586J84k33878O37479q8092j2333
2509A139230J61680L63998j53331N5566N63134J65800n73961j34569J48096K86969
2499B022612m37m7601K99224N42099q1648M39216L5218K22801n99829j51537M13248
2488C093366o17507k11412K03085N997J01447j01241l24354j36366L57094k86819
2478B083290l15192J39627K68745K6046L41774L01476O10061J03039j96234m60332
$$ plain form
2468 2902300 3072429 3626801 3408842 4384607 4341674 4405926 4767741 5390539 5683080 5491875
2458 5491875 5439949 4753925 4421950 4348873 4002824 4182420 4174984 3878941 3654361 3593014
2448 3593014 3628673 4455356 4377996 4174643 4021809 3857951 3855786 3911545 3864430 4011193 4196352
2437 4196352 4314173 4469461 4741038 4679504 4418267 4684728 4658299 4993729 5515398 5656922
2427 5656922 5614574 5797989 5591053 5246831 4984177 4913711 5566343 5757028 5294627 5327216
2417 5327216 5169483 5630186 6878204 7021580 6688381 5954405 5771758 6027922 6334370
2408 6334370 6427263 6607160 6473865 6366303 6732830 6771603 6810363 7080522 7540450 7633224
2398 7633224 7321575 6816528 7294641 7826805 7992612 8235303 8517822 8845906 8844200 8991891
$$ packed form
2468B902300J70129N54372k17959R75765m2933O4252L61815O22798K92541j91205
2458E491875n1926o86024l31975p3077l46049J79596p436k96043k24580o1347
2448C593014L5659Q26683p7360k03353j52834j63858k165N5759m7115J46763J85159
2437D196352J17821J55288K71577o1534k61237K66461k6429L35430N21669J41524
2427E656922m2348J83415k06936l44222k62654p0466O52632J90685m62401L2589
2417E327216j57733M60703J248018J43376l33199p33976j82647K56164L06448
2408F334370R2893J79897j33295j07562L66527L8773L8760K70159M59928R2774
2398G633224l11649n05047M78113N32164J65807K42691K82519L28084j706J47691
$$ plain form
2388 8991891 9358748 9603778 10535764 10785249 10841591 11025518 11301300 11356155 11438883 11636854
2378 11636854 11416432 12081313 11967124 11809279 11782424 12518736 12591397 12240333 13304629 13814928
2368 13814928 14254508 15237123 15539522 15421229 15730927 16406984 17329074 17653354 18209492
2359 18209492 19313699 19359657 19880073 20223613 20651622 21995635 22972213 23455648 23741540
2350 23741540 25316350 26362481 28461050 29907307 31500877 33150243 34880007 36486433
2342 36486433 37462481 38195518 38607551 38586372 38002076 36967041 36126191 35518497 34206708
2333 34206708 32697025 31365775 29901274 28437167 27948920 25987087 24645963 23566926
2325 23566926 22415727 21128863 19780128 18780750 17771947 16778458 15584176 15106893 14037792
$$ packed form
2388H991891L66857K45030R31986K49485N6342J83927K75782N4855Q2728J97971
2378A1636854k20422O64881j14189j57845k6855P36312P2661l51064J064296N10299
2368A3814928M39580R82615L02399j18293L09698O76057R22090L24280N56138
2359A8209492J104207M5958N20416L43540M28009J344013R76578M83435K85892
2350B3741540J574810J046131K098569J446257J593570J649366J729764J606426
2342C6486433R76048P33037M12033k1179n84296j035035q40850o07694j311789
2333C4206708j509683j331250j464501j464107m88247j961833j341124j079037
2325B3566926j151199j286864j348735r99378j008803r93489j194282m77283j069101
$$ plain form
2316 14037792 13613241 13085962 12039401 11404595 10901141 10567560 9774781 9040070 8976727
2307 8976727 8245911 8015665 7809423 7231532 7323517 7413856 6606112 6126446 6127678 5996979
2297 5996979 5771984 5409779 5510647 5142844 4746241 4594927 4692771 4661512 4284260 3365785
2287 3365785 3474777 3942672 3797215 3004792 2852335 3312143 3271378 3209208 3106511 2925052
2277 2925052 2530370 2760189 3000097 2488464 2730234 2532922 2596459 2513437 2542443 1733887
2267 1733887 2110917 2284838 2362643 2302510 1908288 1763257 2128217 1949137 2085201 2065875
2257 2065875 1979934 1916676 1756717 1558064 1262113 1320822 1039340 895738 1284872 1262567
2247 1262567 1042438 927360 1029646 960009 947520 1564332 1002841 1427035 1856751 1949069
$$ packed form
2316A4037792m24551n27279j046561o34806n03454l33581p92779p34711o3343
2307H976727p30816k30246k06242n77891R1985R0339q07744m79666J232j30699
2297E996979k24995l62205J00868l67803l96603j51314R7844l1259l77252r18475
2287C365785J08992M67895j45457p92423j52457M59808m0765o2170j02697j81459
2277B925052l94682K29819K39908n11633K41770j97312O3537q3022K9006q08556
2267A733887L77030J73921P7805o0133l94222j45031L64960j79080J36064j9326
2257B065875q5941o3258j59959j98653k95951N8709k81482j43602L89134k2305
2247A262567k20129j15078J02286o9637j2489O16812n61491M24194M29716R2318
$$ plain form
2237 1949069 2073732 1921504 1639328 1371502 845590 935047 871188 983419 944833 760284
2227 760284 928203 1188586 943403 989851 1245465 1271544 677425 663971 871766 1000054
2217 1000054 587086 782701 667407 576218 703434 873573 1407232 1281500 119753 550333
2207 550333 701552 396401 192664 608255 611698 552779 69346 -169585 -411088 90291
2197 90291 460383 646122 589805 702071 1000828 556889 666405 796827 670488 236155
2187 236155 415856 574529 888561 1046676 1043609 267637 389442 688220 988220 804282
2177 804282 600961 712403 773911 486402 658370 605858 677658 626948 464495 350620
2167 350620 581866 952394 565515 298794 524164 371373 787199 766315 903557 458215
$$ packed form
2237A949069J24663j52228k82176k67826n25912Q9457o3859J12231l8586j84549
2227G60284J67919K60383k45183M6448K55614K6079n94119j3454K07795J28288
2217A000054m12968J95615j15294r1189J27216J70139N33659j25732j161747M30580
2207E50333J51219l05151k03737M15591L443n8919m83433k38931k41503N01379
2197I0291L70092J85739n6317J12266K98757m43939J09516J30422j26339m34333
2187B36155J79701J58673L14032J58115l067p75972J21805K98778L00000j83938
2177H04282k03321J11442O1508k87509J71968n2512P1800n0710j62453j13875
2167C50620K31246L70528l86879k66721K25370j52791M15826k0884J37242m45342
$$ plain form
2157 458215 91087 228595 433443 292310 622133 537979 11958 645620 700183 312942
2147 312942 412706 407160 462204 418162 196995 543727 14123 -69338 -156876 -219440 123535
2136 123535 -357592 410830 807871 618774 635973 359105 187557 377071 402722 256120
2126 256120 555041 522666 406709 856527 981528 256858 361349 504518 459731 197124
2116 197124 663252 450284 692443 1114065 515939 700567 770454 757296 931263 1081917
2106 1081917 900796 881591 1054898 1018811 1562180 1792866 1469474 914554 490593 958730
2096 958730 1124605 1106124 1084067 961716 934606 657673 888730 749276 1318421 1206837
2086 1206837 925123 1361594 1318088 1626449 1855082 2000635 1650209 2187407 2632398 2129982
$$ packed form
2157D58215l67128J37508K04848j41133L29823q4154n26021O33662N4563l87241
2147C12942R9764n546N5044m4042k21167L46732n29604q3461q7538o2564L42975
2136A23535m81127P68422L97041j89097J7199k76868j71548J89514K5651j46602
2126B56120K98921l2375j15957M49818J25001p24670J04491J43169m4787k62607
2116A97124M66128k12968K42159M21622n98126J84628O9887j3158J73967J50654
2106A081917j81121j9205J73307l6087N43369K30686l23392n54920m23961M68137
2096I58730J65875j8481k2057j22351k7110k76933K31057j39454N69145j11584
2086A206837k81714M36471m3506L08361K28633J45553l50426N37198M44991n02416
$$ plain form
2076 2129982 2050053 2120127 2011566 1960540 2069630 2330919 2510537 2170979 2043544 2294919
2066 2294919 2539922 2872629 2388284 2520824 2171846 1961758 2343387 2752108 2777593 2811297
2056 2811297 2787286 2612303 2988573 3384944 3671390 3525714 3659063 4081721 3898462 4174764
2046 4174764 4449621 4148283 4087340 4496311 4961886 5315616 5251601 5271988 5744878 5648390
2036 5648390 6475659 6865286 6771532 6947090 7828812 8119826 8116610 8811461 9179802 9361581
2026 9361581 10132113 10766344 11426757 12246703 13041107 13799558 14080534 13975002 14118524 14853289
2016 14853289 14566853 14309712 14913088 15006148 14649613 14741113 14708734 15045675 14813438 14671357
2006 14671357 15134879 15581495 15759835 15916232 15949604 16395936 16555705 17078879 18564924
$$ packed form
2076B129982p9929P0074j08561n1026J09090K61289J79618l39558j27435K51375
2066B294919K45003L32707m84345J32540l48978k10088L81629M08721K5485L3704
2056B811297k4011j74983L76270L96371K86446j45676J33349M22658j83259K76302
2046D174764K74857l01338o0943M08971M65575L53730o4015K0387M72890r6488
2036E648390Q27269L89627r3754J75558Q81722K91014l216O94851L68341J81779
2026I361581P70532O34231O60413Q19946P94404P58451K80976j05532J43522P34765
2016A4853289k86436k57141O03376R3060l56535R1500l2379L36941k32237j42081
2006A4671357M63522M46616J78340J56397L3372M46332J59769N23174J486045
$$ plain form
1997 18564924 19400258 20602926 21709344 23601752 25769508 27952523 29638762 28836402
1989 28836402 27281955 24858644 22123389 20010022 18649280 17519889 16285350 15274344
1981 15274344 14480639 13637598 12969195 12955465 12204041 11517760 11490064 11158737 10775609 10482482
1971 10482482 10425597 10425533 10282852 10300911 10393993 11003643 10875270 11400098 11698974 11975850 11942005
1960 11942005 12198229 11589795 10781950 10462055 9698357 8973795 8327133 7893618 7273386
1951 7273386 6477753 6010146 5851401 5197467 4889103 4684015 4781928 4219258 3733146 3751273
1941 3751273 3645687 3809238 3029873 2371809 2743271 2619556 2648887 2454987 1950769 2329741
1931 2329741 2120750 2058336 2181346 1896164 1813507 1576138 1460658 1247761 1593809 1331606
$$ packed form
1997A8564924Q35334J202668J106418J892408K167756K183015J686239q02360
1989B8836402j554447k423311k735255k113367j360742j129391j234539j011006
1981A5274344p93705q43041o68403j3730p51424o86281k7696l31327l83128k93127
1971A0482482n6885o4j42681J8059R3082O09650j28373N24828K98876K76876l3845
1960A1942005K56224o08434q07845l19895p63698p24562o46662m33515o20232
1951G273386p95633m67607j58745o53934l08364k05088R7913n62670m86112J8127
1941C751273j05586J63551p79365o58064L71462j23715K9331j93900n04218L78972
1931B329741k08991o2414J23010k85182q2657k37369j15480k12897L46048k62203
$$ plain form
1921 1331606 1262917 1308851 1389526 1635092 813008 341099 949335 953304 885818 955876 586329
1910 586329 617186 809830 651905 1244818 1720723 1540681 1093486 1081735 741471 89767
1900 89767 225750 591170 534041 41778 633114 609068 313975 258330 536802 732805
1890 732805 629565 246222 247604 466557 377457 -120162 -228152 -17981 -20272 77350 17187
1879 17187 583120 782841 495905 583766 379232 -79948 192351 234253 -315798 -130826
1869 -130826 -484350 -298083 251166 321021 37205 -30175 128217 117371 442390 -4231
1859 -4231 -132499 233936 273987 104656 206407 200131 231563 11064 315410 519459 136506
1848 136506 130724 444702 391574 418996 529741 249474 -19345 377562 233207 227303 -279824
$$ packed form
1921A331606o8689M5934Q0675K45566q22084m71909O08236L969o7486P0058l69547
1910E86329L0857J92644j57925N92913M75905j80042m47195j1751l40264o51704
1900H9767J35983L65420n7129m92263N91336k4046k95093n5645K78472J96003
1890G32805j03240l83343J382K18953q9100m97619j07990K10171k291R7622o0163
1879A7187N65933J99721k86936Q7861k04534m59180K72299M1902n50051J84972
1869a30826l53524J86267N49249O9855k83816o7380J58392j0846L25019m46621
1859d231j28268L66435M0051j69331J01751o276L1432k20499L04346K04049l82953
1848A36506n782L13978n3128K7422J10745k80267k68819L96907j44355n904n07127
$$ plain form
1837 -279824 -607030 -380962 117314 697303 269004 7026 -534988 -317542 103175 -132438
1827 -132438 262567 -101148 34357 -30309 -392310 -97708 -275417 161149 87918 -60099
1817 -60099 228511 70043 -141180 185163 92521 -359815 -288788 -387447 1111 73960 -42309
1806 -42309 -124254 -410343 -215176 96413 -75415 -197146 -224577 -142390 -266261 -290371 -76351
1795 -76351 176488 -68492 18691 -25190 -193603 -310757 -327586 -123519 -193908 -86688 -90234
1784 -90234 99184 -162106 462047 265123 177489 498379 625253 853276 495593 94441
1774 94441 16587 -199581 -430515 -278196 -131812 -402353 -847194 -447878 -537690 -459717
1764 -459717 -591210 -354341 161993 -6176 27750 200928 -182904 115247 35961 -381101
$$ packed form
1837b79824l27206K26068M98276N79989m28299k61978n42014K17446M20717k35613
1827a32438L95005l63715J35505o4666l62001K94602j77709M36566p3231j48017
1817f0099K88610j58468k11223L26343r2642m52336P1027r8659L88558P2849j16269
1806d2309q1945k86089J95167L11589j71828j21731k7431Q2187j23871k4110K14020
1795g6351K52839k44980Q7183m3881j68413j17154j6829K04067p0389J07220l546
1784i0234J89418k61290O24153j96924q7634L20890J26874K28023l57683m01152
1774I4441p7854k16168k30934J52319J46384k70541m44841L99316q9812P7973
1764d59717j31493K36869N16334j68169L3926J73178l83832K98151p9286m17062
$$ plain form
1754 -381101 -525424 -493382 -355958 -612759 64118 218727 238259 -405970 -188575 -363210
1744 -363210 -956850 -1030887 -797543 -750633 -739729 -539597 -143497 81022 -353031 -749715
1734 -749715 -574481 -269672 -275352 -405946 -252634 -222172 84066 -434899 -880761 -309164
1724 -309164 281586 185765 297801 5781 -520915 -343101 -317646 -989209 -808132 -173836
1714 -173836 50169 -21728 233714 -69074 -596667 -712540 -574547 7365 -234730 -200099
1704 -200099 -326703 -188733 -306967 -490367 156043 114555 -381346 -80822 -196723 -280064
1694 -280064 -285049 -177562 -82125 259922 47771 -214910 -221548 -279730 70512 46591 -170986
1683 -170986 -314554 -349659 -356968 -345910 -25800 -122898 -334833 -577779 -589384 -564550 -264635
$$ packed form
1754c81101j44323L2042J37424k56801O76877J54609J9532o44229K17395j74635
1744c63210n93640p4037K33344M6910J0904K00132L96100K24519m34053l96684
1734g49715J75234L04809n680j30594J53312L0462L06238n18965m45862N71597
1724c09164N90750r5821J12036k92020n26696J77814K5455o71563J81077O34296
1714a73836K24005p1897K55442l02788n27593j15873J37993N81912k42095L4631
1704b00099j26604J37970j18234j83400O46410m1488m95901L00524j15901q3341
1694b80064m985J07487R5437L42047k12151k62681o638n8182L50242k3921k17577
1683a70986j43568l5105p309J1058L20110r7098k11935k42946j1605K4834K99915
$$ plain form
1672 -264635 -329334 -80677 494449 522667 104649 526750 330493 -76108 -325770 -167084
1662 -167084 348233 80802 80669 -127353 -313264 -83754 -205813 -31239 178497 -24690
1652 -24690 254653 -242504 -190531 -494674 -156038 -246958 -31434 -155363 -330294 -671695
1642 -671695 -1048117 -378308 -236757 -125796 -250387 -308131 -269463 -84619 -668877 -359193
1632 -359193 -59597 -191611 -107775 -256444 -634449 -335231 -378716 -259854 228897 123512
1622 123512 -124652 -498232 -630631 -116135 -252160 -394900 -742788 -499841 -641299 -600185
1612 -600185 -337170 -172815 -36212 222674 25155 230606 750365 146800 -64931 -324381
1602 -324381 -583996 -627060 -359892 -521461 -365682 -100254 -37439 -377897 -196562 17854
$$ packed form
1672b64635o4699K48657N75126K8218m18018M22101j96257m06601k49662J58686
1662a67084N15317k67431j33k08022j85911K29510j22059J74574K09736k03187
1652b4690K79343m97157N1973l04143L38636r0920K15524j23929j74931l41401
1642f71695l76422O69809J41551J10961j24591n7744L8668J84844n84258L09684
1632c59193K99596j32014Q3836j48669l78005K99218m3485J18862M88751j05385
1622A23512k48164l73580j32399N14496j36025j42740l47888K42947j41458M1114
1612f00185K63015J64355J36603K58886j97519K05451N19759o03565k11731k59450
1602c24381k59615m3064K67168j61569J55779K65428O2815l40458J81335K14416
$$ plain form
1592 17854 -41578 -808902 -879441 -313416 -715656 -974881 -841621 -548699 -449799 -229896
1582 -229896 120543 -29960 -149073 -165264 -450624 -518333 -428392 -363664 -296082 -225516 -613788
1571 -613788 -423705 -612499 -374625 -129548 -90152 -48495 10643 -460447 -405373 -95753
1561 -95753 -27429 606 -766296 -572718 -669588 -777004 -975761 -647170 -537305 -319774
1551 -319774 -562547 -790663 -301785 -256152 -187831 -470993 -322206 -62619 -7832 -55108
1541 -55108 -629120 -880760 -1301700 -851221 -415692 -267910 -341848 -264485 163358 -87429
1531 -87429 -387717 -265711 -795778 -529065 -796057 -637820 17838 132151 223411 -288996
1521 -288996 -31544 -56782 121057 -101077 -404785 15254 384274 585847 356940 112180
$$ packed form
1592A7854n9432p67324p0539N66025m02240k59225J33260K92922R8900K19903
1582b29896L50439j50503j19113j6191k85360o7709Q9941O4728O7582P0566l88272
1571f13788J90083j88794K37874K45077L9396M1657N9138m71090N5074L09620
1561i5753O8324K8035p66902J93578r6870j07416j98757L28591J09865K17531
1551c19774k42773k28116M88878M5633O8321k83162J48787K59587N4787m7276
1541e5108n74012k51640m20940M50479M35529J47782p3938P7363M27843k50787
1531h7429l00288J22006n30067K66713k66992J58237O55658J14313R1260n12407
1521b88996K57452k5238J77839k22134l03708M20039L69020K01573k28907k44760
$$ plain form
1511 112180 65336 173653 117688 85651 -238267 -406179 -39857 -32197 31547 35171 -116762
1500 -116762 188992 -38784 -49539 433191 -53432 -617389 -359242 -671591 -393199 -355243
1490 -355243 -338401 50628 163922 -85705 -313688 -131643 -221777 70585 164504 -92699
1480 -92699 483005 436276 -225892 -420772 -348115 17189 17217 85929 -230919 -207020 -197462 -246312
1468 -246312 -149030 153804 -431101 -782140 -42908 323264 117618 -444362 -471060 413502
1458 413502 188814 -72201 -287392 -299156 266357 231468 -659134 -835882 216499 184146
1448 184146 211480 162073 -110281 -439230 -55337 165637 89309 -134864 -361427 -364408 -30206
1437 -30206 483401 168567 74697 -313826 -40035 -189237 -414961 -47018 -34000 -448962
$$ packed form
1511A12180m6844J08317n5965l2037l23918j67912L66322P660O3744L624j51933
1500a16762L05754k27776j0755M82730m86623n63957K58147l12349K78392L7956
1490c55243J6842L89029J13294k49627k27983J82045r0134K92362R3919k57203
1480i2699N75704m6729o62168j94880P2657L65304K8O8712l16848K3899R558m8850
1468b46312R7282L02834n84905l51039P39232L66172k05646n61980k6698Q84562
1458D13502k24688k61015k15191j1764N65513l4889q90602j76748J052381l2353
1448A84146K7334m9407k72354l28949L83893K20974p6328k24173k26563k981L34202
1437c0206N13607l14834r3870l88523K73791j49202k25724L67943J3018m14962
$$ plain form
1427 -448962 7520 -184870 -570731 -221826 -147031 -276424 27606 -291496 -432947 -432723
1417 -432723 -660225 -54674 505139 -40191 269055 777949 716141 -208883 -861139 338513
1407 338513 493510 376929 -454293 -100678 97407 -52174 -95939 -78723 463515 500524
1397 500524 685449 -161831 -146338 -306322 10068 326482 -266005 49350 123405 184400
1387 184400 362761 271310 -54904 -82821 -326450 -280073 -208950 49348 218924 -77137
1377 -77137 -162699 2300 -406138 -615347 -387054 -43438 282009 77448 -158861 -587427
1367 -587427 -709151 -566305 -88987 -26450 -203239 192008 57253 -120319 -144324 626286
1357 626286 323977 261978 324714 252948 -196677 -588828 60372 326453 609953 178379
$$ packed form
1427d48962M56482j92390l85861L48905P4795j29393L04030l19102j41451K24
1417d32723k27502O05551N59813n45330L09246N08894o1808r25024o52256J199652
1407C38513J54997j16581q31222L53615J98085j49581m3765J7216N42238L7009
1397E00524J84925q47280J5493j59984L16390L16414n92487L15355P4055O0995
1387A84400J78361r1451l26214k7917k43629M6377P1123K58298J69576k96061
1377g7137q5562J64999m08438k09209K28293L43616L25447k04561k36309m28566
1367e87427j21724J42846M77318O2537j76789L95247j34755j77572k4005P70610
1357F26286l02309o1999O2736p1766m49625l92151O49200K66081K83500m31574
$$ plain form
1347 178379 -76163 -31022 128207 239817 -210592 -505314 1007 -33561 43901 360406
1337 360406 420647 204042 120086 98050 334322 225396 -29010 361751 418668 150427
1327 150427 -171622 -235207 -17186 56717 562586 865905 598278 -39721 -288749 -419822
1317 -419822 43507 -364599 13827 516769 319440 547821 458298 523717 750414 717731
1307 717731 778993 301497 -80988 -142776 613856 976549 828655 687946 404850 466611
1297 466611 272260 673227 587183 600582 429805 631005 1009308 1425925 1664331 1565828
1287 1565828 1053247 878295 1151799 1768892 1251085 869859 805618 761246 705074 826306
1277 826306 1419071 1162350 914568 1131287 1017220 1384496 1589740 2067609 2124736 2017843
$$ packed form
1347A78379k54542M5141J59229J11610m50409k94722N06321l4568P7462L16505
1337C60406O0241k16605q3956k2036K36272j08926k54406L90761N6917k68241
1327A50427l22049o3585K18021P3903N05869L03319k67627o37999k49028j31073
1317d19822M63329m08106L78426N02942j97329K28381q9523O5419K26697l2683
1307G17731O1262m77496l82485o1788P56632L62693j47894j40709k83096O1761
1297D66611j94351M00967q6044J3399j70777K01200L78303M16617K38406r8503
1287A565828n12581j74952K73504O17093n17807l81226o4241m4372n6172J21232
1277H26306N92765k56721k47782K16719j14067L67276K05244M77869N7127j06893
$$ plain form
1267 2017843 2222745 2299133 2213381 2460529 2286962 2188843 1817087 2061880 1884691 2623959
1257 2623959 3183718 2588798 2807791 3189137 3606184 3355143 2997229 3014222 3214098 3573179
1247 3573179 3169521 3470693 3992663 4393847 4345602 4489676 4692403 4970609 5025695 4974048
1237 4974048 5516444 5608381 5558416 5588184 5504085 5398071 6081367 5974004 6375018 6619385
1227 6619385 6936218 7165650 6808075 6989148 7772681 7951274 8417397 8755823 9339169 9619654
1217 9619654 10294823 10531186 11559791 11982185 12317627 12468127 13211812 14589647 15749646
1208 15749646 17008091 18510358 19922639 21145398 22271499 23527263 25366969 27745935
1200 27745935 30521603 34506369 38959719 44754209 51759545 61070953 73239360 89539373
$$ packed form
1267B017843K04902P6388q5752K47148j73567r8119l71756K44793j77189P39268
1257B623959N59759n94920K18993L81346M17047k51041l57914J6993J99876L59081
1247C573179m03658L01172N21970M01184m8245J44074K02727K78206N5086n1647
1237D974048N42396R1937m9965K9768q4099j06014O83296j07363M01014K44367
1227F619385L16833K29432l57575J81073P83533J78593M66123L38426N83346K80485
1217I619654O75169K36363J028605M22394L35442J50500P43685J377835J159999
1208A5749646J258445J502267J412281J222759J126101J255764J839706K378966
1200B7745935K775668L984766M453350N794490P005336R311408J2168407J6300013
$$ plain form
1192 89539373 108542372 117971565 109001703 87523410 70036571 58591451 48801629 41410527
1184 41410527 35426282 29858730 26132329 23355405 21474902 19559621 18044829 17158957
1176 17158957 16461358 15203546 13662890 12064606 11125189 10412680 9469401 8882987 8443521
1167 8443521 8006581 7673366 7286025 6925567 6299106 5916021 5713911 5272672 5020285 5210304
1157 5210304 5138681 5035098 4699771 4504367 4433045 3992860 3734950 3466865 3705565 3944441
1147 3944441 3795204 3738824 3332700 2986309 2873779 2769131 3102168 2501352 2398539 2069105
1137 2069105 2087536 1932169 2187358 2223771 2140774 2431611 2142453 2545050 2192189 1856580
1127 1856580 2009292 1359725 1907332 1626215 1522203 1425172 1384122 925429 925093 1188269
$$ packed form
1192H9539373J9002999R429193q969862k1478293j7486839j1445120r789822p391102
1184D1410527n984245n567552l726401k776924j880503j915281j514792q85872
1176A7158957o97599j257812j540656j598284r39417p12509r43279n86414m39466
1167H443521m36940l33215l87341l60458o26461l83085k02110m41239k52387J90019
1157E210304p1623j03583l35327j95404p1322m40185k57910k68085K38700K38876
1147C944441j49237n6380m06124l46391j12530j04648L33037o00816j02813l29434
1137B069105J8431j55367K55189L6413q2997K90837k89158M02597l52861l35609
1127A856580J52712o49567N47607k81117j04012r7031m1050m58693l36K63176
$$ plain form
1117 1188269 1388006 1596331 1057899 877351 820871 1250714 899106 399858 694018 525962
1107 525962 431490 1123423 1145850 825475 1254638 1459107 1262548 1194742 898123 853454
1097 853454 773387 958538 669625 732080 412105 773357 598683 874931 489076 478735
1087 478735 1188182 1082147 922817 742272 545080 178537 269071 284381 816162 840798
1077 840798 687329 520980 313385 342759 338024 508920 683169 846394 270272 504434
1067 504434 605099 711304 818179 542972 221900 58535 204182 641847 759004 663201
1057 663201 674724 330461 345794 452951 492791 93237 -73200 312642 348525 573958
1047 573958 554670 403633 461896 348977 470391 -78698 -282662 30874 237454 385960
$$ packed form
1117A188269J99737K08325n38432j80548n6480M29843l51608m99248K94160j68056
1107E25962r4472O91933K2427l20375M29163K04469j96559o7806k96619m4669
1097H53454q0067J85151k88913O2455l19975L61252j74674K76248l85855j0341
1087D78735P09447j06035j59330j80545j97192l66543R0534J5310N31781K4636
1077H40798j53469j66349k07595K9374m735J70896J74249J63225n76122K34162
1067E04434J00665J06205J06875k75207l21072j63365J45647M37665J17157r5803
1057F63201J1523l44263J5333J07157L9840l99554j66437L85842L5883K25433
1047E73958j9288j51037N8263j12919J21414n49089k03964L13536K06580J48506
$$ plain form
1037 385960 387301 685749 5972 -99418 -182333 -234426 18399 -25141 -377808 -613435 -109790
1026 -109790 -129609 -127206 -95494 216279 65882 -197997 253930 228197 -79128 -301451 -551590
1015 -551590 -581829 -818340 -514496 -29498 -227682 -337025 376570 -3238 -258252 254959
1005 254959 -21001 -102336 91747 236579 -292791 134185 130034 143908 -299589 -55906
995 -55906 495325 237353 377758 344533 581046 490854 98461 46744 312045 505548 125637
984 125637 -120263 -331000 -68912 265857 107387 11611 -86777 215917 55152 -207386
974 -207386 -40937 515737 863773 896689 392987 304622 418056 151778 128189 82601 -123500
963 -123500 -376749 -730208 -284104 166505 536456 1767 -153905 237262 512421 483213
$$ packed form
1037C85960J341K98448o79777j05390q2915n2093K52825m3540l52667k35627N03645
1026a09790j9819K403L1712L11773j50397k63879M51927k5733l07325k22323k50139
1015e51590l0239k36511L03844M84998j98184j09343P13595l79808k55014N13211
1005B54959k75960q1335J94083J44832n29370M26976m151J3874m43497K43683
995e5906N51231k57972J40405l3225K36513r0192l92393n1717K65301J93503l79911
984A25637k45900k10737K62088L34769j58470r5776r8388L02694j60765k62538
974b07386J66449N56674L48036L2916n03702q8365J13434k66278k3589m5588k06101
963a23500k53249l53459M46104M50609L69951n34689j55672L91167K75159k9208
$$ plain form
953 483213 441857 718874 218556 -96665 182464 -416884 -324950 -632907 -274622 -486846
943 -486846 -89116 -103994 -205356 318612 202688 -444849 -570149 -617197 -653715 -355860
933 -355860 141291 81681 -210751 423669 347458 316218 579268 341446 395576 605182 328918
922 328918 787663 411085 526647 358134 38180 330969 -58534 -157463 -95887 -196057
912 -196057 29159 387001 421848 185853 -65071 -208025 -128369 -138153 -401796 -210258 24775
901 24775 -54361 115694 191142 141401 -146218 -89346 158231 121197 308009 -502474 -798118
890 -798118 -448004 -169528 -265399 -532482 -394866 -506323 -281501 -136668 79591 -38814
880 -38814 -368769 -546635 -388097 96840 139699 -248219 97872 607540 752340 -134427
$$ packed form
953D83213m1356K77017n00318l15221K79129n99348R1934l07957L58285k12224
943d86846L97730j4878j01362N23968j15924o47537j25300m7048l6518K97855
933c55860M97151n9610k92432O34420p6211l1240K63050k37822N4130K09606k76264
922C28918M58745l76578J15562j68513l19954K92789l89503r8929O1576j00170
912a96057K25216L57842L4847k35995k50924j42954P9656r784k63643J91538K35033
901B4775p9136J70055P5448m9741k87619N6872K47577l7034J86812q10483k95644
890g98118L50114K78476r5871k67083J37616j11457K24822J44833K16259j18405
880c8814l29955j77866J58538M84937M2859l87918L46091N09668J44800q86767
$$ plain form
870 -134427 -360478 -142843 -178648 132275 24350 -363162 334898 560603 110290 -108671
860 -108671 143664 88354 245819 37797 -46709 -192005 -523295 -553425 -434721 69600
850 69600 196902 -449879 -687343 -218938 -219151 -233168 -355653 -536285 135063 -52264 -271832
839 -271832 -658063 -234909 110483 -194346 -166787 242998 -101791 -13287 -61913 -594908
829 -594908 -438023 -225853 176502 516868 223007 -515442 -329719 -163410 -285802 184013
819 184013 108490 291606 307576 169849 69565 -166153 -471278 -302498 -203703 -260733 -344290
808 -344290 189407 196432 -469345 -368443 -454424 -168783 -266999 236340 276381 78642 107575
797 107575 -231570 -625252 -389351 -242067 16826 -305427 -408787 -78567 115918 189141
$$ packed form
870a34427k26051K17635l5805L10923j07925l87512O98060K25705m50313k18961
860a08671K52335n5310J57465k08022q4506j45296l31290l0130J18704N04321
850F9600J27302o46781k37464M68405k13j4017j22485j80632O71348j87327k19568
839b71832l86231M23154L45392l04829K7559M09785l44789Q8504m8626n32995
829e94908J56885K12170M02355L40366k93861p38449J85723J66309j22392M69815
819A84013p5523J83116J5970j37727j00284k35718l05125J68780R8795n7030q3557
808c44290N33697P025o65777J00902q5981K85641r8216N03339M0041j97739K8933
797A07575l39145l93682K35901J47284K58893l22253j03360L30220J94485P3223
$$ plain form
787 189141 -106065 -482958 243431 667062 285587 -141494 16483 356 -88203 -23811
777 -23811 -140135 -403804 -356926 -389153 -331926 4980 276337 -513895 -648771 -394863 -166489
766 -166489 24570 -49957 27973 68797 78667 257983 1936 31158 253754 519988 287160
755 287160 -166623 160365 48050 16276 -200054 -466198 -222326 -139957 120269 -137352
745 -137352 453120 643003 39903 104958 372681 -161781 -369682 75458 -12376 -128401
735 -128401 -63038 -72371 121093 -157597 -442188 88890 -360841 -221357 -140544 -349045 -58989
724 -58989 -315697 -674844 -919924 -268702 -72924 33256 268052 211551 -112338 128534
714 128534 344122 167807 505119 82733 -39324 -209210 162260 -315656 -147103 41583
$$ packed form
787A89141k95206l76893P26389M23631l81475m27081J57977j6127q8559O4392
777b3811j16324k63669M6878l2227N7227L36906K71357p90232j34876K53908K28374
766a66489J91059p4527P7930M0824R870J79316k56047K9222K22596K66234k32828
755B87160m53783L26988j12315l1774k16330k66144K43872Q2369K60226k57621
745a37352N90472J89883o03100O5055K67723n34462k07901M45140q7834j16025
735a28401O5363r333J93464k78690k84591N31078m49731J39484Q0813k08501K90056
724e8989k56708l59147k45080O51222J95778J06180K34796n6501l23889K40872
714A28534K15588j76315L37312m22386j22057j69886L71470m77916J68553J88686
$$ plain form
704 41583 87871 -249972 -647077 -540255 -488960 -410751 -631704 -643506 -641386 -771091 -520039
693 -520039 -641060 -289094 140 315611 344100 -750146 -660700 -481071 -397758 -208733
683 -208733 -362154 -365400 -293278 518443 77132 -6516 408087 173767 -364222 -418575 -771547
672 -771547 -318299 -61535 -305056 156831 464543 630720 90652 271842 -146938 189366
662 189366 -102475 -45218 441441 -26192 90567 155120 -187016 -287644 -578937 -512508
652 -512508 -398220 353580 -35729 292428 92767 -751268 -665123 -534515 207480 59284
642 59284 52550 -71742 -166484 -219889 -59006 -204950 -379683 -519408 -22043 367289 67585
631 67585 249102 65296 399546 408734 -287996 -263224 -7817 163585 84088 -28296 -303029
$$ packed form
704D1583M6288l37843l97105J06822N1295P8209k20953j1802K120j29705K51052
693e20039j21021L51966K89234L15471K8489j094246Q9446J79629Q3313J89025
683b08733j53421l246P2122Q11721m41311q3648M14603k34320n37989n4353l52972
672g71547M53248K56764k43521M61887L07712J66177n40068J81190m18780L36304
662A89366k91841N7257M86659m67633J16759O4553l42136j00628k91293O6429
652e12508J14288P51800l89309L28157j99661q44035Q6145J30608P41995j48196
642E9284o734j24292r4742n3405J60883j45944j74733j39725M97365L89332k99704
631F7585J81517j83806L34250R188o96730K4772K55407J71402p9497j12384k74733
$$ plain form
620 -303029 66765 60908 -107831 121118 188999 409962 -85895 -147909 -232981 -163173 70084
609 70084 -143409 39609 86957 -216992 -146511 -7861 20418 -6171 -408406 -367581 -321628
598 -321628 -195354 22633 521215 669473 629940 18626 144006 -35262 -635056 -509152
588 -509152 -714024 -555998 114803 94503 229150 271365 415410 -329956 -601117 -610395 -262981
577 -262981 -281490 -424269 166003 218968 262670 23453 -41877 -246418 -439511 -224996 -57076
566 -57076 41490 197120 -249921 -157174 -263275 -218156 302130 -145799 -491043 -248191 71344
555 71344 -182471 -30802 295437 -62432 -246910 -515831 -494905 -274191 276119 -65493
545 -65493 -101022 -229848 -76609 365605 -301402 -504488 -504790 -315151 -253636 -549093 -318513
$$ packed form
620c03029L69794n857j68739K28949O7881K20963m95857o2014q5072O9808K33257
609G0084k13493J83018M7348l03949P0481J38650K8279k6589m02235M0825M5953
598c21628J26274K17987M98582J48258l9533o11314J25380j79268n99794J25904
588e09152k04872J58026O70801k0300J34647M2215J44045p45366k71161r278L47414
577b62981j8509j42779N90272N2965M3702k39217o5330k04541j93093K14515J67920
566e7076R8566J55630m47041R2747j06101M5119N20286m47929l45244K42852L19535
555G1344k53815J51669L26239l57869j84478k68921K0926K20714N50310l41612
545f5493l5529j28826J53239M42214o67007k03086l02J89639O1515k95457K30580
$$ plain form
534 -318513 -146563 -27563 130589 -347114 -425871 -183095 -22905 190859 -217980 331170
524 331170 444389 338078 44061 41763 -106613 -427090 -237833 -522705 -158966 596003
514 596003 235810 -275884 -212032 -217332 -603526 -358765 -298608 -260390 -334580 127526 227362
$$ packed form
534c18513J71950J19000J58152m77703p8757K42776J60190K13764m08839N49150
524C31170J13219j06311k94017k298j48376l20477J89257k84872L63739P54969
514E96003l60193n11694O3852n300l86194K44761O0157L8218p4190M62106R9836
$$ [...]
##END NTUPLES=NMR SPECTRUM
##END=
