##TITLE=1H_CG-1195y
 DMSO
 8 sc, 
 13.3.2024
##JCAMPDX= 6.0         $$ Bruker NMR JCAMP-DX V2.0
##DATA TYPE= NMR SPECTRUM
##DATA CLASS= NTUPLES
##ORIGIN= UXNMR, Bruker Analytische Messtechnik GmbH
##OWNER= root
$$ XWIN-NMR		Version 3.5
$$ Wed Mar 13 14:38:45 2024 Russian Standard Time (UT+4h)  she@DPX200
##.OBSERVE FREQUENCY= 200.1313
##.OBSERVE NUCLEUS= ^1H
##.ACQUISITION MODE= SIMULTANEOUS
##.ACQUISITION SCHEME= undefined
##.AVERAGES= 8
##.DIGITISER RES= 18
##SPECTROMETER/DATA SYSTEM= spect
##.PULSE SEQUENCE= zg30
##.SOLVENT NAME= DMSO
##.SHIFT REFERENCE= (INTERNAL, DMSO, 0, 15.4869)
##AUDIT TRAIL= $$ (NUMBER, WHEN, WHO, WHERE, WHAT)
$$ ##TITLE= Audit trail, XWIN-NMR		Version 3.5
$$ ##JCAMPDX= 5.01
$$ ##ORIGIN= Bruker BioSpin GmbH
$$ ##OWNER= she
$$ F:/spectra/data/she/nmr/H-F/1/pdata/1/auditp.txt
$$ ##AUDIT TRAIL=  $$ (NUMBER, WHEN, WHO, WHERE, WHAT)
(   1,<2024-03-13 14:37:42.18 +0400>,<she>,<DPX200>,
      <created by zg, POWCHK disabled, PULCHK disabled
       configuration hash MD5:
       00 E9 B6 7A A2 85 ED C7 34 08 36 98 17 FE 4E 26
       data hash MD5: 16K
       0D 72 AC 9C 3F D4 D6 CA B1 8A AA C5 5F FB F8 16>)
(   2,<2024-03-13 14:37:44.31 +0400>,<she>,<DPX200>,
      <Start of raw data processing
       efp BC_mod = 2 LB = 0.24 FT_mod = 6 PKNL = 1 PHC0 = -25301.27 PHC1 = 9.987313 SI = 16K 
       data hash MD5: 16K
       19 D2 C4 81 B6 3E 31 18 A2 C5 3E 32 E3 3D C8 B4>)
(   3,<2024-03-13 14:38:01.81 +0400>,<she>,<DPX200>,
      <pk PHC0 = -2.897209 PHC1 = 0 
       data hash MD5: 16K
       77 31 1D C8 9E 3C CA 64 05 A0 A4 BA D1 46 E2 30>)
(   4,<2024-03-13 14:38:05.00 +0400>,<she>,<DPX200>,
      <abs ABSG = 5 
       data hash MD5: 16K
       2F A8 87 45 22 4A 40 C3 0D F9 00 50 5C 82 44 EC>)
$$ ##END=
$$ 
$$ hash MD5
$$ C6 BF F4 C3 FB 8B B0 CA 1A 1B 27 D8 2F AA F2 2F
##$RELAX= 
##$RELAX= 
##$RELAX= 
##$RELAX= 
##$RELAX= 
##$RELAX= 
$$ Bruker specific parameters
$$ --------------------------
##$DU= <F:/spectra>
##$EXPNO= 1
##$NAME= <H-F>
##$PROCNO= 1
##$TYPE= <nmr>
##$USER= <she>
##$AMP= (0..31)
100 100 100 100 100 100 100 100 100 100 100 100 100 100 100 100 100 100 
100 100 100 100 100 100 100 100 100 100 100 100 100 100 
##$AQSEQ= 0
##$AQ_mod= 1
##$AUNM= <au_zg>
##$AUTOPOS= <>
##$BF1= 200.13
##$BF2= 200.13
##$BF3= 200.13
##$BF4= 200.13
##$BF5= 200.13
##$BF6= 200.13
##$BF7= 200.13
##$BF8= 200.13
##$BYTORDA= 1
##$CFDGTYP= 0
##$CFRGTYP= 5
##$CHEMSTR= <none>
##$CNST= (0..31)
1 1 145 1 1 1 1 1 1 1 1 1 1 1 1 1 1 1 1 1 1 1 1 1 1 1 1 1 1 1 1 1 
##$CPDPRG= <>
##$CPDPRG1= <>
##$CPDPRG2= <>
##$CPDPRG3= <>
##$CPDPRG4= <mlev>
##$CPDPRG5= <mlev>
##$CPDPRG6= <mlev>
##$CPDPRG7= <mlev>
##$CPDPRG8= <mlev>
##$CPDPRGB= <>
##$CPDPRGT= <>
##$D= (0..31)
0 1.2 0 0 0 0 0 0 0 0.06 0 0.03 0 0 0 0 0.0002 0 0 0 0 0 0 0 0 0 0 0 0 
0 0 0 
##$DATE= 1710326261
##$DBL= (0..7)
120 120 120 120 120 120 120 120 
##$DBP= (0..7)
150 150 150 150 150 150 150 150 
##$DBP07= 0
##$DBPNAM0= <>
##$DBPNAM1= <>
##$DBPNAM2= <>
##$DBPNAM3= <>
##$DBPNAM4= <>
##$DBPNAM5= <>
$$ [...]
##$SUBNAM3= <"">
##$SUBNAM4= <"">
##$SUBNAM5= <"">
##$SUBNAM6= <"">
##$SUBNAM7= <"">
##$SUBNAM8= <"">
##$SUBNAM9= <"">
##$SW= 18.0517328524113
##$SWIBOX= (0..15)
0 0 2 0 0 0 0 0 0 0 0 0 0 0 0 0 
##$SW_h= 3612.71676300578
##$TD= 16384
##$TD0= 1
##$TE= 0
##$TE2= 300
##$TE3= 300
##$TEG= 300
##$TL= (0..7)
0 120 120 120 120 120 120 120 
##$TP= (0..7)
150 150 150 150 150 150 150 150 
##$TP07= 0
##$TPNAME0= <>
##$TPNAME1= <>
##$TPNAME2= <>
##$TPNAME3= <>
##$TPNAME4= <>
##$TPNAME5= <>
##$TPNAME6= <>
##$TPNAME7= <>
##$TPOAL= (0..7)
0.5 0.5 0.5 0.5 0.5 0.5 0.5 0.5 
##$TPOFFS= (0..7)
0 0 0 0 0 0 0 0 
##$TUNHIN= 0
##$TUNHOUT= 0
##$TUNXOUT= 0
##$USERA1= <user>
##$USERA2= <user>
##$USERA3= <user>
##$USERA4= <user>
##$USERA5= <user>
##$V9= 5
##$VALIST= <valist>
##$VCLIST= <CCCCCCCCCCCCCCC>
##$VD= 0
##$VDLIST= <DDDDDDDDDDDDDDD>
##$VPLIST= <PPPPPPPPPPPPPPP>
##$VTLIST= <TTTTTTTTTTTTTTT>
##$WBST= 1024
##$WBSW= 4
##$XGAIN= (0..3)
0 0 0 0 
##$XL= 0
##$YL= 0
##$YMAX_a= 128761
##$YMIN_a= -322010
##$ZGOPTNS= <>
##$ZL1= 120
##$ZL2= 120
##$ZL3= 120
##$ZL4= 120
##$ABSF1= 15.48687
##$ABSF2= -2.56498
##$ABSG= 5
##$ABSL= 3
##$ALPHA= 0
##$AQORDER= 0
##$ASSFAC= 0
##$ASSFACI= 0
##$ASSFACX= 0
##$ASSWID= 0
##$AUNMP= <proc_1d>
##$AZFE= 0.1
##$AZFW= 0.1
##$BCFW= 0
##$BC_mod= 2
##$BYTORDP= 0
##$COROFFS= 0
##$CY= -3
##$DATMOD= 1
##$DC= 0
##$DFILT= <>
##$DTYPP= 0
##$F1P= 0
##$F2P= 0
##$FCOR= 1
##$FTSIZE= 16384
##$FT_mod= 6
##$GAMMA= 0
##$GB= 0
##$INTBC= 1
##$INTSCL= 3.70164e-10
##$ISEN= 128
##$LB= 0.24
##$LEV0= 0
##$LPBIN= 0
##$MAXI= 10000
##$MC2= 0
##$MEAN= 0
##$ME_mod= 0
##$MI= 1.114404
##$NCOEF= 0
##$NC_proc= -8
##$NLEV= 6
##$NOISF1= 3.799351
##$NOISF2= 2.8
##$NSP= 0
##$NTH_PI= 0
##$NZP= 0
##$OFFSET= 15.48687
##$PC= 1
##$PHC0= -25304.17
##$PHC1= 9.987313
##$PH_mod= 1
##$PKNL= yes
##$PPARMOD= 0
##$PSCAL= 0
##$PSIGN= 0
##$REVERSE= no
##$SF= 200.130006971924
##$SI= 16384
##$SIGF1= 3
##$SIGF2= 2
##$SINO= 5.538805
##$SIOLD= 16384
##$SREGLST= <1H.CDCl3>
##$SSB= 0
##$STSI= 16384
##$STSR= 0
##$SW_p= 3612.71676300578
##$SYMM= 0
##$S_DEV= 0
##$TDeff= 16384
##$TDoff= 0
##$TI= <>
##$TILT= no
##$TM1= 0
##$TM2= 0
##$TOPLEV= 0
##$USERP1= <user>
##$USERP2= <user>
##$USERP3= <user>
##$USERP4= <user>
##$USERP5= <user>
##$WDW= 1
##$XDIM= 16384
##$YMAX_p= 500136504
##$YMIN_p= -1639349
$$ End of Bruker specific parameters
$$ ---------------------------------
##NTUPLES= NMR SPECTRUM
##VAR_NAME=  FREQUENCY,     SPECTRUM/REAL,   SPECTRUM/IMAG
##SYMBOL=    X,             R,               I
##VAR_TYPE=  INDEPENDENT,   DEPENDENT,       DEPENDENT
##VAR_FORM=  AFFN,          ASDF,            ASDF
##VAR_DIM=   16384,         16384,           16384
##UNITS=     HZ,            ARBITRARY UNITS, ARBITRARY UNITS
##FACTOR=    0.220516191357247, 1,           1
##FIRST=     3099.38736345118, 0,            0
##LAST=      -513.329399554596, 0,           0
##MIN=       -513.329399554596, -1639349,    0
##MAX=       3099.38736345118, 500136504,    0
$$ Real data points
##PAGE= N=1
##DATA TABLE= (X++(R..R)), XYDATA
$$ [...]
$$ plain form
10244 -267438 530600 436039 542031 1112962 1274302 1237417 1076441 773543 1166270 1109840
10234 1109840 870240 339698 717591 702152 -2587 493032 654668 263453 649845 576652
10224 576652 152541 545326 515120 758729 738455 -47724 102141 1096211 935708 1018289
10214 1018289 1043350 520310 -251568 662417 1011673 -12934 402871 911985 285172
10205 285172 582855 771467 913205 564809 625616 696288 1408181 917639 1358999 1754464
10195 1754464 1001521 790881 1204496 1170313 852766 463240 798118 1335805 1064305 1542861
10185 1542861 1328211 1843099 1958055 1470807 1570114 1414709 861846 446329 304528 117313
10175 117313 823597 1059597 1221947 1181324 1215427 1432063 1571103 1111607 1133520 1952876
$$ packed form
10244b67438P98038r4561J05992N70931J61340l6885j60976l02898L92727n6430
10234A109840k39600n30542L77893j5439p04739M95619J61636l91215L86392p3193
10224E76652m24111L92785l0206K43609k0274p86179J49865R94070j60503Q2581
10214A018289K5061n23040p71878R13985L49256j024607M15805N09114o26813
10205B85172K97683J88612J41738l48396O0807P0672P11893m90542M41360L95465
10195A754464p52943k10640M13615l4183l17547l89526L34878N37687k71500M78556
10185A542861k14650N14888J14956m87248R9307j55405n52863m15517j41801j87215
10175A17313P06284K36000J62350m0623L4103K16636J39040m59496K1913Q19356
$$ plain form
10165 1952876 1733229 749863 810019 1415125 1682224 1550525 1260766 1002437 1147692 855405
10155 855405 624182 963815 103075 721372 921626 1285564 1178702 583356 649847 526145
10145 526145 892309 972607 941744 975374 523417 498444 825577 707410 955287 1071699
10135 1071699 1033764 1205934 1396226 1171310 1101491 1239252 1112506 1226714 1173770 1296970
10125 1296970 929403 926444 758176 1499444 1582426 1370714 1057977 1290550 1949164 2051994
10115 2051994 1951539 1990617 1448746 1449042 1525306 1758793 1656257 2311229 2522214 1674711
10105 1674711 1432544 960899 1724567 2431859 1883929 2100842 1830532 2556181 2810808
10096 2810808 2140758 2141037 2336375 2256028 2729095 3068570 2481590 2310633 1902536 2615861
$$ packed form
10165A952876k19647r83366O0156O05106K67099j31699k89759k58329J45255k92287
10155H55405k31223L39633q60740O18297K00254L63938j06862n95346O6491j23702
10145E26145L66164Q0298l0863L3630m51957k4973L27133j18167K47877J16412
10135A071699l7935J72170J90292k24916o9819J37761j26746J14208n2944J23200
10125A296970l67567k959j68268P41268Q2982k11712l12737K32573O58614J02830
10115B051994j00455L9078n41871K96P6264K33487j02536O54972K10985q47503
10105A674711k42167m71645P63668P07292n47930K16913k70310P25649K54627
10096B810808o70050K79J95338q0347M73067L39475n86980j70957m08097P13325
$$ plain form
10086 2615861 2318931 2276571 2058151 1432843 1668916 1735592 1350578 1800272 2060085 2070925
10076 2070925 2246305 2243717 1856318 2344168 2761935 2607824 3252663 3768450 3575761 2918300
10066 2918300 3755009 3638214 3272093 3207070 2944470 3512604 3028800 3012742 3744869 3789683
10056 3789683 4146991 4170289 3996623 3866146 3533709 4047931 4047839 3967123 4420812 4271253
10046 4271253 3839657 4084490 4148406 4139733 4698415 4449188 4001131 4191326 4366464 5241832
10036 5241832 5032624 5018838 5073885 5259454 4725412 4480188 4797919 5634597 5550876 5774469
10026 5774469 5045101 5107086 5824404 5332229 5134978 5637177 5949068 5187601 4585433 5700896
10016 5700896 6522693 6457573 6579843 6593322 7198811 7104581 6528020 6465449 6982502 7856687
$$ packed form
10086B615861k96930m2360k18420o25308K36073O6676l85014M49694K59813J0840
10076B070925J75380k588l87399M87850M17767j54111O44839N15787j92689o57461
10066B918300Q36709j16795l66121o5023k62600N68134m83804j6058P32127M4814
10056C789683L57308K3298j73666j30477l32437N14222r2q0716M53689j49559
10046D271253m31596K44833O3916q673N58682k49227m48057J90195J75138Q75368
10036E241832k09208j3786N5047J85569n34042k45224L17731Q36678q3721K23593
10026E774469p29368O1985P17318m92175j97251N02199L11891p61467o02168J115463
10016E700896Q21797o5120J22270J3479O05489r4230n76561o2571N17053Q74185
$$ plain form
10006 7856687 7797382 8476897 8442404 7815701 8149628 8601731 9208606 9042204 9737332 9527065
9996 9527065 9210529 9747613 9985596 10685999 11184713 11207513 11469359 11524671 12158633 13135062
9986 13135062 12935179 13221287 13900581 14889129 15279947 15222918 15860346 16260893 17491654
9977 17491654 18249422 20361910 21198811 22043338 22873482 24364367 25997919 28285503 30468626
9968 30468626 32828123 35715708 39064884 42852136 47407192 52515991 56773286 61133253
9960 61133253 64533090 66727352 68514463 69576651 69372739 68882477 68544183 68129393 67295708
9951 67295708 66627238 64437038 60711873 56211262 51547481 46690116 42003147 38493333
9943 38493333 34305091 31771715 29248573 26590321 25371397 24377741 22772905 21383211
$$ packed form
10006G856687n9305O79515l4493o26703L33927M52103O06875j66402O95128k10267
9996I527065l16536N37084K37983P00403M98714K2800K61846N5312O33962R76429
9986A3135062j99883K86108O79294R88548L90818n7029O37428M00547J230761
9977A7491654P57768K112488Q36901Q44527Q30144J490885J633552K287584K183123
9968C0468626K359497K887585L349176L787252M555056N108799M257295M359967
9960F1133253L399837K194262J787111J062188k03912m90262l38294m14790q33685
9951F7295708o68470k190200l725165m500611m663781m857365m686969l509814
9943C8493333m188242k533376k523142k658252j218924r93656j604836j389694
$$ plain form
9935 21383211 19255585 18065751 17568087 16751550 15819050 14717230 14490404 13780252 13216306
9926 13216306 12378805 11904262 11347948 10652970 10730573 10028334 9978785 9707212 8911185 8810233
9916 8810233 8414371 8246858 7195755 6796517 6414585 6125547 5865203 5670920 5757619 6046406
9906 6046406 6049607 5927146 5736695 5675157 5567267 5319298 5195844 5285691 5015287 4991217
9896 4991217 4551889 5036254 4639168 4862666 4647791 4463729 3917469 4250921 4533710 4274563
9886 4274563 3931586 3615063 4732168 4788980 4042223 3700579 3075724 2994028 3476145 3670554
9876 3670554 4118830 3512924 2828425 2888911 3474392 3552277 3669505 3342161 3079232 3123625
9866 3123625 3111862 3111619 3173961 2573492 2547114 3528247 3382974 2893072 3317016 3450715 3056182
$$ packed form
9935B1383211k127626j189834m97664q16537r32500j101820k26826p10152n63946
9926A3216306q37501m74543n56314o94978P7603p02239m9549k71573p96027j00952
9916H810233l95862j67513j051103l99238l81932k89038k60344j94283Q6699K88787
9906F046406L201j22461j90451o1538j07890k47969j23454Q9847k70404k4070
9896D991217m39328M84365l97086K23498k14875j84062n46260L33452K82789k59147
9886D274563l42977l16523J117105N6812p46757l41644o24855q1696M82117J94409
9876C670554M48276o05906o84499O0486N85481P7885J17228l27344k62929M4393
9866C123625j1763k43O2342o00469k6378R81133j45273m89902M23944J33699l94533
$$ plain form
9855 3056182 3008531 2991175 2508567 2251520 2397309 2586306 3011677 3462980 2778082 3206483
9845 3206483 2741923 2050614 2156037 2784302 2985691 2973875 2940686 3491430 2799353 2160347
9835 2160347 2245490 2750719 2713700 2494570 1951045 2188595 2483545 2515710 2801669 2301303
9825 2301303 1853885 1831812 2013486 2275324 2628568 2658934 2389975 2187285 2086039 2813641
9815 2813641 2588807 2464293 2649434 2701694 2946359 3247922 3544331 2392031 2198954 1962174
9805 1962174 2429019 2634335 2798501 2405149 2711137 2867692 2558985 2161564 2696710 3016438
9795 3016438 3026973 3236910 2935276 2640890 3244351 3214401 2906393 3203236 2958182 2395181
9785 2395181 2507847 3236699 3515881 3264311 3153500 2747481 3222123 3518316 3363011 3144801
$$ packed form
9855C056182m7651j7356m82608k57047J45789J88997M25371M51303o84898M28401
9845C206483m64560o91309J05423O28265K01389j1816l3189N50744o92077o39006
9835B160347Q5143N05229l7019k19130n43525K37550K94950L2165K85959n00366
9825B301303m47418k2073J81674K61838L53244L0366k68959k02690j01246P27602
9815B813641k24834j24514J85141N2260K44665L01563K96409j152300j93077k36780
9805A962174M66845K05316J64166l93352L05988J56555l08707l97421N35146L19728
9795C016438J0535K09937l01634k94386O03461k9950l08008K96843k45054n63001
9785B395181J12666P28852K79182k51570j10811m06019M74642K96193j55305k18210
$$ plain form
9775 3144801 3138856 3122239 3314640 3319697 3903664 4169667 4138482 3936433 3520592 3677465 4232665
9764 4232665 4690177 4034430 4194361 3920642 4397212 4905545 4910539 5099344 5087370 4988363
9754 4988363 5214894 5226274 5245333 5396606 5022423 4879054 5184650 4539110 4882532 5874686
9744 5874686 5879256 6326148 5883690 5791224 6345285 6604959 6158040 6001087 6166283 6428951
9734 6428951 6935221 7441132 7770703 7673485 7484246 7652245 8066074 8048747 7798253 8326106
9724 8326106 8689090 8805065 8508742 8799122 9364203 9430154 9962166 10447161 10995477 11626873
9714 11626873 11474668 12438064 13070205 13535457 14353016 14070153 15131191 16406864 16934837
9705 16934837 18112696 19672703 20784763 22029980 22907832 24827453 26665827 28580478
$$ packed form
9775C144801n945j6617J92401N057N83967K66003l1185k02049m15841J56873N55200
9764D232665M57512o55747J59931k73719M76570N08333M994J88805j1974r9007
9754D988363K26531J1380J9059J51273l74183j43369L05596o45540L43422R92154
9744E874686M570M46892m42458r2466N54061K59674m46919j56953J65196K62668
9734F428951N06270N05911L29571r7218j89239J67999M13829j7327k50494N27853
9724H326106L62984J15975k96323K90380N65081O5951N32012M84995N48316O31396
9714A1626873j52205R63396O32141M65252Q17559k82863J061038J275673N27973
9705A6934837J177859J560007J112060J245217Q77852J919621J838374J914651
$$ plain form
9697 28580478 31233967 34166884 36808832 39421926 41837094 44801379 45969141 47040876
9689 47040876 47495778 47955291 46579394 44260057 41741075 39620764 37360064 34703127
9681 34703127 32344322 30540215 28917603 26380865 25180688 24767206 24519097 24136450 23609312
9672 23609312 23129183 23489221 24103463 24431836 24866050 25501472 26874170 27928013 29763931
9663 29763931 32546901 33996023 36616927 39153807 41999025 44812337 46723511 47828124
9655 47828124 48612609 48871756 48150734 46252822 43686177 41455063 38566746 34829706 31483466
9646 31483466 28729735 25945037 23264267 20941347 19371639 17910577 16505753 16246006
9638 16246006 14875833 13974002 12756133 12029061 11732401 11025046 10843984 10327394 9894165
$$ packed form
9697B8580478K653489K932917K641948K613094K415168K964285J167762J071735
9689D7040876M54902M59513j375897k319337k518982k120311k260700k656937
9681C4703127k358805j804107j622612k536738j200177m13482k48109l82647n27138
9672B3609312m80129L60038O14242L28373M34214O35422J372698J053843J835918
9663B9763931K782970J449122K620904K536880K845218K813312J911174J104613
9655D7828124P84485K59147p21022j897912k566645k231114k888317l737040l346240
9646C1483466k753731k784698k680770k322920j569708j461062j404824k59747
9638A6246006j370173r01831j217869p27072k96660p07355j81062n16590m33229
$$ plain form
9629 9894165 9623577 9222660 8844408 8242753 8062126 7953831 7466088 7010991 6573559 6784627
9619 6784627 6628618 5765175 5551457 5245115 5196489 4954092 4669712 4845476 4613977 4244182
9609 4244182 3646247 3787209 4096918 4300767 3928635 3556735 3180331 3378268 3094213 3161964
9599 3161964 4227683 3830531 3380598 3445924 3364304 3142117 2539547 2720511 3145335 2744359
9589 2744359 2484593 2256476 2044435 2922915 3004655 3425875 3634186 3381255 3096512 3017141
9579 3017141 2811433 2334637 2899175 2829889 2539886 2549320 2536973 1956182 1884305 2401218
9569 2401218 2281478 2211993 1528838 2047850 2872906 2894712 2664350 2349131 1767126 903830
9559 903830 1577079 2269923 2151175 2314653 2437098 2372983 1999945 1339911 929889 1588994
$$ packed form
9629I894165k70588m00917l78252o01655j80627j08295m87743m55097m37432K11068
9619F784627j56009q63443k13718l06342m8626k42397k84380J75764k31499l69795
9609D244182n97935J40962L09709K03849l72132l71900l76404J97937k84055O7751
9599C161964J065719l97152m49933O5326q1620k22187o02570J80964M24824m00976
9589B744359k59766k28117k12041Q78480Q1740M21220K08311k52931k84743p9371
9579C017141k05708m76796N64538o9286k90003R434j2347n80791p1877N16913
9569B401218j19740o9485o83155N19012Q25056K1806k30362l15219n82005q63296
9559I03830O73249O92844j18748J63478J22445o4115l73038o60034m10022O59105
$$ plain form
9549 1588994 1505469 953513 795815 1312094 2061722 1952280 2233973 2304931 1599571 1539091
9539 1539091 2166908 2590478 2641038 2592844 2571582 2100632 2151985 1723513 2311499 1830400
9529 1830400 1727492 1351589 1353341 1202659 1374034 1635554 1674574 1771977 2119886 1684307
9519 1684307 2321003 2189128 2149654 1758076 797564 785094 1723542 1652314 1435881 1872792
9509 1872792 1789525 1692439 1954141 1724923 1480146 1486634 602695 918658 1306475 1417006
9499 1417006 1268750 1091675 1393668 1825786 1247976 1574184 2161926 2819394 2414513 1892232
9489 1892232 1290713 1702894 1398065 1635829 1795142 2107321 2047495 1445246 1705356 1823223
9479 1823223 1937142 1504465 841985 1273002 1214541 1287663 1776939 1489023 1247889 1419677
$$ packed form
9549A588994q3525n51956j57698N16279P49628j09442K81693P0958p05360o0480
9539A539091O27817M23570N0560m8194k1262m70950N1353m28472N87986m81099
9529A830400j02908l75903J752j50682J71375K61520L9020R7403L47909m35579
9519A684307O36696j31875l9474l91578r60512j2470R38448p1228k16433M36911
9509A872792q3267r7086K61702k29218k44777O488q83939L15963L87817J10531
9499A417006j48256j77075L01993M32118n77810L26208N87742O57468m04881n22281
9489A892232o01519M12181l04829K37764J59313L12179n9826o02249K60110J17867
9479A823223J13919m32677o62480M31017n8461P3122M89276k87916k41134J71788
$$ plain form
9469 1419677 1610713 1587330 1858299 2306663 2299378 2088180 2089182 1972602 1462826 1624162
9459 1624162 1617989 2121510 1962521 2073002 2162596 2002607 1951147 1931386 1747499 1994587
9449 1994587 1887009 1994044 2169765 1844056 1140995 1465248 1929984 2118793 1927056 2367406
9439 2367406 2521519 2249401 2528432 2156686 1259756 1723066 2294122 1803812 2436931 1919977
9429 1919977 1291288 1922723 2319467 2075240 2051409 1835132 1502532 1372571 1237768 1363492
9419 1363492 1228409 1616331 1808710 1748976 2157857 2130188 1837388 1491144 1524004 1795859
9409 1795859 1514075 1432893 1896760 2493616 2711656 2130576 1912277 1529787 1667341 1671520
9399 1671520 1724201 2190126 2354859 1928525 2186962 2123835 2269743 2288991 2668777 1874285
$$ packed form
9469A419677J91036k3383K70969M48364p285k11198J002j16580n09776J61336
9459A624162o173N03521j58989J10481Q9594j59989n1460j9761j83887K47088
9449A994587j07578J07035J75721l25709p03061L24253M64736J88809j91737M40350
9439B367406J54113k72118K79031l71746q96930M63310N71056m90310O33119n16954
9429A919977o28689O31435L96744k44227k3831k16277l32600j29961j34803J25724
9419A363492j35083L87922J92379n9734M08881k7669k92800l46244L2860K71855
9409A795859k81784q1182M63867N96856K18040n81080k18299l82490J37554M179
9399A671520N2681M65925J64733m26334K58437o3127J45908J9248L79786p94492
$$ plain form
9389 1874285 1636559 1999347 2665472 2593163 2966442 3139178 2733199 3476658 3393414 2838890
9379 2838890 2904276 1974007 1822088 2310493 2336748 2573440 2547401 2728898 2555164 2477192
9369 2477192 2766106 2595714 2414361 2328316 2742538 3044586 2386253 2010597 1804577 1774345
9359 1774345 2630897 2597539 2344547 2746975 2735093 2564145 3006639 2992792 2220688 2233178
9349 2233178 2244215 2522744 2401211 2246366 2432939 2580698 2742182 2725518 2871468 3129698
9339 3129698 3243591 2759778 2573991 2709009 2670467 2334818 2530914 2721313 2678081 2610798
9329 2610798 2481270 2101630 2670766 3375111 3187260 2904002 2320515 2407251 2934754 2218682
9319 2218682 2849916 3369596 2992958 2991285 3082654 2417772 2640001 3076364 2486179 2055282
$$ packed form
9389A874285k37726L62788O66125p2309L73279J72736m05979P43459q3244n54524
9379B838890O5386r30269j51919M88405K6255K36692k6039J81497j73734p7972
9369B477192K88914j70392j81353q6045M14222L02048o58333l75656k06020l0232
9359A774345Q56552l3358k52992M02428j1882j70948M42494j3847p72104J2490
9349B233178J1037K78529j21533j54845J86573J47759J61484j6664J45950K58230
9339C129698J13893m83813j85787J35018l8542l35649J96096J90399m3232o7283
9329B610798j29528l79640N69136P04345j87851k83258n83487Q6736N27503p16072
9319B218682O31234N19680l76638j673R1369o64882K22229M36363n90185m30897
$$ plain form
9309 2055282 2069024 2252422 1834983 2222761 2092634 2842168 2969118 3323406 3309471 2677588
9299 2677588 2661194 3297309 2917490 2806588 2848498 2280118 1701131 2084771 2497840 3151309
9289 3151309 3686607 3443048 3255345 2504800 2778396 2688314 2081469 2566755 2831957 2660348
9279 2660348 2697501 2692708 3431566 3023768 2863996 3493237 3424793 3650178 3240990 2929195
9269 2929195 2476773 2546986 2546805 2616348 2337209 2623193 2863260 3407941 3735390 3690319 3182772
9258 3182772 3153087 2685684 2974341 3007029 3111807 3584760 3114639 2939375 3026545 3616950
9248 3616950 3426949 3695173 4343005 4546183 3726421 3513922 3782074 3559457 3209255 3706123
9238 3706123 4016963 3552712 3641323 3639545 3841514 4270624 5073340 5031861 4617498 4253709
$$ packed form
9309B055282J3742J83398m17439L87778j30127P49534J26950L54288j3935o31883
9299B677588j6394O36115l79819j10902M1910n68380n78987L83640M13069O53469
9289C151309N35298k43559j87703p50545K73596r0082o06845M85286K65202j71609
9279B660348L7153m793P38858m07798j59772O29241o8444K25385m09188l11795
9269B929195m52422P0213j81O9543k79139K85984K40067N44681L27449m5071n07547
9258C182772k9685m67403K88657L2688J04778M72953m70121j75264Q7170N90405
9248C616950j90001K68224O47832K03178q19762k12499K68152k22617l50202M96868
9238C706123L10840m64251Q8611j778K01969M29110Q02716m1479m14363l63789
$$ plain form
9228 4253709 4605136 4757290 4952585 4609272 4432065 5092863 4494236 4788926 5146227 5046793
9218 5046793 5262388 5243874 4290912 4216093 4597993 5356927 5364036 5016665 4937313 5411158
9208 5411158 5011368 4783783 5285673 5904840 6058603 6287797 5866409 5468853 5770201 5964642
9198 5964642 6300919 6364319 6141916 6241883 6286101 6279695 6325444 6060981 5505748 6134794 6220699
9187 6220699 6102688 6260737 6648482 7049707 6908008 7122491 6771649 7027375 7112154 7021473
9177 7021473 6732941 7149484 7555238 7573788 7493075 7572149 7817845 7721512 7582420 7536512
9167 7536512 8499352 8169408 7994120 8692463 8813167 8955270 9487788 10280092 10234565 9575800
9157 9575800 9852372 10720441 10833262 11055240 11337895 11498080 10706814 11408315 11638940 11551640
$$ packed form
9228D253709L51427J52154J95295l43313j77207O60798n98627K94690L57301r9434
9218E046793K15595j8514r52962p4819L81900P58934P109l47371p9352M73845
9208E411158l99790k27585N01890O19167J53763K29194m21388l97556L01348J94441
9198E964642L36277O3400k22403R9967M4218o406M5749k64463n55233O29046Q5905
9187F220699j18011J58049L87745M01225j41699K14483l50842K55726Q4779r0681
9177G021473k88532M16543M05754J8550q0713P9074K45696r6333j39092m5908
9167G536512R62840l29944j75288O98343J20704J42103N32518P92304m5527o58765
9157I575800K76572Q68069J12821K21978K82655J60185p91266P01501K30625q7300
$$ plain form
9147 11551640 11790264 12288528 12685962 12522014 13069839 13316634 13239492 13435872 14141903 13768783
9137 13768783 14514957 14611416 14911679 15574506 15924083 16166021 17260051 18112754 18572841
9128 18572841 18693135 18949485 19522567 19981827 21561237 22640844 24214182 25469839 27268423
9119 27268423 28655919 29413589 30502641 31425417 32398389 32812566 32658094 32981019 33148279
9110 33148279 33621470 33897214 33734497 33520866 33328785 32945689 32213198 31602295 30270344
9101 30270344 30188029 30372307 30129242 30582062 30682220 30828538 31641484 32203216 32721772 33635105
9091 33635105 34793612 35789014 36941024 38537010 40103384 41434969 42825022 45303111
9083 45303111 47736032 51506241 54983418 58341438 62654405 65508493 68527742 71069320
$$ packed form
9147A1551640K38624M98264L97434j63948N47825K46795p7142J96380P06031l73120
9137A3768783P46174R6459L00263O62827L49577K41938J094030Q52703M60087
9128A8572841J20294K56350N73082M59260J579410J079607J573338J255657J798584
9119B7268423J387496P57670J089052R22776R72972M14177j54472L22925J67260
9110C3148279M73191K75744j62717k13631j92081l83096p32491o10903j331951
9101C0270344q2315J84278k43065M52820J00158J46318Q12946N61732N18556R13333
9091C3635105J158507R95402J152010J595986J566374J331585J390053K478089
9083D5303111K432921L770209L477177L358020M312967K854088L019249K541578
$$ plain form
9075 71069320 71947574 71254919 71065631 71338777 71785991 72201027 72136081 71481275 70652720 68185425
9065 68185425 64891966 61296747 58052292 55162595 52542662 51348018 50567216 49216191
9057 49216191 47967647 47985863 47312876 47058934 47302648 47975955 48803630 49472723 50031130
9048 50031130 52011945 53433465 55394668 57471086 60264873 63752112 67895294 72592502
9040 72592502 77554977 82035595 86365267 90031532 92821363 93552717 92742209 90921652
9032 90921652 87226110 82977365 77457009 73107221 67931888 64217849 61892374 60099832
9024 60099832 58770975 57873315 57598887 57106324 56568501 56543996 57027532 57403361 57783655
9015 57783655 58616501 60001804 60773569 61737678 63226006 65154583 67305420 69444513 72554114
$$ packed form
9075G1069320Q78254o92655j89288K73146M47214M15036o4946o54806q28555k467295
9065F8185425l293459l595219l244455k889697k619933j194644p80802j351025
9057D9216191j248544J8216o72987k53942K43714O73307Q27675O69093N58407
9048E0031130J980815J421520J961203K076418K793787L487239M143182M697208
9040G2592502M962475M480618M329672L666265K789831P31354q10508j820557
9032I0921652l695542m248745n520356m349788n175333l714039k325475j792542
9024F0099832j328857q97660k74428m92563n37823k4505M83536L75829L80294
9015E7783655Q32846J385303P71765R64109J488328J928577K150837K139093L109601
$$ plain form
9006 72554114 76774278 81516245 86186418 92113704 98884938 105636397 112309023 118602407
8998 118602407 123988541 128052473 130038454 129883671 128204831 124792823 119552437 114117664
8990 114117664 109722838 105363420 103069402 102260430 102030564 103140164 105439152 107345782
8982 107345782 108999984 110170892 110886086 110833290 109721677 107175730 103220322 98038112
8974 98038112 92696425 87529887 81822159 76255557 70177630 65321563 60261045 55840876
8966 55840876 52362352 48723385 45957697 43643826 41617243 39140093 36941159 35369366
8958 35369366 34130617 32738616 31967640 30928455 29727023 28915591 27808733 26999491 26061750
8949 26061750 25772842 24896915 24545427 24149722 23494722 22448953 21369869 21634114 22014082
$$ packed form
9006G2554114M220164M741967M670173N927286O771234O751459O672626O293384
8998A18602407N386134M063932J985981j54783j678840l412008n240386n434773
8990A14117664m394826m359418k294018q08972k29866J109600K298988J906630
8982A07345782J654202J170908P15194n2796j111613k545947l955408n182210
8974I8038112n341687n166538n707728n566602o077927m856067n060518m420169
8966E5840876l478524l638967k765688k313871k026583k477150k198934j571793
8958C5369366j238749j392001p70976j039185j201432q11432j106858q09242r37741
8949B6061750k88908q75927l51488l95705o55000j045769j079084K64245L79968
$$ plain form
8940 22014082 21414223 20194814 20088993 19585703 19946241 19695471 19287590 18602637 17505501
8931 17505501 16819716 16558137 15912299 15333579 15445327 14986898 14424920 14277914 14077575
8922 14077575 13642602 13640736 12937009 12911208 13015515 13244591 12423644 12202027 11820785 12173624
8912 12173624 12588544 12347133 12038034 11517986 11739655 11611398 11636551 12060807 11893430 11688648
8902 11688648 11334110 11363156 11669557 11877644 12095799 12139423 12264047 11817443 12021794 12011760
8892 12011760 11914127 11840346 12379353 12706536 12538506 12451171 13001584 13056659 12623658 13098679
8882 13098679 13356403 13824918 14746373 14709886 15005334 15307717 15494440 15461468 15473652 16301881
8872 16301881 16424591 16400099 16447183 16801499 16762797 17097960 17448355 18458510 19390197 20097492
$$ packed form
8940B2014082n99859j219409j05821n03290L60538k50770m07881o84953j097136
8931A7505501o85785k61579o45838n78720J11748m58429n61978j47006k00339
8922A4077575m34973j866p03727k5801J04307K29076q20947k21617l81242L52839
8912A2173624M14920k41411l09099n20048K21669j28257K5153M24256j67377k04782
8902A1688648l54538K9046L06401K08087K18155M3624J24624m46604K04351j0034
8892A2011760r7633p3781N39007L27183j68030q7335N50413N5075m33001M75021
8882A3098679K57724M68515R21455l6487K95448L02383J86723l2972J2184Q28229
8872A6301881J22710k4492M7084L54316l8702L35163L50395J010155R31687P07295
$$ plain form
8862 20097492 20266220 21277006 22778565 23885109 25162486 27133434 28286933 29464968
8854 29464968 30483230 30936694 30705892 30131088 29693785 28681208 28868510 28858301 27987247
8845 27987247 28434916 28867978 29616846 30663187 32081127 34157862 35638823 36857396 37199210
8836 37199210 37320204 37382543 37062083 36528575 36024190 35345901 34857540 34152801 32527250
8827 32527250 32407730 32397171 32860567 33731546 33962892 35406361 36886887 38667297 39484682
8818 39484682 39981737 39588089 39196313 37904110 36240488 34517497 33173101 32191539 31158554
8809 31158554 30758253 30647765 30274963 30618527 31792919 32547831 32806771 33474068 33807038
8800 33807038 33666650 32946678 31737550 30167559 29611324 28138209 26669624 25813278 25084000
$$ packed form
8862B0097492J68728J010786J501559J106544J277377J970948J153499J178035
8854B9464968J018262M53464k30802n74804m37303j012577J87302j0209q71054
8845B7987247M47669M33062P48868J046341J417940K076735J480961J218573L41814
8836C7199210J20994O2339l20460n33508n04385o78289m88361p04739j625551
8827C2527250j19520j0559M63396Q70979K31346J443469J480526J780410Q17385
8818C9484682M97055l93648l91776j292203j663622j722991j344396r81562j032985
8809C1158554m00301j10488l72802L43564J174392P54912K58940O67297L32970
8800C3807038j40388p19972j209128j569991n56235j473115j468585q56346p29278
$$ plain form
8791 25084000 23930544 22922613 21257432 20925932 21392583 21634714 20881854 21037984 21241849
8782 21241849 21926668 21433362 21022508 20268678 18852207 17834946 16917695 15479574 14284134
8773 14284134 13850116 12864159 12679997 11758710 11667035 11366340 11082593 11688878 11780815 10591387
8763 10591387 10202111 9649570 9162196 9260533 9004238 8558872 8705800 8418372 7964715 7765312
8753 7765312 7646216 7396030 7344197 7446379 7331809 6739549 7030106 7009859 7553905 7676088
8743 7676088 7450837 6316584 6921683 6720483 7369743 7099383 6356359 5955994 5944968 6898659
8733 6898659 6635489 6412086 6973546 7121326 7011922 6894662 6510004 6805560 7218193 7183431
8723 7183431 6764860 5932245 6186757 5873129 5535724 5688452 5465402 6050689 6483205 6437493
$$ packed form
8791B5084000j153456j007931j665181l31500M66651K42131p52860J56130K03865
8782B1241849O84819m93306m10854p53830j416471j017261r17251j438121j195440
8773A4284134m34018r85957j84162r21287r1675l00695k83747O06285R1937j189428
8763A0591387l89276n52541m87374R8337k56295m45366J46928k87428m53657j99403
8753G765312j19096k50186n1833J02182j14570n92260K90557k0247N44046J22183
8743G676088k25251j134253O05099k01200O49260k70360p43024m00365j1026R53691
8733F898659k63170k23403N61460J47780j09404j17260l84658K95556M12633l4762
8723G183431m18571q32615K54512l13628l37405J52728k23050N85287M32516m5712
$$ plain form
8713 6437493 7154405 6784532 6676966 6405375 5708287 6358910 6120902 5861318 5990661 6259823
8703 6259823 5888806 5973883 6019316 6464620 6059591 6116985 6436670 5793607 6017740 6319884
8693 6319884 6467315 6732355 6098376 6391669 6029440 6216325 6724961 6658499 6340928 6990545
8683 6990545 6782987 6211633 5983830 5937944 6629711 6599088 6395032 6615403 6078285 5608696
8673 5608696 6542539 6453419 6329319 5919903 5122422 5520776 5753196 5512402 6214027 6164317
8663 6164317 6021276 6170523 6721316 6376675 6538149 6452186 6685568 6853457 6648928 6967441
8653 6967441 7079852 6554380 6163679 6486839 6390712 5790343 6312638 6954700 6204228 6500696
8643 6500696 7131206 7080977 6766293 6462149 6252037 6870508 7465590 6988241 6367784 6248692
$$ packed form
8713F437493P16912l69873j07566k71591o97088O50623k38008k59584J29343K69162
8703F259823l71017Q5077M5433M45304m05029N7394L19685o43063K24133L02144
8693F319884J47431K65040o33979K93293l62229J86885N08636o6462l17571O49617
8683F990545k07558n71354k27803m5886O91767l0623k04056K20371n37118m69589
8673E608696R33843q9120j24100m09416p97481L98354K32420k40794P01625m9710
8663F164317j43041J49247N50793l44641J61474q5963K33382J67889k04529L18513
8653F967441J12411n25472l90701L23160r6127o00369N22295O42062p50472K96468
8643F500696O30510n0229l14684l04144k10112O18471N95082m77349o20457j19092
$$ plain form
8633 6248692 6044114 5987572 5733877 5931284 6034560 6072329 6758977 7024016 6310271 6801462
8623 6801462 6382811 6408344 6410465 6380579 6496737 6317406 6403337 6467192 6339009 6197351 6746450
8612 6746450 6899815 7259356 6742794 6662912 6646106 6037382 6316510 6018566 6354938 7460218
8602 7460218 6677254 6589594 6673848 6976941 7677935 7336446 7677977 6429817 6232094 7030400
8592 7030400 7256099 6439215 5855054 6504097 6123848 6704071 6838143 6521684 6676958 7250308
8582 7250308 7692769 6605031 6351797 5969560 6848394 7240427 6977523 6896799 6707037 6724771
8572 6724771 6833206 6907505 7123034 6859366 7466734 7306409 6579387 6887799 6766690 6700947
8562 6700947 6403752 7017202 6928553 6851030 7137085 7597804 6894848 6247864 6746702 6868799
$$ packed form
8633F248692k04578n6542k53695J97407J03276L7769O86648K65039p13745M91191
8623F801462m18651K5533K121k9886J16158j79331Q5931O3855j28183j41658N49099
8612F746450J53365L59541n16562p9882j6806o08724K79128k97944L36372J105280
8602G460218p82964q7660Q4254L03093P00994l41489L41531j248160j97723P98306
8592G030400K25699q16884n84161O49043l80249N80223J34072l16459J55274N73350
8582G250308M42461j087738k53234l82237Q78834L92033k62904q0724j89762J7734
8572F724771J08435P4299K15529k63668O07368j60325p27022L08412j21109o5743
8562F700947k97195O13450q8649p7523K86055M60719p02956o46984M98838J22097
$$ plain form
8552 6868799 7361003 6897319 7034095 7461099 7307428 7908226 7900646 7608262 7403896 7439916
8542 7439916 7473040 7837969 7790471 7579496 7448858 7427901 7826507 8004800 7892166 7271206
8532 7271206 7201806 7657420 7752500 7889833 7150594 7579666 7923803 8160708 8101740 7487646
8522 7487646 7656204 7887545 7181141 7484712 7979142 8396591 8520270 8321093 7841152 7804023
8512 7804023 8206354 8108159 8198118 8540553 8373224 8263753 8080762 7885347 7747750 7989750
8502 7989750 7969869 7427896 7748871 8046505 7912341 7863269 8417429 8065028 8835614 9584632
8492 9584632 9091673 8805834 8631665 9094816 8434416 8521877 8638654 8902136 8343520 8178964
8482 8178964 8534048 7954889 8990031 9038450 8830350 9841050 9333989 8722216 8836485
$$ packed form
8552F868799M92204m63684J36776M27004j53671O00798p580k92384k04366L6020
8542G439916L3124L64929m7498k10975j30638k0957L98606J78293j12634o20960
8532G271206o9400M55614R5080J37333p39239M29072L44137K36905n8968o14094
8522G487646J68558K31341p06404L03571M94430M17449J23679j99177m79941l7129
8512G804023M02331r8195Q9959L42435j67329j09471j82991j95415j37597K42000
8502G989750j9881n41973L20975K97634j34164m9072N54160l52401P70586P49018
8492I584632m92959k85839j74169M63151o60400Q7461J16777K63482n58616j64556
8482H178964L55084n79159J035142M8419k08100J010700n07061o11773J14269
$$ plain form
8473 8836485 9033161 8913237 8915933 8955884 8923242 9710990 9852845 9807508 9651216 9024791
8463 9024791 8967362 9278372 9163567 9353134 9404496 9428151 9619225 10078039 9703233 9851799
8453 9851799 9782097 9990336 9946514 9483334 9835142 10097574 10561279 9979105 10302344 10502489
8443 10502489 10367839 10193741 10684039 11276613 10463835 10204279 10234474 10120935 9755285 9535354
8433 9535354 10014515 11239080 11147441 10169403 10229456 10458216 10690246 10927323 11021323 10806805
8423 10806805 10895833 11154827 10871024 11350810 11790031 11278936 10992622 10634365 10352480 11692615
8413 11692615 11610592 11177609 11682427 11654881 10859471 11448914 11943531 11509795 11696586 12654988
8403 12654988 12799307 12773825 12458270 12119127 11848829 11750180 12224015 12577723 12914382 12608230
$$ packed form
8473H836485J96676j19924K696L9951l2642P87748J41855m5337j56292o26425
8463I024791n7429L11010j14805J89567N1362K3655J91074M58814l74806J48566
8453I851799o9702K08239m3822m63180L51808K62432M63705n82174L23239K00145
8443A0502489j34650j74098M90298N92574q12778k59556L0195j13539l65650k19931
8433I535354M79161J224565r1639r78038O0053K28760K32030K37077R4000k14518
8423A0806805Q9028K58994k83803M79786M39221n11095k86314l58257k81885J340135
8413A1692615q2023m32983N04818k7546p95410N89443M94617m33736J86791R58402
8403A2654988J44319k5482l15555l39143k70298r8649M73835L53708L36659l06152
$$ plain form
8393 12608230 12203888 12566455 12610461 12553618 12398441 12552319 12696012 12444455 12551713 13362815
8383 13362815 13434981 13029851 13308457 13045344 12913128 13624696 13549733 13119510 13257094 13622109
8373 13622109 13757959 14273292 14185781 14067875 13482908 13545249 14469775 14449194 15118459 15303417
8363 15303417 14428647 14340569 14328327 14727650 15344746 14960124 15426822 15613287 15257764 15000399
8353 15000399 16254250 16540878 16408178 16357763 16192125 16274423 16674280 16651469 16510670 17228511
8343 17228511 16852251 16746860 17582890 17840980 17877998 18008075 18356197 18535940 18001992 18247087
8333 18247087 18204655 18808137 19874666 19662587 19605842 18941121 19108433 20337101 20638474
8324 20638474 19676444 20345496 20723989 20919256 21434696 21711703 21679228 22207184 22555652 23468456
$$ packed form
8393A2608230m04342L62567M4006n6843j55177J53878J43693k51557J07258Q11102
8383A3362815P2166m05130K78606k63113j32216P11568p4963m30223J37584L65015
8373A3622109J35850N15333q7511j17906n84967O2341R24526k0581O69265J84958
8363A5303417q74770q8078j2242L99323O17096l84622M66698J86465l55523k57365
8353A5000399J253851K86628j32700n0415j65638Q2298L99857k2811j40799P17841
8343A7228511l76260j05391Q36030K58090L7018J30077L48122J79743n33948K45095
8333A8247087m2432O03482J066529k12079n6745o64721J67312J228668L01373
8324B0638474r62030O69052L78493J95267N15440K77007l2475N27956L48468R12804
$$ plain form
8314 23468456 23421132 22626949 22841908 23101064 23310642 23947187 25188175 25309571 25571749
8305 25571749 25691124 25495154 25066055 24933291 26032153 26321184 26369123 27258873 27784810
8296 27784810 27606259 27215867 27982042 29261430 29253558 28903458 29460433 30493697 30551711 30333682
8286 30333682 30843323 31361029 32886378 33669678 33007325 33704263 34293203 34511336 34668538
8277 34668538 35444070 35934892 36394529 36295644 36029484 36987416 37679619 37999039 38438148 39278140
8267 39278140 40113311 41427313 41424513 40914869 41342050 42046192 42961785 43588253 44224365 44018265
8257 44018265 44120824 45216657 46066246 46681955 46879744 47308133 48234210 49162583 49585249
8248 49585249 50984889 51372449 51820210 53241760 53552281 54016023 54781718 55472369 56946538
$$ packed form
8314B3468456m7324p94183K14959K59156K09578O36545J240988J21396K62178
8305B5571749J19375j95970m29099j32764J098862K89031M7939Q89750N25937
8296B7784810j78551l90392P66175J279388p872l50100N56975J033264N8014k18029
8286C0333682N09641N17706J525349P83300o62353O96938N88940K18133J57202
8277C4668538P75532M90822M59637r8885k66160R57932O92203L19420M39109Q39992
8267C9278140Q35171J314002k800n09644M27181P04142R15593O26468O36112k06100
8257D4018265J02559J095833Q49589O15709J97789M28389R26077R28373M22666
8248D9585249J399640L87560M47761J421550L10521M63742P65695O90651J474169
$$ plain form
8239 56946538 57706819 58886328 59935333 60955741 61942430 62781635 63778601 64194313 65618434
8230 65618434 66726369 67864811 68062937 68675701 69805373 70836804 72007393 73248127
8222 73248127 74007930 74852302 75938794 77324628 77595159 77779495 78463980 79036591 80467318
8213 80467318 81451733 82840156 83522040 83881074 83618409 84585526 85301460 85854243 86129749
8204 86129749 86241260 86555574 87454045 86971872 86900615 85985946 86487634 85971471 85884590 84167772
8194 84167772 83722462 79220829 82303064 90047372 86825559 85862202 85686627 85599739 84080213
8185 84080213 83745698 82249152 82244701 81916527 81685743 80716829 81084081 80592963 78920069
8176 78920069 78332914 78546464 78262614 77942834 77497357 76808562 76824007 76768718 76301051 76149874
$$ packed form
8239E6946538P60281J179509J049005J020408R86689Q39205R96966M15712J424121
8230F5618434J107935J138442J98126O12764J129672J031431J170589J240734
8222G3248127P59803Q44372J086492J385834K70531J84336O84485N72611J430727
8213H0467318R84415J388423O81884L59034k62665R67117P15934N52783K75506
8204H6129749J11511L14314Q98471m82173p1257r14669N01688n16163q6881j716818
8194H4167772m45310m501633L082235P744308l221813r63357j75575q6888j519526
8185H4080213l34515j496546m451l28174k30784r68914L67252m91118j672894
8176G8920069n87155K13550k83850l19780m45477o88795J5445n5289m67667j51177
$$ plain form
8166 76149874 76169872 75962435 75648259 75590442 75406234 74857798 74817237 75133103 75058453 74511309
8156 74511309 74378906 74523047 74176441 74031537 73946796 74066561 74207921 73162827 72917253
8147 72917253 72588625 72623082 72440713 72570371 71870804 72061770 72238249 72284111 72420698 72399445
8137 72399445 71512880 71988651 71924846 72712311 72449236 71439518 71847470 72241614 72334749 72154257
8127 72154257 72694179 72459856 72335417 72183594 71684780 71641480 72338965 72395670 72280054 72641463
8117 72641463 72778226 72847162 72796522 72650435 72627233 72964419 73121830 72851878 72473591 73071542
8107 73071542 73491620 73287551 73960122 74194881 74155702 73751966 74146198 74983339 75357396 75296960
8097 75296960 75098197 74671331 75060834 75403330 75271673 75579949 75885338 76033144 75810172
$$ packed form
8166G6149874J9998k07437l14176n7817j84208n48436m0561L15866p4650n47144
8156G4511309j32403J44141l46606j44904q4741J19765J41360j045094k45574
8147G2917253l28628L4457j82369J29658o99567J90966J76479M5862J36587k1253
8137G2399445q86565M75771o3805P87465k63075j009718M07952L94144R3135j80492
8127G2154257N39922k34323j24439j51823m98814m3300O97485N6705j15616L61409
8117G2641463J36763O8936n0640j46087k3202L37186J57411k69952l78287N97951
8107G3071542M20078k04069O72571K34759l9179m03736L94232Q37141L74057o0436
8097G5296960j98763m26866L89503L42496j31657L08276L05389J47806k22972
$$ plain form
8088 75810172 75840522 76061939 76169866 76743146 77118230 77217030 77063565 77030442 76873262 77681033
8078 77681033 77388553 77914131 77746669 78104279 78800725 79052416 78781558 78576736 79045718
8069 79045718 79075228 78969823 79544848 79312605 79701934 80287775 79909587 79646066 79878769 79636031
8059 79636031 79539036 80152678 80554141 80202870 80066877 80011875 80435394 80737156 80568525 80903546
8049 80903546 81113373 81131973 80934381 81037872 81536665 81630852 81957787 82249104 82027998 82669227
8039 82669227 82917732 82572921 82491120 82268578 82528747 82467584 82069835 82298361 83083034 82811877
8029 82811877 82212300 82852702 82507743 82753124 82974903 83161781 82687201 82837596 82828166 82625382
8019 82625382 82752723 83209508 83301443 83031266 82184787 82408953 82190913 81952433 82085947 82243983
$$ packed form
8088G5810172L0350K21417J07927N73280L75084R8800j53465l3123j57180Q07771
8078G7681033k92480N25578j67462L57610O96446K51691k70858k04822M68982
8069G9045718K9510j05405N75025k32243L89329N85841l78188k63521K32703k42738
8059G9636031r6995O13642M01463l51271j35993n5002M23519L01762j68631L35021
8049H0903546K09827J8600j97592J03491M98793R4187L26935K91317k21106O41229
8039H2669227K48505l44811q1801k22542K60169o1163l97749K28526P84673k71157
8029H2811877n99577O40402l44959K45381K21779J86878m74580J50395r430k02784
8019H2625382J27341M56785R1935k70177q46479K24166k18040k38480J33514J58036
$$ plain form
8009 82243983 81997767 81915371 81660468 82152627 82432354 82230833 82194757 82127037 82524042 82239218
7999 82239218 81660615 81986351 82247160 82406942 82374835 82513947 82357287 82331835 81909415 82053885
7989 82053885 82267739 82223438 82024479 82443997 82080393 81710036 81926487 81878817 82254494 81445859
7979 81445859 81383521 82605032 83306543 83492713 83542915 83400459 82825320 82589258 82458254 82786498
7969 82786498 82542814 82199374 82873197 82803165 82606219 82707032 83275829 83300912 83184234 82636055
7959 82636055 82891547 82778755 83106777 82797016 82223111 82015967 82526827 82880171 82838436 82903146
7949 82903146 83343619 82967738 82513168 82951219 82670546 83352366 83283583 82816308 82202626 82386525
7939 82386525 82749310 83489116 83321009 82917491 82623678 82474789 83174229 82766691 82825888 82939460
$$ packed form
8009H2243983k46216q2396k54903M92159K79727k01521l6076o7720L97005k84824
7999H2239218n78603L25736K60809J59782l2107J39112j56660k5452m22420J44470
7989H2053885K13854m4301j98959M19518l63604l70357K16451m7670L75677q08635
7979H1445859o2338J221511P01511J86170N0202j42456n75139k36062j31004L28244
7969H2786498k43684l43440O73823p0032j96946J00813N68797K5083j16678n48179
7959H2636055K55492j12792L28022l09761n73905k07144N10860L53344m1735O4710
7949H2903146M40473l75881m54570M38051k80673O81820o8783m67275o13682J83899
7939H2386525L62785P39806j68107m03518k93813j48889O99440m07538N9197J13572
$$ plain form
7929 82939460 83013091 82788011 82382434 82541438 82809047 83138833 83919313 84068817 83492827 83295768
7919 83295768 83678717 84117261 84394024 84601949 84142727 84540189 85546541 85191215 85834149
7910 85834149 86214406 86981528 86677190 86734496 87360453 87685555 88200999 88762195 89363220 90168028
7900 90168028 90204031 91195422 91781659 91647893 92055388 92335758 92244793 92363149 93083152 93205588
7890 93205588 93567630 93373810 93360569 93499310 93862437 94063821 93833515 94335784 94495364 94918984
7880 94918984 95185343 94542643 94292266 94629119 94154283 93762171 94323956 94440036 95030534
7871 95030534 95053270 94887317 94880638 94435039 94964037 94519691 94484107 94481623 93721713 94230374
7861 94230374 94188957 93995052 93959179 94230444 94054427 93712336 94878062 94671897 94266876 94531602
$$ packed form
7929H2939460P3631k25080m05577J59004K67609L29786P80480J49504n75990j97059
7919H3295768L82949M38544K76763K07925m59222L97462J006352l55326O42934
7910H5834149L80257P67122l04338N7306O25957L25102N15444N61196O01025Q04808
7900I0168028L6003R91391N86237j33766M07495K80370r0965J18356P20003J22436
7890I3205588L62042j93820j3241J38741L63127K01384k30306N02269J59580M23620
7880I4918984K66359o42700k50377L36853m74836l92112N61785J16080N90498
7871I5030534K2736j65953o679m45599N28998m44346l5584k484p59910N08661
7861I4230374m1417j93905l5873K71265j76017l42091J165726k06165m05021K64726
$$ plain form
7851 94531602 95356613 94813353 94489539 94541762 94103317 94443770 94707033 94942633 95451458 95181178
7841 95181178 94594314 94571298 94676198 95446508 96106911 96891803 96590472 96746719 96464088 96638272
7831 96638272 96988319 96962636 97132829 97121204 97391679 97000225 96654245 96863910 97107464 97580364
7821 97580364 97970889 97851119 97370721 97752914 98458937 98462479 97878875 98067391 98627739 98640753
7811 98640753 98153182 98879867 98618816 98817419 99179071 99535670 98818381 98335775 97341618
7802 97341618 97162570 98404225 98382009 98712833 98672735 98897901 99403431 99167119 99303609 99000972
7792 99000972 98646736 98478600 99021606 99258411 98864566 99322235 99707812 99692101 99610078 99798601
7782 99798601 99369318 99492278 99796879 100029559 100632952 100809784 100024397 99369492 99437403 99723773
$$ packed form
7851I4531602Q25011n43260l23814N2223m38445L40453K63263K35600N08825k70280
7841I5181178n86864k3016J04900P70310O60403P84892l01331J56247k82631J74184
7831I6638272L50047k5683J70193j1625K70475l91454l45980K09665K43554M72900
7821I7580364L90525j19770m80398L82193P06023L542n83604J88516N60348J3014
7811I8640753m87571P26685k61051J98603L61652L56599p17289m82606r94157
7802I7341618j79048J241655k2216L30824m0098K25166N05530k36312J36490l02637
7792I9000972l54236j68136N43006K36805l93845M57669L85577j5711q2023J88523
7782I9798601m29283J22960L04601K32680O03393J76832p85387o54905O7911K86370
$$ plain form
7772 99723773 99549067 100143736 100289736 101234245 101467213 101546225 101450548 100891806 101322422 101887851
7762 101887851 102200280 102914002 102909469 102984689 103865826 104327085 104367881 104516250 104595663 104489967
7752 104489967 105470304 105851166 105904742 106316287 106329911 107036582 107316804 107790199 108640279 108635813
7742 108635813 108909721 109891439 109939291 109396537 109684090 109907450 110696014 111236663 111911134
7733 111911134 111926801 111141463 110945956 111781587 111731837 112186721 112728910 112764309 112279968 112634599
7723 112634599 113266129 113018112 113579373 113605346 113285186 113086679 112462547 112774796 112762449 112604526
7713 112604526 113137863 112950899 112807809 112842082 113039241 112909857 112814868 113171550 112982112 113038048
7703 113038048 112396381 112553806 113558988 113864633 114601936 114926819 115245711 115575841 116410213
$$ packed form
7772I9723773j74706N94669J46000R44509K32968P9012r5677n58742M30616N65429
7762A01887851L12429P13722m533P5220Q81137M61259M0796J48369P9413j05696
7752A04489967R80337L80862N3576M11545J3624P06671K80222M73395Q50080m466
7742A08635813K73908R81718M7852n42754K87553K23360P88564N40649O74471
7733A11911134J5667p85338j95507Q35631m9750M54884N42189L5399m84341L54631
7723A12634599O31530k48017N61261K5973l20160j98507o24132L12249j2347j57923
7713A12604526N33337j86964j43090L4273J97159j29384r4989L56682j89438N5936
7703A13038048o41667J57425J005182L05645P37303L24883L18892L30130Q34372
$$ plain form
7694 116410213 116694091 116712834 117657639 117854281 117823983 118418280 118793882 119221377 119852169 120618327
7684 120618327 120951845 120512299 121004496 121692434 122355550 122600499 122940108 123973951 124024377
7675 124024377 124930051 125757975 126803450 127484497 128655111 128725772 129793000 131134845 131631444
7666 131631444 132113194 133204052 133719276 134166274 135848881 137030020 137419307 138479193 139646987
7657 139646987 140365336 141223367 141747046 142619009 143728048 143990771 145356915 146816005 147382918
7648 147382918 147627833 148051874 148465549 148968414 149500933 149757335 150726411 151311655 152225924
7639 152225924 153363710 154174228 154746971 155509591 156347511 157385509 158449400 159022699 159680441
7630 159680441 160985334 162361879 162902468 163803858 164446320 165066710 165675772 166546090 167691745
$$ packed form
7694A16410213K83878J8743R44805J96642l0298N94297L75602M27495O30792P66158
7684A20618327L33518m39546M92197O87938O63116K44949L39609J033843N0426
7675A24024377R05674Q27924J045475O81047J170614P0661J067228J341845M96599
7666A31631444M81750J090858N15224M46998J682607J181139L89287J059886J167794
7657A39646987P18349Q58031N23679Q71963J109039K62723J366144J459090N66913
7648A47382918K44915M24041M13675N02865N32519K56402R69076N85244R14269
7639A52225924J137786Q10518N72743P62620Q37920J037998J063891N73299O57742
7630A59680441J304893J376545N40589R01390O42462O20390O09062Q70318J145655
$$ plain form
7621 167691745 168838070 169830535 169757979 170732111 172142344 173151177 173935003 174304301 175366716
7612 175366716 175874674 176649222 177445738 178901729 180052190 181078061 182606826 183198202 184432150
7603 184432150 185356888 186454369 187940778 189197129 190897421 193492577 194142969 195143960
7595 195143960 196825431 198486856 199713753 200717568 203094348 204535865 205866855 207350618
7587 207350618 208943031 211124366 212176355 214479875 216350790 218450976 219993278 222304762
7579 222304762 223817881 225844075 228242748 231590566 234253916 236183195 238041522 240854068
7571 240854068 243764319 246399124 248889832 251760057 254197458 257116349 260421478 263192695
7563 263192695 266316136 269406315 271894555 274578963 277070263 279914702 283191158 284657123
$$ packed form
7621A67691745J146325R92465p2556R74132J410233J008833P83826L69298J062415
7612A75366716N07958P74548P96516J455991J150461J025871J528765N91376J233948
7603A84432150R24738J097481J486409J256351J700292K595156O50392J000991
7595A95143960J681471J661425J226897J003815K376780J441517J330990J483763
7587B07350618J592413K181335J051989K303520J870915K100186J542302K311484
7579B22304762J513119K026194K398673L347818K663350J929279J858327K812546
7571B40854068K910251K634805K490708K870225K437401K918891L305129K771217
7563B63192695L123441L090179K488240K684408K491300K844439L276456J465965
$$ plain form
7555 284657123 287525343 290471304 293427424 296679700 299620573 302250863 305133958 307983091
7547 307983091 310523324 313748731 317037058 320544677 323844110 327370614 331136878 334164760
7539 334164760 338046935 342079849 346319029 350309608 355027022 359578601 364642006 369861461
7531 369861461 375050285 380554870 386658467 392541941 399524238 405362661 411272362 417488767
7523 417488767 424017676 430259367 437056188 442480184 448076470 453778212 459195548 464071729
7515 464071729 468937855 473224154 476999486 480167775 482875048 486355194 488165455 490362073
7507 490362073 492509312 494492338 495443878 496149031 497098769 497984876 498313210 499327207 499982656
7498 499982656 500136504 499629908 498576092 497673210 496109636 493680795 489941597 485921304
$$ packed form
7555B84657123K868220K945961K956120L252276K940873K630290K883095K849133
7547C07983091K540233L225407L288327L507619L299433L526504L766264L027882
7539C34164760L882175M032914M239180L990579M717414M551579N063405N219455
7531C69861461N188824N504585O103597N883474O982297N838423N909701O216405
7523D17488767O528909O241691O796821N423996N596286N701742N417336M876181
7515D64071729M866126M286299L775332L168289K707273L480146J810261K196618
7507D90362073K147239J983026R51540P05153R49738Q86107L28334J013997O55449
7498D99982656J53848n06596j053816r02882j563574k428841l739198m020293
$$ plain form
7490 485921304 480366963 473614581 465843666 456891142 447263104 436389673 424479589 411355979
7482 411355979 398348595 384613668 371060322 358329951 345009942 331700680 318661215
7475 318661215 306276605 294026269 281948393 271414314 260235966 248975956 239010300
7468 239010300 229377266 220388976 212081541 204232972 197209434 190203694 183383847 176825765
7460 176825765 170251199 164142973 158304793 153413439 148298686 143404420 138592766 134176156
7452 134176156 130100212 126161503 122074871 118242806 114849105 111971987 108877230 105609053
7444 105609053 102810082 100314478 97615563 94424654 91558961 88809035 86965450 84555101
7436 84555101 82114202 79666001 77884816 75505344 73996665 72529348 70899332 68538103
$$ packed form
7490D85921304n554341o752382p770915q952524r628038j0873431j1910084j3123610
7482D11355979j3007384j3734927j3553346j2730371j3320009j3309262j3039465
7475C18661215j2384610j2250336j2077876j0534079j1178348j1260010r965656
7468B39010300r633034q988290q307435p848569p023538p005740o819847o558082
7460A76825765o574566o108226n838180m891354n114753m894266m811654m416610
7452A34176156m075944l938709m086632l832065l393701k877118l094757l268177
7444A05609053k798971k495604k698915l190909k865693k749926j843585k410349
7436H4555101k440899k448201j781185k379472j508679j467317j630016k361229
$$ plain form
7428 68538103 66841858 65396011 63166587 62371221 61007344 59498094 58039274 56223659
7420 56223659 54970028 53984276 52536322 51901415 50853050 49611840 48550397 47278486
7412 47278486 46385343 45997211 44627358 43788521 43177698 42186086 41036059 40122965 39786462
7403 39786462 39686782 38499933 37516577 36435440 35448608 35137502 34840614 33621054 32746792
7394 32746792 32678987 31902483 31532200 31094537 30879523 30273248 30277356 29651093 28779932 28395260
7384 28395260 28039332 27127938 26514541 26624470 25540456 24754169 24111946 23494940 23984544
7375 23984544 23063818 23051084 22912442 23163075 22802197 21547912 21284374 21172006 21477964
7366 21477964 20630973 20223630 19402815 18756511 18575051 18548254 18390196 17541166 17185436 17228198
$$ packed form
7428F8538103j696245j445847k229424p95366j363877j509250j458820j815615
7420E6223659j253631r85752j447954o34907j048365j241210j061443j271911
7412D7278486q93143l88132j369853q38837o10823r91612j150027r13094l36503
7403C9786462r9680j186849r83356j081137r86832l11106k96888j219560q74262
7394C2746792o7805p76504l70283m37663k15014o06275M108o26263q71161l84672
7384B8395260l55928r11394o13397J09929j084014p86287o42223o17006M89604
7375B3984544r20726j2734j38642K50633l60878j254285k63538j12368L05958
7366B1477964q46991m07343q20815o46304j81460k6797j58058q49030l55730M2762
$$ plain form
7356 17228198 16512458 16330021 16454602 16498246 15974978 16033062 15908242 15495922 15306969 15581809
7346 15581809 15685055 15018604 15075578 14633625 14291089 13842336 13814443 13458906 13315589 13257016
7336 13257016 13753180 13266242 12220262 12766825 12107573 11629791 11838597 11760674 12386619
7327 12386619 12359595 12205999 11240231 10940413 10865681 10679315 11044690 10479273 10469959 10607064
7317 10607064 10164209 10262907 11050838 10422907 9976877 10914116 10696056 10184925 9684166 9165903
7307 9165903 9301284 8784546 8822607 8719819 8545514 8199632 8103418 8310675 7707773 7884976
7297 7884976 7910455 8274813 8121845 7571843 7798715 6860503 6775279 7334737 7202111 7468465
7287 7468465 6547221 6292817 6521114 6737997 6654792 6372759 6085474 5866071 6611115 6670163
$$ packed form
7356A7228198p15740j82437J24581M3644n23268N8084j24820m12320j88953K74840
7346A5581809J03246o66451N6974m41953l42536m48753k7893l55537j43317n8573
7336A3257016M96164m86938j045980N46563o59252m77782K08806p7923O25945
7327A2386619k7024j53596r65768k99818p4732j86366L65375n65417r314J37105
7317A0607064m42855R8698P87931o27931m46030R37239k18060n11131n00759n18263
7307I165903J35381n16738L8061j02788j74305l45882r6214K07257o02902J77203
7297G884976K5479L64358j52968n50002K26872r38212q5224N59458j32626K66354
7287G468465r21244k54404K28297K16883q3205k82033k87285k19403P45044N9048
$$ plain form
7277 6670163 6353879 6543243 6720650 6585844 5878851 5526253 5282359 5239017 5123556 4282875
7267 4282875 4608482 5552492 4895078 5146913 5305108 5053499 5329518 4660573 4457519 4107186
7257 4107186 4645358 4758147 4040237 3865078 4024334 4070303 3877901 3926965 4328285 4028936
7247 4028936 4093366 3913627 3815921 3814765 4511225 4182824 3430871 3505784 3717414 3494282
7237 3494282 3576282 3638908 3379829 3378481 3643462 3430339 3611629 3641652 2822723 3133518
7227 3133518 2727249 2281612 2039897 2344272 2616207 2900566 3024589 2601242 2328238 2417376
7217 2417376 2180054 2082202 2236493 2540700 2810467 2607661 2599713 2542720 2472880 2758624
7207 2758624 3008046 2452197 2480609 2701289 3384803 3455878 2652322 2211970 1839096 1988773
$$ packed form
7277F670163l16284J89364J77407j34806p06993l52598k43894m3342j15461q40681
7267D282875L25607R44010o57414K51835J58195k51609K76019o68945k03054l50333
7257D107186N38172J12789p17910j75159J59256M5969j92402M9064M01320k99349
7247D028936O4430j79739r7706j156O96460l28401p51953P4913K11630k23132
7237C494282Q2000O2626k59079j348K64981k13123J81290L0023q18929L10795
7227C133518m06269m45637k41715L04375K71935K84359J24023m23347k73004Q9138
7217B417376k37322r7852J54291L04207K69767k02806p948n6993o9840K85744
7207B758624K49422n55849K8412K20680O83514P1075q03556m40352l72874J49677
$$ plain form
7197 1988773 2384643 2336667 2252857 1888296 1422739 2139289 2536804 2246497 2251354 2025401
7187 2025401 1727079 1712308 1551209 1241274 1560915 2104340 1795865 1366194 1432353 1507301
7177 1507301 1225994 1366820 1977049 1429647 1058739 1381785 1121148 1959375 2331219 1511148
7167 1511148 1570409 780062 505113 220146 527849 709140 726581 1280275 1403343 1031755
7157 1031755 937870 1122347 663023 917796 1467304 1226579 1053299 726851 504535 1200867
7147 1200867 1175730 749846 523147 922291 1194104 1054568 595067 831769 473276 483578
7137 483578 1160746 1347897 991598 873876 867627 1502146 724510 868116 741525 1091339
7127 1091339 1293609 1136849 593963 432173 620374 -29580 13198 141860 141399 580582
$$ packed form
7197A988773L95870m7976q3810l64561m65557P16550L97515k90307M857k25953
7187B025401k98322j4771j61099l09935L19641N43425l08475m29671O6159P4948
7177A507301k81307J40826O10229n47402l70908L23046k60637Q38227L71844q20071
7167A511148N9261p90347k74949k84967L07703J81291J7441N53694J23068l71588
7157A031755r3885J84477m59324K54773N49508k40725j73280l26448k22316O96332
7147A200867k5137m25884k26699L99144K71813j39536m59501K36702l58493J0302
7137D83578O77168J87151l56299j17722o249O34519p77636J43606j26591L49814
7127A091339K02270j56760n42886j61790J88201o49954M2778J28662m61M39183
$$ plain form
7117 580582 1043604 1092819 1230457 912137 600500 74206 664400 862708 1008466 845957
7107 845957 1088632 560328 254592 985228 1193649 874220 456247 578559 128781 -334173
7097 -334173 -280882 -444404 495057 324915 -73913 506568 558644 551601 488854 748420 2746
7086 2746 -326680 192426 150211 175936 -456502 -515565 312673 810255 614607 701938 449661
7075 449661 -64092 572095 336115 775625 334989 311621 253603 -242510 -58669 243441
7065 243441 301897 -337035 4001 -109922 221524 312272 -2815 -307727 -964497 -832195
7055 -832195 -11285 404343 -45126 -192761 45852 -324561 -556509 -111587 2049 -184751
7045 -184751 -364254 -753308 -431838 561172 560502 692773 229967 -568713 -1036780 -673724
$$ packed form
7117E80582M63022M9215J37638l18320l11637n26294N90194J98308J45758j62509
7107H45957K42675n28304l05736P30636K08421l19429m17973J22312m49778m62954
7097c34173N3291j63522R39461j70142l98828N80481N2076p043o2747K59566p45674
7086B746l29426N19106m2215K5725o32438n9063Q28238M97582j95648Q7331k52277
7075D49661n13753O36187k35980M39510m40636k3368n8018m96113J83841L02110
7065B43441N8456o38932L41036j13923L31446R0748l15087l04912o56770J32302
7055h32195Q20910M15628m49469j47635K38613l70413k31948M44922J13636j86800
7045a84751j79503l89054L21470R93010o70J32271m62806p98680m68067L63056
$$ plain form
7035 -673724 -52364 -432272 -649465 -635932 -62193 -873559 -1092518 -817381 -137197 -514824
7025 -514824 -233033 -235398 -621684 -578287 -318213 -562841 -1137170 -1113177 -1239554 -854940
7015 -854940 -789345 -683243 -396347 -559890 -1055505 -1193969 -1053004 -1021660 -634824 64448
7005 64448 446696 -397762 -690463 -450981 -346880 -326407 -322340 -831106 -782775 -699188 -297865
6994 -297865 -140591 -992932 -649232 -771458 -539596 -276186 405513 250023 258655 152734
6984 152734 172350 678928 25787 -922384 -235635 15574 -47683 -202387 182139 -491681
6974 -491681 -682640 -681127 -819748 -672829 -686907 -924326 -595849 68836 -641301 -663872
6964 -663872 -166557 118901 -50031 216681 -606475 -888672 -153367 -181969 -246476 -729251
$$ packed form
7035f73724O21360l79908k17193J3533N73739q11366k18959K75137O80184l77627
7025e14824K81791k365l86286M3397K60074k44628n74329K3993j26377L84614
7015h54940O5595J06102K86896j63543m95615j38464J40965L1344L86836O99272
7005F4448L82248q44458k92701K39482J04101K0473M067n08766M8331Q3587M01323
6994b97865J57274q52341L43700j22226K31862K63410O81699j55490Q632j05921
6984A52734J9616N06578o53141r48171O86749K51209o3257j54704L84526o73820
6974d91681j90959J513j38621J46919j4078k37419L28477O64685p10137k2571
6964f63872M97315K85458j68932K66712q23156k82197P35305k8602o4507m82775
$$ plain form
6954 -729251 -174797 -36116 -666820 -240144 -715991 -284000 -550959 -538812 -908538 -577144
6944 -577144 -1045141 -1235200 -522946 -694017 -759988 -962440 -682729 -139873 -493077 -244195
6934 -244195 -211915 -442752 -670929 -534748 171970 -14531 -15334 -304645 -561232 -1322470
6924 -1322470 -450420 -178831 -754330 -524663 -945434 -1252962 -845588 -994025 -1045169 -693818
6914 -693818 -574810 -589591 123555 -386151 -818702 -463077 -96538 320751 -212029 -427987
6904 -427987 -696952 -1295221 -1066817 -533483 -707675 -1106248 -751968 -1102053 -555021 -360077
6894 -360077 -388650 -631036 -182582 -962763 -1639349 -707031 -572066 -717793 -956619 -584967
6884 -584967 -610857 -285316 83316 -680024 -1042205 -1443673 -1168612 -1059757 -891766 -593335
$$ packed form
6954g29251N54454J38681o30704M26676m75847M31991k66959J2147l69726L31394
6944e77144m67997j90059P12254j71071o5971k02452K79711N42856l53204K48882
6934b44195L2280k30837k28177J36181P06718j86501q03k89311k56587p61238
6924a322470Q72050K71589n75499K29667m20771l07528M07374j48437n1144L51351
6914f93818J19008j4781P13146n09706m32551L55625L66539M17289n32780k15958
6904d27987k68965n98269K28404N33334j74192l98573L54280l50085N47032J94944
6894c60077k8573k42386M48454p80181o76586R32318J34965j45727k38826L71652
6884e84967k5890L25541L68632p63340l62181m01468K75061J08855J67991K98431
$$ plain form
6874 -593335 -559234 -883753 -1217384 -774298 -345152 -81406 -653305 -548926 -1115878 -781162
6864 -781162 -684134 -30936 47546 -150342 18573 -670330 -1148876 -1165458 -908553 -647750
6854 -647750 -896211 -856408 -761495 199043 176089 -311475 -586175 -588464 -1300861 -1168529 -556077
6843 -556077 -645146 -228214 -690496 -511054 -404669 -644498 -364900 305263 148164 136961
6833 136961 -593020 -909413 -961765 -1070808 -790572 -824933 -589827 -366361 -1225192 -1345849
6823 -1345849 -727182 -707760 -1050062 -701359 -169842 -682764 -866860 -645226 -654158 -1220290
6813 -1220290 -1465195 -784634 -600919 -832941 -623945 -435656 -623808 -628993 -436786 -592136
6803 -592136 -767518 243034 573615 -136805 -373822 -427714 -287754 -517211 -560073 -177034
$$ packed form
6874e93335L4101l24519l33631M43086M29146K63746n71899J04379n66952L34716
6864g81162R7028O53198P8482j97888J68915o88903m78546j6582K56905K60803
6854f47750k48461L9803R4913R60538k2954m87564k74700k289p12397J32332O12452
6843e56077q9069M16932m62282J79442J06385k39829K79598O70163j57099j1203
6833A36961p29981l16393n2352j09043K80236l4361K35106K23466q58831j20657
6823a345849O18667J9422l42302L48703N31517n12922j84096K21634q932n66132
6813a220290k44905O80561J83715k32022K08996J88289j88152n185J92207j55350
6803e92136j75382J010552L30581p10420k37017n3892J39960k29457m2862L83039
$$ plain form
6793 -177034 -710536 -992604 -412324 -267109 -630610 -740781 -943763 -1285788 -1036647 -890343
6783 -890343 -1024049 -872721 -950005 -1262608 -783608 -203514 -441313 -386530 -542182 -1005722
6773 -1005722 -891106 -1257795 -497277 -772184 -1044713 -1212287 -1535484 -1000893 -995857 -748009
6763 -748009 -563706 -1176847 -1520563 -1373855 -956794 -1001268 -1199817 -602375 -1125548 -1127835
6753 -1127835 -1481779 -1552813 -539884 -358589 77532 -247498 -426190 -1091117 -1264466 -119312
6743 -119312 -522539 -580964 -1024141 -978568 -1213336 -1117256 -693941 -980805 -857648 -1018266
6733 -1018266 -721804 -580116 -576898 -521474 57710 -325743 -170897 -420065 -209394 -394765
6723 -394765 -1090932 -996535 -855364 -892774 -889030 -1323724 -1466932 -655609 -804697 -1277716
$$ packed form
6793a77034n33502k82068N80280J45215l63501j10171k02982l42025K49141J46304
6783h90343j33706J51328p7284l12603M79000N80094k37799N4783j55652m63540
6773a005722J14616l66689P60518k74907k72529j67574l23197N34591N036K47848
6763g48009J84303o13141l43716J46708M17061m4474j98549N97442n23173k287
6753a127835l53944p1034J012929J81295M36121l25030j78692o64927j73349J145154
6743a19312m03227n8425m43177M5573k34768R6080M23315k86864J23157j60618
6733a018266K96462J41688L218N5424N79184l83453J54846k49168K10671j85371
6723c94765o96167R4397J41171l7410L744m34694j43208Q11323j49088m73019
$$ plain form
6713 -1277716 -944177 -610306 -386047 -687503 -1101376 -642367 -371709 -602514 -1355665 -1421224
6703 -1421224 -719717 -433061 -1278288 -1380553 -923099 -790445 -846669 -96578 -535550 -1088377
6693 -1088377 -947214 -506335 -538990 -818165 -638717 -754145 -1272725 -1087450 -653057 -1129389
6683 -1129389 -1596509 -1067967 -380752 -251259 -652774 -1101024 -1305100 -904807 -904599 -1499233
6673 -1499233 -1167656 -262440 -27885 -6047 -286628 -472102 -291814 -461504 -562582 -673156
6663 -673156 -272169 287414 552055 -202617 -106240 -284626 -556182 -418599 -800985 -171962
6653 -171962 -158742 -126023 160594 -60996 132009 446701 -193137 -119100 -665532 -794025
6643 -794025 160650 -99528 -142332 -399214 -310685 -540487 -476843 129392 -164170 188619
$$ packed form
6713a277716L33539L33871K24259l01456m13873M59009K70658k30805p53151o5559
6703a421224P01507K86656q45227j02265M57454J32654n6224P50091m38972n52827
6693a088377J41163M40879l2655k79175J79448j15428n18580J85275M34393m76332
6683a129389m67120N28542O87215J29493m01515m48250k04076M00293K08n94634
6673a499233L31577R05216K34555K1838k80581j85474J80288j69690j01078j10574
6663f73156M00987N59583K64641p54672R6377j78386k71556J37583l82386O29023
6653a71962J3220L2719K86617k21590J93005L14692o39838P4037n46432j28493
6643g94025R54675k60178m2804k56882Q8529k29802O3644O06235k93562L52789
$$ plain form
6633 188619 199276 -183757 -374117 -623105 -79791 330128 350928 302590 183136 240962
6623 240962 930574 217167 -184094 49921 334589 -22252 -191367 214228 -75448 702
6613 702 316747 241560 313877 363253 -455847 -551902 541343 1161126 1178045 820908 1029387
6602 1029387 778235 387785 954054 747595 379726 -138629 265767 698135 620755 569130
6592 569130 218882 472047 633028 661064 456466 -444763 -539280 -534972 -531833 92214 465193
6581 465193 183260 22538 -157637 -458435 -534581 197183 1037521 485168 -149208 -145772
6571 -145772 198421 240520 749232 75496 585439 609722 163012 679297 1128717 841660
6561 841660 -375022 81884 -111914 -215811 -391040 -254003 346637 344796 -159850 -53131
$$ packed form
6633A88619J0657l83033j90360k48988N43314M09919K0800m8338j19454N7826
6623B40962O89612p13407m01261K34015K84668l56841j69115M05595k89676P6150
6613G02L16045p5187P2317M9376q19100r6055J093245O19783J6919l57137K08479
6602A029387k51152l90450N66269k06459l67869n18355M04396M32368p7380n1625
6592E69130l50248K53165J60981K8036k04598r01229r4517M308L139O24047L72979
6581D65193k81933j60722j80175l00798p6146P31764Q40338n52353o34376L436
6571a45772L44193M2099N08712o73736N09943K4283m46710N16285M49420k87057
6561H41660j216682M56906j93798j03897j75229J37037O00640j841n04646J06719
$$ plain form
6551 -53131 316732 398650 8422 -215037 -827933 -1571489 -1153007 -487455 -55732 -11441
6541 -11441 82097 -73855 35961 -33717 -883232 -36588 -106128 -467772 -94694 33976
6531 33976 121661 -578263 -435547 -187209 -274044 125596 323079 234911 555338 449817
6521 449817 55640 -78146 128446 -112847 -897044 -572507 -778286 -347508 -600418 -251073
6511 -251073 -72565 -520753 235113 632809 544695 185903 713641 426754 385515 1064538
6501 1064538 220873 -39609 -79320 34294 629749 640533 416718 119207 41158 208942
6491 208942 986528 765984 891758 990075 1248519 1362658 1243464 213776 471792 534705
6481 534705 302382 356488 161919 88262 499221 337620 309906 422872 812075 624472
$$ packed form
6551e3131L69863Q1918l90228k23459o12896p43556M18482O65552M31723M4291
6541a1441R3538j55952J09816o9678q49515Q46644o9540l61644L73078J28670
6531C3976Q7685o99924J42716K48338q6835L99640J97483q8168L20427j05521
6521D49817l94177j33786K06592k41293p84197L24537k05779M30778k52910L49345
6511b51073J78508m48188P55866L97696q8114l58792N27738k86887m1239O79023
6501A064538q43665k60482l9711J13614N95455J0784k23815k97511p8049J67784
6491B08942P77586k20544J25774R8317K58444J14139j19194j029688K58016O2913
6481E34705k32323N4106j94569p3657M10959j61601k7714J12966L89203j87603
$$ plain form
6471 624472 352251 1004416 1233359 449208 408489 1012581 1699083 1465866 933618 1428231
6461 1428231 1691012 1465117 1241662 1238069 1574613 1545055 794976 732815 1209955 1183783
6451 1183783 1051732 1806326 1792649 865395 947355 1517489 1751924 1974404 1952539 1333060
6441 1333060 1709622 1675953 1170891 1451112 1365600 1843322 2108865 1877313 2149919 2399701
6431 2399701 2359495 2440953 2095671 2168856 2226635 2775650 2851583 2801745 2569001 2831604 3038541
6420 3038541 3063445 3239230 3574187 3074110 3439359 3215005 3381330 3743203 3872648 3895905
6410 3895905 4523310 3979375 3629066 4150224 4012252 4322949 4522991 4462031 3832902 4023836
6400 4023836 3993180 3704413 4077105 4532016 4284410 4012467 4365326 4641685 5090628 4904431
$$ packed form
6471F24472k72221O52165K28943p84151m0719O04092O86502k33217n32248M94613
6461A428231K62781k25895k23455l593L36544k9558p50079o2161M77140k6172
6451A183783j32051P54594j3677r27254Q1960N70134K34435K22480k1865o19479
6441A333060L76562l3669n05062K80221q5512M77722K65543k31552K72606K49782
6431B399701m0206Q1458l45282P3185N7779N49015P5933m9838k32744K62603K06937
6420C038541K4904J75785L34957n00077L65249k24354J66325L61873J29445K3257
6410C895905O27405n43935l50309N21158j37972L10697K00042o0960o29129J90934
6400D023836l0656k88767L72692M54911k47606k71943L52859K76359M48943j86197
$$ plain form
6390 4904431 5109094 5458224 6001025 5886834 6775950 6924944 6614111 6627059 6451887 6775045
6380 6775045 6837951 6762689 7570989 8104051 9072838 8570841 8117741 8294456 7884712 8173799
6370 8173799 8353461 8486358 8763171 9386333 9203425 10179650 9997961 10219977 10635646 10631438
6360 10631438 11213355 11539631 11765501 12164111 12518004 13259459 13466521 14389096 14378763 15119205
6350 15119205 15880304 15474299 15434004 16164431 17006167 18215599 19071327 19965171 20843010
6341 20843010 21500719 21947581 23150805 24443109 25403198 26254451 27287527 28752239 29924640
6332 29924640 30533825 31997454 32987697 34551519 36003961 36913824 38059000 38979553 39544800
6323 39544800 40639025 41290991 41971920 43144700 43791261 45413971 46481580 48980875 50727335
$$ packed form
6390D904431K04663L49130N42801j14191Q89116J48994l10833J2948j75172L23158
6380F775045O2906p5262Q08300N33062R68787n01997m53100J76715m09744K89087
6370H173799J79662J32897K76813O23162j82908R76225j81689K22016M15669m208
6360A0631438N81917L26276K25870L98610L53893P41455K07062R22575j0333P40442
6350A5119205P61099m06005m0295P30427Q41736J209432Q55728Q93844Q77839
6341B0843010O57709M46862J203224J292304R60089Q51253J033076J464712J172401
6332B9924640O09185J463629R90243J563822J452442R09863J145176R20553N65247
6323C9544800J094225O51966O80929J172780O46561J622710J067609K499295J746460
$$ plain form
6314 50727335 52531791 54672218 56533207 58764788 60505189 62427274 63779176 64890569
6306 64890569 65201144 64651285 64837753 64721805 63632241 62743041 62427378 61400483 60806877
6297 60806877 60274820 59834821 59659888 59548654 60724110 61153232 61832297 62723156 64400996
6288 64400996 65619402 66485270 67669541 67795795 67782204 66659420 65321127 63418782 60692745
6279 60692745 58449306 56392184 53129980 50520763 48889089 46534005 44669928 43378401
6271 43378401 42106219 40936432 39213169 37946290 37553030 36823307 36764225 36351078 36476059
6262 36476059 36338490 35056724 33821978 32537104 31654082 29588271 27646865 26600165
6254 26600165 25651798 24397978 22931675 21278475 20088562 19351987 18219962 16934243
$$ packed form
6314E0727335J804456K140427J860989K231581J740401J922085J351902J111393
6306F4890569L10575n49859J86468j15948j089564q89200l15663j026895n93606
6297F0806877n32057m39999j74933j11234J175456M29122O79065Q90859J677840
6288F4400996J218406Q65868J184271J26254j3591j122784j338293j902345k726037
6279F0692745k243439k057122l262204k609217j631674k355084j864077j291527
6271D3378401j272182j169787j723263j266879l93260p29723n9082m13147J24981
6262C6476059j37569j281766j234746j284874q83022k065811j941406j046700
6254B6600165r48367j253820j466303j653200j189913p36575j132025j285719
$$ plain form
6246 16934243 15867345 14925703 14222519 14009908 13778850 13070136 11836282 11359423 10807019
6237 10807019 10820479 10301267 9893338 9623011 8885178 8146016 8222615 7989112 7415846 7752013
6227 7752013 6710152 6940972 7217353 6465922 5974243 5821575 5777880 6021427 6113931 5351257
6217 5351257 5331754 5341753 4815258 4544144 4179269 4405650 3945270 3973392 3713800 3238003
6207 3238003 3058632 3385953 3345855 3383036 3572254 3523487 2783495 2500579 2837331 3210306
6197 3210306 2425570 2264548 2308647 2479528 2459163 2520204 2838767 2654920 2498197 2329359
6187 2329359 1868136 1749274 2007949 1361894 2095012 1836221 1760759 1565093 1510965 1571216
6177 1571216 1239370 1831248 1899922 1551103 994976 857962 1186203 1345710 1161285 1151243
$$ packed form
6246A6934243j066898r41642p03184k12611k31058p08714j233854m76859n52404
6237A0807019J3460n19212m07929k70327p37833p39162P6599k33503n73266L36167
6227G752013j041861K30820K76381p51431m91679j52668m3695K43547R2504p62674
6217E351257j9503R999n26495k71114l64875K26381m60380K8122k59592m75797
6207C238003j79371L27321m0098L7181J89218m8767p39992k82916L36752L72975
6197C210306p84736j61022M4099J70881k0365O1041L18563j83847j56723j68838
6187B329359m61223j18862K58675o46055P33118k58791p5462j95666n4128O0251
6177A571216l31846N91878O8674l48819n56127j37014L28241J59507j84425j0042
$$ plain form
6167 1151243 1240734 1187694 1002727 960062 848866 802545 373498 593243 953533 992181
6157 992181 858547 601449 1205140 1303293 654488 222293 193579 479967 129834 -212277
6147 -212277 70414 87774 -260112 255628 386171 712080 1161602 1121877 681708 -102248
6137 -102248 422951 20164 399688 146976 -327422 -526301 -855273 -455150 337197 -175353
6127 -175353 369330 360316 398267 -321515 -594333 -583334 285544 454933 -104256 -223914
6117 -223914 -111782 -97833 -697005 225691 257653 -694157 -672456 -169614 768117 1097642
6107 1097642 43846 333597 -160087 -331077 -242762 -851440 -1038015 -116907 -205085 -464536
6097 -464536 -7331 278864 280698 263808 885560 1047301 -60901 9591 -47589 -17911 472838
$$ packed form
6167A151243Q9491n3040j84967m2665j11196m6321m29047K19745L60290L8648
6157I92181j33634k57098O03691R8153o48805m32195k8714K86388l50133l42111
6147b12277K82691J7360l47886N15740J30543L25909M49522l9725m40169p83956
6137a02248N25199m02787L79524k52712m74398j98879l28972M00123P92347n12550
6127a75353N44683r014L7951p19782k72818J0999Q68878J69389n59189j19658
6117b23914J12132J3949n99172R22696L1962r51810K1701N02842R37731L29525
6107A097642j053796K89751m93684j70990Q8315o08678j86575R21108q8178k59451
6097d64536M57205K86195J834j6890O21752J61741j108202P0492n7180K9678M90749
$$ plain form
6086 472838 218279 -164417 -1081549 -1257295 -1115184 -640493 -698057 -638040 -910210 -716158
6076 -716158 164439 -89180 50501 -181913 -1113081 -1066299 -1056751 -1411791 -1069628 -526573
6066 -526573 -216298 -496416 -977096 -556856 -878246 -486568 333926 269950 93357 -573770
6056 -573770 -828195 -577920 -630146 -730053 -928986 -1292603 -539610 -206723 -423811 -401794
6046 -401794 -319338 -252926 -40944 -249940 252479 460720 31723 -559424 -972109 -558092
6036 -558092 -71584 -416882 -838072 -982263 -757497 -726819 -836717 -889048 -369238 -561240
6026 -561240 -597176 -461462 -444622 -174093 -163446 -197932 -612048 -283257 -296316 -403592 125145
6015 125145 318411 812847 272955 -395881 10625 -123683 396567 -416716 -166594 187524
$$ packed form
6086D72838k54559l82696r17132j75746J42111M74691n7564O0017k72170J94052
6076g16158Q80597k53619J39681k32414r31168M6782R548l55040L42163N43055
6066e26573L10275k80118m80680M20240l21390L91678Q20494o3976j76593o67127
6056e73770k54425K50275n2226r9907j98933l63617P52993L32887k17088K2017
6046d01794Q2456O6412K11982k08996N02419K08241m28997n91147m12685M14017
6036e58092M86508l45298m21190j44191K24766L0678j09898n2331N19810j92002
6026e61240l5936J35714J6840K70529J0647l4486m14116L28791j3059j07276N28737
6015A25145J93266M94436n39892o68836M06506j34308N20250q13283K50122L54118
$$ plain form
6005 187524 171862 460381 151898 -156044 -510198 20074 507252 114645 -881124 -859059
5995 -859059 -413620 -389773 15024 532603 1106290 1533395 1411814 639962 221739 414216
5985 414216 31724 599925 588425 250703 235803 172321 137577 -141679 593805 173013
5975 173013 123619 -104607 78032 -109521 308768 737586 723287 887731 593423 175184
5965 175184 440486 463322 -100169 489381 485159 1278390 1678231 1540196 973437 101603
5955 101603 -349290 -635143 -598183 181459 401248 597544 360307 -201490 -475820 -169681
5945 -169681 54899 654622 376763 592736 454297 76 -735112 -440193 108298 -176191
5935 -176191 -898702 -1068431 -482847 -678460 -309936 117062 -357296 -473315 -276399 174117
$$ packed form
6005A87524j5662K88519l08483l07942l54154N30272M87178l92607r95769K2065
5995h59059M45439K3847M04797N17579N73687M27105j21581p71852m18223J92477
5985D14216l82492N68201j1500l37722j4900o3482l4744k79256P35484m20792
5975A73013m9394k28226J82639j87553M18289M28818j4299J64444k94308m18239
5965A75184K65302K2836n63491N89550m222P93231L99841j38035n66759q71834
5955A01603m50893k85853L6960P79642K19789J96296k37237n61797k74330L06139
5945a69681K24580N99723k77859K15973j38439m54221p35188K94919N48491k84489
5935a76191p22511j69729N85584j95613L68524M26998m74358j16019J96916M50516
$$ plain form
5925 174117 -138510 -418049 133346 -35041 60900 246454 245800 -462334 -577397 -431568
5915 -431568 -829320 -455840 223497 311588 256950 71451 -135362 582602 1095727 784258
5905 784258 704214 35470 -87685 -435080 -794448 -586835 -603425 -1175744 -748079 33014
5895 33014 450377 254573 209099 -392340 -727591 -439271 141569 273651 231554 -137023
5885 -137023 -110357 160085 276719 423034 321513 -225658 210874 -15832 344041 1096696
5875 1096696 638658 569893 -230340 -222584 310425 -22792 264426 1099386 880517 465214
5865 465214 486954 72758 690938 665906 200579 -227510 -600927 -686467 -265239 98937
5855 98937 660194 882515 521410 126879 22119 570006 329099 609594 803400 713144
$$ packed form
5925A74117l12627k79539N51395j68387R5941J85554o54p08134j15063J45829
5915d31568l97752L73480O79337Q8091n4638j85499k06813P17964N13125l11469
5905G84258q0044o68744j23155l47395l59368K07613j6590n72319M27665P81093
5895C3014M17363j95804m5474o01439l35251K88320N80840J32082m2097l68577
5885a37023K6666K70442J16634J46315j01521n47171M36532k26706L59873P52655
5875A096696m58038o8765q00233P756N33009l33217K87218Q34960k18869m15303
5865D65214K1740m14196O18180k5032m65327m28089l73417q5540M21228L64176
5855I8937N61257K22321l61105l94531j04760N47887k40907K80495J93806r0256
$$ plain form
5845 713144 -232660 80569 453360 805605 174088 311949 118915 363066 403507 118789
5835 118789 1015003 1570813 959669 464934 401596 124626 574510 190181 867230 841363
5825 841363 698026 1073262 974908 954802 940162 332046 29259 932359 771526 21169
5815 21169 376736 791061 866520 1154283 915242 1296081 1657425 1311146 1163259 1151533
5805 1151533 871721 748583 750478 861529 1360487 1959254 1868101 2076569 2220557 1390189
5795 1390189 1716179 1654858 1280513 1373945 1472058 1294264 1303600 1576902 2226251 1950919
5785 1950919 1940890 2292155 2409715 2336325 1977602 2060063 1884958 1728656 2455128 2665266
5775 2665266 2332372 2578810 2485896 2474232 2499109 2585722 2700920 2959834 2689553 2644424
$$ packed form
5845G13144r45804L13229L72791L52245o31517J37861j93034K44151M0441k84718
5835A18789Q96214N55810o11144m94735o3338k76970M49884l84329O77049k5867
5825H41363j43337L75236r8354k0106j4640o08116l02787R03100j60833p50357
5815B1169L55567M14325P5459K87763k39041L80839L61344l46279j47887j1726
5805A151533k79812j23138J895J11051M98958N98767r1153K08468J43988q30368
5795A390189L25990o1321l74345R3432R8113j77794R336K73302O49349k75332
5785A950919j0029L51265J17560p3390l58723Q2461j75105j56302P26472K10138
5775B665266l32894K46438r2914j1664K4877Q6613J15198K58914k70281m5129
$$ plain form
5765 2644424 2073717 2573289 3549939 3875256 4425953 4158542 3832426 3842862 3654192 3901902
5755 3901902 4127592 4012000 4385455 4582360 4389422 4771027 3999183 4139885 4269750 4694165
5745 4694165 5191587 5076520 5092410 5400100 5154530 4502747 5270448 5546836 5641913 5426473
5735 5426473 6023841 5934541 5466759 5344992 6419128 6611755 6332676 6244689 5933514 6303164
5725 6303164 6615238 7427947 7909607 7609371 8112572 8958851 8491569 8391399 8871515 9175967
5715 9175967 10032238 9843930 9695237 9500771 9501495 10216669 11036522 11582531 11541205 12076869
5705 12076869 13162270 13819193 14138637 14211892 14797134 15127544 15047532 15701806 15984501 16480078
5695 16480078 17233838 18334099 18624734 18961948 19647370 20723361 21803560 22025091 22209567
$$ packed form
5765B644424n70707M99572R76650L25317N50697k67411l26116J0436j88670K47710
5755C901902K25690j15592L73455J96905j92938L81605p71844J40702J29865M24415
5745D694165M97422j15067J5890L07690k45570o51783P67701K76388R5077k15440
5735E426473N97368q9300m67782j21767J074136J92627k79079q7987l11175L69650
5725F303164L12074Q12709M81660l00236N03201Q46279m67282j00170M80116L04452
5715I175967Q56271j88308j48693j94466P24P15174Q19853N46009m1326N35664
5705A2076869J085401O56923L19444P3255N85242L30410q0012O54274K82695M95577
5695A6480078P53760J100261K90635L37214O85422J075991J080199K21531J84476
$$ plain form
5686 22209567 23457766 24777068 26286883 27030746 27940162 28790517 29470907 31568407 33592287
5677 33592287 35673124 37630691 39017324 41706162 43893027 45805740 47655810 49549723
5669 49549723 51264034 53099763 54744990 56572835 58487043 58780835 58917039 59695122 59974442
5660 59974442 59641610 59426790 59552853 59367787 59958495 60995326 61806357 63193567 64756379
5651 64756379 67026297 68944556 70397380 72677931 75564748 76165041 76668015 77744844
5643 77744844 78344980 78668478 79073718 78288644 76492187 74363970 71875980 67965008 64786482
5634 64786482 62402848 60312470 57811999 56110756 54818857 53928228 52668544 51414980
5626 51414980 50466936 50081055 49422029 48329661 47297354 46600011 45850016 45083252 43672689
$$ packed form
5686B2209567J248199J319302J509815P43863R09416Q50355O80390K097500K023880
5677C3592287K080837J957567J386633K688838K186865J912713J850070J893913
5669D9549723J714311J835729J645227J827845J914208K93792J36204P78083K79320
5660E9974442l32832k14820J26063j85066N90708J036831Q11031J387210J562812
5651F4756379K269918J918259J452824K280551K886817O00293N02974J076829
5643G7744844O00136L23498M05240p85074j796457k128217k487990l910972l178526
5634F4786482k383634k090378k500471j701243j291899q90629j259684j253564
5626E1414980r48044l85881o59026j092368j032307o97343p49995p66764j410563
$$ plain form
5617 43672689 42191378 40871903 39302859 37830143 35795812 34433746 33008547 29846191
5609 29846191 28076438 26372424 24715948 23752581 22320161 21470451 20158925 19349026 18484047
5600 18484047 17749473 16413192 15666885 14570988 13685183 13256218 12819186 12048792 11852729
5591 11852729 11788846 11244807 10668897 10601506 10017899 9410480 8386285 8320890 8818317 8803755
5581 8803755 8162432 7766858 7269186 7325476 6806543 6382143 6141106 5014964 4993967 5605918
5571 5605918 5404925 5115503 4957021 4643344 4416641 4496029 4639449 4019458 4495345 4376589
5561 4376589 4045375 3980251 3625857 3784580 3515547 3160847 3038721 3896938 3340282 3118946
5551 3118946 3516730 3163156 2711247 2521013 2703586 2825458 2567061 2025191 2586812 2342574
$$ packed form
5617D3672689j481311j319475j569044j472716k034331j362066j425199l162356
5609B9846191j769753j704014j656476r63367j432420q49710j311526q09899q64979
5600A8484047p34574j336281p46307j095897q85805m28965m37032p70394j96063
5591A1852729o3883n44039n75910o7391n83607o07419j024195o5395M97427j4562
5581H803755o41323l95574m97672N6290n18933m24400k41037j126142k0997O11951
5571E605918k00993k89422j58482l13677k26703P9388J43420o19991M75887j18756
5561D376589l31214o5124l54394J58723k69033l54700j22126Q58217n56656k21336
5551C118946L97784l53574m51909j90234J82573J21872k58397n41870N61621k44238
$$ plain form
5541 2342574 1880285 1836568 1642285 1604830 1990906 2511804 2348116 1684708 1250598 1045335
5531 1045335 1539932 1909311 1709142 1374266 1285785 1361124 1146990 1198211 1395894 1280438
5521 1280438 1527703 999428 1123467 1198819 1106471 943691 1351530 1146343 741368 800569
5511 800569 755312 1040645 1159053 923643 807140 701940 1209355 1217324 830539 617228
5501 617228 543440 449743 838501 959956 665807 883507 1139974 801865 346342 745161
5491 745161 925387 1146735 1336389 755735 803110 631763 625610 743144 705212 385752
5481 385752 317587 514792 -110604 100136 620305 567859 650457 1082619 544500 140732
5471 140732 84819 282071 -276179 140263 573934 199528 409103 1011276 373236 564202
$$ packed form
5541B342574m62289m3717j94283l7455L86076N20898j63688o63408m34110k05263
5531A045335M94597L69379k00169l34876q8481P5339k14134N1221J97683j15456
5521A280438K47265n28275J24039P5352r2348j62780M07839k05187m04975N9201
5511H00569m5257K85333J18408k35410j16503j05200N07415P969l86785k13311
5501F17228p3788r3697L88758J21455k94149K17700K56467l38109m55523L98819
5491G45161J80226K21348J89654n80654M7375j71347o153J17534l7932l19460
5481C85752o8165J97205o25396K10740N20169n2446Q2598M32162n38119m03768
5471A40732n5913J97252n58250M16442M33671l74406K09575O02173o38040J90966
$$ plain form
5461 564202 529787 350863 450426 -122552 -1578 146467 -323074 11095 -515203 -560756
5451 -560756 -240649 368031 601911 557157 78111 -76098 -645823 -792577 8105 264750
5441 264750 506900 -258793 -2619 -242737 -768755 -772445 -312995 -367689 177791 213637
5431 213637 -717028 -237400 206261 -389709 -407336 -19317 -202985 -43619 -261603 -411246
5421 -411246 -574561 -199521 6078 -125134 -193531 59554 189645 -56379 -208175 52159
5411 52159 -203496 -747909 -626827 -747107 -56808 -129779 -1007073 -1014299 -1039005 -590796 -168604
5400 -168604 -670085 -534599 -511377 -48464 -48507 -223816 -475521 -114695 -199709 -781242 -1090230
5389 -1090230 -982037 -740238 -752704 -472519 -321637 5796 249408 461198 90118 63244
$$ packed form
5461E64202l4415j78924R9563n72978J20974J48045m69541L34169n26298m5553
5451e60756L20107O08680K33880m4754m79046j54209n69725j46754Q00682K56645
5441B64750K42150p65693K56174k40118n26018l690M59450n4694N45480L5846
5431B13637r30665M79628M43661n95970j7627L88019j83668J59366k17984j49643
5421d11246j63315L75040K05599j31212o8397K53085J30091k46024j51796K60334
5411E2159k55655n44413J21082j20280O90299p2971q77294p226k4706M48209M22192
5400a68604n01481J35486K3222M62913m3j75309k51705L60826q5014n81533l08988
5389a090230J08193K41799j2466K80185J50882L27433K43612K11790l71080k6874
$$ plain form
5379 63244 624095 -40943 -782399 -886988 -280587 -497511 -551149 -433414 -708181 -227601
5369 -227601 -437149 -318290 242295 343131 -166074 -753264 102647 18165 -337051 -717856
5359 -717856 -345880 -137328 -162990 -233965 -71623 -338657 -284346 -1148288 -1355554 -803053
5349 -803053 -602177 -777199 -832172 -146342 167548 -136993 -724370 74833 43412 -313806
5339 -313806 326409 293658 404257 42866 -386602 -583901 -426669 -472525 -484326 113399
5329 113399 -32009 219973 153159 -221383 -574202 -47575 -119025 -337067 -565091 -909127
5319 -909127 -871618 -217948 -229679 -665671 -797889 -589256 -780747 -572865 64908 -414967
5309 -414967 -500781 -148076 -482772 96539 696721 544553 -95195 115918 -257825 -328370
$$ packed form
5379F3244N60851o65038p41456j04589O06401k16924n3638J17735k74767M80580
5369b27601k09548J18859N60585J00836n09205n87190Q55911q4482l55216l80805
5359g17856L71976K08552k5662p0975J62342k67034N4311q63942k07266N52501
5349h03053K00876j75022n4973O85830L13890l04541n87377P99203l1421l57218
5339c13806O40215l2751J10599l61391m29468j97299J57232m5856j1801N97725
5329A13399j45408K51982o6814l74542l52819N26627p1450k18042k28024l44036
5319i09127L7509O53670j1731m35992j32218K08633j91491K07882O37773m79875
5309d14967q5814L52705l34696N79311O00182j52168o39748K11113l73743p0545
$$ plain form
5299 -328370 -137599 70927 -477406 -58358 -533876 -1409267 -1427450 -1098632 -665017 -450278
5289 -450278 -502346 -347538 -189819 -378067 -277518 -565254 -360245 -571151 -415877 -764198
5279 -764198 -752268 -1253262 -819589 -740039 -822668 -462512 -308442 239998 43709 78840
5269 78840 29153 -72193 -581408 -689500 -603388 -327731 -206730 -211873 -361075 -154302 -680748
5258 -680748 -688179 33812 230366 576701 119269 -104913 356362 -341293 -540283 -284061
5248 -284061 104513 175923 -526629 58923 -122068 -698295 -584219 -276783 -441387 -1201338
5238 -1201338 -1175428 -1192551 -1386836 -730617 -761191 -581648 -49434 -331905 -399100 -300846
5228 -300846 -553066 -819291 -1536988 -1093059 -584751 -209990 -468179 -448236 157283 -134446
$$ packed form
5299c28370J90771K08526n48333M19048m75518q75391j8183L28818M33615K14739
5289d50278n2068J54808J57719j88248J00549k87736K05009k10906J55274l48321
5279g64198J1930n00994M33673P9550q2629L60156J54070N48440j96289L5131
5269G8840m9687j01346n09215j08092Q6112K75657J21001n143j49202K06773n26446
5258f80748p431P21991J96554L46335m57432k24182M61275o97655j98990K56222
5248b84061L88574P1410p02552N85552j80991n76227J14076L07436j64604p59951
5238a201338K5910j7123j94285O56219l0574J79543N32214k82471o7195R8254
5228c00846k52220k66225p17697M43929N08308L74761k58189J9943O05519k91729
$$ plain form
5218 -134446 303342 -466996 -122452 56351 -317665 -185053 -711648 -747237 -703663 -438919
5208 -438919 -179149 363992 -82228 93875 110013 -506608 -420936 -399950 -635349 -367473
5198 -367473 -225156 -332470 -262117 -148493 108820 424929 80849 -341574 -813447 -816072
5188 -816072 -548832 -375890 -3643 -64635 -447814 -333195 -178553 -46284 243367 338133
5178 338133 228318 489092 123760 -190518 -14130 -323509 -428018 -448600 -873139 -1194849
5168 -1194849 -350167 -366405 -143702 434622 218662 -202402 -438665 -436496 -246766 -421969
5158 -421969 -660902 -1250080 -1236398 -1005367 -616612 -890172 -29952 468046 -298 362729
5148 362729 -63404 156644 120170 124707 91253 -320886 -211024 -81621 122787 209040 -151769
$$ packed form
5218a34446M37788p70338L44544J78803l74016J32612n26595l5589M3574K64744
5208d38919K59770N43141m46220J76103J6138o16621Q5672K0986k35399K67876
5198c67473J42317j07314P0353J13624K57313L16109l44080m22423m71873k625
5188h16072K67240J72942L72247o0992l83179J14619J54642J32269K89651R4766
5178C38133j09815K60774l65332l14278J76388l09379j04509k0582m24539l21710
5168a194849Q44682j6238K22703N78324k15960m21064k36263K169J89730j75203
5158d21969k38933n89178J3682K31031L88755k73560Q60220M97998m68344L63027
5148C62729m26133K20048l6474M537l3454m12139J09862J29403K04408Q6253l60809
$$ plain form
5137 -151769 -411019 -15099 -165652 -641710 -229644 300953 372751 -159404 -15592 -388829
5127 -388829 -532475 -15557 22904 -739781 -722666 -651071 -492092 -939543 -496159 -530788
5117 -530788 -367209 -601644 -548450 -578532 -505644 -1161281 -1368007 -874020 -1178099 -673216
5107 -673216 -574693 -860180 -897121 -699057 -654884 -386280 -205526 -613014 -687547 -1100294
5097 -1100294 -1364173 -1041561 -1404104 -686453 -831487 -490563 158492 -329706 -175340 17793
5087 17793 146317 513837 511650 610372 334159 -411574 -651487 -413257 -824272 -692002
5077 -692002 -908513 -253561 -470754 -443514 -458539 -120664 158601 41114 85803 109750
5067 109750 -300415 42734 453600 -276618 -982406 -356595 -403649 -365377 -278296 -260868
$$ packed form
5137a51769k59250L95920j50553m76058M12066N30597P1798n32155J43812l73237
5127c88829j43646N16918L8461p62685J7115P1595J58979m47451M43384l4629
5117e30788J63579k34435N3194l0082P2888o55637k06726M93987l04079N04883
5107f73216R8523k85487l6941J98064M4173K68604J80754m07488p4533m12747
5097a100294k63879L22612l62543P17651j45034L40924O49055m88198J54366J93133
5087A7793J28524L67520k187R8722k76213p45733k39913K38230m11015J32270
5077f92002k16511O54952k17193K7240j5025L37875K79265j17487M4689K3947
5067A09750m10165L43149M10866p30218p05788O25811m7054L8272Q7081J7428
$$ plain form
5057 -260868 13462 -389064 -182344 -217779 -59732 192420 240646 -127344 -338739 -666556
5047 -666556 -87593 -285211 -362856 -504433 -576472 -260765 -406004 -282394 -227458 253293
5037 253293 -508328 -454115 -173421 13519 -255401 -323755 -909044 -768197 35307 -529203
5027 -529203 -458287 -526767 -329830 -44040 -51134 1681 19241 219127 72459 125849 -173440
5016 -173440 -817484 -409689 101235 -298692 -543819 -398083 -51543 340417 -122552 -159829
5006 -159829 -170654 407080 26279 -72237 -273433 207094 88415 -445492 -228228 110695
4996 110695 -33592 -73304 540897 116165 129637 -93406 642843 830746 459399 -53153
4986 -53153 487883 831998 619416 -432948 -483644 -279176 -190083 -299754 -475865 340619
$$ packed form
5057b60868K74330m02526K06720l5435J58047K52152M8226l67990k11395l27817
5047f66556N78963j97618p7645j41577p2039L15707j45239J23610N4936M80751
5037B53293p61621N4213K80694J86940k68920o8354n85289J40847Q03504n64510
5027e29203P0916o8480J96937K85790p094N2815J7560J99886j46668N3390k99289
5016a73440o44044M07795N10924l99927k45127J45736L46540L91960m62969l7277
5006a59829j0825N77734l80801r8516k01196M80527j18679n33907K17264L38923
4996A10695j44287l9712O14201m24732J3472k23043P36249J87903l71347n12552
4986e3153N41036L44115k12582j052364n0696K04468Q9093j09671j76111Q16484
$$ plain form
4976 340619 471557 373911 -226773 -564173 411548 189999 -1226019 -816023 -872263 -612745
4966 -612745 -794573 119899 192837 -137545 44350 -92572 557669 680684 755698 985750
4956 985750 557658 418106 541425 672865 91915 438135 949854 760283 204608 209967
4946 209967 999316 1281361 509095 358956 887290 869849 543604 468809 412618 942430
4936 942430 604530 -111151 879556 1126316 1073880 1444594 1258497 1258895 300688 16903
4926 16903 336131 207987 450849 522362 554661 920137 907365 1225205 688472 385239
4916 385239 465015 658616 1305360 547399 565951 587514 191427 858476 1164308 1145914
4906 1145914 1921293 2259678 812474 761304 1155365 1176275 1204134 1485103 1794507 470184
$$ packed form
4976C40619J30938r7646o00684l37400R75721k21549j416018M09996n6240K59518
4966f12745j81828R14472P2938l30382J81895j36922O50241J23015P5014K30052
4956I85750m28092j39552J23319J31440n80950L46220N11719j89571n55675N359
4946B09967P89349K82045p72266j50139N28334j7441l26245p4795n6191N29812
4936I42430l37900p15681R90707K46760n2436L70714j86097L98r58207k83785
4926A6903L19228j28144K42862P1513L2299L65476j2772L17840n36733l03233
4916C85239P9776J93601O46744p57961J8552K1563l96087O67049L05832j8394
4906A145914P75379L38385j447204n1170L94061K0910K7859K80969L09404j324323
$$ plain form
4896 470184 228967 549872 640817 666325 746273 510642 373576 468743 226109 257060 516472
4885 516472 752761 1016876 443641 416008 733614 965303 563991 500466 251887 911502
4875 911502 1294662 1226463 1021430 1320476 904942 91400 763475 1166400 1085661 657231
4865 657231 -408603 -315698 -14074 756180 740651 548925 1012252 220728 -32933 158824
4855 158824 372919 959398 560155 535325 -38224 -141052 530633 556674 454923 267766
4845 267766 744427 471052 199003 370814 485925 235973 28712 -279245 42291 37485
4835 37485 535102 340371 154652 668229 541049 448445 564331 1042052 588141 798163
4825 798163 614996 678029 1057185 1348864 1480905 801044 770770 635099 878105 528473
$$ packed form
4896D70184k41217L20905R0945K5508P9948k35631j37066R5167k42634L0951K59412
4885E16472K36289K64115n73235k7633L17606K31689m01312o3525k48579O59615
4875I11502L83160o8199k05033K99046m15534q13542O72075M02925q0739m28430
4865F57231j065834R2905L01624P70254j5529j91726M63327p91524k53661J91757
4855A58824K14095N86479l99243k4830n73549j02828O71685K6041j01751j87157
4845B67766M76661k73375k72049J71811J15111k49952k07261l07957L21536m806
4835C7485M97617j94731j85719N13577j27180r2604J15886M77721m53911K10022
4825G98163j83167O3033L79156K91679J32041o79861l0274j35671K43006l49632
$$ plain form
4815 528473 673307 1195445 980186 699974 785833 1087521 1045612 1449932 1644078 1541687
4805 1541687 1374270 1220996 1320308 1676430 1175709 1656770 1717932 1994974 1504303 1079090
4795 1079090 1071214 1036513 1995179 1462272 1774140 1730446 1992293 2376393 2685340 2481381
4785 2481381 2016891 1294496 1536863 2281720 1506743 1415726 1786147 1646528 1812039 1987379
4775 1987379 1970636 1985873 2068970 1601690 1647240 1258497 1519707 2642180 2693019 2507284
4765 2507284 2172917 1699652 1229274 1590346 1679862 1551210 1295647 2374914 2324486 1877480
4755 1877480 2433397 3481685 3459840 2168258 2546081 2987618 2317984 2041307 2738680
4746 2738680 2628552 2625803 2784021 2445353 2324026 2582552 2532782 2664807 3035729 3354218
$$ packed form
4815E28473J44834N22138k15259k80212Q5859L01688m1909M04320J94146j02391
4805A541687j67417j53274R9312L56122n00721M81061O1162K77042m90671m25213
4795A079090p876l4701R58666n32907L11868m3694K61847L84100L08947k03959
4785B481381m64490p22395K42367P44857p74977r1017L70421j39619J65511J75340
4775A987379j6743J5237Q3097m67280M5550l88743K61210J122473N0839j85735
4765B507284l34367m73265m70378L61072Q9516j28652k55563J079267n0428m47006
4755A877480N55917J048288k1845j291582L77823M41537o69634k76677O97373
4746B738680j10128k749J58218l38668j21327K58526m9770J32025L70922L18489
$$ plain form
4736 3354218 3293401 3338362 3116217 3352007 2999151 2806677 3507240 3738806 3564713 4142357
4726 4142357 3910263 3511445 3852036 4153101 3977148 4156197 4305638 3926534 3831885 3281133
4716 3281133 4247772 4320639 4410574 4219985 4034637 4380977 4166347 4525602 4310653 4626772
4706 4626772 4702240 4099636 4577763 5489678 5521022 5231739 4645915 5206502 5749908 5465467
4696 5465467 6031656 6498059 6123803 6114743 6237982 6027347 6067757 5821423 6537114 6775335
4686 6775335 6508138 6703627 7098058 7366359 7263377 7741433 7499007 7766548 7934534 7920537
4676 7920537 7985925 8363340 8845193 8192251 8465782 9326699 9325730 9227332 9725119 9927419
4666 9927419 9866048 10682234 10656692 11183929 11437917 11694436 11596930 11360762 11574852 12033524
$$ packed form
4736C354218o0817M4961k22145K35790l52856j92474P00563K31566j74093N77644
4726D142357k32094l98818L40591L01065j75953J79049J49441l79104r4649n50752
4716C281133R66639P2867Q9935j90589j85348L46340k14630L59255k14949L16119
4706D626772P5468o02604M78127R11915L1344k89283n85824N60587N43406k84441
4696E465467N66189M66403l74256r060J23239k10635M0410k46334P15691K38221
4686F775335k67197J95489L94431K68301j02982M78056k42426K67541J67986j3997
4676G920537O5388L77415M81853o52942K73531Q60917r69r8398M97787K02300
4666I927419o1371Q16186k5542N27237K53988K56519r7506k36168K14090M58672
$$ [...]
##END NTUPLES=NMR SPECTRUM
##END=
