##TITLE=1H_CG-1195
 DMSO
 8 sc, 
 12.3.2024
##JCAMPDX= 6.0         $$ Bruker NMR JCAMP-DX V2.0
##DATA TYPE= NMR SPECTRUM
##DATA CLASS= NTUPLES
##ORIGIN= UXNMR, Bruker Analytische Messtechnik GmbH
##OWNER= root
$$ XWIN-NMR		Version 3.5
$$ Tue Mar 12 14:51:12 2024 Russian Standard Time (UT+4h)  she@DPX200
##.OBSERVE FREQUENCY= 200.1313
##.OBSERVE NUCLEUS= ^1H
##.ACQUISITION MODE= SIMULTANEOUS
##.ACQUISITION SCHEME= undefined
##.AVERAGES= 8
##.DIGITISER RES= 18
##SPECTROMETER/DATA SYSTEM= spect
##.PULSE SEQUENCE= zg30
##.SOLVENT NAME= DMSO
##.SHIFT REFERENCE= (INTERNAL, DMSO, 0, 15.4031)
##AUDIT TRAIL= $$ (NUMBER, WHEN, WHO, WHERE, WHAT)
$$ ##TITLE= Audit trail, XWIN-NMR		Version 3.5
$$ ##JCAMPDX= 5.01
$$ ##ORIGIN= Bruker BioSpin GmbH
$$ ##OWNER= she
$$ F:/spectra/data/she/nmr/H-F/1/pdata/1/auditp.txt
$$ ##AUDIT TRAIL=  $$ (NUMBER, WHEN, WHO, WHERE, WHAT)
(   1,<2024-03-12 14:50:16.01 +0400>,<she>,<DPX200>,
      <created by zg, POWCHK disabled, PULCHK disabled
       configuration hash MD5:
       00 E9 B6 7A A2 85 ED C7 34 08 36 98 17 FE 4E 26
       data hash MD5: 16K
       CD 43 42 BE DC C1 97 B9 DC 8E 24 4A 27 5E 6C 35>)
(   2,<2024-03-12 14:50:18.20 +0400>,<she>,<DPX200>,
      <Start of raw data processing
       efp BC_mod = 2 LB = 0.24 FT_mod = 6 PKNL = 1 PHC0 = -25304.6 PHC1 = 10.58731 SI = 16K 
       data hash MD5: 16K
       76 81 BC 25 AB AC 68 D0 2F 35 D8 2F 33 C2 76 90>)
(   3,<2024-03-12 14:50:31.53 +0400>,<she>,<DPX200>,
      <pk PHC0 = -1.644279 PHC1 = 4.4 
       data hash MD5: 16K
       0C A5 92 68 71 53 91 3F C7 35 75 C8 5F EB 0C 0A>)
(   4,<2024-03-12 14:50:34.98 +0400>,<she>,<DPX200>,
      <abs ABSG = 5 
       data hash MD5: 16K
       09 B5 ED E1 9E 43 63 86 18 C7 1D 65 EB 02 6F 99>)
$$ ##END=
$$ 
$$ hash MD5
$$ B8 34 B1 26 DA EF 68 87 05 07 C0 85 1E EC 23 29
##$RELAX= 
##$RELAX= 
##$RELAX= 
##$RELAX= 
##$RELAX= 
##$RELAX= 
$$ Bruker specific parameters
$$ --------------------------
##$DU= <F:/spectra>
##$EXPNO= 1
##$NAME= <H-F>
##$PROCNO= 1
##$TYPE= <nmr>
##$USER= <she>
##$AMP= (0..31)
100 100 100 100 100 100 100 100 100 100 100 100 100 100 100 100 100 100 
100 100 100 100 100 100 100 100 100 100 100 100 100 100 
##$AQSEQ= 0
##$AQ_mod= 1
##$AUNM= <au_zg>
##$AUTOPOS= <>
##$BF1= 200.13
##$BF2= 200.13
##$BF3= 200.13
##$BF4= 200.13
##$BF5= 200.13
##$BF6= 200.13
##$BF7= 200.13
##$BF8= 200.13
##$BYTORDA= 1
##$CFDGTYP= 0
##$CFRGTYP= 5
##$CHEMSTR= <none>
##$CNST= (0..31)
1 1 145 1 1 1 1 1 1 1 1 1 1 1 1 1 1 1 1 1 1 1 1 1 1 1 1 1 1 1 1 1 
##$CPDPRG= <>
##$CPDPRG1= <>
##$CPDPRG2= <>
##$CPDPRG3= <>
##$CPDPRG4= <mlev>
##$CPDPRG5= <mlev>
##$CPDPRG6= <mlev>
##$CPDPRG7= <mlev>
##$CPDPRG8= <mlev>
##$CPDPRGB= <>
##$CPDPRGT= <>
##$D= (0..31)
0 1.2 0 0 0 0 0 0 0 0.06 0 0.03 0 0 0 0 0.0002 0 0 0 0 0 0 0 0 0 0 0 0 
0 0 0 
##$DATE= 1710240615
##$DBL= (0..7)
120 120 120 120 120 120 120 120 
##$DBP= (0..7)
150 150 150 150 150 150 150 150 
##$DBP07= 0
##$DBPNAM0= <>
##$DBPNAM1= <>
##$DBPNAM2= <>
##$DBPNAM3= <>
##$DBPNAM4= <>
##$DBPNAM5= <>
$$ [...]
##$SUBNAM3= <"">
##$SUBNAM4= <"">
##$SUBNAM5= <"">
##$SUBNAM6= <"">
##$SUBNAM7= <"">
##$SUBNAM8= <"">
##$SUBNAM9= <"">
##$SW= 18.0517328524113
##$SWIBOX= (0..15)
0 0 2 0 0 0 0 0 0 0 0 0 0 0 0 0 
##$SW_h= 3612.71676300578
##$TD= 16384
##$TD0= 1
##$TE= 0
##$TE2= 300
##$TE3= 300
##$TEG= 300
##$TL= (0..7)
0 120 120 120 120 120 120 120 
##$TP= (0..7)
150 150 150 150 150 150 150 150 
##$TP07= 0
##$TPNAME0= <>
##$TPNAME1= <>
##$TPNAME2= <>
##$TPNAME3= <>
##$TPNAME4= <>
##$TPNAME5= <>
##$TPNAME6= <>
##$TPNAME7= <>
##$TPOAL= (0..7)
0.5 0.5 0.5 0.5 0.5 0.5 0.5 0.5 
##$TPOFFS= (0..7)
0 0 0 0 0 0 0 0 
##$TUNHIN= 0
##$TUNHOUT= 0
##$TUNXOUT= 0
##$USERA1= <user>
##$USERA2= <user>
##$USERA3= <user>
##$USERA4= <user>
##$USERA5= <user>
##$V9= 5
##$VALIST= <valist>
##$VCLIST= <CCCCCCCCCCCCCCC>
##$VD= 0
##$VDLIST= <DDDDDDDDDDDDDDD>
##$VPLIST= <PPPPPPPPPPPPPPP>
##$VTLIST= <TTTTTTTTTTTTTTT>
##$WBST= 1024
##$WBSW= 4
##$XGAIN= (0..3)
0 0 0 0 
##$XL= 0
##$YL= 0
##$YMAX_a= 161212
##$YMIN_a= -145793
##$ZGOPTNS= <>
##$ZL1= 120
##$ZL2= 120
##$ZL3= 120
##$ZL4= 120
##$ABSF1= 15.40312
##$ABSF2= -2.648727
##$ABSG= 5
##$ABSL= 3
##$ALPHA= 0
##$AQORDER= 0
##$ASSFAC= 0
##$ASSFACI= 0
##$ASSFACX= 0
##$ASSWID= 0
##$AUNMP= <proc_1d>
##$AZFE= 0.1
##$AZFW= 0.1
##$BCFW= 0
##$BC_mod= 2
##$BYTORDP= 0
##$COROFFS= 0
##$CY= -3
##$DATMOD= 1
##$DC= 0
##$DFILT= <>
##$DTYPP= 0
##$F1P= 0
##$F2P= 0
##$FCOR= 1
##$FTSIZE= 16384
##$FT_mod= 6
##$GAMMA= 0
##$GB= 0
##$INTBC= 1
##$INTSCL= 3.70164e-10
##$ISEN= 128
##$LB= 0.24
##$LEV0= 0
##$LPBIN= 0
##$MAXI= 10000
##$MC2= 0
##$MEAN= 0
##$ME_mod= 0
##$MI= 1.114404
##$NCOEF= 0
##$NC_proc= -6
##$NLEV= 6
##$NOISF1= 3.799351
##$NOISF2= 2.8
##$NSP= 0
##$NTH_PI= 0
##$NZP= 0
##$OFFSET= 15.40312
##$PC= 1
##$PHC0= -25306.24
##$PHC1= 14.98731
##$PH_mod= 1
##$PKNL= yes
##$PPARMOD= 0
##$PSCAL= 0
##$PSIGN= 0
##$REVERSE= no
##$SF= 200.130023730637
##$SI= 16384
##$SIGF1= 3
##$SIGF2= 2
##$SINO= 5.538805
##$SIOLD= 16384
##$SREGLST= <1H.CDCl3>
##$SSB= 0
##$STSI= 16384
##$STSR= 0
##$SW_p= 3612.71676300578
##$SYMM= 0
##$S_DEV= 0
##$TDeff= 16384
##$TDoff= 0
##$TI= <>
##$TILT= no
##$TM1= 0
##$TM2= 0
##$TOPLEV= 0
##$USERP1= <user>
##$USERP2= <user>
##$USERP3= <user>
##$USERP4= <user>
##$USERP5= <user>
##$WDW= 1
##$XDIM= 16384
##$YMAX_p= 515703047
##$YMIN_p= -2044698
$$ End of Bruker specific parameters
$$ ---------------------------------
##NTUPLES= NMR SPECTRUM
##VAR_NAME=  FREQUENCY,     SPECTRUM/REAL,   SPECTRUM/IMAG
##SYMBOL=    X,             R,               I
##VAR_TYPE=  INDEPENDENT,   DEPENDENT,       DEPENDENT
##VAR_FORM=  AFFN,          ASDF,            ASDF
##VAR_DIM=   16384,         16384,           16384
##UNITS=     HZ,            ARBITRARY UNITS, ARBITRARY UNITS
##FACTOR=    0.220516191357247, 1,           1
##FIRST=     3082.62677930988, 0,            0
##LAST=      -530.089983695903, 0,           0
##MIN=       -530.089983695903, -2044698,    0
##MAX=       3082.62677930988, 515703047,    0
$$ Real data points
##PAGE= N=1
##DATA TABLE= (X++(R..R)), XYDATA
$$ [...]
10966 -117761 -23000 12521 128701 333239 308010 165306 124651 183949 225945 -3865 10153
10955 10153 -67024 -39422 -38745 -41555 -167866 -93940 -41861 -62436 -24166 -8865 -113743 38879
10943 38879 -44974 -72476 23045 50701 100698 43937 101766 119372 182325 256055 121817
10932 121817 53981 144453 196246 124436 18461 53467 -50503 -66035 -6835 33297 46971
10921 46971 -17713 139849 142589 15434 96346 -52714 2847 78069 7487 -90973 78418
10910 78418 180508 -26137 -239288 -145253 40760 99109 43707 4836 137289 28697
10900 28697 -36967 43276 -40471 8008 77149 164164 166916 223755 92086 -65458 -24050
10889 -24050 37500 172863 -28341 -197655 -46192 -64268 -102501 -139305 -72628 -6386 15759
10878 15759 -55649 51616 -25174 -28031 51927 52271 93 -89970 -169630 -140965 22397 19343
10866 19343 107175 -41482 -80128 -135059 -45995 88461 61863 59300 -17009 -25926 -173491
10855 -173491 -158819 -42381 5527 8432 -66287 11842 91910 -35611 -32389 13159 102895
10844 102895 52342 -14575 -698 -91927 -49912 69715 -9693 -1138 85587 47547 102084
10833 102084 181648 135346 4320 -93493 149636 90814 79399 75997 -34014 -117746 23466
10822 23466 43712 78560 26967 37778 97712 -132982 -151317 44874 -4151 130495 -34079
10811 -34079 -148566 -137866 -154739 -35093 34166 137084 -19458 -157437 -156040 132021 86664
10800 86664 75986 5780 -86794 -234358 -45140 128654 159513 120243 51896 49356 -59660
10789 -59660 -39180 -40324 102473 81801 -2480 84890 82607 -49967 -87754 -255506 -191715
10778 -191715 78419 12434 81116 85792 47924 7394 -96970 887 43249 95979 125094
10767 125094 -102426 15665 106192 139359 68298 138066 1699 -87483 -11837 -118623 -86327
10756 -86327 -60988 -85446 -2014 -47427 -4554 -103965 -76563 32124 41507 -114517 -33230
10745 -33230 17133 -68018 -213058 -73822 -91140 43839 101004 -26065 -57672 -94631 9796
10734 9796 -181977 -110389 46216 -75905 -38751 40300 -55485 -40670 183788 204663 31653
10723 31653 8865 36965 24049 122 136532 -12186 -196175 -110606 -215813 -155422 -40471
10712 -40471 -44783 -24179 -39178 74161 149355 235361 77552 74867 134933 -24390 -70854
10701 -70854 -48733 21437 51071 -91450 -30230 -21760 17444 95984 -5566 -76130 -16088
10690 -16088 21232 36656 56559 175938 1841 59869 50459 -88441 -147625 -86252 -39141
10679 -39141 12843 21245 39537 102081 72215 -39666 -51183 94282 -22135 -139889 -58576
10668 -58576 -154481 66256 16388 -196492 -207193 29022 -22638 -202468 -156265 -172838 -115042
10657 -115042 -18743 -44640 9087 -43829 20087 81855 308592 130448 -56116 83909 118615
10646 118615 110031 131786 43456 -13845 53876 51030 91966 -16669 69472 48851 259236
10635 259236 129870 -19703 58667 73942 56779 184218 -40451 59051 31676 76865 136909
10624 136909 90814 170372 64917 -99499 -2947 -44039 -40141 77250 16927 26728 126726
10613 126726 141996 165108 185757 198010 107628 -30083 -158415 -48202 264222 178614 161417
10602 161417 49029 2176 89139 1385 -73032 -154822 -11120 -103247 -135631 63813 49292
10591 49292 -16484 -60877 33985 2713 31083 118698 78517 -82041 -55774 12775 28297
10580 28297 62176 -72147 -141288 -20387 -30901 65512 296359 205168 52615 -51546 -106944
10569 -106944 -116638 -103596 58344 116234 94212 155712 47672 -130795 -142379 -68151 2097
10558 2097 7905 71987 239934 208337 125308 45326 37094 -38548 -89839 81507 36782 200944
10546 200944 171340 -66021 35797 -34460 1573 198638 221488 117012 130458 91795 -1452
10535 -1452 54016 -52475 87249 130385 -567 -45941 93570 109420 -27986 -95642 -69166
10524 -69166 -29496 65556 19597 34042 104752 -37650 -24551 27159 58001 -35138 -99432
10513 -99432 45705 67104 211295 142562 98203 62012 76681 16044 60631 4204 -19769
10502 -19769 95428 153546 83912 -143978 -68119 51 120660 273313 123170 -4442
10492 -4442 32956 -33451 62818 27934 22031 -53592 -128220 -115847 -21843 727 29052 -17751
10480 -17751 95496 116496 160138 7284 -122181 -177996 -88896 2965 140769 234934 187757
10469 187757 257385 222961 266046 267313 188157 87965 114677 -16355 166593 263239 119213
10458 119213 216137 164535 183395 258918 102014 -26226 90767 187797 34909 -27423 23063
10447 23063 125115 85855 49020 151581 89098 -8848 42092 19033 -38212 113768 117211
10436 117211 131195 -70418 51500 109979 175424 143062 172936 224303 -3843 -64306 -4369
10425 -4369 -28063 -19395 -21544 20523 -32095 -129460 61815 120205 248364 64495 253133
10414 253133 351324 236158 110421 58452 90977 32452 -14237 96840 203154 201752 245278
10403 245278 215645 228108 184169 154393 2179 53387 72035 11408 200318 196683 187258
10392 187258 266935 158130 157629 232319 102600 116115 201999 176238 201824 179932 92391
10381 92391 193828 80240 170265 354409 211870 -3558 144339 11605 -39675 109516
10371 109516 -21852 -200915 24906 211269 136220 155921 117266 180005 181908 190448 129596
10360 129596 239659 299588 343430 352029 284882 169275 211674 265749 283430 218997 230973
10349 230973 374722 284637 195687 215290 134088 207046 329511 133275 184553 61798 48561
10338 48561 155213 245629 191739 171108 475988 359833 139921 -81644 -40153 95371
10328 95371 57934 210255 286708 256406 135072 131873 194872 314993 366506 120068 142973
10317 142973 278934 212547 275708 122692 156378 81380 116269 252472 208969 141047 20334
10306 20334 103753 232279 96159 -59112 13282 141957 215421 224890 267686 180208 236381
10295 236381 81342 82858 100964 39543 121799 190509 167979 49990 -57584 17517 8911
10284 8911 105827 245506 276335 158470 162269 114088 143346 23090 -40251 39993 -13267
10273 -13267 132745 266069 236672 160144 219749 145811 154193 144995 319329 295722 225690
10262 225690 296731 207187 218428 300385 267232 378133 394559 304563 253358 226854 234031
10251 234031 234984 233083 234523 389187 233813 324430 306788 204229 115753 97943 234876
10240 234876 294463 260372 467207 298383 211187 345831 326061 170232 175269 413321 468509
10229 468509 493135 358541 164416 199451 316359 268980 235007 157786 223967 254503 325629
10218 325629 364721 285825 372699 332306 202655 258095 332802 260262 236613 361849 409880
10207 409880 161287 298168 336447 189397 139514 98139 182480 196562 244125 211451 29441
10196 29441 27764 102105 182993 358256 288551 174746 149818 315429 164776 291853 303413
10185 303413 343913 362343 324154 238172 299048 364861 335589 297318 237116 119688 254495
10174 254495 329050 428019 318003 134740 161945 419110 323185 321555 335000 203167 198704
10163 198704 115619 419975 370194 340564 585322 437967 372143 580126 531990 413808
10153 413808 436263 529028 576505 558740 481185 595444 604989 663410 498380 308547 153606
10142 153606 285862 500719 348388 463766 527767 435396 539640 475880 356760 394335
10132 394335 510286 494773 531365 574511 601120 514334 559685 478877 632883 540388 559336
10121 559336 688462 656781 788104 565963 539985 519895 690002 744031 815090 627946
10111 627946 642772 645627 530122 431001 532293 512806 480714 512848 443132 465572 436376
10100 436376 574364 533283 385057 516822 720274 656909 744999 768242 683253 597782 667279
10089 667279 585591 673631 745738 819448 688127 799557 753526 659871 764752 894206 1098389
10078 1098389 1001333 818867 809110 812352 871053 918847 894135 929033 902396 1049118 1278030
10067 1278030 1336260 1242568 1106422 1332817 1316496 1149052 1239677 1178220 1360953 1489586
10057 1489586 1515458 1480113 1434406 1333428 1269103 1206501 1327044 1414144 1306106 1406985
10047 1406985 1476393 1535911 1534145 1488694 1423946 1432233 1410350 1417876 1465932 1591505 1644801 1589298
10035 1589298 1730575 1657280 1653376 1616633 1560985 1686772 1811637 1786422 2004921 1941970 1919271
10024 1919271 2035288 2065763 2187459 2357380 2425783 2554805 2504645 2215111 2391722 2657596
10014 2657596 2764550 2803538 2871509 2806093 2960112 3114090 2979953 3036776 3249916 3329287
10004 3329287 3434481 3571888 3752114 3701233 3735131 3982372 3986783 3953834 4179974 4413006
9994 4413006 4561076 4797420 4867729 5094074 5450866 5614764 5918993 6341418 7055485 7630778
9984 7630778 8249067 8901968 9638187 10509114 11430102 12634158 13861486 14992655 16108499
9975 16108499 16736623 17146731 17368007 17380846 17518925 17519898 17519854 17510825 17354531 16656414 15738468
9964 15738468 14880877 13656868 12198353 11190112 10170913 9333448 8430206 7693572 7284100
9955 7284100 6655977 6260944 5816308 5440595 5020845 4776281 4652042 4370088 4086899 3741394
9945 3741394 3664224 3509610 3282162 3016308 2810695 2633970 2499326 2411806 2506212 2415052
9935 2415052 2036031 1902486 2034705 1933578 1908782 1836146 1624782 1643866 1611289 1569266
9925 1569266 1714231 1684654 1515510 1346763 1260759 1433873 1404855 1171988 1072085 1195675
9915 1195675 1280251 1167535 1165674 1094377 1198762 1413300 1310662 1254967 1024357 1073676 1144632
9904 1144632 1110980 1097215 1051337 1007931 956909 985078 1016495 1084674 970083 934783 902978
9893 902978 822336 844477 799371 875599 917933 732665 597158 626744 853202 903455 786564
9882 786564 751757 823021 802877 715904 661782 613295 721662 792261 754568 694347 744614
9871 744614 772873 693995 776555 736008 743114 733222 605743 778660 874355 769610 918535
9860 918535 701951 564986 667426 641280 560599 575972 588080 593440 599868 740520 722309
9849 722309 605511 633109 521765 527752 541052 708838 552273 561180 626901 569889 512553
9838 512553 697945 689302 691287 662504 523310 627403 635883 754794 783362 701328 651093
9827 651093 635091 606073 539395 682086 581210 520941 557039 831121 722952 641315 826317
9816 826317 760334 652720 754632 831739 773505 692452 734826 777948 593336 813742 787257
9805 787257 797230 884228 638146 622572 660919 723041 810845 729276 681483 698443 692269 783067
9793 783067 878580 786315 810809 816562 815974 820856 833449 933421 970484 943749 993307 1014909
9781 1014909 990722 975175 1074997 1013622 872837 962400 1082854 1067369 960717 984961 1042348
9770 1042348 1105581 1239225 1249532 1222519 1180895 1154176 1344330 1397951 1386734 1259768 1290635
9759 1290635 1449855 1431349 1412604 1393773 1587977 1626465 1707052 1788277 1687119 1632530 1580756
9748 1580756 1655705 1775132 1820979 1815788 1718961 1790911 1953295 2010368 2102970 2124774 2054409
9737 2054409 2195959 2279090 2380195 2331327 2319996 2346901 2431634 2505369 2575348 2767119 2945514
9726 2945514 2889194 2915532 2971293 3028485 3338379 3462988 3644973 3711990 3893272 4259619
9716 4259619 4417529 4577208 4861444 5222651 5559852 5886849 6354580 6871833 7478563 8146485
9706 8146485 8982938 9746707 10366330 10951386 11481710 11693112 11818244 11818852 11495975 11028611
9696 11028611 10364609 9862274 9368337 8852288 8372429 7858163 7448914 7149860 6639450
9687 6639450 6427781 6108985 5999484 6017395 6048123 6131913 6290930 6364189 6286086 6533282
9677 6533282 6776347 7053554 7508350 7917879 8394866 9026258 9737866 10528378 11050689 11511637
9667 11511637 11960178 12222040 12168458 12079418 11832954 11120678 10609608 9829999 9136807 8416256
9657 8416256 7516154 6673308 6217632 5650700 5023355 4617290 4253169 4212792 3856236 3600802
9647 3600802 3292208 3193977 2974422 2847766 2774464 2635462 2198940 2113076 2346657 2243417
9637 2243417 2023506 1903843 1729224 1786793 1627467 1558797 1472218 1500763 1502179 1228218 1204227
9626 1204227 1432417 1371737 1231261 1058442 1021255 1003658 980562 1061196 1088138 999042 1090750
9615 1090750 1034817 865217 828706 749044 693747 708856 771324 782516 808197 729797 782501
9604 782501 628533 635825 506199 610688 852301 1003654 867401 895795 746506 675041
9594 675041 503506 462157 624619 643200 675033 728966 809460 817154 768482 558540 567451
9583 567451 512649 456283 553344 615791 470979 459698 571017 527306 495973 459773 453906
9572 453906 345598 309063 338229 367998 416094 389892 312432 400388 483904 350852 452969
9561 452969 586591 359217 511559 535413 443967 515692 513047 508307 286479 204251 358240
9550 358240 198938 138103 343486 337411 391004 437528 473742 398256 263064 514083 604862
9539 604862 439281 424138 493535 448127 326698 343962 425739 414096 370579 384481 269311
9528 269311 317242 335522 443877 407214 338026 469282 465852 407924 352315 313759 453242
9517 453242 511432 482008 389678 339060 260864 262793 346397 421812 369492 430901 556107 402160
9505 402160 291192 387503 325742 358781 373525 381284 474849 593894 220661 50281 266966
9494 266966 232126 349817 346984 209167 339331 431423 399724 508307 417203 328261 401690
9483 401690 386761 444422 500436 252565 179553 173805 377449 319540 305121 336150 404640
9472 404640 454280 348001 372028 416364 331728 362076 335689 335870 424400 401103 327363 249948
9460 249948 347057 337714 297372 187364 196986 224860 268730 253783 299559 499785 397066
9449 397066 430238 434998 336431 461972 410511 323994 425959 394965 381421 446154 387617
9438 387617 342746 455433 460731 398863 373705 455710 478400 511380 463299 399425 407262 466299
9426 466299 423984 431736 460745 489177 625410 749435 651128 436272 331712 473291 535157
9415 535157 549419 603514 526398 455236 495894 670712 662145 530896 475761 392836 463088
9404 463088 357480 453215 485491 412524 551642 428892 548391 571698 483568 465385 541228
9393 541228 551134 573284 662294 583432 630167 663703 606411 742715 673705 699145 799294
9382 799294 838690 657344 703434 821498 751975 665548 586614 441726 408362 499458 671191
9371 671191 664670 621536 714198 686976 696370 688201 581694 548011 584654 577128 549433 603343
9359 603343 599083 581673 704908 876703 668900 544263 590817 629140 658502 721608 653370
9348 653370 644533 677321 634470 676307 721057 638551 591772 559326 574424 611242 668408 623146
9336 623146 579860 573161 531131 587880 593424 684604 810606 771123 764941 976545 843403 767213
9324 767213 734688 581708 691263 795488 875471 760525 658485 796105 936521 883265
9314 883265 676229 680489 650772 792307 751821 659506 715545 637636 657859 681004 625042
9303 625042 764383 741650 696741 639207 638236 648511 529240 418430 596163 758884 683765
9292 683765 790459 970054 851759 843846 877352 716386 862774 831682 732361 769691 748615
9281 748615 850249 815481 746192 757366 753643 781083 901513 869628 879224 729369 752628
9270 752628 815879 796547 882050 809063 889102 1001881 934517 938488 938058 772930 779556 802179
9258 802179 815857 708494 621588 870367 995397 1038068 943554 995884 993334 905779 855102
9247 855102 1069338 1014960 975230 1140825 1156944 1098008 1260095 1343495 1240511 1187383 1287816
9236 1287816 1502355 1377718 1322255 1232488 1242246 1199988 1239280 1285636 1391848 1289645 1248409
9225 1248409 1113295 1186445 1423456 1267234 1277113 1367695 1351869 1352406 1526939 1447479 1468094
9214 1468094 1552656 1463335 1489856 1502047 1548146 1455483 1479179 1546046 1581146 1685251 1692113
9203 1692113 1720735 1601617 1551954 1712156 1692004 1524273 1630219 1760247 1740628 1780270
9193 1780270 1763048 1903009 1908666 1780844 1768717 1900030 2000530 2031217 1967479 1885618 1959118
9182 1959118 2057443 2169752 2162620 2116863 2215861 2303914 2285784 2262780 2319269 2345379 2498731
9171 2498731 2671261 2707891 2626611 2635983 2590893 2615342 2694827 2917441 3018308 2934825 2925698
9160 2925698 3105659 3146971 3170994 3207544 3284096 3272866 3431978 3570892 3534940 3552018 3483203
9149 3483203 3532738 3809505 3936736 3969771 4054110 4168145 4325382 4606550 4611979 4639492 4856580
9138 4856580 4942022 5098229 5401587 5723731 5879888 6057582 6389152 6912633 7316951 7519437
9128 7519437 8018453 8265378 8160790 8310278 8313697 8323429 8380933 8749718 8795260 8813618 8709909
9117 8709909 8446945 8280288 8058159 7950993 7774192 7573805 7683505 7795241 7757979 7794950
9107 7794950 7841447 7806031 7956251 8111721 8356573 8585411 9023969 9347634 9787434 10050873
9097 10050873 10447212 11052341 11684671 12246992 13079290 14190641 15169066 16146163 16814084
9088 16814084 17475525 17857901 18221431 18323028 18343789 18353868 18317849 18373758 18417004 18300110
9078 18300110 17856858 17138051 16357521 15578629 14673602 14142655 13604799 13198426 12865021
9069 12865021 12535562 12324077 12241629 12178793 12192591 12276764 12380743 12674828 12965173 13351817
9059 13351817 13837013 14407170 15150718 15835719 16668743 17755371 18900732 20231563 21351644
9050 21351644 22230659 22996631 23491826 23385299 22963428 21975560 20883780 19706771 18559425
9041 18559425 17611750 16825488 15950240 15237765 14729797 14265344 13964648 13775546 13710678 13544575
9031 13544575 13511673 13568208 13593202 13699794 13753254 13946185 14283557 14537172 14722369 14929848
9021 14929848 15495495 16094775 16613649 17480125 18172501 19121268 20228661 21624413 23063902
9012 23063902 24716933 26564292 28192522 29669837 30658082 31455834 31626060 31412256 30831195
9003 30831195 30029730 29040539 27916900 26896591 26102679 25323743 25022267 25047966 24993452
8994 24993452 25236579 25537382 25947871 26239201 26197136 26167619 25934315 25332592 24777524 23915756
8984 23915756 22948753 21806314 20561013 19368510 17965848 16566739 15356415 14237052
8976 14237052 13166453 12312292 11546865 10907330 10383974 9839249 9445436 8987013 8488250
8967 8488250 8169198 7697671 7347024 7118820 6865880 6567854 6306000 5968833 5965028 5682025
8957 5682025 5516455 5368839 5278371 5207540 5193269 5164539 5117143 5020048 4937240 4858695 4740502
8946 4740502 4531552 4606145 4378336 4092745 4048360 3838830 3849730 3741543 3605194 3417408
8936 3417408 3206994 3074914 2900677 2778940 2885469 2846286 2885804 2881508 2883742 2682139 2654941
8925 2654941 2590470 2671473 2656286 2553053 2497859 2448702 2557302 2628182 2534426 2467103 2457955
8914 2457955 2353158 2300405 2427638 2369847 2495708 2614356 2549833 2403568 2436382 2425799
8904 2425799 2505243 2282496 2295147 2357296 2443822 2379851 2577566 2660967 2680347 2534158 2434163
8893 2434163 2619036 2770934 2759241 2632145 2774956 2797834 2960286 3189903 3297824 3279191
8883 3279191 3410277 3368971 3416569 3576535 3714734 3626415 3718523 3682953 3763149 3850153 4130857
8872 4130857 4247379 4401893 4431741 4538210 4766720 5047621 5336659 5664524 6014378 6324029
8862 6324029 6672288 6871012 7015362 7161164 7066552 6951464 6834094 6707797 6556911 6509902
8852 6509902 6644510 6934307 7246921 7424557 7609168 7876486 8270069 8476895 8535996 8493690
8842 8493690 8532600 8505424 8449670 8265731 8084816 7973469 7907382 7709234 7516342 7601423
8832 7601423 7567075 7625080 7823346 8261670 8668719 8985645 9186298 9382216 9324807 9069145
8822 9069145 8825752 8481932 7997686 7785025 7471880 7293792 7126903 6941448 7155667 7177584
8812 7177584 7225191 7148759 7250777 7188623 7195817 7028225 6915476 6858887 6689385 6545679 6268489
8801 6268489 6058143 5777035 5542160 5315475 5041663 4810120 4668569 4619023 4616464 4679203
8791 4679203 4680996 4543172 4444098 4415294 4260446 3805305 3679965 3333991 2955424 2731562
8781 2731562 2670817 2423996 2409451 2336722 2085167 2144553 1992345 1778011 1730555 1708716 1647324
8770 1647324 1654621 1684511 1656085 1448377 1435909 1451554 1349874 1243581 1299349 1136488 1026450
8759 1026450 1011732 1098247 1131883 999932 889560 733757 779719 895193 842864 709075
8749 709075 533759 683070 711587 716822 628907 679621 673692 614226 564255 573125 578329 661505
8737 661505 524405 617642 497054 378933 499369 529799 339218 270511 470443 432012
8727 432012 512088 509121 382601 406466 438989 365189 315423 302143 239594 264527 197657 157707
8715 157707 364013 354218 219762 247185 253365 274727 341512 228080 237215 274479 355161 342398
8703 342398 267662 205373 112234 197216 224967 165348 165588 223543 326987 265082 225585 43578
8691 43578 101280 151606 234403 194053 238852 221375 211132 242096 315129 381690 100329 69812
8679 69812 238282 297907 299554 127737 338078 286652 211299 121350 61187 80538 96761
8668 96761 189089 197887 266154 229248 234394 284633 379654 147621 208912 193191 120288 290495
8656 290495 307770 298933 281164 373321 312384 229390 181653 252851 211843 158692 85516 -20398
8644 -20398 39896 66928 -17012 115364 123709 153908 50167 -67091 76873 89088 157001
8633 157001 173644 131991 -35357 15728 238691 110390 186760 44834 12484 267919 294055
8622 294055 243607 307985 299210 227647 157340 6841 -76059 49045 10545 -86272 39684
8611 39684 -8607 37342 -62977 68435 132411 -54479 -163211 36067 89343 58300 86673
8600 86673 123947 -98496 43518 145902 36465 -46081 -1766 -119419 -18189 -21263 -135223
8589 -135223 -104241 -35603 2640 -81115 40815 -23967 63016 81255 83017 91798 12700 -55196
8577 -55196 11476 -109154 -64336 -29413 -118250 -99686 -78120 113879 121630 109591 31275 7765
8565 7765 -77951 -44015 -29127 61468 189736 193040 -46581 -18897 -3872 164040 31381
8554 31381 -74349 -47016 -49297 129854 70243 104830 100973 99181 -73716 -171416 -120015 -81620
8542 -81620 56988 23271 -69447 89752 -37806 -3290 -19743 -90956 -40995 -176917 -110401
8531 -110401 -56478 -50505 -55787 -205313 -165236 -133581 -165393 -165696 -129479 -116875 -86427 -106821
8519 -106821 -119967 -155711 -113680 -42492 38742 -62625 -40951 -185163 -22349 -118704 -249676
8508 -249676 -201201 -271093 -111630 -82902 -101509 -18691 -54860 -109237 -101543 235184 217221
8497 217221 108751 -16875 -60798 18681 104859 -12430 -170884 -106486 -76918 111096 155739
8486 155739 134205 139280 116458 -29726 52731 89331 59263 -88222 -65366 -61919 -175236
8475 -175236 6541 -121067 -114047 -60027 -81852 -140019 -195780 -43643 78162 -35244 -77070
8464 -77070 97824 -19843 -138934 -186626 -134481 -107932 -145362 -145262 -121658 -165862 -116565 -82571
8452 -82571 -80707 -200715 -209368 -219085 -126596 -125545 1664 74469 -37742 -153954 -39569 -17343
8440 -17343 -67965 -51043 -183860 -179335 -130384 -54158 -57354 37146 -651 -93423 -168831 -169760
8428 -169760 -90272 -86584 -117843 -109992 -90797 -15436 122866 26520 -54808 -96930 -101786 -157850
8416 -157850 -72624 12314 -20787 -134328 -168057 -169348 -266578 -339709 -293473 17429 35422
8405 35422 13100 26621 77933 -66945 -156046 -93072 -199132 -106066 -274243 -316452 -124786
8394 -124786 -116300 -236066 -219536 -250178 -175183 2708 -187624 -236870 -13797 -13525 -183048
8383 -183048 -341170 -278899 -422486 -291799 -86131 -92586 -186308 -167516 -135539 -74645 23887
8372 23887 -53878 122880 -49580 -23795 -118454 -271461 -368407 -429089 -561705 -393068 -104699
8361 -104699 -188934 20719 -41268 -139621 -145146 -179340 -71897 -53738 12056 83087 -4238
8350 -4238 -33556 -87554 -45119 -184312 -194105 -175687 -278085 -211463 -247379 -196687 -166778 -82018
8338 -82018 -30629 -14249 -138573 -193514 -117844 -124540 -48119 -82934 -209020 -147430 -141105 -27046
8326 -27046 -53144 -55318 -59250 -151103 -198961 -140683 -188497 -165408 -79782 -82379 -142669 -278871
8314 -278871 -161888 -156605 -4703 16602 -95994 -179399 -151074 -187686 -242633 -192228 -61431
8303 -61431 8738 -106283 -195529 -158809 -62211 -176297 -160651 -143631 -108914 -197016 -139167
8292 -139167 -151410 -143441 -27725 -67884 -35117 -16001 -58587 -101380 -160436 -71849 -77475 -112855
8280 -112855 -147029 -128243 -83503 -43970 -139046 -88687 53036 -44249 -212481 -92477 -151354
8269 -151354 -245901 -129317 -131415 -141086 -181238 -174970 -334781 -177303 -112945 -228813 -215414
8258 -215414 -272259 -152543 -101601 -71638 -237627 -196563 -100320 -56983 -16517 -88622 47490
8247 47490 17608 -114554 -255255 -60751 -95003 -185939 -123480 -183087 -192676 -173851 -95683
8236 -95683 78917 -68186 -217825 -226192 -208051 -119695 -49194 -219348 -410552 -132010 -58733
8225 -58733 -126091 -36705 -201571 -82572 -232066 -349013 -332170 -204152 -226692 -18110 -63589
8214 -63589 -166900 -50649 -6061 17075 -4339 -84822 91231 -148870 -318569 -207229 -30764
8203 -30764 -23582 115621 119202 28865 97126 54844 12257 153764 74401 -224346 -620478
8192 -620478 -2044698 -966709 -281966 -214208 -155822 -206650 -64636 -154674 -53914 -69525
8182 -69525 -125437 16178 -145921 -35036 -23191 -79980 25049 -148578 -62306 -129792 -160796
8171 -160796 -87487 10566 -66663 -121451 -134890 -28156 -138956 -159938 -186335 -133271 -188519
8160 -188519 -121414 -55136 -160516 -82367 112508 -92998 -43065 44673 -80919 -195233 -305787
8149 -305787 -118316 -106569 -79369 -5989 -93611 -249026 -279146 -254531 -260802 -146227 -34653
8138 -34653 -44155 10741 54214 1256 -110556 -402300 -415933 -315001 -257093 -209504 -164051
8127 -164051 -162431 -215479 -179355 -56756 -273017 -203720 -15060 -86586 -250971 -140710 102244
8116 102244 -29152 -228753 -160371 -215582 -211793 -82993 -38176 -104874 -192274 -91115 -122731
8105 -122731 -29711 -96000 -122710 -136015 -180783 -285106 -144617 81744 5348 605 -47357
8094 -47357 -188955 -107259 -24389 -97996 -49104 -214302 -253584 -90489 -81445 47023 -19479
8083 -19479 -15175 -156570 -192005 -141421 -171304 -85069 -119558 -139616 -117450 -104660 30483 -57642
8071 -57642 -109385 -11288 -106314 -278718 -223400 -190714 -91178 -138140 -190405 -193018 -160666 -272451
8059 -272451 -200549 -244545 -165152 -285326 -179190 -194640 -218295 -119170 -131605 67403 51089
8048 51089 -129548 -135958 -1774 -160400 -55617 -40029 -37500 -103905 -151850 46017 157967
8037 157967 -159747 -141121 -195090 -184083 59785 37679 -71399 -86821 -126103 -103607 -142001
8026 -142001 10391 -49987 -208531 -300545 -153158 -103424 -222622 -145602 -45276 -22236 -8805
8015 -8805 -120101 74949 -110991 -174429 -216501 -215788 -141164 -201849 -181964 -305970 -221311 -79738
8003 -79738 -42496 -197093 -318155 -247047 -89159 -61029 -140240 -252700 -233555 -166543 -115785
7992 -115785 -151113 -33682 71936 123994 -86217 46419 -75105 -247352 -103107 -197070
7982 -197070 -171519 -180136 -239318 -310367 -125563 -130219 -35360 -165567 -164202 -8841 6259 37281
7970 37281 -54767 -104190 -277229 -239185 -263576 -281853 -204183 -62894 -78063 50056 -80031
7959 -80031 -123901 -207535 -196142 -213455 -186550 -48119 -108471 -52641 -113770 -86504 -199961
7948 -199961 -195565 15361 54837 98808 27989 116730 48603 -15878 -65624 -198466 -90267
7937 -90267 -49169 47935 40483 -19554 -135937 -178849 -114809 -120567 -103530 -191127 -186169 -62277
7925 -62277 50868 47018 -157487 -178582 -276398 -379602 -304687 -69269 -123333 -96545 -127739
7914 -127739 -100674 -20053 -181105 -43165 -34504 -91166 -95863 -134255 -190821 -150661 -169165 -141246
7902 -141246 -23879 -57951 -30891 -163181 -212028 -60295 -83576 -61855 -26572 -221403 -283962
7891 -283962 -413841 -254880 -130192 -176603 -77639 -69078 -136736 -169058 -112558 -158439 -181306
7880 -181306 -291265 -52381 -49675 -164454 -340425 -345381 -185340 -104535 -45788 -42638 -77778
7869 -77778 -118516 -72917 38681 -69362 -383125 -294497 -130414 -123293 -93999 -194070 -106102
7858 -106102 -107669 -200238 -162827 -33150 139901 -110115 -223475 -241938 -185360 -208144 -234552
7847 -234552 -326574 -129296 14829 -11022 -108348 -167142 -119453 -161739 -92430 -43697 -174241
7836 -174241 -203889 -49968 -35906 -13280 -41107 -39360 -1759 -5040 -53635 -79479 -144723 -162069
7824 -162069 -129316 -28503 -63024 -113784 -72806 -71612 -99892 -89636 18242 -63190 -193238
7813 -193238 2396 68767 -171309 -208391 -131115 -249077 -288605 -140173 -79668 35926 -24147
7802 -24147 247723 153861 -214084 -214048 -276590 -149384 -169231 -164652 -210274 -71636 -30402 -84518
7790 -84518 22058 -8808 -7561 -74526 -211550 -165444 -151346 -263922 -179057 -115739 -75872
7779 -75872 -53528 -161505 -317220 -419728 -376667 -322742 -185539 -45028 -76809 -48092 -132344
7768 -132344 -234903 -298327 -236512 -52015 -101276 -12834 29945 131184 58118 -37086 -66359
7757 -66359 -84242 -251937 -111058 -67202 -110645 -209708 -140999 156997 81600 -38799 2422
7746 2422 46648 -126611 -265715 -109663 20918 984 -47574 -202603 -161593 -150817 -200831
7735 -200831 -291115 -74706 -180090 -245929 -195260 -103004 -108974 -79213 -131169 -297622 -305349
7724 -305349 -96038 97253 118714 22863 -150396 -15098 -31111 -148051 -177096 -163652 -127863
7713 -127863 -319118 -341255 -308014 -270661 -311099 -343645 -294882 -123644 -69939 -206101 -166747
7702 -166747 -101110 -100285 -225174 -109538 -9791 -179292 -233637 -222694 -216389 -24415 -15694 -3662
7690 -3662 -75825 -143092 -135810 -254126 -274078 -70738 -182048 -240021 -229549 -187138 -200071 -275588
7678 -275588 -172675 -83486 -112559 -203637 -239875 -231367 -83680 -40934 13327 -192287 -104664
7667 -104664 -119161 -204459 -168301 -148230 -98851 -67815 -148428 -80389 -192033 -155979 -16947
7656 -16947 -23363 -32366 -70260 -94223 -186027 -25936 -92350 -156531 -116179 -37496 40986 -121444
7644 -121444 -146104 20522 4895 -123431 -137431 -160181 -207742 -14263 -45878 -60921 -104129
7633 -104129 -156820 -151598 -138597 -192776 -209350 -105298 2739 -14769 -17612 -146301 -354037
7622 -354037 -251967 -171836 -199824 -138453 -156454 -180332 -14925 -72258 -204759 -190475 -172903
7611 -172903 -47432 -38708 -152607 -136345 -37899 -69360 126015 149650 -17159 -65998 9821
7600 9821 -2321 -31350 -192950 -97367 -153453 -175618 -28284 -171194 -155353 -162371 -108282 -159893
7588 -159893 -229166 -232370 -44629 125266 -18140 -44924 -991 -162213 -153595 -65015 -189124
7577 -189124 -266589 -182073 -199898 -163824 -148587 -128308 -127616 -151314 -127620 -83987 -51134 -57319
7565 -57319 -96139 -186989 -99023 -66219 -48523 64157 -78495 -272528 -214159 -140807 -61698
7554 -61698 -27876 -150480 -220106 -187635 -235189 -103085 -39994 -143308 -82016 -69794 -48815
7543 -48815 -249664 -274147 -165591 -143661 -151155 -43326 -48128 28059 -32078 -130072 14279
7532 14279 -88362 -127521 -67148 9856 -122326 -168057 -52955 -3996 14028 27360 52092
7521 52092 75408 -64900 -131657 -32803 -20801 -12480 29253 -155840 -383113 -129078 -98161
7510 -98161 -72708 -196386 -136548 -75169 -76191 -18368 -100392 -156240 -248092 -61876 -47721 83199
7498 83199 185533 150990 56861 -15445 -120215 -157646 -232229 -212209 -197800 -175480 -175975 -204159
7486 -204159 -24968 118617 -7363 -131922 -48080 -156215 -263639 -238777 -32001 -5295
7476 -5295 -102611 -36189 -172936 -297798 -59700 -105074 -64380 -79374 -168478 -221145 -121133
7465 -121133 -276506 -261846 -293085 -246432 -186214 18051 -70610 -204220 -171707 -68901 -136780
7454 -136780 -173030 -52045 -159817 -141789 -146796 -132337 -101789 177269 100246 -136370 -210730
7443 -210730 14377 -73076 -177225 -340658 -135058 58599 76037 4530 65417 78319 22932
7432 22932 -58632 -77350 48845 46771 -149935 -177999 -47101 -14636 -23377 -129015 -164631
7421 -164631 -95587 -21143 16394 -34925 -88665 -69365 -39120 -190520 -91861 10259 -42912
7410 -42912 35013 -138737 -161326 -49067 -51726 -181920 -304905 -307660 -279945 -287057 -307547 31170
7398 31170 -3571 -129213 -272080 -222920 -157729 -212587 -58900 -94545 -82984 -162542 -112259
7387 -112259 -154591 -261896 -203911 -47827 21056 61392 13066 -73770 -99644 -17906 -15633
7376 -15633 -19851 84629 59872 58376 -91002 -145295 -132345 -305910 -316450 -125280 -83908
7365 -83908 32119 36404 -54161 -61772 -74564 -157403 -124824 -83402 -3923 -11367 -2430 7084 -201613
7352 -201613 -61150 68463 62068 -66131 -206125 -215518 -155863 -203452 -204131 -70580 3914
7341 3914 -92001 -54826 -15922 -7953 -220826 -150185 -37635 -110151 -129207 15658 4445 -103986
7329 -103986 -129027 -163456 -153324 -198311 -174817 -65027 126329 45702 19313 24065 -23970
7318 -23970 57096 -105694 -60222 7516 -105223 -34284 -123879 -278856 -245888 -89827 -184753
7307 -184753 -127586 -64710 24458 14365 -69145 -21422 1373 -5946 -94289 -169810 -256177 -205998
7295 -205998 -245445 -281773 -242288 -88565 -91092 -221991 -324366 -286595 -262034 65371 214192
7284 214192 48447 -9336 75582 51972 64420 80108 -25692 -273694 -294568 -113017 -107469
7273 -107469 -24259 47407 98048 -24624 -88255 19519 91370 38768 -96360 -180799 -85190
7262 -85190 -86482 -132598 -220367 -189988 -212969 -169324 -214898 -247514 -272841 -103585 -82183 -385719
7250 -385719 -253078 -325616 -255331 -96943 -92611 -52831 -136374 -126122 -213869 -368698 -385379
7239 -385379 -253599 -52130 31752 -86525 -103381 -146346 66972 -8141 -27198 -8973 -101965
7228 -101965 -111709 -163180 -184507 -35706 -10638 -119777 -103098 -25535 128309 14804 -52533
7217 -52533 -100210 -76858 -111894 -42492 -96112 -152424 -73738 -21643 9101 44063 -108725 -138679
7205 -138679 36494 56957 28447 -118690 -46714 6863 -16894 -169300 -114051 -83532 -353671
7194 -353671 -147759 -1396 94000 -19561 -253230 -214649 -194097 -65524 -86087 -101098 -3976
7183 -3976 41874 -6159 -84157 -126417 51815 -94888 -154708 -15788 -100191 -118255 -211698
7172 -211698 -156551 68778 77854 -95814 52569 -62082 -24665 24659 -71905 -138915 -153638
7161 -153638 -60710 -48714 28641 47120 -194101 -329210 -235384 -129499 -131350 -110798 -119447
7150 -119447 -119632 -91402 104658 -7322 -160085 -12217 -25323 -112802 -62962 185285 47047
7139 47047 -11266 -86980 -95521 -194694 -140435 -185041 -222541 -233614 -224082 -124899 -228512 -244453
7127 -244453 -52061 90142 75136 128363 69351 -5891 -22961 -30973 -419 -62327 -93959
7116 -93959 -7175 -124271 -186783 -154468 -209049 -163527 -118127 -73084 -44224 -21489 -86361 20566
7104 20566 2036 17190 -104109 -111543 -101768 -6070 16270 -43481 -129779 -197802 -104749 -256760
7092 -256760 -236144 -155814 -63143 -82952 -130101 -249255 -96974 1990 -115237 -131158 -228728
7081 -228728 -131717 47320 -44988 -139871 -187613 -53643 40102 -30484 -2628 29090 44144
7070 44144 71304 -97165 31211 -18535 -27379 94898 159960 115209 105915 17810 -52553 9021
7058 9021 -80125 -37214 -22633 -44463 -18949 50097 61681 -27856 94334 -1762 -109450 -144581
7046 -144581 -112689 -59383 -51239 56353 46306 -12260 37579 159150 87278 89718 -57676
7035 -57676 -71864 19067 -113289 -51480 21911 -17921 -99013 -56865 -147552 -37254 68263
7024 68263 99332 11932 -108616 -171906 -112486 70578 -34487 -123062 -137470 -91856 9180
7013 9180 54972 -123595 -170168 -162678 -135371 -114053 -37386 93569 79504 -22011 -271109
7002 -271109 -337408 -81152 62166 33029 -44273 -101882 -1334 -25297 102434 170966 118705
6991 118705 42763 -105542 -40375 -75754 -238 47099 61531 189438 -10413 7186 28130
6980 28130 -115176 -20427 8992 70855 -82915 328 -54723 -8505 -4448 -98232 -211805
6969 -211805 -95497 22934 31714 55234 58078 109754 31296 -160850 -79185 86276 57154
6958 57154 22686 -11449 -126859 -56278 124216 -44882 -55817 8368 -152 -63550 -9709
6947 -9709 -112390 -4994 -47837 -28845 58580 3311 -97420 52941 157546 -13470 -83416
6936 -83416 -174766 -64871 -45129 35125 63001 147634 124740 151921 153242 131042 41551 94170
6924 94170 71943 152138 -88865 46226 147397 27006 -78349 74882 277427 74703
6914 74703 122630 117968 112532 -51093 -64189 13696 2487 -6510 74609 -33826 -39812 -68686
6902 -68686 -73415 -12986 6778 -23510 -192565 -154752 9875 32367 -16799 24820 14753 22221
6890 22221 24372 71201 81968 40656 29411 -18692 39778 -33241 -11887 -69211 -28748 -116311
6878 -116311 -148316 -130256 -77114 128277 228992 114741 179389 -12338 -72133 -14807 -22965
6867 -22965 -171608 -116636 -124522 -110922 -148318 -95566 49008 23677 17501 -91409 -57805 -182285
6855 -182285 -85727 -61499 -105380 50761 37935 -99736 -49090 -51260 -123496 -203536 -101389
6844 -101389 32489 38370 11721 67915 64287 -49485 -39814 -60673 99661 202365 159881
6833 159881 133486 22480 81250 47954 -25530 -52563 -15556 -67317 -27312 -154521 -175543
6822 -175543 -12419 -18032 232481 299952 33068 17731 41169 189194 187952 29727 50856
6811 50856 -91686 -15438 -10649 21230 -49611 -147846 -81756 -62210 -1070 30022 123010 30436
6799 30436 82611 219191 339033 94972 -100658 28115 32415 32424 -72632 -3677 -58486 -104300
6787 -104300 -109791 -31446 -103855 -204640 -253468 -232806 -147527 26036 28376 100832 207107
6776 207107 123720 80818 14551 159563 -74875 -111813 52987 24267 11030 -43154 -61060
6765 -61060 1140 26788 -10962 104120 -31233 -30729 41273 31138 95021 -141536 -137774 -46589
6753 -46589 -61036 -16923 35360 -58211 -58401 34624 34574 80788 188777 160818 6887 -56145
6741 -56145 82408 121934 275906 203342 102268 -2484 90460 140182 132599 67895 -40691
6730 -40691 -36182 -86956 -10041 -56219 -69905 -5742 82281 81165 121812 134755 225463 122389
6718 122389 73890 242754 240191 105106 -47696 24753 29250 71247 114125 129244 -6883
6707 -6883 -88650 -84622 -101913 -87782 103374 70720 70300 -106879 21316 -48999 -12694 32098
6695 32098 -36537 41298 174871 107784 81584 86798 30756 201644 112856 259224 243628
6684 243628 242784 132739 108515 25416 48184 80457 175378 104888 218648 225773 251580 190292
6672 190292 173543 306816 283920 51140 -2847 157557 179661 186138 265090 244793 207342
6661 207342 138699 243419 148101 97694 170670 254006 289797 301768 278190 223829 147795
6650 147795 143349 84434 124996 87278 91745 80623 216570 223002 319626 504504 237475 458536
6638 458536 437574 326017 439276 360365 290648 269438 327606 436525 249909 166587 242384
6627 242384 272936 390844 399144 270933 238232 135282 325363 382671 360561 342511 311210
6616 311210 296784 260510 318912 362788 299120 191902 344086 373411 491337 503306 480590
6605 480590 423789 362610 460099 588050 379619 179370 344315 322913 212060 232546 318069
6594 318069 338162 410832 376521 370599 334848 362946 254794 476531 506741 327493 364046
6583 364046 471895 293155 300082 389902 429647 356409 235793 201726 205797 218081 317424
6572 317424 354276 463443 394360 298983 372157 320906 340246 261893 290210 351786 559662
6561 559662 357792 255727 350337 294260 380187 186142 302727 446375 343518 317666
6551 317666 297904 397653 332252 284502 223712 285248 268376 297817 436344 373363 302264
6540 302264 206219 316814 406445 394180 377675 421679 377833 235032 375590 411671 484864
6529 484864 550672 487480 409470 445238 327842 280531 282089 343518 494123 420955 524267
6518 524267 586058 433571 405177 479621 524990 498824 454634 419624 504516 458676 375955
6507 375955 380826 553843 492348 467189 545369 462814 537775 517638 463058 491796 537113 447469
6495 447469 412184 546142 564341 532238 623586 693036 656475 599862 543860 628171 667254
6484 667254 654488 461194 584761 764996 794644 680499 587732 561409 740466 759748 588678
6473 588678 671068 616123 582967 612777 833815 720132 584310 497880 796213 836329 666734
6462 666734 765776 715757 774378 925587 764580 803698 768039 826541 997936 847284 785948
6451 785948 836061 984425 917771 830646 898259 1048297 1035643 975136 921119 950772 1030997
6440 1030997 929383 1071474 1133619 1143133 1055238 974078 956204 1048633 1021550 1137890 1208105
6429 1208105 1152705 1186035 1159446 1106542 1102445 1360734 1293981 1343870 1305967 1183734 1380461
6418 1380461 1341027 1386470 1531424 1385031 1218397 1163576 1258728 1412803 1484446 1455454 1603516
6407 1603516 1664471 1642948 1633921 1668005 1594342 1629811 1576531 1774825 1880235 1885411 1845736
6396 1845736 1877611 1861873 1964959 2020415 2009152 2174518 2196873 2246777 2202475 2263001 2261292
6385 2261292 2305966 2412711 2377390 2317108 2455212 2388245 2503245 2566234 2575934 2648545 2855412
6374 2855412 2953742 3014743 3119387 3177882 3270820 3370263 3391950 3385732 3480044 3584194 3667837
6363 3667837 3704767 3790387 3961328 4032132 4078194 4117141 4380856 4624873 4802920 4907042
6353 4907042 5063804 5427824 5455992 5574640 5934075 6025893 6286698 6681284 6772910 7246590
6343 7246590 7503400 7631998 7856158 8175845 8494115 8679399 9032454 9459506 9520428 9681611
6333 9681611 9794618 9979227 10342623 10619318 10810496 11035079 11274694 11558672 11830405 12232865
6323 12232865 12791080 13249750 14045640 14607468 15081506 15366922 15740349 16247507 16646794
6314 16646794 16761354 16667623 16719617 16605574 16432279 16248183 15884862 15582854 15536945 15373408
6304 15373408 15426415 15446592 15467726 15474258 15551208 15748124 16003737 16315646 16545176 16858920
6294 16858920 17164994 17134512 17158387 17123222 16825239 16532469 16087513 15560409 15011411 14357274
6284 14357274 13734493 13138210 12366288 11969411 11628913 11209335 10898705 10684934 10288128
6275 10288128 10179228 10036066 9890245 9686649 9508953 9440294 9316974 9106877 8838812 8676882
6265 8676882 8264503 7945055 7643292 7275236 6915301 6352898 5966941 5742545 5423191 5173952
6255 5173952 4976847 4808376 4596691 4469198 4190511 3911108 3724385 3579563 3491292 3252677
6245 3252677 3152682 3023252 2938826 2855659 2639238 2571676 2629579 2573091 2409730 2238046 2284673
6234 2284673 2299820 2279452 2201080 1992893 1794094 1811333 1821015 1841826 1717705 1588698 1664630
6223 1664630 1647572 1607845 1534367 1534671 1508102 1482866 1531551 1429498 1302581 1305759 1314179 1244836
6211 1244836 963316 1220790 1318487 1229955 1267971 1125075 1071558 934947 887164 907109 800550
6200 800550 799438 764954 779645 838773 789084 782720 874713 843853 929910 950462 995138 912830
6188 912830 891996 840915 755432 682482 596611 597220 713882 762439 726684 671559 542635 560255
6176 560255 748583 786277 736957 714256 646252 605159 577001 559498 636588 642800 433604
6165 433604 676374 715686 616748 602338 478229 452051 684840 579495 401336 350879 361667
6154 361667 428107 503899 467242 418998 428339 479567 435528 404088 379394 497917 507591 501732
6142 501732 446539 422145 482740 571958 542109 393396 559692 658458 611888 462373 389977
6131 389977 344268 318255 300324 257373 389906 342626 282423 425403 368246 510091 517416
6120 517416 517000 515839 472052 367521 470521 524728 399738 416126 469164 433450 454226 326227
6108 326227 231279 203358 272368 190098 205554 393010 416342 322584 453339 488655 301716
6097 301716 318079 293362 408791 581321 401800 299917 268838 350537 501474 429477 291160
6086 291160 360975 485450 482553 468894 500166 630628 486804 393969 433805 394703 408270
6075 408270 501865 576062 501668 559671 568198 610233 476603 429954 538553 429915 355704
6064 355704 360440 343725 361671 363516 311243 544867 540480 609556 663872 618686 455623 385227
6052 385227 313953 354526 320854 373512 530996 672428 517919 538295 665378 598758 485528
6041 485528 453259 486493 525460 598999 494517 386402 350019 294201 286061 376052 437190
6030 437190 329250 429419 507940 546449 483273 644171 652927 565099 611239 453347 536401
6019 536401 564803 655351 633497 504062 638281 594480 545672 624161 740101 705171 383106
6008 383106 359674 645605 687770 572866 654480 574407 534754 421389 329844 319794 583913
5997 583913 607837 665765 580143 629171 721571 551919 585845 626824 688799 684875 563723
5986 563723 439123 680746 655255 542981 647902 738464 822206 616890 832356 899202
5976 899202 730817 802865 737767 701405 751273 801395 793140 647356 536155 586945 629486
5965 629486 721493 794105 788726 852859 822033 752655 535521 477416 679031 845266 896080
5954 896080 821608 659056 608083 420926 434272 586934 775523 745467 661887 808626 643870
5943 643870 553897 589345 834309 923811 903017 715529 624576 697021 629287 692738 727787
5932 727787 675351 641532 685967 879207 801268 828259 768790 622292 687054 646019 728197
5921 728197 693012 598729 636396 597751 589701 709321 735011 746980 860674 782976 768920
5910 768920 684181 776220 812665 744008 727949 784924 807595 778345 862078 881679 907142 849658
5898 849658 842488 754562 772238 699506 613934 785573 843694 957510 1093569 1028281 1022501
5887 1022501 1084979 1006913 955773 885389 763300 775972 902039 957771 901551 942879 786047
5876 786047 822759 887941 1001758 1032166 978553 1063736 1093354 1104613 1077130 943157 1012786
5865 1012786 1041709 1040402 1047229 947993 956403 1177149 1084927 846826 836201 1082488 1150272
5854 1150272 1083451 1174246 1162151 1103213 1109708 1038877 927516 996569 841251 902429 1027128
5843 1027128 1054624 958545 972245 910594 944456 963036 1012109 1049690 980544 1030611 975941
5832 975941 1173464 1336442 1260245 1180473 1106856 1181152 1215660 1212108 1207050 1268324 1287306 1372208
5820 1372208 1403124 1304218 1383292 1391071 1396976 1369816 1322523 1271474 1303249 1339458 1424227 1329798
5808 1329798 1322243 1391591 1224236 1300784 1433498 1517424 1563066 1627050 1479781 1494192 1527773
5797 1527773 1578229 1619543 1676756 1723883 1734514 1777948 1774341 1652348 1609677 1616414 1826800
5786 1826800 1949802 2005040 1859548 1898149 1987880 1964324 1962374 1909899 1921543 1976143 2106903
5775 2106903 2138313 2037621 1971709 2067226 2124986 2123505 2217345 2191778 2104871 2186419 2160511
5764 2160511 2246831 2187814 2174204 2102511 2100609 2222947 2319718 2460653 2536761 2482443 2455578
5753 2455578 2424961 2408807 2375249 2600539 2626711 2701101 2757126 2784861 2774893 2751291 2999741
5742 2999741 2947148 2863663 3103014 3148664 3208432 3104742 3065129 3116624 3235633 3298898 3507152
5731 3507152 3595214 3491178 3551046 3589981 3715855 3662227 3767489 3948299 3928033 3994923 4056545
5720 4056545 4133266 4222036 4281169 4323178 4357510 4422922 4483855 4607394 4796253 4731951 4871301
5709 4871301 4935952 5182972 5350188 5632416 5871715 5667939 5845420 5946395 6079707 6221448
5699 6221448 6474263 6432999 6589547 6955533 7018683 7237630 7519924 7643963 7865071 8193367
5689 8193367 8356848 8567901 8920105 9170703 9527109 9914604 10142482 10439321 10680313 11112212
5679 11112212 11670190 12083541 12750667 13184826 13764801 14309463 14724850 15087048 15440267
5670 15440267 15877448 16421955 16705260 17140523 17303688 17452474 17325459 17156583 17294906
5661 17294906 17543059 17650146 17759346 18008435 18242909 18616878 19008589 19441066 19972261
5652 19972261 20396655 20865605 21474091 21897461 22287657 22510945 22773703 22801994 22636965 22208460
5642 22208460 21981687 21541031 20943727 20215899 19563936 18860576 18383722 18006818 17496251
5633 17496251 17180484 16854427 16722733 16412868 16249016 16019480 15581267 15383013 15255342
5624 15255342 15164600 15053500 14844394 14415164 14220583 13935040 13543913 13280709 13022726 12394638
5614 12394638 11789497 11433140 11099930 10725903 10343230 9940761 9539378 9281784 9148370
5605 9148370 8930451 8683702 8470925 8151859 7831788 7584677 7393129 7250882 7174693 7040156
5595 7040156 7107038 6947369 6612232 6580242 6505706 6530412 6681047 6562711 6507870 6559275 6485287
5584 6485287 6377879 6292811 6352985 6327410 6468006 6418256 6322152 6412165 6537240 6753323 6716878
5573 6716878 6598174 6730585 6760639 6633575 6571029 6705364 6896197 6841846 6956897 7074828
5563 7074828 7070032 6997461 7109018 7205435 7334847 7392134 7406239 7312500 7248511 7302516 7404710
5552 7404710 7336278 7353591 7336656 7408808 7481142 7339778 7427231 7611963 7574577 7631202 8019249
5541 8019249 7999356 7992541 8231782 8224337 8225805 8177189 8413215 8549698 8349237 8320374 8581387
5530 8581387 8696408 8548040 8647183 8840566 9007593 9003674 9295013 9314574 9389188 9456017 9463062
5519 9463062 9655647 9828580 10151602 10395350 10570981 10680514 10784984 10796339 10720697 10838727
5509 10838727 11090115 11271404 11446608 11604162 11895522 12249861 12557427 12728091 12937310
5500 12937310 13103979 13400131 13624459 13843049 13975836 14165965 14252289 14434287 14661671 14826805
5490 14826805 14954270 15366970 15628569 15771509 16074636 16168189 16530660 16878380 17197954 17488430
5480 17488430 17888064 18285238 18770575 19203691 19715498 20293511 20754432 21163763 21505959
5471 21505959 21912453 22164964 22444692 22865548 23270734 23803278 24251162 24610660 25049971
5462 25049971 25368217 25696689 26240023 26710384 27240251 27773746 28341211 28843904 29469027
5453 29469027 30020639 30665372 31513331 32260634 32978480 33909908 34862340 35647412 36663937
5444 36663937 37812433 38810987 39779785 41009338 42408933 43864307 45480795 47034613
5436 47034613 48699682 50372911 51943999 53711660 55526528 57443735 59348888 61136125
5428 61136125 62929460 64603501 66579505 68593041 70697418 73145354 75721270 78455157
5420 78455157 81446278 84591668 88162008 92278269 97100904 102430732 108179163 114727935
5412 114727935 122551441 131506326 141832341 153669161 166936500 182605175 201172265
5405 201172265 222565931 247988930 279284065 318092035 364377377 415828705 464033770
5398 464033770 498737179 515703047 511802806 486020983 444694529 397265277 350006438
5391 350006438 307384943 270584398 238957536 212400107 190219478 171638570 156014039
5384 156014039 142716711 131289238 121249674 112279799 104413570 97840383 92016191 86632411
5376 86632411 81686660 77002290 72664533 68433731 64812116 61519114 58376624 55795304
5368 55795304 53153432 50834763 48759217 46913492 44984022 43003532 41239798 39491782
5360 39491782 37765432 36258637 34747610 33352890 32093390 31036341 29964837 28713629
5352 28713629 27592867 26725810 25927384 25232112 24462984 23793787 23131365 22546465 21882653
5343 21882653 21347783 20968183 20530965 20049031 19476619 18876559 18340031 17960398 17513543
5334 17513543 16872796 16138837 15586655 15115050 14593454 14008089 13629037 13312148 12985590
5325 12985590 12668480 12178393 11781822 11617641 11321080 10961777 10856889 10794665 10563312 10332500
5315 10332500 10129086 10067342 9923077 9711541 9612475 9366277 9059416 8744188 8584788 8549680
5305 8549680 8289249 8098668 7915099 7791892 7746805 7520960 7346515 7205750 7038592 6912190
5295 6912190 6616617 6422566 6345096 6152434 6126804 6107363 5920704 5885198 5835306 5632823
5285 5632823 5536899 5510481 5232212 5105187 5199124 5158856 5141768 4902545 4634475 4744668
5275 4744668 4816871 4864106 4768116 4635673 4384070 4228214 4248702 4192267 4075420 4093929 4090722
5264 4090722 3925404 3830599 3862178 3890996 3783567 3671549 3715677 3605730 3512632 3415618 3347435
5253 3347435 3353723 3355337 3376808 3386622 3239177 3074022 3129460 3138011 2935473 2805936 2782029
5242 2782029 2730825 2757733 2555835 2526955 2578269 2450383 2276933 2314001 2416839 2383518 2338794
5231 2338794 2484649 2541529 2406560 2521026 2429828 2293485 2241365 2223511 2269298 2191028 2262193
5220 2262193 2352294 2336895 2263302 2278766 2269093 2333792 2251711 2127451 2227999 2154180 2153792 2064663
5208 2064663 2061075 2061182 2021381 2079085 2148528 2057138 2051848 1926590 1965494 1935342 1940342 1990801
5196 1990801 1965471 1876646 1851043 1808710 1729926 1682749 1733396 1646403 1654241 1785000 1692077
5185 1692077 1675907 1710862 1642357 1502224 1545598 1470629 1391133 1319278 1468734 1437108 1266736
5174 1266736 1203545 1283211 1323250 1368510 1416716 1271963 1067994 960488 962338 1048177 1135852
5163 1135852 1152282 1139614 1242352 1167451 1281559 1166532 1116259 1217307 1106493 964440
5153 964440 1005711 1017420 907969 985359 1176817 1203118 1128468 996553 1031610 1047025 1037690
5142 1037690 1041203 918741 1001966 966009 1046898 1021058 938323 927755 792074 824634 845310
5131 845310 933278 921718 914651 904077 923518 824298 669053 768809 674297 593557 665695 817512
5119 817512 814409 752242 701248 512363 607875 630653 700273 574680 752248 787958 637327
5108 637327 599694 672582 592634 582356 697747 568249 599813 647354 798639 731056 654716
5097 654716 601707 658035 739535 739002 754471 613743 651607 709487 793603 765206 538057 468712
5085 468712 448682 496925 624881 750030 676150 508770 619139 845940 816735 667514
5075 667514 622776 668118 576795 502680 433948 618498 769160 704023 597457 528148 560182
5064 560182 462733 321993 387638 393458 452772 454669 488801 266247 324720 514123 395188
5053 395188 422434 579231 551564 534504 606533 556682 516399 442674 397072 419166 570871
5042 570871 667333 752483 740940 646918 525115 331402 553987 555507 480690 370003 472553
5031 472553 515605 626516 600914 491372 433782 443033 442526 309707 253471 489891 389284
5020 389284 303255 382489 483054 371010 327621 430026 596138 540717 515708 522392 405078
5009 405078 512916 564243 441764 411866 419883 537671 622950 532936 474297 404935 466489
4998 466489 394106 521429 459695 334652 333516 326695 185093 463563 465886 421593 429161 462862
4986 462862 442823 498866 404974 407872 442872 388502 392293 421729 345134 464681 637088 693408
4974 693408 534214 336706 344711 430170 310663 363326 298803 205479 192462 286784 243691
4963 243691 385748 409066 252610 366854 417947 548898 456376 318974 385632 553728
4953 553728 570903 628695 715816 514896 452599 486617 479447 525395 509704 435405 482843 497982
4941 497982 580304 584329 443190 480163 617756 630543 535610 521314 499016 378745 331823
4930 331823 432428 512687 417140 388774 400852 517901 467913 432861 449062 426075 210666
4919 210666 147802 344324 390101 353371 465912 441779 290295 360183 579523 717597 554668
4908 554668 545846 498404 503724 448243 553889 552557 645312 424554 436917 483266 671095 648874
4896 648874 539149 413957 546477 601081 611094 527514 505269 436965 408595 394222 509753
4885 509753 571343 348686 408528 224053 413295 389540 485540 422069 422132 563960 641814
4874 641814 730460 475716 494369 469111 453935 317166 478536 451883 240213 305731 473118
4863 473118 528337 433726 396606 243744 168961 307821 366545 329383 274609 378476 521732
4852 521732 562498 565867 428120 471153 329411 439024 537920 461618 429743 274638 183584
4841 183584 245204 430345 544545 517526 401336 284316 261479 394172 369109 350939 319668
4830 319668 253661 398433 463151 436204 471299 504431 382709 383950 292273 216659 292357
4819 292357 332519 249340 374408 509519 587265 618134 686885 640129 543351 562719 436209
4808 436209 521872 528140 368288 545634 721473 619199 654219 598372 608793 706612 626540
4797 626540 752832 750501 783786 956955 833425 677156 650411 511750 563241 669951 565012
4786 565012 614025 831819 627240 710141 609843 597490 658873 651220 629657 618991 666033
4775 666033 621590 565558 541467 642616 602482 586112 670394 710955 678002 549807 486571
4764 486571 616585 597210 759398 661293 774487 860986 731818 534006 473564 654443
4754 654443 767545 763117 747601 764152 694486 633570 645459 694004 626089 883505 907208
4743 907208 646277 726680 763900 705297 744242 849719 867334 958098 937877 874863 771126
4732 771126 799473 843560 811230 821209 1059544 1133062 1137030 1028635 1031945 1031591 922467 1075564
4720 1075564 1013126 972677 1062513 934622 1188028 1327022 1167733 967578 972238 1146949
4710 1146949 1233886 1364197 1319264 1152206 1110189 1246843 1404341 1471909 1474073 1413862 1410255
4699 1410255 1569059 1513712 1478425 1461148 1430019 1435727 1450788 1461239 1470123 1493695 1717122
4688 1717122 1680482 1776589 1706477 1610451 1840262 1951272 2003136 2129704 2110528 2125555 2112631
4677 2112631 2034232 1997731 2023107 2143316 2285910 2226789 2328088 2298851 2335152 2415265 2506914
4666 2506914 2582380 2687488 2671800 2771857 2964723 2948090 2969806 2929639 3187642 3256811 3147487
4655 3147487 3137848 3259229 3444295 3459832 3459469 3636233 3642985 3806558 4091581 4163140 4159919
4644 4159919 4364186 4405913 4366472 4453857 4589311 4825394 5098553 5218039 5314339 5586102
4634 5586102 5816009 5802672 5974466 6117080 6161861 6271707 6535605 6908343 7121106 7420459
4624 7420459 7752082 8113502 8432133 8658255 9139745 9471524 10076588 10806901 11375011 11941898
4614 11941898 12776938 13628798 14652956 15730534 16945823 18226945 19460771 20703831
4606 20703831 21898691 23158999 24314982 25625900 27084942 28625362 30052919 31129469
4598 31129469 31907770 32741061 33448258 34152659 35070815 36044085 36699680 37198919 37245647 36779362
4588 36779362 36092448 35473508 34759360 33943171 33086323 32280768 31347521 30110450 28855869
4579 28855869 27317683 25667021 24182981 22734165 21510456 20331069 19062717 17866249
4571 17866249 16588955 15332608 14189382 13199823 12189055 11092555 10153391 9483092 8824044
4562 8824044 8224829 7892682 7382987 6826238 6517133 6296766 5977425 5782423 5533680 5337832
4552 5337832 5195153 4920504 4541921 4279477 4210791 4094303 3886381 3757224 3593291 3454316
4542 3454316 3372707 3281792 3259305 3041916 3161599 2992026 2688206 2666269 2577701 2365150
4532 2365150 2369849 2548357 2497758 2640350 2447061 2270237 2256344 2155811 1989896 1969591
4522 1969591 1935422 1824996 1769347 1733481 1801707 1895731 1782194 1675306 1594727 1503821 1509109
4511 1509109 1448855 1401459 1387344 1418561 1311536 1286718 1253215 1314274 1310077 1105340 1118526
4500 1118526 1031166 932462 934960 1066626 1175087 937681 1094023 1069981 1000424 1037814 943838
4489 943838 953504 936433 799406 805870 748663 622214 675214 715420 715685 793691 590159 552192
4477 552192 677455 621512 575608 559922 710096 760331 580099 640262 683030 530954 619489
4466 619489 541732 486991 426647 636804 735476 625123 507167 605748 569693 650613 610064
4455 610064 451575 412508 327387 446749 553818 492172 335452 346481 406984 441481 364749
4444 364749 435510 485103 345609 334040 199402 287268 477075 456530 425650 411717 360105
4433 360105 376116 237063 207738 309895 277914 335608 165202 209071 355785 430602 328905
4422 328905 300562 362905 424896 413488 380546 372733 351796 200914 283832 260165 149176
4411 149176 198379 253318 191439 339840 444220 207101 237755 302112 362910 295427 257372
4400 257372 327253 345161 436707 403873 365933 352139 285493 163854 254234 256734 171480 308156
4388 308156 388496 335542 229773 298908 281546 320944 306528 210132 215121 111237 265857
4377 265857 203597 157561 153965 56677 15793 -77292 -59490 58412 -29762 67016 168899
4366 168899 92605 40387 44473 167257 158043 183301 193447 135392 202936 196032 76632 95387
4354 95387 107598 152819 33531 46068 184296 250191 220254 236322 62318 -75111 -9455
4343 -9455 110647 139250 169160 69440 269468 153870 70011 27748 56776 -10301 60241
4332 60241 66599 165341 245006 165703 327148 258437 89293 58086 110188 98625 272046
4321 272046 322798 275588 267534 162019 160293 169554 160687 163328 178122 140937 184109 254195
4309 254195 72296 95470 68132 61961 116716 182265 129013 149341 141588 164148 172663 280341
4297 280341 308250 188604 138395 187847 240976 330077 180772 68667 1124 57800 100186
4286 100186 124592 326503 267018 141498 166129 272794 298799 176523 215987 169094 124249
4275 124249 185559 308695 199732 178624 194016 135152 150365 286103 409772 248995 216950
4264 216950 218743 248251 332680 329256 264764 263853 182200 -74414 -34276 97378 229932 207897
4252 207897 92448 135013 26508 86924 80649 222069 299651 231587 137702 27291 124527
4241 124527 265950 347582 336711 210240 441631 364546 236583 260636 257286 371281 354154
4230 354154 349481 364432 298312 440313 500153 297686 357095 406201 408590 412399 498852 450570
4218 450570 634684 741524 767294 740433 805122 1180656 1473060 1489962 1459130 1386364 1201990
4207 1201990 1248566 1016498 987933 1082574 702802 445077 469075 421302 384231 434342 296299
4196 296299 218528 272259 260490 315110 464410 281749 312808 188769 123232 196017 181254
4185 181254 240503 228823 185147 171501 145755 165866 311245 313137 271511 114348 150329
4174 150329 144337 274776 205923 184106 160082 332826 251186 87077 51692 60938 59193 167475
4162 167475 86034 -17465 62108 -50232 -20243 61510 120233 33599 118476 116498 -35862
4151 -35862 -19935 3438 -116549 -4639 72984 129122 139899 108733 90237 173164 110068
4140 110068 139274 158377 154094 69630 117504 99673 -4629 56564 32073 57297 79970 -25120
4128 -25120 -68868 75662 126479 51786 -54962 -74382 -97794 171676 180344 111241 174222
4117 174222 274910 74278 -28914 -65670 -95441 -100262 -67631 693 32928 29 -65845
4106 -65845 117366 29307 -125831 -89429 117313 20088 -105017 -127894 75660 152359 -47717
4095 -47717 -63028 -39762 84114 142720 59314 -7790 30086 -877 927 -2220 148432 116970
4083 116970 -21192 -32539 -7801 -114182 -147015 -6623 -4020 178312 10494 -490 155617
4072 155617 100198 94489 16354 43216 98371 75928 91313 -68487 -78230 -44193 -70038 -46193
4060 -46193 -25875 31308 -10038 -80967 -106386 -115862 -15694 113470 18567 21358 9882 -114195
4048 -114195 -70621 28105 13685 50408 72358 -209890 -173521 -127628 -136893 131732 254857
4037 254857 6120 -79288 -56358 -40656 94228 77875 164208 81773 34763 234639 36183
4026 36183 -101313 -35500 59060 92140 31742 -71605 -202081 -98611 -51154 -61889 -12023
4015 -12023 16954 156320 140842 116895 50842 -173192 -198291 -50013 10054 -800 -43873
4004 -43873 -50537 -32771 -57726 15204 330 -93133 31708 43051 15488 29442 -11704 -70631
3992 -70631 -92982 -29575 -42997 -28205 39424 -13696 12779 44404 -37974 26033 -106640 -12490
3980 -12490 58030 49155 -63777 -68534 -147618 -55441 18597 -2361 21168 -86446 -110084 -47678
3968 -47678 6412 -10340 144199 78140 82604 212345 134637 -16954 67849 115229 155734
3957 155734 51039 77415 144174 52431 -80664 -103657 107521 141895 154371 22355 69642
3946 69642 89185 106931 154329 127455 146399 72976 97462 40579 -172 70023 75114 201286
3934 201286 185511 224959 145408 124667 199584 131826 100608 -23960 -55218 122753 90849
3923 90849 73706 108111 77479 85406 272933 290839 213342 162976 88475 235024 179070 115990
3911 115990 193344 171462 91594 -23394 63583 142966 -8937 -13270 -19518 -78606 25573
3900 25573 136345 99628 62921 9394 81283 255614 252891 245749 256963 190915 175221 213280
3888 213280 211057 247037 286981 258318 181557 15961 62452 11143 155303 135822 260799
3877 260799 117664 61584 152963 185624 164511 -16893 33797 207345 114583 39104 47998
3866 47998 -50817 95801 34767 7091 44574 -3200 105669 172936 167582 123610 108052 91347
3854 91347 18457 23796 -12979 159007 256422 202928 130758 95529 11832 37014 -24597 183849
3842 183849 201753 85823 -19490 -89885 -108647 -19174 -50963 -93610 25939 -96252 28847
3831 28847 139809 243904 392156 361702 67276 100271 81787 127506 166014 189593 111906
3820 111906 181057 230907 215080 219401 261270 377319 199619 153795 132979 187410 329717
3809 329717 279703 223693 272091 332776 295453 233170 56111 137431 300757 341004 423815
3798 423815 389747 409841 289488 138085 223614 361897 172116 172910 267305 285987 193516
3787 193516 218107 317820 329630 196792 152776 250850 140870 31974 106650 247836 316507
3776 316507 368341 390484 413028 355297 246205 121541 259718 247877 259786 273840 138249
3765 138249 277554 285267 283476 93896 158605 155260 185525 74005 199523 208894 180068 323265
3753 323265 243018 208177 341524 367786 500879 436783 304629 188658 -31270 75008
3743 75008 13284 -18622 -74380 22666 24466 117302 186158 175005 164317 164243 158715 131039 198999
3730 198999 75893 137107 296542 227241 248809 326115 282752 283589 386926 216220 206450
3719 206450 229381 254960 285983 231107 283005 455636 418732 175774 122527 252518 163905
3708 163905 125014 201239 320379 304217 396818 402230 255315 241214 299875 257695 377545
3697 377545 441326 200495 128822 229053 341281 281426 274145 218175 244470 307937 184040
3686 184040 390091 374417 401075 401778 404135 413311 203161 234375 285810 172907 256467 344160
3674 344160 158512 135807 145245 262783 348834 266841 308586 477656 325218 270527 240261
3663 240261 172353 128867 117180 161714 251884 205725 329904 469616 452289 248686 225717
3652 225717 348507 363223 417331 304314 277325 252199 263942 93839 -57426 157403 201774
3641 201774 253164 383819 359615 354879 256367 250226 376395 369954 335101 204593 263920 354934
3629 354934 334866 137976 177082 332157 164042 201021 391464 341163 329854 364746 384515
3618 384515 223858 207769 268464 205086 243041 282366 278719 289905 283250 302302 276586 186734
3606 186734 194098 302000 507524 269296 131707 295197 515106 598194 529395 459100 448564
3595 448564 528520 423994 446790 475111 414457 499492 522963 385182 377376 441809 318015
3584 318015 419257 327063 336816 377917 343906 419405 366366 232893 138841 234704 523425
3573 523425 526865 388319 276484 404721 616239 437287 407794 426805 465496 500404 432197
3562 432197 454619 403583 503006 609353 608973 466708 461970 396475 248550 344385 344469 402614
3550 402614 308520 425468 600059 434390 367061 430921 425046 305755 312144 335346 407124
3539 407124 418711 358876 459966 353061 529453 608346 569223 543587 597391 667295 423547
3528 423547 378643 356565 158286 239229 543976 630964 644188 643753 443990 302399 463348
3517 463348 547097 541822 653421 508430 553105 720869 643833 622311 683064 688294 567486
3506 567486 680669 562138 621356 722839 772213 729278 535813 610293 746379 762307 658783
3495 658783 535560 538597 638497 780149 730189 506790 666336 800749 875376 760056 630325
3484 630325 705689 694996 858856 937862 1030992 992617 980346 1003811 972260 1019074 1050075
3473 1050075 917817 832855 967997 947551 991105 993902 882045 952035 974120 1035598 925156
3462 925156 1063498 1068132 1065303 1132952 929100 902800 931160 1039206 1055343 1000219 975179
3451 975179 968771 1185195 1161376 1138922 1291761 1234480 1149929 1282000 1404458 1294560 1462312
3440 1462312 1375036 1373403 1210512 1344638 1423978 1469029 1475283 1567025 1596530 1711784 1534061
3429 1534061 1436092 1479664 1606560 1779284 1856551 1756183 1679926 1704949 1629823 1587319 1637997
3418 1637997 1829246 1622225 1450018 1601496 1737260 1552311 1540867 1635108 1676918 1568202
3408 1568202 1561978 1597287 1462942 1520133 1562934 1639310 1568027 1500190 1455792 1427435 1460787
3397 1460787 1405349 1413606 1447790 1544674 1705375 1597832 1601478 1754418 1634294 1547018 1782065
3386 1782065 1767146 1642899 1745657 1674372 1704830 1758213 1711557 1649598 1588652 1481602 1405902
3375 1405902 1435044 1704154 1663169 1619112 1419403 1505834 1435397 1376688 1318930 1422856 1441032
3364 1441032 1389561 1367947 1410855 1339183 1572519 1590983 1510094 1526706 1557970 1537294 1427867
3353 1427867 1327632 1346824 1376090 1267581 998851 946358 1043388 977277 1132451 1098622 1152724
3342 1152724 1128516 1038584 874545 892277 867732 810517 956480 906839 857440 860702 1003763
3331 1003763 959059 1041769 1012871 1024738 1039796 886449 834058 812089 829959 733535 795443
3320 795443 622619 787584 775571 775412 840207 912023 782626 709762 777804 723310 737739
3309 737739 735088 665717 761018 716313 597601 711571 850883 736383 696622 703665 669951
3298 669951 728518 629352 616017 730319 742251 643566 496313 432081 398850 540536 495102
3287 495102 494348 602159 629675 590308 451379 632365 577874 552998 512325 443566 549077
3276 549077 555108 490611 513479 696470 678182 680506 593714 609087 647730 721926 754622 817006
3264 817006 680867 636346 724110 522221 628363 524778 438151 473172 460119 563281 400742
3253 400742 325631 337241 381874 574739 506534 545082 622670 621755 626137 585668 647716 626132
3241 626132 546031 458201 479873 322577 498145 449308 358605 405135 417063 355482 438880
3230 438880 441083 412183 479342 409590 327529 326244 438441 331540 593196 596032 530104 508014
3218 508014 368644 389848 426870 445248 614722 572117 567144 583320 532174 538187 368576
3207 368576 217099 280357 374089 443848 435679 495299 590034 583860 436203 289878 407499
3196 407499 526507 616649 602107 397108 294455 403809 461214 396733 485513 621423 564350
3185 564350 467577 468464 423315 449599 445252 423966 406137 506668 454408 370777 269953 324435
3173 324435 467316 568437 538777 463815 334392 304402 478682 443904 353878 218923 314801
3162 314801 469253 461364 526963 460696 439366 313208 272332 376278 489755 515768 403889
3151 403889 460667 477457 365141 346247 390761 516092 503547 384889 415599 403237 510834
3140 510834 612396 483617 503921 522834 611875 460918 354521 417122 377056 498598 442123
3129 442123 501639 480807 583209 605430 580774 591094 625676 517748 418565 516697 516024 461871
3117 461871 544886 521651 537026 516355 494236 478581 479218 727636 743895 646572 637051 639206
3105 639206 634104 827010 939389 796583 873435 866824 626144 790803 824942 821506 809305
3094 809305 911604 897138 831258 805427 773134 755132 730434 914659 829065 802983 733701
3083 733701 633611 611010 736111 940053 898304 765238 833934 909332 898401 822268 830988
3072 830988 847881 832496 709591 617172 545580 665462 764814 743956 809910 898586 947015
3061 947015 987515 877078 895884 816530 885139 998117 841371 959922 778311 856239 947496
3050 947496 999864 941624 871446 936090 773822 725469 647414 799356 878480 913585 887227
3039 887227 823450 780422 709138 822736 856185 917985 834627 919699 861721 886997 792424
3028 792424 760696 725727 554118 752627 759381 734725 772965 696639 529594 733844 726658
3017 726658 705220 842346 708813 668236 694698 759290 669389 661493 851605 818480 784762
3006 784762 613946 658942 692056 674479 561841 660215 663189 644363 687118 694936 565950
2995 565950 548200 695760 624032 584604 620891 608014 521155 563811 598274 487173 487337 528697
2983 528697 421138 465694 429109 478712 591095 598340 417087 354316 316460 417842 332356
2972 332356 363645 435418 175893 205605 234952 293308 294227 252171 361766 512753 417468
2961 417468 374155 353888 363675 445675 371847 393589 409261 346818 401635 472743 323099 365084
2949 365084 343006 362411 215604 209448 152562 13279 71114 200044 199497 183373 126616 66068
2937 66068 197203 60946 52061 452085 454744 213338 190204 141845 186053 392663 371215
2926 371215 253674 81379 99190 129013 94052 -63421 -42511 92918 273292 372900 295019
2915 295019 214437 203564 156033 110265 304651 208692 46575 89768 266743 354714 215550
2904 215550 -32749 -11056 -31049 36364 121875 236423 232539 133784 165062 64620 64365 137589
2892 137589 123444 157836 64786 75931 130338 176792 158687 242421 130964 -32943 152791
2881 152791 215555 310862 163112 182261 176542 210135 233394 93771 58392 96151 131504
2870 131504 197346 281216 189873 104267 111042 245034 200399 29342 60575 204415 236538
2859 236538 192374 177156 121243 -29253 55394 185160 178227 172374 177636 214073 169342 122839
2847 122839 140480 205336 102146 98688 110939 104517 156530 128253 109350 43862 237151 161776
2835 161776 166941 105683 -51466 -18140 29530 72219 129566 9140 -21801 64300 47585
2824 47585 -16468 61716 157747 203383 280699 305892 178890 227005 242330 148459 22715
2813 22715 151393 194837 90106 91619 124665 137390 81514 -16993 16648 106036 105102 -110527
2801 -110527 -184943 -131803 103236 160081 -17989 78417 98625 139938 127176 66712 132120
2790 132120 173101 147082 89394 117273 223888 272254 162665 -35780 -62752 -10149 85846
2779 85846 -23809 48539 11860 -49068 47883 -130073 -148195 -72723 -235796 -19267 53405
2768 53405 108358 -32411 -19775 -31531 168212 250539 211996 140087 -38719 -32200 78262
2757 78262 149885 25182 -62173 -19959 -52109 73128 56412 -54429 -34967 46338 -140173
2746 -140173 -209125 87613 91464 53647 12411 -49961 73160 -40568 -47237 68246 -11947
2735 -11947 96038 104661 -60792 -62216 -62760 36063 131109 -12574 6523 35332 157731 -20867
2723 -20867 71823 -95405 -190525 -112413 33594 39810 12008 -75263 -25385 -89545 -204153
2712 -204153 -168774 -46020 -14733 -9457 7361 -35189 -90673 -68809 -72234 -77546 23556 64690
2700 64690 51314 88215 69046 67273 287642 180723 50349 -169012 -78678 -52464 -280762
2689 -280762 -240740 -90337 -182309 -57758 7745 -56107 -8424 10960 -34060 20696 69880
2678 69880 -13108 -10838 180158 117450 37136 183033 255672 53031 64810 106681 58107
2667 58107 153559 160204 -75675 -40826 17747 45390 -147100 -61703 -101871 -142627 -160137 -200543
2655 -200543 32794 91087 144581 67146 27922 -46458 13699 44759 54139 -176742 -143896
2644 -143896 22969 -81147 -141868 -56877 122108 38985 81680 80929 49768 -14631 -196548
2633 -196548 -144813 22878 65945 136460 204724 51579 -4878 -94307 -55960 -54012 19269
2622 19269 35772 13784 56159 51641 -104882 -5587 118773 98299 29713 -75529 55887
2611 55887 -33747 89942 133452 -34989 -26057 -62906 -76189 11852 201044 139933 41792
2600 41792 -128404 -9372 3168 -41711 -8076 -6509 -85506 -4476 45053 68996 -74209
2589 -74209 -159093 -215201 -134389 -235544 -81003 74796 18059 -39951 -200023 -19232 121303
2578 121303 12945 -68468 -117026 -148097 -194388 -75677 -41147 18534 57500 -106866 -202456
2567 -202456 -105482 -649 -102427 -50193 -70496 -116066 -87528 -100964 1827 -3834 -32498
2556 -32498 -2934 -40700 -57025 -215700 -85732 -41730 -73098 -140202 -37248 84628 -54373
2545 -54373 -289530 -208224 -133525 -147902 -147100 -27526 -34492 8954 -51366 -164922 -212520 57125
2533 57125 303600 78357 -71547 20816 -125308 -301847 -294847 -219541 -124045 875 -116416
2522 -116416 -3758 -26919 24714 57025 -41386 -84095 -176346 -23985 43356 36898 -113829
2511 -113829 -231314 -85373 -4016 42350 53621 -76122 49739 120693 69048 65130 32889
2500 32889 -20909 61731 -35606 -1543 -895 -76214 -122116 -63180 130494 16918 -11176 -8345
2488 -8345 -84941 -100039 -124813 -106824 -138975 -3181 73887 -116267 16751 86876 126271
2477 126271 4033 67891 189847 109693 25952 -34074 156948 270615 194506 -81632 -82072
2466 -82072 15423 -6978 -58423 -162185 -117122 -56119 59632 -7190 -59621 -22519 -31677 20031
2454 20031 107927 22958 64351 81294 15784 27078 -211344 -217286 -187710 -44076 -24534 -159170
2442 -159170 -96981 -73561 -58148 1934 -34151 -30376 -9580 -129995 -113282 -22971 -149366
2431 -149366 -193097 -194691 -111473 -61045 55704 -39518 59784 -28815 38889 -1599 54153 164360
2419 164360 -67810 55223 11233 11710 -61009 -111322 42849 -37505 -93721 -118191 -70434
2408 -70434 -216604 -185015 -172068 -197705 -49491 -59927 62880 27614 123171 81487 143235
2397 143235 -42972 -147718 -21941 -80103 -160734 -106741 -70571 -111457 -210396 -257673 -184319
2386 -184319 -234379 -209849 -182304 -132693 -66459 -109938 -34603 -99294 -230306 -225019 -263418 -200352
2374 -200352 -177795 -191648 -180764 -127043 -190801 -138816 -99771 -50867 -31045 58978 -13391 -90226
2362 -90226 -156261 -230679 -249022 -258166 -156213 817 44263 56912 -60820 -207141 -137703
2351 -137703 -215097 -102338 16324 29280 50143 -42508 -106659 -91918 -51096 52494 45719
2340 45719 -1514 523 -3788 886 168010 101295 -95455 35233 -65941 23015 56283 47840
2328 47840 77 36368 42928 -117979 -138154 -32024 44150 22291 -11033 17974 69333 25640
2316 25640 70450 12048 5318 -84284 19925 105894 58413 -15743 -54950 50336 -5671 -200828
2304 -200828 -134661 -49070 70983 -25310 -149445 -75686 -147680 -324208 -262998 -209694 -177310
2293 -177310 -71103 -49529 -128260 -201658 -250979 -13392 -93327 -28670 -113715 -109496 42595
2282 42595 673 4633 -124503 -142334 -3596 -31206 -26499 -89289 -34901 -108917 -190826 -84943
2270 -84943 -189595 -36871 -87645 -246219 -142345 21444 -15231 87515 129896 97333 71193
2259 71193 53435 -157428 -35750 -122540 -260660 -16744 12013 -150870 -52871 -24001 -144217
2248 -144217 -54385 -35046 -140802 -55888 -15931 -146653 -151220 -288828 -175996 -187147 -152079
2237 -152079 -78150 29861 108831 49969 -175732 -252427 -23909 44064 55646 -86182 -183801
2226 -183801 -103760 -131211 -94170 -153027 -163075 -134074 -167581 -116318 -156594 -187711 -194731 -227643
2214 -227643 -228879 -128235 -104545 -75016 -78920 -92202 -118397 -198136 -285014 -107838 -98733 -20711
2202 -20711 -57033 -80375 -127637 -195578 -70015 60092 -145351 -248559 -187910 -92715 -53805
2191 -53805 -172272 -91838 -4530 -39899 -75802 54583 46674 39756 136309 14531 -68319 -239385
2179 -239385 -445551 -281861 -69338 -31097 49485 -21829 52348 24399 -251475 -224280 -187290
2168 -187290 -283715 -124921 -201584 -191514 7644 -201333 -253204 -118767 -167438 -158823 -100475
2157 -100475 -56996 -45215 -145754 -120192 -22841 121012 126824 -55603 -138930 -89043 -120294
2146 -120294 -226521 -94756 -41582 -132755 -89486 -123959 9881 -79572 -147922 -14982 22419
2135 22419 -138884 -156578 -124285 -182303 -156646 -225470 -166360 -235377 -208917 -154796 -124987 -143935
2123 -143935 -297128 -311537 -85815 -15599 -144036 -96088 -163505 -58651 45228 68103 -123675
2112 -123675 -319338 -170612 -205886 -178252 -246699 -215887 -86601 -209897 -194800 -254605 -293633
2101 -293633 -208775 -11410 -113593 -269335 -148151 -75647 -206487 -191236 -242930 -232110 -168813
2090 -168813 -105780 72797 -49555 -51998 55137 34000 -19482 -177126 -179381 -69771 -151018
2079 -151018 -111015 -61880 -236995 -260611 -73748 -38592 -212350 -220202 -94532 -60520 -75203
2068 -75203 -92487 54442 31990 -110639 -63039 -85630 -2322 -12536 40242 -130979 -195187
2057 -195187 -37547 33568 -92311 -15473 25922 -95275 -160939 -280109 -267512 -215934 -204343
2046 -204343 -178672 -75316 45726 33921 44386 -81035 -170029 -17771 -128997 -246565
2036 -246565 -159849 -68893 -117940 -4522 -136744 -111339 -67265 -165944 -180813 -277716 -224074
2025 -224074 -159099 -115406 -216341 -171081 -200637 -331984 -117583 -61556 -130930 -208939 -375235
2014 -375235 -271638 -175757 -139707 -37879 -37461 -42576 -24563 -79474 -16705 -99290 -221371 -197394
2002 -197394 -103423 17876 38472 33239 -135678 -127108 -58770 -105830 -34563 121378 94794
1991 94794 -10769 -111113 -90059 -83958 -110253 -222144 -200757 -69004 18411 10167 -55491
1980 -55491 -47695 -203306 -338189 -223964 -60328 18146 -63571 -119769 -188434 -183590 -182098 -52287
1968 -52287 43084 -129551 -262987 -132802 -112009 63792 73646 -69629 -233860 -146568 2490
1957 2490 -33146 -42652 -4264 -47118 -2688 33617 135567 93478 -98580 -149543 11035 3901
1945 3901 -149578 -115937 -248965 -155575 -9985 36419 -13361 -111930 21768 23271 -180974
1934 -180974 -99058 -71049 -150938 -274383 -320439 -149094 -127674 -264812 -217619 -158682 -164527
1923 -164527 -281510 -209280 -355402 -422389 -166298 -21878 -81844 -140800 -167294 -169348 -138576
1912 -138576 -168667 -81498 -8667 8753 -114611 -170681 -194999 -268804 -313230 -319360 -290560 -163278
1900 -163278 -162586 -127780 -199348 -206689 -211669 -320289 -396366 -440093 -251068 -294996 -118115 -72511
1888 -72511 -2276 -202773 -172223 -203599 -146598 -204164 -167574 -205643 -223511 -238480 -399834
1877 -399834 -234302 -77449 37692 -36716 -203499 -256216 -116207 -127264 -218019 -190288 -200024
1866 -200024 -145578 -154541 -102326 -244429 -225666 -150756 -259834 -238982 -154770 -123089 -216205
1855 -216205 -198159 -289219 -120345 -131669 -21070 -50879 -116048 -152086 -206456 -106007 -100921
1844 -100921 -220186 -139718 -33729 -154428 -104154 -67994 -140639 -235822 -172609 -157504 -275268
1833 -275268 -203104 -74380 -12225 -144772 -6852 70967 29669 26559 -73637 -168616 -195001
1822 -195001 -212861 -247424 -291587 -294553 -267525 -293433 -267561 46816 72243 1581 -73041 -80311
1810 -80311 -24380 60434 26055 -130569 -197212 -85458 1972 -178461 -55569 -36188 -35520
1799 -35520 18903 -11032 -96908 -51189 -82397 -124332 20577 63268 10378 -255808 -233691
1788 -233691 -153221 -103338 -116082 -151051 -52505 -41823 -8028 -70775 41690 153663 142740
1777 142740 77618 37278 -152022 -201432 -68452 7120 -83267 -256696 -263021 -239153 -86010
1766 -86010 32873 69675 -47416 -237885 -197668 -146979 -24215 -58408 -148445 -246953 -196053
1755 -196053 -198359 -222251 -132411 -67338 -126862 -172989 -44128 -177628 -229886 -137917 -115393
1744 -115393 -21303 -137566 -200136 -90539 -135076 -109100 -118645 -39619 -87559 -111682 -49083
1733 -49083 -105600 -154644 -101748 -86378 -76398 -84859 -176701 -143110 -16014 -11665 -116611 -92335
1721 -92335 50126 -89695 -74883 50111 -42567 -146747 -162558 -87618 -98396 -160796 -137654
1710 -137654 -191370 -344586 -221035 -61476 10006 41299 -42665 -22749 -31417 -84553 -130940
1699 -130940 -145332 -138672 -184316 -209506 -139589 -190673 -178417 -176405 -275372 -182836 -259358 -342568
1687 -342568 -58086 34297 -132010 -163925 -190610 -97713 -209166 -146508 -14345 47510 -57565
1676 -57565 -143914 -137803 -67768 -28121 119846 149757 -59024 -201832 -307839 -210582 -272934
1665 -272934 -158107 -102477 11025 -13496 -36857 -152994 -2229 -19164 -143725 -183701 -191713
1654 -191713 -150644 -158449 34719 57548 12982 -73160 -170866 -191214 -141735 -56054 -173820
1643 -173820 -317996 -71213 102652 131594 -84008 -40805 -96609 -108622 -38009 55698 -23778
1632 -23778 -2406 -155192 -177336 -32551 73646 -23753 15261 105965 160012 63935 -109661
1621 -109661 -7719 -66940 -123282 -294576 -58300 132187 23521 -93739 -26248 -171827
1611 -171827 -241026 -66270 7772 -41786 -9603 -247018 -232510 -46125 -161746 -147373 -28789
1600 -28789 71234 102070 50438 -89891 -31052 -80610 -45246 -72378 -3793 -81934 -248279
1589 -248279 -220327 -156245 -12908 -31651 -273144 -361767 -104403 -170395 -105651 30805 -6876
1578 -6876 -42240 -47472 8943 -52327 -60544 -30270 -36723 57357 68664 69573 -30774 41030 91016
1565 91016 -27110 -69550 -166247 -198763 -358782 -196586 -194026 -106816 220157 172966 154586
1554 154586 -11538 -147519 -12376 40368 -56620 -242953 -236481 -294735 -217036 -166961 -146346
1543 -146346 -224227 -210724 -115117 -215892 -139384 -88430 -10667 14815 107164 -46642 -40503
1532 -40503 25768 -20075 -99884 23339 30130 15044 -98810 -220073 -202974 -76654 -222985
1521 -222985 -216583 -97476 -70876 -39545 -28293 -72075 -117561 -127487 -117369 -77887 -78486 -70476
1509 -70476 84592 50300 -57049 -30529 -75413 -72208 -139969 -155215 -183680 -92252 47677
1498 47677 -17220 -22800 -221566 -207509 -86436 -294622 -257645 -166792 -42341 -29613 -28945 -2902
1486 -2902 -4713 -88525 65255 55959 137170 47302 46547 -114410 -50475 -111909 -108985 26692
1474 26692 80588 11071 -197586 -111256 -133216 -69479 85359 129638 -134903 -168449 -67323
1463 -67323 -108610 -144938 -75735 -58216 -169944 -207554 -95255 -134445 -61652 -79074 -33680
1452 -33680 -25417 -218936 -287976 -131397 -199431 -173930 -130572 -170569 2729 -104766 -163005
1441 -163005 -111241 -182976 -196182 -60443 -36219 24004 45822 47813 -33795 -135975 -117953
1430 -117953 -70843 61220 44321 -58545 -15632 -102072 -73038 123424 -57043 -159706 -32961
1419 -32961 94668 55180 -47752 -141934 -259536 -61027 134572 173490 -23018 -106505 -5438
1408 -5438 37257 2428 175 40505 -2955 22492 -10218 -49321 -133135 -28884 -40675 -89126
1396 -89126 -26651 -46562 29505 -25968 17067 -153912 -123413 -54949 -47235 50781 -175167 -204274
1384 -204274 -240391 -105837 31058 -44814 -117551 -125512 -72586 11610 -30087 -184767 -112174
1373 -112174 -33208 17139 -31556 21629 36972 -43181 6352 -115841 -227717 -162629 16014
1362 16014 121743 40128 -54487 -114243 96193 80557 2856 -59848 -80023 -114030 -107256 -105289
1350 -105289 -137441 -59031 -57680 -23654 -60032 -77666 -76981 -112304 -167759 -18857 84470 60078
1338 60078 -66458 -52663 -39773 -110232 20452 -8139 90744 72903 75673 -48375 -103656
1327 -103656 -31495 -204821 -67495 59388 19644 39548 23323 -203247 -159538 -102454 -20919
1316 -20919 168912 187605 68243 130712 73562 114807 189078 200727 72150 -129034 -231320
1305 -231320 -114225 -106141 9832 -138141 2412 162503 -71777 -65966 -87984 -201298 -54042
1294 -54042 77369 -14477 -27975 -125917 -107468 -19354 -98112 -136054 -13392 52950 142842
1283 142842 136964 14244 61962 57075 -5831 -124408 -67384 140128 -44 -50559 -49010
1272 -49010 -128617 -176912 -97687 8567 -110991 -162026 -105240 -176645 -299325 -259914 -7638
1261 -7638 -211083 -81055 115740 -54369 -58700 67817 -4368 -39921 23390 99521 -70418
1250 -70418 -219899 -135174 -122356 -209972 -36485 84842 164160 75136 -29881 -127476 -21661
1239 -21661 126393 16239 -66862 -266114 -263164 -141207 -118980 -191881 -53323 31718 -120180
1228 -120180 -181110 -222691 -216085 -147602 -120428 -80987 11608 83509 -157459 -31584 -78901
1217 -78901 -167637 -113960 -127063 -79042 -150524 -71106 -61524 -77906 -13364 -24864 -176227 -253602
1205 -253602 -198874 -172453 -58731 -31644 -92077 -141793 -215511 -73000 -159614 -176783 -222631
1194 -222631 -274876 -276883 -169981 -37035 19290 94830 289 -154288 -107966 -47035 -236755
1183 -236755 -253699 -61613 19755 -44951 -120699 -204344 -63711 28630 -133071 -139806 -140036 -346221
1171 -346221 -126198 55467 120909 128366 57132 -6890 -110143 -174864 -132020 -61167 -101395
1160 -101395 -20130 -61403 -116303 -129148 -3375 53776 63644 99648 30521 -92899 -10668
1149 -10668 -1065 -142961 -97732 -111663 -82950 25299 47406 6749 -10910 -184001 -54884
1138 -54884 -36486 -101227 32544 82097 -23274 -96206 -15883 24762 517 -35658 -88710
1127 -88710 -112300 20904 -18230 47280 -31662 -97613 -51264 -54281 -54660 28227 -16359 -52883
1115 -52883 -294 -63396 -72908 -22283 -9457 -118511 -79791 -93492 -107819 87451 153527 86788
1103 86788 111834 86239 113496 620 -24666 -21807 -71418 -99659 -11002 95229 50624 -60794
1091 -60794 -44677 31611 8311 -62960 -132940 114410 12773 9314 106710 -27994 -91743
1080 -91743 -108968 -79482 -178456 -24270 63984 93042 -38058 57797 99039 -127971 -74286
1069 -74286 -40929 -107316 -202921 -131813 -3373 -70340 -116333 4033 -35821 -15486 -47937
1058 -47937 -208325 -135355 -180638 -180105 -82693 -102551 24349 36016 -65125 -26155 -58052 -160581
1046 -160581 -142446 -133882 -166874 -78558 -114523 -26655 -51715 -14723 132708 98871 68034 19065
1034 19065 -21310 54418 92925 74418 -89228 -205375 -22984 -11914 -85368 -82095 -127676
1023 -127676 -159048 -255620 -123684 -37245 60300 90805 82401 105644 59442 -40266 -84168 -95324
1011 -95324 -246222 -132978 2029 -29801 -132145 -150033 -160137 -76638 -26241 -56542 -49336
1000 -49336 -12329 -103265 -226498 -191244 -64862 116114 -3320 -85614 103991 218066 166810
989 166810 42905 72110 13925 168906 141831 21310 -114027 -77227 -151944 -8613 -1229
978 -1229 43595 50833 -76213 116093 116734 40959 -18649 -30127 -100787 -153602 77795 164414
966 164414 12627 -65760 4029 77587 99887 46584 54623 113650 -47647 -95411 -41430 -74202
954 -74202 -148057 -71896 -73956 -16505 157778 173722 51063 -56669 -159550 -112511 -33998
943 -33998 -122808 -133677 -44262 18157 131836 174240 204002 94953 52582 127832 113963 134452
931 134452 178672 144819 73675 113374 2963 189360 77094 -22565 -24537 -35465 -84137
920 -84137 -69765 23876 107616 305816 200322 25078 106481 98236 126112 53162 -48036
909 -48036 43757 38991 93163 94893 32568 -46316 76022 74113 55353 46005 76533 33861 -16110
896 -16110 -2350 -85025 -109253 -30385 -146025 -101652 -151017 -129056 -195410 -182808 -27391 9915
884 9915 119503 116948 33700 14450 109094 210212 188243 28228 4264 141805 -1394
873 -1394 26399 2770 36492 45055 54755 -41024 -52894 57575 66882 201165 29144 72946
861 72946 36891 -16170 81212 -77665 33707 9947 -98173 -16780 170106 186352 77688
850 77688 -129429 -98222 -15709 177276 158982 4146 15122 96382 31592 44424 -26197
839 -26197 -41478 -8678 -23975 -171682 4560 155423 -35173 -52775 30941 102851 100629
828 100629 101691 91654 17160 25879 48458 104740 135908 -62490 63320 89127 198014 68103
816 68103 -72872 -134058 -11528 -130683 29531 38070 120080 195428 134710 51093 165469
805 165469 212008 136578 97924 194515 140853 924 78810 61542 -874 -67528 -152694 -163364
793 -163364 -76596 19162 56662 11 -29822 -10249 -44281 140388 117963 -28193 -210860
782 -210860 -122773 -32006 113908 161418 47441 -70762 -230113 -116845 -119023 -104594 71117
771 71117 66010 41426 78952 78468 181929 146296 170484 70554 152938 77965 67598 46040
759 46040 66978 89605 97076 -9578 -50182 -41397 127075 114159 -20154 -103514 -57701 73988
747 73988 158890 203333 55393 24476 -58986 98681 63480 -4482 -6586 124957 283891
736 283891 145003 148295 197580 156781 183944 69508 34788 66947 161624 51719 73726
725 73726 -108081 -174792 -79109 21862 189877 117144 145611 65699 132127 206878 260352
714 260352 162708 57420 -26090 -100648 45921 -110990 -34696 -24103 -72978 25948 17138
703 17138 170904 238310 253352 100188 171279 164254 51944 -21122 -146015 -47800 18099
692 18099 113498 146525 74324 204621 243781 199893 186447 163469 150945 144987 77263 37700
680 37700 -31219 69822 114662 60111 5045 65105 -24181 33024 -73573 -181707 -74980
669 -74980 23814 88557 81066 -122357 -111496 -85171 -12546 152173 216687 126152 35676 248402
657 248402 170832 -37458 32392 31408 47522 161879 227896 185444 54026 15567 78911 190380
645 190380 70389 71378 106920 -54766 204 -60716 54249 140732 85305 93913 102035 -30137
633 -30137 -38152 -29112 -15159 -11319 -102049 -36536 46999 250010 332377 196187 198360 107851
621 107851 105815 118457 127620 254744 181553 75770 78331 -29800 -49079 -7868 -8254 226261
609 226261 359045 444903 297812 98188 -39944 73359 82164 165698 232564 360302 361104
598 361104 211268 71436 -49420 130218 275544 141302 152992 211755 139368 131163 178103
587 178103 113393 239644 266161 274898 127606 12345 -21864 250529 155117 113953 129737
576 129737 112715 165189 18942 -27006 -8283 4321 160301 86258 26412 142327 106928
565 106928 199936 187100 149157 158168 68095 140913 153424 -29801 40130 93723 110057 138200
553 138200 367685 342204 293194 164722 95120 166002 143320 114679 4020 67774 276120
542 276120 274141 322907 201107 147244 207490 243452 238261 193531 137983 62625 270182 235211
530 235211 179275 291714 304819 333490 210085 69282 99558 124870 -59396 -11010 119559
519 119559 125469 118252 92226 71827 57156 159164 72003 169414 235885 177959 138017 105011
507 105011 22958 38204 73874 146147 -41264 24341 207871 311288 239622 261258 163548
496 163548 130768 215681 244106 142331 -46834 11730 70338 46452 186286 402709 160737
485 160737 101376 34561 200084 258844 311013 173403 26534 65707 255898 122571 27740
474 27740 22850 171458 256286 340010 178648 113183 116325 86597 105900 307987 244279 117591
462 117591 155004 166822 80550 84349 26788 125602 84831 89432 270723 260626 279957 179905
450 179905 198847 210151 197875 184396 307532 151666 96289 244188 292668 127250 121777
439 121777 115110 66261 173936 92946 126445 94410 190734 83957 98538 246287 225811
428 225811 243924 132856 282140 268309 242862 211430 342712 216589 250976 124606 238089
417 238089 260438 158467 58301 159778 131029 44112 199556 138993 153932 149764 183734
406 183734 42499 48554 24087 107325 180018 32639 72110 147948 191693 30915 -75492
395 -75492 3956 91975 18539 -38559 25593 75369 110805 237094 183522 219638 317739 147514
383 147514 226609 74325 112177 109444 134167 347096 258693 87663 98379 145196 114530
372 114530 47764 132787 167091 91504 103879 123466 102487 112410 150019 176338 151753 248408
360 248408 377451 322168 222620 76331 64112 38153 197671 224293 192218 90794 -11789
349 -11789 113952 262077 92906 38823 60744 18039 8593 5283 30890 -148942 -232999 25672
337 25672 94265 19250 222847 318226 232949 149470 168513 239596 258793 170588 53830 118372
325 118372 124438 104256 263391 216579 18226 91329 112741 57465 71481 203894 214602
314 214602 169263 48186 92849 146684 224190 154920 7139 203380 87142 133668 90781
303 90781 64274 123361 76888 131657 226745 106597 -58405 159551 182148 298897 264889
292 264889 118436 28418 94655 67012 142339 160423 254204 218234 27649 42364 -1674
281 -1674 121168 111427 94502 174770 173521 54578 104987 142670 336391 381773 341687 247985
269 247985 137106 122544 172461 79128 192726 149994 118872 76256 131950 269980 305180
258 305180 175918 113857 144886 67494 119672 221659 298115 342962 343365 119099 87949 96965
246 96965 79789 39005 65868 183065 222564 198007 107661 80184 187621 250598 128270
235 128270 169411 98137 58246 162304 164245 6908 92183 -16024 158205 24852 22011
224 22011 187652 95455 115305 119327 140213 122106 59008 96022 124031 185014 241016 178581
212 178581 61974 231913 217193 116469 240945 264191 245052 176469 164835 213841 235730
201 235730 155892 226312 238181 246420 345271 379087 318193 314217 179332 266723 262109 36400
189 36400 -18922 110525 185499 201406 89959 177655 166537 149156 83512 140103 163295 156830
177 156830 77613 213676 278390 146506 155433 340045 372747 272354 168295 151838 121816
166 121816 312921 249636 230136 160804 113960 178440 157095 146773 191918 329420 434178
155 434178 399686 313047 145895 231448 161864 101297 148187 217945 273635 132947 78890
144 78890 6320 52986 85793 88233 138410 273591 177898 266702 336981 229513 221032 226852
132 226852 49512 102129 98980 159712 130669 65826 86858 310761 187024 127718 225407
121 225407 238012 159628 98931 110297 74124 104811 153052 263929 324099 276543 111656
110 111656 138633 101924 36401 -3053 82444 172179 315731 358267 180523 155716 306398
99 306398 357826 205459 251210 263650 213889 191857 141364 135824 131122 10898 89041 194498
87 194498 245273 218708 166044 182972 64851 149907 239290 131082 236492 285210 299805
76 299805 332556 296976 264590 132622 100253 261057 332085 278139 281970 309763 155750 87484
64 87484 40832 93376 258559 193737 189872 166664 253663 334277 336376 316166 291298 292848 252121
51 252121 295494 247046 308415 416685 296453 204058 177647 125647 118283 251316 206159 207872
39 207872 186033 268787 164125 139249 188384 53861 84999 84082 217621 200030 290106 245826
27 245826 188427 231737 204107 179375 309592 425434 279998 253670 259053 142607 173910
16 173910 195464 222730 327073 254618 158625 78582 166656 199639 234391 248680 238736 204359
4 204359 235231 234885 208072 269828
0 269828
$$ Imaginary data points
##PAGE= N=2
##DATA TABLE= (X++(I..I)), XYDATA
16383 -408796 -445025 -370071 -353990 -305094 -372416 -528306 -523573 -460428 -312998 -323486 -258920
16372 -258920 -230017 -287154 -219282 -99827 -74671 -207198 -116177 -160631 -179142 -245973 -309964
16361 -309964 -329824 -204763 -169715 -235280 -173690 -189640 -199227 -31274 -130253 -229636 -149945
16350 -149945 -128080 -159535 -220512 -100258 -28323 -96148 -67104 10543 84157 -35426 -76600
16339 -76600 -28964 -22369 58956 31463 7262 -21406 18242 152178 77246 73883 138483 62107
16327 62107 20498 40908 156243 189970 154196 6341 24404 -2408 147081 172597 255947
16316 255947 240489 169058 124951 177650 271254 342047 354901 320239 215836 322060 363423
16305 363423 279947 250426 337366 339927 301461 230707 206699 234562 335388 406280 322149
16294 322149 395149 306212 499094 410512 329122 402192 423688 418106 419802 518749 507660 448300
16282 448300 470637 352373 359613 543891 583185 566799 549090 680508 580190 477173 464298
16271 464298 602768 654414 523472 547187 468804 300551 379397 422489 486630 659302 639233
16260 639233 588947 637524 558105 528628 573049 571741 480648 565296 542121 603510 728223
16249 728223 819038 733270 738928 844993 625225 617383 659935 689353 622113 819803 686615
16238 686615 663642 614728 599458 692547 711014 707551 802381 751359 807879 827078 782798 638298
16226 638298 627121 615179 652329 701209 802330 837584 685039 723425 633965 623784 790370
16215 790370 944296 989566 913903 909445 880930 730241 730147 818561 957255 887683 767295
16204 767295 698534 817487 874520 837761 890176 874820 892384 908880 726204 693168 741721
16193 741721 851108 797259 833895 919325 885763 951163 904045 1092866 1131019 1145056 970295
16182 970295 910943 979074 841616 984667 932563 850290 972772 1010832 841262 842677 976903
16171 976903 1088543 986196 1024549 1093563 1109245 1017910 1087591 1013324 929261 957468 1010821
16160 1010821 997562 897985 938161 1037933 1088508 1091576 1101977 965936 1104587 1016419 957240
16149 957240 966070 1067955 1037715 958265 881728 650379 840425 925969 954750 1012668 1008417
16138 1008417 1049839 898746 1031636 907842 857767 886392 1055616 1009880 1029654 1061407
16128 1061407 996976 969384 975759 941142 925626 1068061 920730 1123217 1371645 1248798
16118 1248798 1047148 1110104 982458 937146 1084741 1113557 1088840 989436 1007076 1133750
$$ [...]
##END NTUPLES=NMR SPECTRUM
##END=
