##TITLE=1H_CG-1194-xy
 DMSO
 8 sc, 
 13.3.2024
##JCAMPDX= 6.0         $$ Bruker NMR JCAMP-DX V2.0
##DATA TYPE= NMR SPECTRUM
##DATA CLASS= NTUPLES
##ORIGIN= UXNMR, Bruker Analytische Messtechnik GmbH
##OWNER= root
$$ XWIN-NMR		Version 3.5
$$ Wed Mar 13 14:45:02 2024 Russian Standard Time (UT+4h)  she@DPX200
##.OBSERVE FREQUENCY= 200.1313
##.OBSERVE NUCLEUS= ^1H
##.ACQUISITION MODE= SIMULTANEOUS
##.ACQUISITION SCHEME= undefined
##.AVERAGES= 8
##.DIGITISER RES= 18
##SPECTROMETER/DATA SYSTEM= spect
##.PULSE SEQUENCE= zg30
##.SOLVENT NAME= DMSO
##.SHIFT REFERENCE= (INTERNAL, DMSO, 0, 15.4869)
##AUDIT TRAIL= $$ (NUMBER, WHEN, WHO, WHERE, WHAT)
$$ ##TITLE= Audit trail, XWIN-NMR		Version 3.5
$$ ##JCAMPDX= 5.01
$$ ##ORIGIN= Bruker BioSpin GmbH
$$ ##OWNER= she
$$ F:/spectra/data/she/nmr/H-F/1/pdata/1/auditp.txt
$$ ##AUDIT TRAIL=  $$ (NUMBER, WHEN, WHO, WHERE, WHAT)
(   1,<2024-03-13 14:43:58.26 +0400>,<she>,<DPX200>,
      <created by zg, POWCHK disabled, PULCHK disabled
       configuration hash MD5:
       00 E9 B6 7A A2 85 ED C7 34 08 36 98 17 FE 4E 26
       data hash MD5: 16K
       75 25 70 6F E8 B8 50 D8 CA 79 EA 62 7D 25 54 D9>)
(   2,<2024-03-13 14:44:00.67 +0400>,<she>,<DPX200>,
      <Start of raw data processing
       efp BC_mod = 2 LB = 0.24 FT_mod = 6 PKNL = 1 PHC0 = -25304.17 PHC1 = 9.987313 SI = 16K 
       data hash MD5: 16K
       7D 85 7E 60 82 04 AC 9A C8 CA 2F 36 DF E6 31 CE>)
(   3,<2024-03-13 14:44:19.25 +0400>,<she>,<DPX200>,
      <pk PHC0 = 2.426598 PHC1 = -5 
       data hash MD5: 16K
       9F 4C 84 3D 9A C6 DF 44 62 E8 98 49 36 82 6E 18>)
(   4,<2024-03-13 14:44:23.04 +0400>,<she>,<DPX200>,
      <abs ABSG = 5 
       data hash MD5: 16K
       F2 84 6C A6 43 B4 6A BB E1 01 8C 29 8E 0C B6 DD>)
$$ ##END=
$$ 
$$ hash MD5
$$ B7 FF CE B6 CC 38 95 0E 47 6A 42 1D AE 4F 58 5B
##$RELAX= 
##$RELAX= 
##$RELAX= 
##$RELAX= 
##$RELAX= 
##$RELAX= 
$$ Bruker specific parameters
$$ --------------------------
##$DU= <F:/spectra>
##$EXPNO= 1
##$NAME= <H-F>
##$PROCNO= 1
##$TYPE= <nmr>
##$USER= <she>
##$AMP= (0..31)
100 100 100 100 100 100 100 100 100 100 100 100 100 100 100 100 100 100 
100 100 100 100 100 100 100 100 100 100 100 100 100 100 
##$AQSEQ= 0
##$AQ_mod= 1
##$AUNM= <au_zg>
##$AUTOPOS= <>
##$BF1= 200.13
##$BF2= 200.13
##$BF3= 200.13
##$BF4= 200.13
##$BF5= 200.13
##$BF6= 200.13
##$BF7= 200.13
##$BF8= 200.13
##$BYTORDA= 1
##$CFDGTYP= 0
##$CFRGTYP= 5
##$CHEMSTR= <none>
##$CNST= (0..31)
1 1 145 1 1 1 1 1 1 1 1 1 1 1 1 1 1 1 1 1 1 1 1 1 1 1 1 1 1 1 1 1 
##$CPDPRG= <>
##$CPDPRG1= <>
##$CPDPRG2= <>
##$CPDPRG3= <>
##$CPDPRG4= <mlev>
##$CPDPRG5= <mlev>
##$CPDPRG6= <mlev>
##$CPDPRG7= <mlev>
##$CPDPRG8= <mlev>
##$CPDPRGB= <>
##$CPDPRGT= <>
##$D= (0..31)
0 1.2 0 0 0 0 0 0 0 0.06 0 0.03 0 0 0 0 0.0002 0 0 0 0 0 0 0 0 0 0 0 0 
0 0 0 
##$DATE= 1710326637
##$DBL= (0..7)
120 120 120 120 120 120 120 120 
##$DBP= (0..7)
150 150 150 150 150 150 150 150 
##$DBP07= 0
##$DBPNAM0= <>
##$DBPNAM1= <>
##$DBPNAM2= <>
##$DBPNAM3= <>
##$DBPNAM4= <>
##$DBPNAM5= <>
$$ [...]
##$SUBNAM3= <"">
##$SUBNAM4= <"">
##$SUBNAM5= <"">
##$SUBNAM6= <"">
##$SUBNAM7= <"">
##$SUBNAM8= <"">
##$SUBNAM9= <"">
##$SW= 18.0517328524113
##$SWIBOX= (0..15)
0 0 2 0 0 0 0 0 0 0 0 0 0 0 0 0 
##$SW_h= 3612.71676300578
##$TD= 16384
##$TD0= 1
##$TE= 0
##$TE2= 300
##$TE3= 300
##$TEG= 300
##$TL= (0..7)
0 120 120 120 120 120 120 120 
##$TP= (0..7)
150 150 150 150 150 150 150 150 
##$TP07= 0
##$TPNAME0= <>
##$TPNAME1= <>
##$TPNAME2= <>
##$TPNAME3= <>
##$TPNAME4= <>
##$TPNAME5= <>
##$TPNAME6= <>
##$TPNAME7= <>
##$TPOAL= (0..7)
0.5 0.5 0.5 0.5 0.5 0.5 0.5 0.5 
##$TPOFFS= (0..7)
0 0 0 0 0 0 0 0 
##$TUNHIN= 0
##$TUNHOUT= 0
##$TUNXOUT= 0
##$USERA1= <user>
##$USERA2= <user>
##$USERA3= <user>
##$USERA4= <user>
##$USERA5= <user>
##$V9= 5
##$VALIST= <valist>
##$VCLIST= <CCCCCCCCCCCCCCC>
##$VD= 0
##$VDLIST= <DDDDDDDDDDDDDDD>
##$VPLIST= <PPPPPPPPPPPPPPP>
##$VTLIST= <TTTTTTTTTTTTTTT>
##$WBST= 1024
##$WBSW= 4
##$XGAIN= (0..3)
0 0 0 0 
##$XL= 0
##$YL= 0
##$YMAX_a= 116748
##$YMIN_a= -361569
##$ZGOPTNS= <>
##$ZL1= 120
##$ZL2= 120
##$ZL3= 120
##$ZL4= 120
##$ABSF1= 15.48687
##$ABSF2= -2.56498
##$ABSG= 5
##$ABSL= 3
##$ALPHA= 0
##$AQORDER= 0
##$ASSFAC= 0
##$ASSFACI= 0
##$ASSFACX= 0
##$ASSWID= 0
##$AUNMP= <proc_1d>
##$AZFE= 0.1
##$AZFW= 0.1
##$BCFW= 0
##$BC_mod= 2
##$BYTORDP= 0
##$COROFFS= 0
##$CY= -3
##$DATMOD= 1
##$DC= 0
##$DFILT= <>
##$DTYPP= 0
##$F1P= 0
##$F2P= 0
##$FCOR= 1
##$FTSIZE= 16384
##$FT_mod= 6
##$GAMMA= 0
##$GB= 0
##$INTBC= 1
##$INTSCL= 3.70164e-10
##$ISEN= 128
##$LB= 0.24
##$LEV0= 0
##$LPBIN= 0
##$MAXI= 10000
##$MC2= 0
##$MEAN= 0
##$ME_mod= 0
##$MI= 1.114404
##$NCOEF= 0
##$NC_proc= -8
##$NLEV= 6
##$NOISF1= 3.799351
##$NOISF2= 2.8
##$NSP= 0
##$NTH_PI= 0
##$NZP= 0
##$OFFSET= 15.48687
##$PC= 1
##$PHC0= -25301.74
##$PHC1= 4.987313
##$PH_mod= 1
##$PKNL= yes
##$PPARMOD= 0
##$PSCAL= 0
##$PSIGN= 0
##$REVERSE= no
##$SF= 200.130006971924
##$SI= 16384
##$SIGF1= 3
##$SIGF2= 2
##$SINO= 5.538805
##$SIOLD= 16384
##$SREGLST= <1H.CDCl3>
##$SSB= 0
##$STSI= 16384
##$STSR= 0
##$SW_p= 3612.71676300578
##$SYMM= 0
##$S_DEV= 0
##$TDeff= 16384
##$TDoff= 0
##$TI= <>
##$TILT= no
##$TM1= 0
##$TM2= 0
##$TOPLEV= 0
##$USERP1= <user>
##$USERP2= <user>
##$USERP3= <user>
##$USERP4= <user>
##$USERP5= <user>
##$WDW= 1
##$XDIM= 16384
##$YMAX_p= 524972967
##$YMIN_p= -1731794
$$ End of Bruker specific parameters
$$ ---------------------------------
##NTUPLES= NMR SPECTRUM
##VAR_NAME=  FREQUENCY,     SPECTRUM/REAL,   SPECTRUM/IMAG
##SYMBOL=    X,             R,               I
##VAR_TYPE=  INDEPENDENT,   DEPENDENT,       DEPENDENT
##VAR_FORM=  AFFN,          ASDF,            ASDF
##VAR_DIM=   16384,         16384,           16384
##UNITS=     HZ,            ARBITRARY UNITS, ARBITRARY UNITS
##FACTOR=    0.220516191357247, 1,           1
##FIRST=     3099.38736345118, 0,            0
##LAST=      -513.329399554596, 0,           0
##MIN=       -513.329399554596, -1731794,    0
##MAX=       3099.38736345118, 524972967,    0
$$ Real data points
##PAGE= N=1
##DATA TABLE= (X++(R..R)), XYDATA
$$ [...]
9755C445742j01916J75636j155697q18203Q18891P4659j04916p2868N9025j77900
9745B142453j134186K26612N82571k28202k97397L69577L27469p55316k13495
9736A020086L76019m55006M49756M18837K09412o76390K5806M14920j37411L09621
9726A955650k99725J06048J91479m41932K94766j50413M89952K17128n79587j25569
9716A657797K90982N35033l14284m26449k07504k32008O95490O39857n38880o19679
9706A480355k80582M75073l4226R0544l13876L09711j05681j88634M37932o1610
9696A809006M2110K77844k88371q4020n01502M56904m31113Q6098N08616k02391
9686A673181j0441K78895L0306n04822k23598M56520M56121p8852n4442j70127
$$ plain form
9755 3445742 3343826 3519462 2363765 1545562 2364453 2439112 2334196 2261328 2320353 2142453
9745 2142453 1008267 1234879 1817450 1589248 1291851 1661428 1988897 1233581 1020086
9736 1020086 1396105 941099 1390855 1809692 2019104 1342714 1368520 1783440 1646029 1955650
9726 1955650 1655925 1761973 1953452 1511520 1806286 1655873 2145825 2362953 1783366 1657797
9716 1657797 1948779 2483812 2169528 1743079 1535575 1303567 1999057 2638914 2100034 1480355
9706 1480355 1199773 1674846 1640620 1731164 1417288 1726999 1621318 1432684 1870616 1809006
9696 1809006 1851116 2128960 1840589 1756569 1255067 1711971 1280858 1366956 1875572 1673181
9686 1673181 1662740 1941635 1971941 1467119 1243521 1700041 2156162 2077310 2022868 1852741
9676A852741O24860n71417J28919O0767n20421m43781K98595J69316k84072L47742
9666A663249J80343j53692N28205k1679o15948Q0617P40037k84771r9479L60301
9656B377183o53184k31596K13384k58543k47048J02930J85712J03099J90847J5039
9646A797823k15929L61205Q9310k67287l25100m7264j0207p19984N34806K49267
9636A446640k02081M01740L04696o08026M60414q1615j25426K49060K46578j9028
9626B072952Q6972j45043n8969J98409o60560J21829M27029l74141J44259q7071
9616A725666M17224M58108l97080j11452j71052K87780j04701j0185Q0768k36796
9606A938280m39504M29386K66596K7211m27698k81344J69605j78552J4365j05753
$$ plain form
9676 1852741 2477601 1906184 2035103 2095870 1575449 1131668 1430263 1599579 1315507 1663249
9666 1663249 1843592 1689900 2218105 2196426 1580478 1661095 2401132 2116361 2016882 2377183
9656 2377183 1723999 1492403 1705787 1447244 1200196 1303126 1488838 1591937 1782784 1797823
9646 1797823 1581894 1943099 2032409 1765122 1440022 1392758 1382551 662567 1197373 1446640
9636 1446640 1244559 1646299 1950995 1342969 1803383 1721768 1596342 1845402 2091980 2072952
9626 2072952 2159924 2014881 1955912 2154321 1493761 1615590 2042619 1668478 1812737 1725666
9616 1725666 2142890 2600998 2203918 2092466 1921414 2209194 2104493 2094308 2175076 1938280
9606 1938280 1498776 1928162 2194758 2221969 1794271 1512927 1682532 1503980 1518345 1412592
9596A412592L65190J64514K00717l16071n44583O60334o28054k42514M4576J7137
9586A133838j1897J05446J66157K07844K5680J14865j36108M1790J35606M09884
9576B193105j49751l09753p1592O9287m6681M70094l05406j7413j38357l64161
9566A329372m41253l68157O24121J06324M2609k25694P81047N38293l18561L2339
9556B100440l24392K44337k09431l34956j84264M93729M3738k71263m4458j54273
9546A359207M49626M98079o4353j76148m8116l5597j56688k60131J31746m54035
9536A243590n58881O28137K56190l9029L13948n07569L51594L98375j53112p89830
9526A143413p359j02357p7730P46927J2823j89617k42j71704L39695j42175k83796
$$ plain form
9596 1412592 1777782 1942296 2143013 1826942 1282359 1942693 1314639 1072125 1116701 1133838
9586 1133838 1121941 1227387 1393544 1601388 1627068 1741933 1605825 1647615 1783221 2193105
9576 2193105 2043354 1733601 1662009 1731296 1684615 2154709 1849303 1831890 1693533 1329372
9566 1329372 888119 519962 1144083 1250407 1293016 1067322 1848369 2386662 2068101 2100440
9556 2100440 1776048 2020385 1810954 1475998 1291734 1785463 1829201 1557938 1513480 1359207
9546 1359207 1808833 2306912 2242559 2066411 2018295 1982698 1826010 1565879 1697625 1243590
9536 1243590 684709 1312846 1569036 1530007 1843955 1336386 1687980 2086355 1933243 1143413
9526 1143413 1136054 1033697 955967 1702894 1715717 1526100 1525858 1354154 1693849 1551674 1267878
9515A267878M09434l4205M10400N99857m77516K0451P19320l19155m3457p6345
9505B476662J15978Q8764l48184J66535j26099j10083m09422K44917m41451n64761
9495A092856L70102m1547Q205J43286K00791k14596L6531N34661m53442o11777
9485A065070N10198M47416o98178L42624O15939k54652M3200M47025l34477J88268
9475B372433j82835j91954j82506J03110L38926J80575j24293l4104R0026k26055
9465B143323K87873j43498o34409O149m15252K76088K21476N32705L51189l15185
9455B310459O9686L5326j47073J41303j17984M05259R97968r34982l44709J05238
9445B520491N88895J02384l23500p5470k4743j95193k60851M69512J04240k90453
$$ plain form
9515 1267878 1677312 1643107 2053507 2653364 2175848 2196299 2915619 2596464 2553007 2476662
9505 2476662 2592640 2681404 2333220 2499755 2373656 2263573 1854151 2099068 1657617 1092856
9495 1092856 1462958 1421411 1429616 1572902 1773693 1559097 1595628 2130289 1676847 1065070
9485 1065070 1575268 2022684 1324506 1667130 2283069 2028417 2071617 2518642 2184165 2372433
9475 2372433 2189598 1997644 1815138 1918248 2257174 2437749 2313456 2279352 2369378 2143323
9465 2143323 2431196 2287698 1653289 1659438 1244186 1520274 1741750 2274455 2625644 2310459
9455 2310459 2380145 2415471 2268398 2409701 2291717 2696976 3694944 2759962 2415253 2520491
9445 2520491 3109386 3211770 2888270 2812800 2788057 2592864 2332013 2801525 2905765 2615312
9435B615312K42027k99159j61421O51005Q44033q863j064908k37985j6422N52713
9425C116332j3363l02671J86391L01490j55189j14169k39894m99916J31658K61343
9415B672012M82698k68133L81205j4521k52140Q30881q9432m58411K85114J02598
9405C671871o2503K66558O3645j08536R1402q681j57598M52252M25500o7795m58079
9394D108036j42279l02376J54229M31991o96903m31999P64524J002982M1874l71649
9384D558430m02099P06307m2490r34175O565n1822J13313J444528P1972j86774
9374E283755l78307N91442j42750l25857L63748n164L7329J89662j27866K6792
9364E512784j84013J53478O1494J56242O25343j70597M15640J86256m289l5847
$$ plain form
9435 2615312 2857339 2558180 2396759 3047764 3891797 3882934 2818026 2580041 2563619 3116332
9425 3116332 3102969 2800298 2986689 3288179 3132990 3018821 2778927 2279011 2410669 2672012
9415 2672012 3154710 2886577 3267782 3253261 3001121 3832002 3742570 3284159 3569273 3671871
9405 3671871 3609368 3875926 3939571 3831035 3922437 3913756 3756158 4208410 4633910 4566115 4108036
9394 4108036 3965757 3663381 3817610 4249601 3552698 3120699 3885223 4888205 4930079 4558430
9384 4558430 4156331 4862638 4820148 3885973 3892538 3840716 3954029 5398557 5470529 5283755
9374 5283755 4905448 5496890 5354140 5028283 5392031 5386867 5424196 5613858 5485992 5512784
9364 5512784 5328771 5482249 5543743 5699985 6325328 6154731 6570371 6756627 6752338 6716491
9354F716491N13227k97511j75106Q07744K93433j87861M2574O25270P0357R2125
9344H500743N43250P2700K5206M10270M34914k25254O65967Q8760l77434O39223
9334A0778345N84060L83512l11216K47194l6598k08211M73742Q10306N50592J35746
9324A3407472R09931N75226N81566R10183Q64035K31755Q98426O31531J738073
9315B0748198K021296J263254K396988K736747M111364L620903L260288K210456
9307D2369494J586130P14110J33765l5576j800772k160091k182536k551741j898158
9298C4174625j812152j928251j785057m02626j2668p44803j54054l64758n76308
9289B6393948K62913L80970N4450K01154Q79924R93434M90151Q96240Q19254J790407
$$ plain form
9354 6716491 7229718 6932207 6757101 7564845 7858278 7670417 7712991 8338261 8408618 8500743
9344 8500743 9043993 9116693 9141899 9552169 9987083 9761829 10427796 10516556 10139122 10778345
9334 10778345 11362405 11745917 11434701 11681895 11645297 11437086 11910828 12721134 13271726 13407472
9324 13407472 14317403 14892629 15474195 16384378 17248413 17480168 18378594 19010125 20748198
9315 20748198 22769494 24032748 26429736 29166483 33277847 36898750 40159038 42369494
9307 42369494 43955624 44669734 44803499 44767923 42967151 40807060 38624524 36072783 34174625
9298 34174625 32362473 30434222 28649165 28246539 28233871 27489068 27335014 26970256 26393948
9289 26393948 26656861 27037831 27092281 27293435 28173359 29166793 29656944 30553184 31372438 33162845
9279C3162845J976708J792476K645161L516462L571278N033547P436047P486447
9271F6620971Q088469R198732Q839921O361040L342103J494152j244527l376211
9263I9324650n012521n481601o294229o952978o483701o461789n689301m463846
9255E2484684l860836k940029k614366j910014j688608j492341l46204o92664
9247C6939622j356430l52703l95135M27510K28736Q88205R74141M67910L84414
9238C8206270J265652J757664K031212L146638M525527N681810O813387P035784
9230G0463944P349276O659447L624713J260495p47049k761902j853403j96764
9222H3798757R34164J827618N46866j863485m222523n941922q126425q104544
$$ plain form
9279 33162845 35139553 36932029 39577190 43093652 46664930 51698477 59134524 66620971
9271 66620971 74709440 83908172 92748093 99109133 102451236 103945388 102700861 99324650
9263 99324650 94312129 88830528 82536299 75583321 69099620 62637831 56948530 52484684
9255 52484684 48623848 45683819 43069453 41159439 39470831 37978490 37632286 36939622
9247 36939622 35583192 35230489 34835354 35262864 35491600 36379805 37353946 37821856 38206270
9238 38206270 39471922 41229586 43260798 46407436 50932963 56614773 63428160 70463944
9230 70463944 77813220 84472667 88097380 89357875 88610826 85848924 83995521 83798757
9222 83798757 84732921 86560539 87107405 85243920 81021397 75079475 66953050 58848506
9214E8848506o241143m903262m532522l523180l201579k458441j798755q66208
9206C1323416j463834q38018n59528k65579r93794j179788m37682O9650n3296
9197B5601547k71045R06853R46927Q54933J699109K698566K054286K190401J619368
9188C8300945K56642J56215r13854j072409l00655m2611M18129J335468l19133
9179C7818737j374205k389804l002916l090218l470070j783463j551102k054051
9171A9102908j371985q46422r10140q03680m50570n69055o42796m84769o81323
9162A2342168j95025L10514m44129m80732n21865j256874r9797M75464r7175j060286
9152H972263P659N78504R1704K91425Q5551k34535J78821L94799q5478q92453
$$ plain form
9214 58848506 52607363 47704101 43171579 39648399 36446820 33988379 32189624 31323416
9206 31323416 29859582 29021564 28462036 28196457 27202663 26022875 25585193 25654843 25601547
9197 25601547 25330502 26237355 27184282 28039215 29738324 32436890 34491176 36681577 38300945
9188 38300945 38557587 38713802 37799948 36727539 36426884 36384273 36802402 38137870 37818737
9179 37818737 36444532 34054728 31051812 27961594 24491524 22708061 21156959 19102908
9171 19102908 17730923 16884501 15974361 15170681 14720111 14151056 13508260 13023491 12342168
9162 12342168 12147143 12457657 12013528 11532796 11010931 9754057 9654260 10129724 10032549 8972263
9152 8972263 8979922 9558426 9650130 9941555 10027106 9792571 9971392 10366191 10280713 9388260
9142I388260l06266O21190N17113m15327k07102r74807L03637J30934j164275
9133G893357N27776l63249q4867m6511J47422p11404k94581j95636N36179L42414
9123G750900l54759n98455j36184K78603K00117j36141l15382j44321M60428j44084
9113F860722p92157m9860O4480J24360N90075L1989l83006J69715l32749j17048
9103F166521J21406k85355K85110l60258k60667P04258p23347O8651O97961L29755
9093F744035l34594j56000m01668L22719k50735M32114K17399K6203m38085m62854
9083E698534J26600K38057N1704N9780k91351k6593j99617k294J92237o32376
9073E214681M76318n64074L76988K62313R1909k86089j08885J87806J40319q2965
$$ plain form
9142 9388260 9081994 9703184 10220297 9804970 9597868 8623061 8926698 9057632 7893357
9133 7893357 8421133 8057884 7973017 7926506 8073928 7362524 7067943 6872307 7408486 7750900
9123 7750900 7396141 6797686 6661502 6940105 7140222 7004081 6688699 6544378 7004806 6860722
9113 6860722 6068565 6018705 6083185 6207545 6797620 6829609 6446603 6616318 6283569 6166521
9103 6166521 6287927 6002572 6287682 5927424 5666757 6371015 5647668 5716319 6414280 6744035
9093 6744035 6409441 6253441 5851773 6174492 5923757 6355871 6573270 6599473 6161388 5698534
9083 5698534 5825134 6063191 6114895 6174675 5883324 5856731 5657114 5654820 5847057 5214681
9073 5214681 5690999 5126925 5503913 5766226 5858135 5572046 5463161 5650967 5791286 5708321
9063E708321L32043n16862L57561J21418J3308J54752k4843j86422L92213j46008
9053F205481l96971K82404k79013K43204L6803N56739o85351M75794M4230m20632
9043F062688Q8656K17675Q6443n28542k40704N784L78322l3894n5733R5637n20467
9032E555865N96161q3551l11639l03382j36176L49225L64468j65074r9996k24665
9022E541236n2763J198o9580O8218M96536L2242K32763M25428l59038l89110k54965
9011E672165Q30560l73594j65583k22714K25284P95904l74361P0020l205P3412
9001F527888r5335J61381N15509n23544l55421o3444N43413K87191l21342J41161
8991F817457o15922N3181m00596L33116L79607r21175k32190M85346M97555o33445
$$ plain form
9063 5708321 6040364 5523502 5881063 6002481 6015789 6170541 6145698 5959276 6351489 6205481
9053 6205481 5808510 6090914 5811901 6055105 6091908 6648647 5963296 6439090 6483320 6062688
9043 6062688 6151344 6369019 6455462 5926920 5686216 5692000 6070322 6036428 5980695 6076332 5555865
9032 5555865 6152026 6068475 5756836 5453454 5317278 5666503 6030971 5865897 5765901 5541236
9022 5541236 5488473 5489671 5420091 5488309 5984845 6017087 6249850 6675278 6316240 5927130 5672165
9011 5672165 6502725 6129131 5963548 5740834 5966118 6762022 6387661 6457681 6454476 6527888
9001 6527888 6432553 6593934 7109443 6585899 6230478 6167034 6710447 6997638 6676296 6817457
8991 6817457 6201535 6254716 5854120 6187236 6566843 5645668 5413478 5898824 6396379 5762934
8981E762934Q465N25370n3683R9019m16025K4128j10672l37660K02827j23183
8971E581520l7916N46174j76943k23823K42886l29579J54961N54045K42731o06786
8961E947270L3486q4175K56390o37r7277l05777q9806Q66100p10299j46188R59221
8950F628308n9977k7642J51966k15033M17788m87303n59481K70032k67496J14955
8940E966117K03352l18376L71156M01683O33130m68812p35574N38043Q9448o25643
8930F054524j61868O50599l46764K35437k5530N31405l55140J63873l69415n15641
8920E861480L1953O1144R42N8061P88846j3910j50955J35778J76618k26303m92929
8909F230725M29853Q4778k0053o51256j49051P34179L82072o9128m15519o41802
$$ plain form
8981 5762934 5771399 6296769 6243086 6342105 5926080 5950208 5839536 5501876 5704703 5581520
8971 5581520 5543604 6089778 5912835 5689012 5931898 5602319 5757280 6311325 6554056 5947270
8961 5947270 5980756 5896581 6152971 6152334 6055057 5749280 5659474 6525574 5815275 5669087 6628308
8950 6628308 6568331 6540689 6692655 6477622 6895410 6408107 5848626 6118658 5851162 5966117
8940 5966117 6169469 5851093 6222249 6623932 7257062 6788250 6052676 6590719 6680167 6054524
8930 6054524 5892656 6543255 6196491 6431928 6406398 6937803 6582663 6746536 6377121 5861480
8920 5861480 5893433 5954577 5955519 6013580 6802426 6788516 6637561 6773339 6949957 6723654 6230725
8909 6230725 6660578 6745356 6725303 6074047 5924996 6659175 7041247 6972119 6556600 5914798
8899E914798l05305R46889L51056j91955L13701L0165r2048l58142l02442M76366
8889F783083q6467J24395j89301L05624j72542J18715N03031J00183K53237n44906
8879G195052o3462N86111k91717o39444M31790k82850m1263K50418j42311o7065
8869F935259J0054l91446l12590M53731M9886J12348J11385l2668P2609k39954
8859F768614l52473J041428K60967n28888J05771J06954L28233m5517m86188P0613
8849G269514R8228n61067J93254O0010O06638k01568m30721N72323o45678k39422
8839F721511K78177k99036N749P3364l7322Q77202L95150l63226q11876p1538
8829F768155M5799L22817K58130J87255j36014j53698m85699L84256j53927J7327
$$ plain form
8899 5914798 5609493 6556382 6907438 6715483 7029184 7059349 6967301 6609159 6306717 6783083
8889 6783083 6696616 6821011 6631710 6937334 6764792 6883507 7386538 7486721 7739958 7195052
8879 7195052 7131590 7717701 7425984 6786540 7218330 6935480 6894217 7144635 7002324 6935259
8869 6935259 6945313 6553867 6241277 6695008 6744894 6857242 6968627 6935959 7008568 6768614
8859 6768614 6416141 7457569 7718536 7189648 7295419 7402373 7730606 7685089 7198901 7269514
8849 7269514 7367742 6806675 6999929 7059939 7666577 7465009 7034288 7606611 6960933 6721511
8839 6721511 6999688 6700652 6706401 6779765 6742443 7619645 8014795 7651569 6839693 6768155
8829 6768155 6813954 7136771 7394901 7582156 7446142 7292444 6806745 7191001 7037074 7054401
8819G054401M9707j36481L53759K22214j4865l20444k31244M16200l26483O47130
8809G713894N89855l5170l12716n43427q1142Q1577M43586R7743p03673M742R62018
8798H217287o8345J99789J54596j66918l25389m41145j54916J003290m80922l51137
8788G586190J08856o01772m70121O18266N14331L01359N86763o13233m47928J3287
8778G595998K10282J29526K29966j87623N13908j09094m6441L34583Q5016j92065
8768H564056n82683j54848J56412N73232L6058j98776J02499J67443K3816L0504
8758H717713O4483m11224m02840j05320o2525O17540P932n37112J49655O77344
8748H715646j83557q0680O2147r8821p8554p0739O2557K92167R9546k93603o8020
$$ plain form
8819 7054401 7104108 6967627 7321386 7543600 7528735 7208291 6977047 7393247 7066764 7713894
8809 7713894 8303749 8268579 7955863 7412436 7331294 7412871 7856457 7954200 7250527 7255269 8217287
8798 8217287 8148942 8348731 8503327 8336409 8011020 7569875 7414959 8418249 7937327 7586190
8788 7586190 7695046 7093274 6623153 7241419 7755750 8057109 8643872 8030639 7582711 7595998
8778 7595998 7806280 7935806 8165772 7978149 8492057 8382963 8336522 8671105 8756121 8564056
8768 8564056 7981373 7826525 7982937 8556169 8592227 8393451 8495950 8663393 8687209 8717713
8758 8717713 8782196 8370972 7968132 7862812 7800287 8417827 8425759 7888647 8038302 8715646
8748 8715646 8532089 8451409 8513556 8414735 8336181 8265442 8327999 8620166 8719712 8426109 8358089
8737H358089k76902k79084N63868L40221j66211J82384L36633L64099l12031l04514
8727H806552N23942K60039k1355n73936k09959J17796k01010r2490L68775k95624
8717H682730J22929m5771o4617K33750K59042l76497P6962M28196O40317k55428
8707I701613J0661J13066l54837l1775J70039k12749l88702j02113O31753J98898
8697I735854k1666K41348p6422k98669M06297L32152K51927l53711l65634K44366
8687A0095842J39821J40502J95172P7314K32663n36663N4411N05053J52312l74359
8677A0682068j01081k8583j60227p6210M59795k83829j13513N99531n03646l45570
8667A0128735J43082R29174o2393J95019J6752J032130J81483o26295m07886k20438
$$ plain form
8737 8358089 8081187 7802103 8365971 8706192 8539981 8722365 9058998 9423097 9111066 8806552
8727 8806552 9330494 9590533 9569178 8995242 8785283 8903079 8702069 8609579 8978354 8682730
8717 8682730 8805659 8759888 8695271 8929021 9188063 8811566 8888528 9316724 9957041 9701613
8707 9701613 9712274 9825340 9470503 9438728 9608767 9396018 9007316 8905203 9536956 9735854
8697 9735854 9714188 9955536 9879114 9580445 9986742 10318894 10570821 10217110 9851476 10095842
8687 10095842 10235663 10376165 10571337 10648651 10881314 10344651 10399062 10904115 11056427 10682068
8677 10682068 10580987 10552404 10392177 10315967 10775762 10491933 10378420 10977951 10474305 10128735
8667 10128735 10271817 11200991 11138598 11333617 11350369 12382499 12563982 11937687 11529801 11309363
8657A1309363k86109N94144J0151k831M88357l32192q9297m05557J2946M36454
8647A1735429l62639K22044J31146J00626k97088J156698n28362m18360N62058
8638A2301552K55184k84743k44286k94600Q03804M31552p1467p56320L62949K78027
8628A2781652K50780R059l72200J02732j04022M16739L46440O9624l85568k99817
8618A2815419L47051n23815O14951L26186L34580J36514o32394L16938l4276j08207
8608A3592947J43357j77092k8263N12721k20784K39512K30185J79362j80840K25882
8598A4516987j77738J76482J27941P49763O3024k14949R3060L25161M0612m61853
8588A5238490M64371L32349N61259k43540N60276j25455k76220N73386M9485Q5071
$$ plain form
8657 11309363 11023254 11617398 11627549 11624718 12113075 11780883 11691586 11286029 11298975 11735429
8647 11735429 11372790 11594834 11725980 11826606 11529518 12686216 12157854 11739494 12301552
8638 12301552 12556736 12271993 12027707 11733107 12536911 12968463 12896996 12140676 12503625 12781652
8628 12781652 13032432 13041491 12669291 12772023 12668001 13084740 13431180 13500804 13115236 12815419
8618 12815419 13162470 12638655 13253606 13579792 13914372 14050886 13418492 13735430 13701154 13592947
8608 13592947 13736304 13559212 13530949 14043670 13822886 14062398 14292583 14471945 14291105 14516987
8598 14516987 14339249 14515731 14643672 15393435 15456459 15241510 15334570 15659731 15700343 15238490
8588 15238490 15702861 16035210 16596469 16352929 16913205 16787750 16511530 17084916 17134401 17219472
8578A7219472o09750K34571k77423K58793l18656O71252O1789L75388k8139L56531
8568A7943828M6655P31549m85623K33904L42693j11625j62045Q00361Q56983m12723
8558A9783957K86249l55083L9662J51891L74308P15643J29537J10256J78295J43115
8548B1557830K31908q1500j68668M44499P41764j41638m33323N28884Q77270N74878
8538B4131904L73106q52786m3846O72968K22504k2152j51906M82548K36125L47607
8528B5396072R8942m64829O3789O23911L49108j40146o5299O53341K58495J04461
8518B6877845l765k86343N22945N13070K35486M53477N00435K39642N26795k55234
8508B9324353K47161k05925l4883N82521L49921L48615K60344k54876K34929m82752
$$ plain form
8578 17219472 16609722 16844293 16566870 16825663 16507007 17178259 17240048 17615436 17587297 17943828
8568 17943828 17990483 18722032 18236409 18470313 18813006 18701381 18539336 19339697 20196680 19783957
8558 19783957 20070206 19715123 19754785 19906676 20280984 20996627 21126164 21236420 21414715 21557830
8548 21557830 21789738 21708238 21539570 21984069 22725833 22584195 22150872 22679756 23557026 24131904
8538 24131904 24505010 23652224 23608378 24281346 24503850 24481698 24329792 24812340 25048465 25396072
8528 25396072 25495014 25030185 25093974 25717885 26066993 25926847 25861548 26514889 26773384 26877845
8518 26877845 26874080 26587737 27110682 27623752 27859238 28312715 28813150 29052792 29579587 29324353
8508 29324353 29571514 29365589 29330706 29913227 30263148 30611763 30872107 30617231 30852160 30369408
8498C0369408K72904J8530M46674K83734K16312M8746q8352L18241O14868K19516
8488C2720581M06659J49320M26868Q49798L55944j47389m82070J62867N71896
8479C5014474O50088Q0960p8364P62069k87783k54812m63358R02503R61506L18583
8469C7605866P11555m3614j9652L48518L37784M9159L01184M88743K19874m20026
8459C9579391J056502R33923M92945K47204J34368N91427m5713k36065K19952
8450D2973934L39145O29858j68590N01249O48920N02649K45536J040220j10912
8441D6602009O42463O98624J03959Q97295N9191O72889P02864L85827K68458L8579
8431E1072158M97587Q59885Q28619J340760P10472k79567N49996O80145L65581
$$ plain form
8498 30369408 30642312 30660842 31107516 31391250 31607562 31656308 31567956 31886197 32501065 32720581
8488 32720581 33127240 33276560 33703428 34553226 34909170 34761781 34279711 34442578 35014474
8479 35014474 35664562 35745522 35667158 36429227 36141444 35886632 35423274 36325777 37287283 37605866
8469 37605866 38317421 38273807 38254155 38602673 38940457 38989616 39290800 39779543 39999417 39579391
8459 39579391 40635893 41569816 42062761 42309965 42444333 43035760 42990047 42753982 42973934
8450 42973934 43313079 43942937 43774347 44275596 44924516 45427165 45672701 46712921 46602009
8441 46602009 47244472 47943096 48047055 48944350 49003541 49676430 50379294 50765121 51033579 51072158
8431 51072158 51569745 52429630 53258249 54599009 55309481 55029914 55579910 56260055 56625636
8422E6625636P81871P42553M11524R9463N54170P33862P20773J071639J002367
8413F2743858R34616K32586M06137Q52558P80355M71242P19207M44327Q28359
8404F8413245M70991N16557R97955O14359J63692O0246K50605n6037K64623m96292
8394G1199944L02675l80958o8498O32753J67715J12799n10517m08275j13182j96325
8384G0738131J50583L10815m63874p86525K73953m7895J28840n331m73433k60314
8374F9564950o8818r9947K4087n48673n40172k37385M0904K41791n26588p31272
8364F7118877p56739k66909k45847N7386j89562K20442r13616n01821n46047l15054
8354F3661110l58804p89075m19461O64758K25378Q2523p69332o87921j94601m73049
$$ plain form
8422 56625636 57407507 58150060 58561584 58661047 59215217 59949079 60669852 61741491 62743858
8413 62743858 63678474 63911060 64317197 65169755 65950110 66421352 67140559 67584886 68413245
8404 68413245 68884236 69400793 70398748 71013107 71176799 71237045 71487650 71431613 71696236 71199944
8394 71199944 71502619 71121661 71053163 71685916 71853631 71966430 71455913 71047638 70934456 70738131
8384 70738131 70888714 71199529 70735655 69949130 70223083 70175188 70304028 70298697 69825264 69564950
8374 69564950 69496132 69396185 69420272 68871599 68331427 68094042 68134946 68376737 67850149 67118877
8364 67118877 66362138 66095229 65849382 65906768 65717206 65937648 65024032 64522211 63976164 63661110
8354 63661110 63302306 62513231 62093770 62758528 62983906 63066429 62297097 61609176 61414575 60941526
8344F0941526n46996O7158J58833m60661j49714J49447q19078K5129Q96643o48221
8334E9614066M08554l12358l82306m60251O2130M84383l96496l48513J94905q0816
8324E8783298j60339o05697L17000o0206n14311J39301M81374o0929j94206p91345
8314E7333940Q05072K48976p2554k57795n26156O64181q90574J03547k24328k36436
8304E6947873J00215J57536J7310o82J0267m53180J76112o14650J66357Q19753
8294E7326911m25242j54844l92733N57262M08108l66451k20738K17707N7286n03111
8284E6504155k294o30533j40251J79608R37270J41648l34524K32992J73131M01481
8274E7462683O40218j203550m08206N05009o81818J36966O55097N55576k01747
$$ plain form
8344 60941526 60394530 60461688 60620521 60159860 60010146 60159593 59340515 59365644 60262287 59614066
8334 59614066 60022620 59710262 59327956 58867705 58929835 59414218 59017722 58669209 58864114 58783298
8324 58783298 58622959 58017262 58334262 58274056 57759745 57899046 58380420 58319491 58125285 57333940
8314 57333940 58139012 58387988 58315434 58057639 57531483 58195664 57305090 57408637 57184309 56947873
8304 56947873 57048088 57205624 57222934 57222252 57232519 56779339 56955451 56340801 56507158 57326911
8294 57326911 56901669 56746825 56354092 56911354 57319462 56953011 56732273 56949980 57007266 56504155
8284 56504155 56501861 55871328 55731077 55910685 56847955 56989603 56655079 56888071 57061202 57462683
8274 57462683 58102901 56899351 56491145 56996154 56314336 56451302 57106399 57661975 57460228
8265E7460228q8392k52509j93825O068j65738M9570k41867M33103K94656k45548
8255E7055746L7274P4962M28278p1691o9588N59088k50028j080938J035842M25603
8245E8144548k58606J03898o08122K51584R30781m17787m63141L36190J19362
8236E8138707p44576l43429P65168R1194m09143L65155L10873N2063k39203O0441
8226E8047250L56035j47361k41569j31008K4162O8605L20728J47687m81170Q06717
8216E8770076M07789j27450j8936m25329L04403J30523l13597l06830K48914Q6347
8206E8755910m9589L98282j8996k79349j69754M78826o68119M01179L09082O68540
8196E9826012n66797O11189K46411K422498J017466n230365O2186Q3635P2790
$$ plain form
8265 57460228 57371836 57119327 56925502 56931570 56765832 56815402 56573535 57006638 57301294 57055746
8255 57055746 57093020 57167982 57596260 57524569 57454981 58014069 57764041 56683103 57718945 58144548
8245 58144548 57885942 57989840 57381718 57633302 58564083 58146296 57683155 58019345 58138707
8236 58138707 57394131 57050702 57815870 57907064 57497921 57863076 58173949 58226012 57986809 58047250
8226 58047250 58403285 58255924 58014355 57883347 57907509 57976114 58296842 58444529 57963359 58770076
8216 58770076 59177865 59050415 59031479 58606150 58910553 59041076 58727479 58420649 58669563 58755910
8206 58755910 58706321 59104603 59085607 58806258 58636504 59115330 58447211 58848390 59157472 59826012
8196 59826012 59259215 59870404 60116815 62539313 63556779 58326414 58388600 58472235 58545025
8187E8545025j34763M72642k29106N49625j18993J80758N58470o92957J19213
8178E9249914L68881m75207K0629j31632L5961L10351L36748P4934P2039j26092
8168E9736526o6080N24095n72619K38386O4812N55796j1512J42065n84389L639
8158F0030719K45195l56865J22315O3J00865L53942k53600M14481K95844o34964
8148F0317995N24221K96893m93181l5820J85287l15119L97423R9449r51649O84294
8138F0709793P41658n8896K10060n2198n6105m26515O40582O30402k25440L42800
8128F2456141j69568N65036l75661Q09L68638k3782l45600j07536M58456P6341
8118F2903274p0413K25444N46247m4917l78135L06768l27510k49791k03976K41252
$$ plain form
8187 58545025 58410262 58882904 58653798 59203423 59084430 59265188 59823658 59130701 59249914
8178 59249914 59618795 59143588 59164217 59032585 59068546 59378897 59715645 59790579 59862618 59736526
8168 59736526 59670446 60194541 59621922 59860308 59925120 60480916 60469404 60611469 60027080 60030719
8158 60030719 60275914 59919049 60041364 60041427 60142292 60496234 60242634 60657115 60952959 60317995
8148 60317995 60842216 61139109 60645928 60610108 60795395 60480276 60877699 60977148 60025499 60709793
8138 60709793 61451451 61392555 61602615 61550417 61494312 61067797 61708379 62338781 62113341 62456141
8128 62456141 62286573 62851609 62475948 62476757 62845395 62821613 62476013 62368477 62826933 62903274
8118 62903274 62832861 63058305 63604552 63559635 63181500 63488268 63160758 62910967 62706991 62948243
8108F2948243M93661J47689P01693k24772k35648M04290J50260L30672N99919
8099F5316007o39853o12783L98253N69697n8253J5800j45083R77120l43345P02427
8089F6179987J1801l09456M16275l54161M92010J22776L06090R6457P62959O0469
8079F7785207m20144K53847k23118J28346J67274k29544o3324o6436R7234M6339
8069F7475681J32048M90085M33218J51459o4433K43123J8294k8120K59854N73852
8059F9685061j97640j14443O25299r1071O14652n9432p4596J37686j58636k82471
8049G0084409k3873M96641J60135K29149K25988J53612k93511k01914L36252P98436
8039G1965324k54683m12047M70411m47585J34741o9977l51010J56482p64811n48945
$$ plain form
8108 62948243 63441904 63589593 64291286 64066514 63830866 64235156 64385416 64716088 65316007
8099 65316007 64676154 64063371 64461624 65031321 64973068 64988868 64843785 65820905 65477560 66179987
8089 66179987 66191788 65882332 66298607 65944446 66436456 66559232 66865322 66961779 67724738 67785207
8079 67785207 67365063 67618910 67395792 67524138 67691412 67461868 67398544 67332108 67429342 67475681
8069 67475681 67607729 68097814 68531032 68682491 68618058 68861181 68879475 68851355 69111209 69685061
8059 69685061 69487421 69372978 69998277 69907206 70521858 70462426 70387830 70525516 70366880 70084409
8049 70084409 70060536 70557177 70717312 70946461 71172449 71326061 71032550 70830636 71166888 71965324
8039 71965324 71710641 71298594 71769005 71321420 71456161 71386184 71035174 71191656 70426845 69877900
8029F9877900J044625Q4258j23303p31167j09497k40747l41745J63257l94884
8020F9228697m83661M00375k43833r6740j008855n89610P29426m74482J11822
8011F7573139P9995L6297m36666m23689p56649N78280J56568o5849p1602k75765
8001F6394059j79724l16468l46651j29248R5564L27177K17271J56521l05007K3610
7991F5937104m16353m53455L81009j0667k06003n61247l4081M370k41715Q54173
7981F5253135J16030l7695n90176j0066m07459J88793Q80729l80245k42903p1337
7971F4698806j03755m6015J14835M32522P4967n69959n9651j29563K86520O12858
7961F5311565l46295j25346L35730n74746o40148K36992L94814j41206N7862p0260
$$ plain form
8029 69877900 70922525 71006783 70883480 70152313 70042816 69802069 69460324 69623581 69228697
8020 69228697 68745036 69145411 68901578 68804838 67795983 67206373 67935799 67461317 67573139
8011 67573139 67653134 67689431 67252765 66829076 66072427 66650707 66807275 66741426 66669824 66394059
8001 66394059 66214335 65897867 65551216 65421968 65517532 65844709 66061980 66218501 65913494 65937104
7991 65937104 65520751 65067296 65448305 65437638 65231635 64670388 64636307 64640677 64398962 65253135
7981 65253135 65369165 65331470 64741294 64731228 64323769 64512562 65393291 65013046 64770143 64698806
7971 64698806 64595051 64549036 64663871 65096393 65171360 64601401 64541750 64412187 64698707 65311565
7961 65311565 64965270 64839924 65175654 64600908 63960760 64197752 64592566 64451360 64509222 64438962
7951F4438962N49783l15103l74939J13843j63347j67281m95740N80741Q98793
7942F5065712J87414m36932m94900p432Q6605K81107J67290q5125k09405K50168
7932F4804502p43585L5768N05351N38504L03m51860l92628m94152Q01276N60981
7922F5164460n43421P2227o62294L44313K36039N65671P32983n17169R070N9023
7912F5460902l54477p0886N22902J42022J37452j00240J33585m0061J77550L58712
7902F6367461l05537o04857m6059J077695j2771j49714o50071K23729P04579k32285
7892F6372170J3066M85671R54l12580R1365p4213J55386k03385J904L22566k65702
7881F6587202K13331k38804K13820N11383n69315K07873n08685l33190n0720J288491
$$ plain form
7951 64438962 64988745 64673642 64298703 64412546 64249199 64081918 63586178 64166919 65065712
7942 65065712 65253126 64816194 64321294 64313862 64400467 64681574 64848864 64763739 64554334 64804502
7932 64804502 64060917 64096685 64602036 65140540 65140843 64688983 64296355 63802203 64603479 65164460
7922 65164460 64621039 64693266 64030972 64375285 64611324 65176995 65909978 65392809 65401879 65460902
7912 65460902 65106425 65035539 65558441 65700463 65837915 65737675 65871260 65831199 66008749 66367461
7902 66367461 66061924 65457067 65411008 66488703 66475932 66326218 65676147 65899876 66604455 66372170
7892 66372170 66385236 66870907 66871861 66559281 66650646 66576433 66731819 66528434 66530338 66852904 66587202
7881 66587202 66800533 66561729 66775549 67286932 66717617 66925490 66416805 66083615 66032895 67321386
7871F7321386M55651o6144j6089L16685p39191r2407o50637J74477L38805K20478
7861F7263014k5801J11806N56332l0080J71158k01693M92845J42022M87231r241
7851F8957593m45019n2218r7860N5255j85219J2955N22543l196k70321N50726
7841F9045239P84644o2715p19199j22629P0033N9671O29748J37247l3225M8395
7831F9837209Q3323M12733J3615n82076K91352j31674j94579M17872O08594k25746
7821G0530623J5959l41540N07404N31678k96193m27501O35553J233933N7158l49515
7811G2097559n1588k9234m302Q7913R1060M71161M12729L36276J464929m20950
7801G4455553j964229J269036Q57894K53410J29236R1788R78322j67948m464m60750
$$ plain form
7871 67321386 67777037 67710893 67694804 68011489 67272298 67179891 66529254 66703731 67042536 67263014
7861 67263014 67237213 67349019 67905351 67875271 68046429 67844736 68337581 68479603 68966834 68957593
7851 68957593 68512574 68460356 68362496 68417751 68232532 68245487 68768030 68764834 68494513 69045239
7841 69045239 69829883 69767168 69047969 68925340 68995373 69055044 69684792 69822039 69788814 69837209
7831 69837209 69920532 70333265 70346880 69764804 70056156 69924482 69729903 70147775 70756369 70530623
7821 70530623 70546582 70205042 70712446 71244124 70947931 70520430 71155983 72389916 72447074 72097559
7811 72097559 72045971 72016737 72012435 72100348 72191408 72662569 73075298 73411574 74876503 74455553
7801 74455553 72491324 73760360 74618254 74871664 75000900 75092688 76071010 75903062 75898598 75437848
7791G5437848L13039O50184l02210k2204P02040k93691K00625n07256p28028N59490
7781G6009837K69042m303l46757L38861n25952K89321k84760k21381l6083j10485
7771G5377340o6625j45739k20069Q6479l54101m80582j2182o7274p21469o77033
7761G2718745k15177M39851L07877N0255k06613r50087M13922n64646M31868P8599
7751G2504594k00035j63049k81675M64015L92499o00899r5985M81890j162967
7742G1338388j515M56973M56716J26963j41596j77110O28643q6879r98186j53611
7732G1448786n9466J98897J6205j30960m96341k36273O47764M00639r56558J21279
7722G0953972P29712m79855l72691L42534P05390m54016m48078p6160K26039L0934
$$ plain form
7791 75437848 75750887 76401071 76098861 76076657 76778697 76485006 76685631 76178375 75450347 76009837
7781 76009837 76278879 76274576 75927819 76266680 75740728 76030049 75745289 75523908 75487825 75377340
7771 75377340 75310715 75164976 74944907 75031386 74677285 74196703 74184521 74117247 73395778 72718745
7761 72718745 72503568 72943419 73251296 73301551 73094938 72144851 72558773 71994127 72425995 72504594
7751 72504594 72304559 72141510 71859835 72323850 72716349 72115450 72019465 72501355 71338388
7742 71338388 71336873 71793846 72250562 72377525 72235929 72058819 72687462 72600583 71602397 71448786
7732 71448786 71389320 71588217 71604422 71473462 70977121 70740848 71388612 71789251 70832693 70953972
7722 70953972 71683684 71203829 70831138 71173672 71879062 71425046 70976968 70900808 71126847 71157781
7712G1157781k78873K28352J11966P645n1063L78178K8764J81036L81959l71444
7702G1774301m19326o4584L73785j79273j28177K2033J09321k94201j21303P31585
7692G1804161K74786l56737l90283L15867p0945j5397M20579o19936j29355J43032
7682G1375772l26014Q2154K82070k11940N82367p36108j22053L61790k3901K29227
7672G1493364L27628O45150p02570N4870j48765J42022L93043J13286j03785n70984
7662G1643259J69244K44329R3241K34419k47237O2742k16029N08828P17323j42627
7652G3067492P6826k9079l11170L74503K23606m1308J17004l3989k76698k73655
7642G2893532k94616N34876j86135p09465p4044N9552J33054j40977m06938N53498
$$ plain form
7712 71157781 70878908 71107260 71219226 71226871 71175808 71553986 71582750 71763786 72145745 71774301
7702 71774301 71354975 71290391 71664176 71484903 71356726 71378759 71488080 71193879 71072576 71804161
7692 71804161 72078947 71722210 71331927 71647794 71576849 71561452 71982031 71362095 71232740 71375772
7682 71375772 71049758 71131912 71413982 71202042 71784409 71048301 70926248 71288038 71264137 71493364
7672 71493364 71820992 72466142 71763572 71818442 71669677 71811699 72204742 72318028 72214243 71643259
7662 71643259 71812503 72056832 72150073 72384492 72137255 72199997 71983968 72492796 73210119 73067492
7652 73067492 73144318 73115239 72804069 73178572 73402178 73360870 73477874 73443885 73167187 72893532
7642 72893532 72598916 73133792 72947657 72238192 72164148 72223700 72356754 72215777 71808839 72362337
7632G2362337k22794o2586j67025l13564L14425L97072L26573K4248o70566r29468
7622G1058652Q4755J63123M96937M36560N33683k53958n27353J77269l98941k58049
7612G1512678K20761M5967k23N56953j020037l39751J126101n71175K60129j87758
7602G1603645l33888m3639k07204O77566k47604n50492j63710K73484p1793m97465
7592G0438900M43456K01347L97214n75779p0696J16230J02372j63668O3447l38886
7582G0613937J72703M2551j28719K99795K63767L05909j52086j59049P9698P0749
7572G1409255j7043k23626J79861M57299k45645R8411k31049K59584o1838R0116
7562G1715325O19388q28628n49646O32041J72437J56586l27106K41947L78097
$$ plain form
7632 72362337 72139543 72076957 71909932 71596368 71910793 72307865 72634438 72658686 71988120 71058652
7622 71058652 71143407 71306530 71803467 72240027 72773710 72519752 71992399 72169668 71770727 71512678
7612 71512678 71733439 71779406 71779183 72336136 71316099 70976348 72102449 71531274 71791403 71603645
7602 71603645 71269757 71226118 71018914 71696480 71448876 70898384 70734674 71008158 70936365 70438900
7592 70438900 70882356 71083703 71480917 70905138 70834442 70950672 71053044 70889376 70952823 70613937
7582 70613937 70786640 70829191 70700472 71000267 71264034 71569943 71417857 71258808 71338506 71409255
7572 71409255 71392212 71168586 71348447 71805746 71560101 71658512 71427463 71687047 71625209 71715325
7562 71715325 72334713 71506085 70956439 71588480 71760917 71917503 71590397 71832344 72210441
7553G2210441N9424j22134m68796n20345M11693P13682l74259K5078J83717R72018
7543G3090519L61554J40195n66829l5304m94377k12403J53794N3625J68608l31580
7533G2327802L9688L75595O5865L65251l98816j78370O05264j01618k40517M25755
7523G3285899l6891k40086K52462K75915k10084o21601Q95560j50128Q5519N52868
7513G4089433M46761N8607m65985k08083Q28961j75655J47732m7727m71613J94107
7503G4396538J028506l37364Q9551J124874q8483k89720k7157o6491O4525m15884
7493G5478895P29852N25125M8861j771k44456o82255m62224J41145O70235J29329
7483G6332736L73241m72278j68956k79074l24373M52078P5712q8039l03799l08409
$$ plain form
7553 72210441 72269865 72147731 71678935 71158590 71570283 72283965 71909706 71934784 72118501 73090519
7543 73090519 73452073 73592268 73025439 72990135 72495758 72283355 72437149 72490774 72659382 72327802
7533 72327802 72367490 72743085 72808950 73174201 72775385 72597015 73202279 73100661 72860144 73285899
7523 73285899 73249008 73008922 73261384 73537299 73327215 72705614 73601174 73451046 73536565 74089433
7513 74089433 74536194 74594801 74128816 73920733 74749694 74574039 74721771 74674044 74202431 74396538
7503 74396538 75425044 75087680 75177231 76302105 76213622 75923902 75896745 75830254 75894779 75478895
7493 75478895 76208747 76733872 76782733 76780962 76536506 75854251 75392027 75533172 76203407 76332736
7483 76332736 76705977 76233699 76064743 75785669 75461296 75913374 75989086 75901047 75597248 75288839
7473G5288839k02998O36341K35768P9157j70329m23776l48154r222n9530l745
7463G5022351J02340j61799l35861L21072K86190M140k76111L7275J70078O01274
7453G5770949l39498k43935k24010q2363j00327J46534K02597Q09719j13285j5416
7443G5810965m25879N9313L27197j2146Q07427k50147j075579j00652M06264k5781
7433G5520982K14860Q62184L26430l66990l12121J61253L75441K33674M875J93666
7423G7214254k85842k91061Q42794J67835j38993j65511K9517K71280k76214J21110
7413G7489169K47854J05334l65305o37987r4494Q19825O10176l57852L34860N91115
7403G8742695j93920m19070N18071L36581q5316k93334j61174P7331j36269O55124
$$ plain form
7473 75288839 75085841 75722182 75957950 76037107 75866778 75443002 75094848 75085626 75026096 75022351
7463 75022351 75124691 74962892 74627031 74948103 75234293 75238433 74962322 74999597 75169675 75770949
7453 75770949 75431451 75187516 74963506 74881143 74780816 74927350 75129947 75939666 75826381 75810965
7443 75810965 75385086 75444399 75771596 75759450 76566877 76316730 75241151 75140499 75546763 75520982
7433 75520982 75735842 76598026 76924456 76557466 76245345 76406598 76782039 77015713 77020588 77214254
7423 77214254 76928412 76637351 77480145 77647980 77508987 77343476 77372993 77644273 77368059 77489169
7413 77489169 77737023 77842357 77477052 76839065 76744571 77564396 78174572 77816720 78151580 78742695
7403 78742695 78548775 78129705 78647776 78984357 78899041 78605707 78444533 78521864 78385595 79040719
7393G9040719j04268j14182J48355J57645q7845J26340N69765L61198l79436j42205
7383G9576086L23396l58329O46013J52601J59014K36548K2756n5700K15036M02199
7373H1319620p44801l33310o9373P05562L41293M7997k60321p23363K88362M24866
7363H0996532k47331j263978R1552M01588K82008n31366J52131J04478R78993
7354H0964607O7329k57545k61071K59417M3172N2102Q212j56391k13092K38878
7344H0745618L0237j63264m16556l54421l37933O53987O23586k30175M83108K41323
7334H1275510r7898l20424K9967l68616L67632j6389J83067L69252J88749j11807
7324H1499043L87856m76094n59045J99838M04993L69373J45375q72611r6268K68104
$$ plain form
7393 79040719 78936451 78822269 78970624 79128269 79040424 79166764 79736529 80097727 79718291 79576086
7383 79576086 79899482 79541153 80187166 80339767 80498781 80735329 80758085 80702385 80917421 81319620
7373 81319620 80574819 80241509 80172136 80877698 81218991 81266988 81006667 80283304 80571666 80996532
7363 80996532 80749201 79485223 79576775 79978363 80260371 79729005 79881136 79985614 80964607
7354 80964607 81031936 80774391 80513320 80772737 80815909 80868011 80876223 80719832 80506740 80745618
7344 80745618 80775855 80612591 80196035 79841614 79503681 80157668 80781254 80551079 81034187 81275510
7334 81275510 81177612 80857188 80887155 80518539 80886171 80869782 81052849 81422101 81610850 81499043
7324 81499043 81886899 81410805 80851760 81051598 81456591 81825964 81971339 81098728 81002460 81270564
7314H1270564j02220n84205J64912J89607p7393M53596K98408L0498m4936K87735
7304H1886566m02176K11787j83213J08030R55649o69467J76753j14717l59017
7295H1610195k49443N48792l5300p0644J56443L56897j79214L09222J96093o21379
7285H2021662p5445J13186P61366K27743m42979K44152J04081n67760M11017O03304
7275H3400327m21545K78910J29068j86752P3453l22334P83399l74351O2602k64155
7265H3158622J5338J1248N5961K92254k32806J134088J84684J29073j28506o07579
7255H4012377m8138o0521O97554L72390l07726n94787L25092l94728N65779M7359
7245H4614651J23624N8498r7095L14218k37798L49543K6771k10070M69615K57130
$$ plain form
7314 81270564 81168344 80584139 80749051 80938658 80861265 81314861 81613269 81643767 81598831 81886566
7304 81886566 81484390 81696177 81512964 81620994 82576643 81907176 82083929 81969212 81610195
7295 81610195 81360752 81909544 81874244 81803600 81960043 82316940 82137726 82446948 82643041 82021662
7285 82021662 81946217 82059403 82820769 83048512 82605533 82849685 82953766 82386006 82797023 83400327
7275 83400327 82978782 83257692 83386760 83200008 83273461 82951127 83734526 83360175 83422777 83158622
7265 83158622 83173960 83185208 83241169 83533423 83300617 84434705 84619389 84748462 84619956 84012377
7255 84012377 83964239 83903718 84601272 84973662 84665936 84071149 84396241 84001513 84567292 84614651
7245 84614651 84738275 84796773 84699678 85013896 84776098 85125641 85152412 84942342 85411957 85669087
7235H5669087O17954r07j84714O37160k2718R5809L2768K17646k82598P3048J41895
7224H6994430M36045l09512N03832O27679n35606J68671K91695M60791j89424
7215H8448601k87864L34287P48238Q3031l24944Q16686J67403M0593k68528L96392
7205I0153895N07450L72928L6273L66077L43750j85808j81935P25275j80628O55407
7195I2612684J66848P5775J330249m50732M16193j21859M93794J29314L78030
7186I5030296N5288P02611K84247l59029k38475R92687M49439K52506Q028R19143
7176I8096741N76389m15741M32506L24146k07232M38645Q35855O29526Q25869
7167A01536704J72525M08555J00169L38135J81949O44279O48578P42271O98323
$$ plain form
7235 85669087 86287041 86286134 86101420 86738580 86715862 86811671 86844439 87062085 86779487 86852535 86994430
7224 86994430 87430475 87120963 87624795 88252474 87716868 87885539 88177234 88638025 88448601
7215 88448601 88160737 88495024 89243262 89326293 89001349 89818035 89985438 90026031 89757503 90153895
7205 90153895 90661345 91034273 91070546 91436623 91780373 91594565 91412630 92137905 91957277 92612684
7195 92612684 92779532 92855307 94185556 93734824 94151017 94029158 94522952 94652266 95030296
7186 95030296 95085584 95788195 96072442 95713413 95474938 96467625 96917064 97169570 97177598 98096741
7176 98096741 98673130 98257389 98689895 99014041 98806809 99245454 100081309 100710835 101536704
7167 101536704 101709229 102117784 102217953 102556088 102738037 103382316 104030894 104773165 105471488
7158A05471488J00059N97379O31718M58893P60598O98103P20905J53340K06549
7149A09799032P08030R03613O18894R2677O08604J100221J209485Q76816J27571
7140A16044943R36533J29860M1556R29656R18477R71874Q54039L31350P72506
7131A21930794Q02782R93789J745571N74072P88374M22412J003839M18527M52473
7122A29132633J176747Q76506J092038J057868J781433Q42398J234943P81049
7114A37975615M00507J269337J550808K13591J032686J498602J295705N50640
7106A45787491J336094L96159J221645P28169N49233J526965Q11692Q42247Q48782
7097A54048477Q98504Q34539J178641Q67788Q78029J384702J056552M76813J690333
$$ plain form
7158 105471488 105571547 106168926 106800644 107259537 108020135 108718238 109439143 109592483 109799032
7149 109799032 110507062 111410675 112029569 112122246 112730850 113831071 115040556 115917372 116044943
7140 116044943 116981476 117111336 117152892 118082548 119001025 119972899 120826938 121158288 121930794
7131 121930794 122733576 123727365 125472936 126047008 126835382 127257794 128261633 128680160 129132633
7122 129132633 130309380 131185886 132277924 133335792 135117225 135959623 137194566 137975615
7114 137975615 138376122 139645459 141196267 141409858 142442544 143941146 145236851 145787491
7106 145787491 147123585 147519744 148741389 149469558 150018791 151545756 152357448 153199695 154048477
7097 154048477 154946981 155781520 156960161 157827949 158705978 160090680 161147232 161624045 163314378
7088A63314378J363773J365428J096724J366979J874617J269744J222251J837043
7080A74710937J166004J430135J712423K077783K335413J511625J535690K428062
7072A88908072K260539J523846K676112K304076K727408K792561K404298L450143
7064B09047055K547733K734740L124950K742100L124711L039039K618877L260752
7056B32239957K054039L097424L581774K113070K380631K520878J885500K021374
7048B51894647K156723K278407K390051K295705K361658K273977K537015K728060
7040B70916243K716482K541356K892535K509067K470955L155066L055242K849413
7032B93106359K936964L389087M220975L873514M055222M090399L272623M400423
$$ plain form
7088 163314378 164678151 166043579 167140303 168507282 170381899 171651643 172873894 174710937
7080 174710937 175876941 177307076 179019499 181097282 183432695 184944320 186480010 188908072
7072 188908072 191168611 192692457 195368569 197672645 200400053 203192614 205596912 209047055
7064 209047055 211594788 214329528 217454478 220196578 223321289 226360328 228979205 232239957
7056 232239957 234293996 237391420 240973194 243086264 245466895 247987773 249873273 251894647
7048 251894647 254051370 256329777 258719828 261015533 263377191 265651168 268188183 270916243
7040 270916243 273632725 276174081 279066616 281575683 284046638 287201704 290256946 293106359
7032 293106359 296043323 299432410 303653385 307526899 311582121 315672520 318945143 323345566
7024C23345566M141027M995009M812653M868776N971068N019575N987296P085148
7016C66226118O050338O979028P305953P483637P771418P827422Q426378Q403601
7008D26473893P846129Q506664R182626Q509930P873526P440515Q516277O921708
7000D91271268O305051O423609N785276N195159M204180L038380K142787O07257
6992E24972967o00666j376027k421464k566864l575134m595249n361993n445159
6984D99030411p454801p172579q853479r234133r687342j0583265j1224597j2703180
6976D22117035j3154438j3172111j3183801j2711076j3168315j3466738j1819801
6969C31440755j2070848j2179511j1982028j1000045j0684155j0165136r770526
$$ plain form
7024 323345566 327486593 332481602 337294255 342163031 348134099 353153674 359140970 366226118
7016 366226118 372276456 379255484 386561437 394045074 401816492 409643914 418070292 426473893
7008 426473893 434320022 442826686 452009312 460519242 468392768 475833283 484349560 491271268
7000 491271268 497576319 503999928 509785204 514980363 519184543 522222923 524365710 524972967
6992 524972967 524372301 522996274 520574810 518007946 514432812 509837563 504475570 499030411
6984 499030411 491575610 484403031 475549552 466315419 456628077 446044812 434820215 422117035
6976 422117035 408962597 395790486 382606685 369895609 356727294 343260556 331440755
6969 331440755 319369907 307190396 295208368 284208323 273524168 263359032 253588506
6962B53588506r832237q919747q551698q185330p841016q646435p137068o559180
6954A87915795o700991o318783n337517n409964n208336n395654m808814m144612
6946A44591124m684597m487011l526179m238920l727749k867614k929108l536822
6938A14593124l048584l233671k770356l045998k562553k609701k459127k405992
6930I2457142k067380k095315k748789k195541j787664j909384k046808j766799
6922G5839462j859051j537062j557805j978371k179959j297299k082760j856561
6914F1490594j319777j202099j141808j276960j875091j983570p90607j408177
6906E0492505j175394j558978j073268n75586q65250j184579j260268r90524j627411
$$ plain form
6962 253588506 243756269 234836522 226284824 218099494 210258478 201612043 194474975 187915795
6954 187915795 181214804 174896021 169558504 164148540 158940204 153544550 148735736 144591124
6946 144591124 139906527 135419516 131893337 127654417 123926668 121059054 118129946 114593124
6938 114593124 111544540 108310869 105540513 102494515 99931962 97322261 94863134 92457142
6930 92457142 90389762 88294447 85545658 83350117 81562453 79653069 77606261 75839462
6922 75839462 73980411 72443349 70885544 68907173 66727214 65429915 63347155 61490594
6914 61490594 60170817 58968718 57826910 56549950 54674859 52691289 51900682 50492505
6906 50492505 49317111 47758133 46684865 46109279 45244029 44059450 42799182 41808658 40181247
6897D0181247l29337q28527j261248j047298j012007m61303m61375q21116j053731
6888C2905305n19151m0089n23295n3038j485696j073972p39680J5232r16991J42795
6878B7711420r06635m14882o60668j115820L52414m77770p05091n3828L26258
6869B4055398p09441q78944r83484l68944l42824n47127J1577o58136n95370O02122
6859A9584827n48356o68400Q3630l49627j060653n24564L8576P01443j5213l99674
6849A6841989q42933m3229J16027o02184p56432p4030L5752J05659n33690m06902
6839A3840027j76980L7635l57790j51914K90859l7066m79268j00263j624q80837
6829A1982779K61906K17494N76778J98696n68180K35216o85682j86018j90175
$$ plain form
6897 40181247 39851910 39023383 37762135 36714837 35702830 35241527 34780152 33959036 32905305
6888 32905305 32386154 32346065 31822770 31769732 30284036 29210064 28470384 28485616 27568625 27711420
6878 27711420 26804785 26389903 25729235 24613415 24965829 24488059 23782968 23729140 24055398
6869 24055398 23345957 22467013 21483529 21114585 20771761 20224634 20236211 19578075 18982705 19584827
6859 19584827 19036471 18368071 18451701 18102074 17041421 16516857 16555433 17256876 17241663 16841989
6849 16841989 15999056 15955827 16071854 15469670 14713238 14639208 14674960 14780619 14246929 13840027
6839 13840027 13663047 13700682 13342892 13190978 13481837 13444771 12965503 12865240 12863616 11982779
6829 11982779 12244685 12462179 13038957 13237653 12669473 12904689 12219007 12032989 11842814
6820A1842814p99437J39919n74161m27866O66660L21156k41699n01977m63404
6811I962005k44332L3253L3613l45045J84687K4292l2863o88134r9730l17045
6801H510701j62641L83789K19390m39122p47890K00195n35764m2723P0758l9151
6791G417542L86561l07931l89411n42267L06142N5460j95205L34597m56489l12432
6781F296567j09573J75137k61781l40347j37860j41584j96767l7965J53462k42131
6771E157158K55771K05263J14474k13755l93380j05315p1405r1704j36578l31490
6761D389039K76459Q56632j12030j321861m07511J03527N74352L89620l18303
6752D429924l99524K57347o90083o63246M74462L89680K32411o22254P16288k96340
$$ plain form
6820 11842814 11043377 11183296 10609135 10181269 10847929 11169085 10927386 10425409 9962005
6811 9962005 9717673 9750926 9784539 9439494 9624181 9648473 9615610 8927476 8827746 8510701
6801 8510701 8348060 8731849 8951239 8512117 7764227 7964422 7428658 7385935 7456693 7417542
6791 7417542 7804103 7496172 7106761 6564494 6870636 6926096 6730891 7065488 6608999 6296567
6781 6296567 6186994 6362131 6100350 5760003 5622143 5480559 5283792 5245827 5399289 5157158
6771 5157158 5412929 5618192 5732666 5518911 5125531 5020216 4948811 4857107 4720529 4389039
6761 4389039 4665498 5522130 5410100 4088239 3680728 3784255 4358607 4748227 4429924
6752 4429924 4030400 4287747 3597664 2934418 3408880 3798560 4030971 3408717 4125005 3828665
6742C828665p39619o5344J13644J79673o06242M14564N81579k22775o45518J17967
6732B956594K4149K4404k59482K8055N95535n91995M4162P89799k76470q9161
6722C245590K51506p7615l51764j83136M52126m36163n4409M9498K25176L73993
6712C494802l79150j43075k55854p3234K86398m75154o79553M08934Q75472J06933
6702C166519k50683k52110J56250k46838k72467l60301P68654J85331N8075m72443
6692B479987j60000m29812J32603O03466N7056L01190p0443j93698K39488k92871
6682B666966m77859p0406J08435P33319l52616n32250m44772r3975N10147m0188
6672B006801k93176P38069k71527m48061j37167n12298N40683M98666P53041l83031
$$ plain form
6742 3828665 3089046 3023702 3137346 3317019 2710777 3125341 3706920 3484145 2838627 2956594
6732 2956594 2980743 3005147 2745665 2773720 3369255 2777260 2821422 3611221 3334751 3245590
6722 3245590 3497096 3419481 3067717 2884581 3336707 2900544 2846135 2895633 3120809 3494802
6712 3494802 3115652 2972577 2716723 2643489 2929887 2454733 1775180 2184114 3059586 3166519
6702 3166519 2915836 2663726 2819976 2573138 2300671 1940370 2709024 2894355 2952430 2479987
6692 2479987 2319987 1890175 2022778 2626244 2683300 2984490 2914047 2720349 2959837 2666966
6682 2666966 2189107 2118701 2227136 2960455 2607839 2075589 1630817 1536842 2046989 2006801
6672 2006801 1713625 2451694 2180167 1732106 1594939 1082641 1623324 2121990 2875031 2492000
6662B492000p98138J20455L42673o2732p40446M76497R1233L95432p8588J20262
6652B358648p80621l0607j4987L34871P04815m9975O8712p24675k89816J71678
6642A748043L2192p0036M03645J555j65778q4479K87916J120709K01552l55008
6632C120311q00623Q811P4462j49758r9616L859J4215M74207P69016q17754l84771
6621B212359M68355J99128p85055K65147J054306q1713l50401p7556K23166m34573
6611B693163L9226j9673L38152J35334l69941O03877K4250J97705q5804M75111
6601D031400k37062L4473M98601k20996j76829J7654R193j39943k47196m57823
6591C111472j52650J05364L33682Q49643N43014L39119o9272k13328l46634m41485
$$ plain form
6662 2492000 1693862 1814317 2156990 2094258 1353812 1830309 1921542 2316974 2238386 2358648
6652 2358648 1578027 1547420 1532433 1867304 2572119 2522144 2590856 1866181 1576365 1748043
6642 1748043 1780235 1710199 2113844 2115399 1949621 1865142 2153058 3273767 3475319 3120311
6632 3120311 2319688 2328499 2402961 2253203 2153587 2157446 2171661 2645868 3414884 2597130 2212359
6621 2212359 2680714 2879842 2094787 2359934 3414240 3332527 2982126 2904570 3127736 2693163
6611 2693163 2732389 2712716 3050868 3186202 2816261 3420138 3444388 3642093 3556289 4031400
6601 4031400 3794338 3828811 4327412 4106416 3929587 3947241 3956434 3816491 3569295 3111472
6591 3111472 2958822 3064186 3397868 4247511 4790525 5129644 5060372 4847044 4500410 4058925
6581D058925P02263L23069J87414O72968n57724q46846K12565R01999l39786Q6045
6571E400892N53340M07625L86643n0681r46376N35267N10522j85591O68201r8408
6561G181434k14356L47956P66455k09525R2834N97120L95441k56685J8160M65732
6551I184566N17317J32386M54162M61705P52630M87243N79138L40035J43684P94833
6541A3847699K31116J74579Q40504R42952N82548P65748J280813K57497J107235
6532B0030691J866336Q32116O27750J137256J411259R70396J421123J858903Q88383
6523C1044213J085664L10130N83796J139480K39561l56243K64780M21136L2790
6514C4765307K1195M95850J065368K58835R86624J420952J447844J317525K036510
$$ plain form
6581 4058925 4761188 5084257 5271671 5944639 5386915 4540069 4752634 5654633 5314847 5400892
6571 5400892 5954232 6361857 6748500 6697819 5751443 6286710 6797232 6611641 7279842 7181434
6561 7181434 6967078 7315034 8081489 7871964 7964798 8561918 8957359 8700674 8718834 9184566
6551 9184566 9701883 9834269 10288431 10750136 11502766 11990009 12569147 12909182 13052866 13847699
6541 13847699 14078815 14253394 15093898 16036850 16619398 17385146 18665959 18923456 20030691
6532 20030691 21897027 22729143 23356893 24494149 25905408 26875804 28296927 30155830 31044213
6523 31044213 32129877 32440007 33023803 34163283 34402844 34046601 34311381 34732517 34765307
6514 34765307 34786502 35282352 36347720 36606555 37593179 39014131 40461975 41779500 43816010
6505D3816010J576398J549271K067140J271296J045798R13477k86006n63959p42931
6496E0646494r98371j548520j543868j837580j651221j504303j791913j323836
6488C8446882n48008j482355q06922K01540n59840m15196k79143n45345l50586
6479C3661027l0337m8960l39097j658618p7562o32289j132983j745410j254720
6470B6741051j588201j758593o09743j492661j720209r94091r24353j051892j329933
6461A5271375n1398o52872j408152k62278q92675j084605p03018n07995j1794
6452I696588j5480m31759l73698P5711m19237k31076k98828j115566L83335n84643
6442F685347j66499l64649l41197m29139l751l97219M57490k40111J09449k7460
$$ plain form
6505 43816010 45392408 46941679 49008819 50280115 51325913 52239390 51953384 51389425 50646494
6496 50646494 49648123 48099603 46555735 44718155 43066934 41562631 39770718 38446882
6488 38446882 37898874 36416519 35609597 35811137 35251297 34836101 34556958 34011613 33661027
6479 33661027 33630690 33581730 33242633 31584015 31506453 30874164 29741181 27995771 26741051
6470 26741051 25152850 23394257 22784514 21291853 19571644 18577553 17653200 16601308 15271375
6461 15271375 15219977 14567105 13158953 12896675 12004000 10919395 10216377 9708382 9696588
6452 9696588 9681108 9249349 8875651 8951362 8532125 8301049 8002221 6886655 7269990 6685347
6442 6685347 6518848 6154199 5813002 5383863 5380112 4982893 5440383 5200272 5309721 5282261
6432E282261p15293j06134k17084k02780k97945l79741n23902K16597l16410l0910
6422B708659R7179J46946O41444l66339j35476l1303L89328k02682l44577k46992
6412B656187l5618K26876n05135J64817p5672m86624J33910L06612j74444K46224
6402B457133j21964J75718m58779J20864j73717k42422J56158P7019J82045n6680
6392B115375n7728N70329J56880j028361l75706j6765L39270k1621j82748O9858
6382A568783o6734N11522L4635j04930P2182r50304n53300J91072m10713N02905
6372G95118J16012L41403o48568k57641R85416M27713o13141J2875K25762k37046
6362A147903k28888K5658j02196P8186L1076o25444k06413J88532l6917m0180
$$ plain form
6432 5282261 4566968 4460834 4243750 4040970 3743025 3363284 2839382 3055979 2739569 2708659
6422 2708659 2805838 2952784 3594228 3227889 3092413 3061110 3450438 3247756 2903179 2656187
6412 2656187 2620569 2847445 2342310 2507127 2431455 1944831 2078741 2385353 2210909 2457133
6402 2457133 2335169 2510887 2052108 2172972 1999255 1756833 1912991 1990010 2172055 2115375
6392 2115375 2057647 2627976 2784856 1756495 1380789 1364024 1703294 1681673 1498925 1568783
6382 1568783 1502049 2013571 2048206 1943276 2015458 1065154 511854 702926 292213 795118
6372 795118 911130 1252533 603965 346324 1331740 1759453 1146312 1159187 1384949 1147903
6362 1147903 919015 944673 842477 920663 951739 326295 119882 308414 271497 231317
6352B31317p597J73056N67071p11202k61086K12610L44542n240r6296n70361J82523
6341E9337K84566N3648N16970L95083l3642l14332k62417k06998K20292P4863
6331G87370l86299k56080N24510K16445m12805L87675o3288q34259j40719J83293
6321E843k85380K75502R79558o51775l11078Q00502L01934r95830J76385M43551
6311G39212L5031j072366l03507P42325J33813J90247L61058j7596o2800m4332
6301G01085n82752M41050M29411j81042j71792r1957j77636k04420P62603K48800
6291A173350j55588j44008k46431l01373k34249K85685n20692n957M56959M75642
6281G83338P8855n95498j3002J71540k00886M4603K14392J39945L49415n73855
$$ plain form
6352 231317 223720 396776 963847 252645 -8441 204169 548711 543471 447175 -123186 59337
6341 59337 343903 397551 914521 1309604 1275962 961630 699213 492215 712507 787370
6331 787370 401071 144991 669501 885946 473141 860816 797528 -36731 -177450 5843
6321 5843 -279537 -4035 975523 323748 12670 813172 1115106 119276 295661 739212
6311 739212 774243 -298123 -601630 140695 274508 464755 825813 808217 745417 701085
6301 701085 118333 559383 988794 807752 635960 544003 366367 161947 924550 1173350
6291 1173350 1017762 873754 627323 325950 91701 377386 -143306 -149263 307696 783338
6281 783338 862193 266695 253693 425233 224347 268950 483342 623287 972702 398847
6271C98847k06020O47933q02364k56079J7267j85365K34401N58477j95250L42908
6261E54755R03503m91941j003095O44865m27170k87284J88631P03728l77549J62629
6251E71072j02530n04383J19881j59120Q4849n82021r4400L68693M72210l04631
6241a30380K57258Q4857R196l47162l84256M00610j14843J50082K80190l79554
6231a74002j74791M86231o9909M51681n3902o36734O43709m30417L13095M2577
6221C97538n52412K28157m0316m33994j86874O70485n94752K20664m18585L53670
6211c56419L40000m42494L4968M4080K06854L40311M815k98797j00269K86146
6201E9195N47981m29706K01399P8576j19382l42561J60973L1608o16036L40031
$$ plain form
6271 398847 192827 840760 38396 -217683 -200416 -385781 -151380 407097 211847 554755
6261 554755 1458258 966317 -36778 608087 180917 -106367 82264 785992 408443 571072
6251 571072 468542 -35841 84040 -75080 9769 -572252 -666652 -297959 174251 -130380
6241 -130380 126878 211735 220931 -126231 -510487 -109877 -224720 -74638 205552 -174002
6231 -174002 -348793 137438 67529 519210 465308 -171426 472283 41866 354961 397538
6221 397538 -154874 73283 32967 -401027 -587901 82584 -512168 -291504 -710089 -356419
6211 -356419 -16419 -458913 -423945 -379865 -173011 167300 172115 -126682 -226951 59195
6201 59195 607176 177470 378869 457445 338063 -4498 156475 188083 -427953 -87922
6191h7922l79527l93503N14725J97937N69764M22148k29116J7741n38164q54252
6181g60169L68336J81656J45775K49858K10414k07237K68122o66139l27583J48175
6171c88792J54495R5708M76162p85027L98728L96267J26507l61450L47107K32834
6161F92539k87259J90335n28330J53018k46982N47964m04597J63010K54154j08893
6151D24959J45714r06650K9893N37378j36621p48167M96135L97610j1419j52956
6141G5876n05836N09055J90542L47724k13345Q655O95820p1973j00586K86504
6131A222436o85465Q206n82916m34114R87835o2193j09621j31278L92189r6650
6121E08429j51676l86556l72024k89663n44707N09889N90652O27894l60325l19039
$$ plain form
6191 -87922 -467449 -860952 -346227 -148290 421474 843622 614506 632247 94083 -760169
6181 -760169 -391833 -210177 -64402 185456 395870 188633 456755 -209384 -536967 -388792
6171 -388792 -234297 -138589 337573 -447454 -48726 347541 474048 112598 459705 692539
6161 692539 405280 595615 67285 220303 -26679 521285 116688 279698 533852 424959
6151 424959 570673 -335977 -306084 231294 94673 -653494 -157359 240251 228832 75876
6141 75876 -429960 79095 269637 617361 404016 412671 1108491 1036518 935932 1222436
6131 1222436 536971 545177 -37739 -471853 515982 453789 344168 212890 605079 508429
6121 508429 356753 -29803 -401827 -691490 -1236197 -726308 -135656 492238 131913 -187126
6111a87126L50765J2399m0985p5955P5749k80279J07385p6018N25269j74377J89188
6100D26015P52746o09180o87708k69505P91301o43403l40959K15716M04514J06123
6090A45660k3511L7468o0073j92937M32860K17032l16383k6488N6371J78100k62351
6079A85748l30007n01745J22464J78888j63112R45551k52513o40072K78180P47671
6069E71053M57791j76384j60513k43642p47385K52127O15188n89500l90298Q521
6059d03042K83602K49692j75831k69785L56424L94164l26307l39173j70610j52406
6049e53272L74257K93484J08082J14829J45663k54838j47881L73449J44773l39988
6039B58558L27122j17553J62658l73045M794M40338m27413Q926k31658J32334
$$ plain form
6111 -187126 163639 176038 135053 59098 134847 -145432 -38047 -114065 411204 236827 426015
6100 426015 1178761 569581 -118127 -387632 403669 -239734 -580693 -364977 39537 145660
6090 145660 122149 159617 99544 -93393 339467 556499 240116 213628 269999 448099 185748
6079 185748 -144259 -646004 -523540 -344652 -507764 437787 185274 -454798 -176618 571053
6069 571053 1028844 852460 691947 448305 -299080 -46953 568235 -21265 -411563 -403042
6059 -403042 -119440 130252 -45579 -315364 41060 435224 108917 -230256 -400866 -553272
6049 -553272 -179015 114469 222551 337380 483043 228205 80324 453773 598546 258558
6039 258558 585680 468127 630785 257740 262534 702872 275459 284385 52727 185061
6029A85061K33639L44870k99761r5782L60346M7715n16245j9255K62708R1595
6019E94891L11558l92542m60758J9426n1205J46964R0803K02245j1353J27204
6009E77233m987L09559k45489l29008j72871j73724q2416K20016O8733L13556
5999D80602q612o5014K53119L17319l35359q9808J46095j1372j39725k5576j04388
5988D17281J6198K00401o2258k03652n05059P33343J18045n47783M90810R9489
5978G56815j85908j64440p6151L03040n1975J73784l52819M35631k92730L53067
5968H98314M32182k7036r00266n11942N05910l09904Q5620L89762J58547K06301
5958I27488k7971k16671J54534L55002m66052K21341N21870k32768o42893J76171
$$ plain form
6029 185061 418700 763570 463809 368027 728373 776088 259843 240588 503296 594891
6019 594891 906449 513907 53149 72575 21370 168334 259137 461382 450029 577233
6009 577233 572246 881805 636316 307308 134437 -39287 -121703 98313 167046 480602
5999 480602 471990 406976 660095 977414 642055 552247 698342 686970 547245 521669 417281
5988 417281 433479 633880 571622 367970 -137089 596254 714299 166516 657326 756815
5978 756815 570907 406467 330316 633356 581381 755165 402346 837977 545247 898314
5968 898314 1330496 1303460 403194 -108748 397162 87258 172878 562640 721187 927488
5958 927488 899517 682846 837380 1192382 726330 947671 1469541 1236773 593880 770051
5948G70051J39301j60269J36139j8164k52754M9828N04561J79583j4413K38342
5938A572205k87673J57748M22841L2145p81950l65059n54644M59158M68403r8159
5928A025015K74066M2236k06177N57855k92004o36453M68982O079l64059N01723
5918A377263M60439m05667M1859j60765P1414P61500P0075j097786m32803N82146
5908A267675N12415l27143k48674l2868L52844P8195j1136K98626K67897m862
5898B152969J1243L35529r5164O4335N14184q3517O498m17727N94109O20248l44945
5887C357762k84359k17640k31984Q63315k20887l8266m0R7044J5471K0676P5341
5876C436433j18592K10413o8558Q8378l05274k90939K84361J019025O29151o1145
$$ plain form
5948 770051 909352 749083 885222 867058 614304 664132 1168693 1348276 1333863 1572205
5938 1572205 1284532 1442280 1865121 1897266 1115316 750257 195613 654771 1123174 1025015
5928 1025015 1299081 1341317 1135140 1692995 1400991 764538 1233520 1239599 875540 1377263
5918 1377263 1837702 1432035 1473894 1313129 1384543 2146043 2216118 1118332 685529 1267675
5908 1267675 1780090 1452947 1204273 1171405 1524249 1602444 1591308 1889934 2157831 2152969
5898 2152969 2164212 2499741 2404577 2468912 2983096 2899579 2906077 2488350 3082459 3702707 3357762
5887 3357762 3073403 2855763 2623779 3487094 3266207 3227941 3227901 3324945 3340416 3361092 3436433
5876 3436433 3317841 3528254 3459696 3548074 3242800 2951861 3236222 4255247 4884398 4823253
5866D823253J90712N45850p02832m57010N56617L40247o23162l05683M98260M32577
5856E298829M01390P6614n72143j40011L30918L53062K18127q0505L71680P67543
5846G025504k13893L04244K9919N1225K89460Q7775P85506l46024N0060L05323
5836H369099L56078q4269P92513N89315L58437K67167k98742O39580P00212L09064
5826A1998454J74631O94141J17187N42267J028743o13111N05480Q39564J118333
5817A6405689P01786Q43759O20106J140417J150920J539742J478619J529584J860518
5808B7271140Q10390J298991K233492J789840R86007J386776J046110o5813M64336
5799C7221269M82297k0020p39868o33888O06200j52097M66726J47451Q68367J700246
$$ plain form
5866 4823253 5013965 5559815 4856983 4399973 4956590 5296837 4673675 4367992 4866252 5298829
5856 5298829 5700219 5776833 5204690 5064679 5395597 5748659 5966786 5886281 6257961 7025504
5846 7025504 6811611 7115855 7145774 7196999 7486459 7574234 8359740 8013716 8063776 8369099
5836 8369099 8725177 8640908 9433421 10022736 10381173 10648340 10349598 10989178 11689390 11998454
5826 11998454 12173085 12867226 12984413 13526680 14555423 13942312 14447792 15287356 16405689
5817 16405689 17107475 17951234 18571340 19711757 20862677 22402419 23881038 25410622 27271140
5808 27271140 28081530 29380521 31614013 33403853 34389860 35776636 36822746 36756933 37221269
5799 37221269 37703566 37683546 36943678 36309790 36915990 36763893 37230619 37378070 38246437 39946683
5789C9946683J003602J544655J924625J413837J687957J382983K360176J800318
5781E3064836J672535Q77467J07077l20369j139794j130920j904640j984078k878498
5772D6363616k692499j890998k024371j543102j608013r89280r76598j598170
5764C3040585m16212p8400M29860M99041q13141o76464m89515r1898M97060p51706
5754C1149210j661690j717033j375738r71747j527783j857025j276878j147706
5746A9613610j172438j067579j426867q27845q11526n34372o12030q09507j153219
5737A1198227o84748j041775L9110m21223k6783L1501j56686l77675p69608n79569
5727G210771l88032l82628P3075J13874j59601m99409p24520j74053n82207j14422
$$ plain form
5789 39946683 40950285 42494940 44419565 45833402 47521359 48904342 51264518 53064836
5781 53064836 54737371 55614838 55721915 55401546 54261752 53130832 51226192 49242114 46363616
5772 46363616 43671117 41780119 39755748 38212646 36604633 35615353 34638755 33040585
5764 33040585 32624373 32545973 32975833 33474874 32661733 31985269 31495754 31403856 31900916 31149210
5754 31149210 29487520 27770487 26394749 25423002 23895219 22038194 20761316 19613610
5746 19613610 18441172 17373593 15946726 15118881 14307355 13772983 13160953 12351446 11198227
5737 11198227 10513479 9471704 9510814 9089591 9062808 9094309 8937623 8559948 7790340 7210771
5727 7210771 6822739 6440111 6513186 6627060 6467459 5968050 5243530 5069477 4487270 4372848
5717D372848O5796N20938n19194J31858J19226k31537l30319K71476O72521p93558
5707D280055j010059K25006q8178P2417L05714l6526n33267k11793J23069m40052
5697B686386l16147O57953L98373l82309j08114k67673O18892p4428j60449M9808
5687C102292J73629j38877k99586j43294J3128J282J90355j1400o39262P6646
5677B324913L03122j83211P0233L70722L58789l07667j35612j0775m43479M57143
5667B804178L84873l8655p16997J34124Q05037l35557m90234N31335L24166n29682
5657B872588q1661M41389M54363p07789N66432L95608k09082k19356n12628J32111
5647C131975J97739l22699m24080J96869p3188j07476K85268K36819l68562Q7480
$$ plain form
5717 4372848 4438644 4959582 4440388 4572246 4691472 4459935 4129616 4401092 5073613 4280055
5707 4280055 3269996 3495002 3406824 3479241 3784955 3748429 3215162 3003369 3126438 2686386
5697 2686386 2370239 3028192 3426565 3044256 2936142 2668469 3287361 3212933 3052484 3102292
5687 3102292 3275921 3137044 2837458 2694164 2707292 2708574 2898929 2887529 2248267 2324913
5677 2324913 2628035 2444824 2515057 2885779 3244568 2936901 2801289 2790514 2347035 2804178
5667 2804178 3189051 3150396 2433399 2567523 3372560 3037003 2546769 3078104 3402270 2872588
5657 2872588 2790927 3232316 3686679 2978890 3545322 3940930 3731848 3512492 2999864 3131975
5647 3131975 3329714 3007015 2582935 2779804 2706616 2599140 2884408 3121227 2752665 2840145
5637B840145J60324R44339l6046J32920l18963K76603M14660K48795q994J1058
5627D664841J43096L37544J8717p70539j16716j45550j03268L37918K48738M9411
5617D664192k07978p1137k22235M04511J31602M21766l7296J4562n5259L26358
5607E369086M71508K61778n21427k66994K57935M04904K9167r115l22793O90459
5597F364508K63724k06927M57967m33222m19109J21079J50064O22836K48083j93547
5587F975456J310071K27472M69681l44377r2172K46224N33374p4693L62P5653
5577I327051P83873N71105L63330K53845R84140L86792M02428K00318J70706R22132
5567A4365720L77047O65228Q10406Q22500L87235R94039R69862J427846J849670
$$ plain form
5637 2840145 3000469 3944808 3908762 4041682 3722719 3999322 4413982 4662777 4653783 4664841
5627 4664841 4807937 5145481 5164198 4393659 4276943 4131393 4028125 4366043 4614781 4664192
5617 4664192 4456214 4385077 4162842 4567353 4698955 5120721 5083425 5097987 5042728 5369086
5607 5369086 5840594 6102372 5580945 5313951 5571886 5976790 6005957 5996842 5674049 6364508
5597 6364508 6628232 6421305 6879272 6446050 6026941 6148020 6298084 6920920 7169003 6975456
5587 6975456 8285527 8512999 8982680 8638303 8546131 8792355 9325729 9251036 9251398 9327051
5577 9327051 10110924 10682029 11045359 11299204 12283344 12670136 13072564 13272882 13443588 14365720
5567 14365720 14742767 15407995 16218401 17040901 17428136 18422175 19392037 20819883 22669553
5558B2669553J476946J424383J546364J219274O30696Q26179J518739J303386
5550C2615520J104414L09861j29736L68311L53655M29483J46944K26599J9579
5541C5444630J50214J196274J982069P61385J063088N16109Q13846K109815J835140
5532D5872570J674825J209826J117174J315516N69969N19576j44669o508l63552
5523E1764727j005933j390534k015342j242611p02471j327492k321834j599571
5515D0158939l10153j846684j037846p83516l68365J82494P152l90021n29863
5506C5082137o81720n09429J16062k43678n01143j119222j230644j199682j586438
5497B8126243j630302j777117j120034j331999j812637m94016r03687j528022
$$ plain form
5558 22669553 24146499 25570882 27117246 28336520 28967216 29793395 31312134 32615520
5550 32615520 33719934 34029795 33900059 34268370 34622025 35051508 35198452 35425051 35444630
5541 35444630 35594844 36791118 38773187 39534572 40597660 41113769 41927615 44037430 45872570
5532 45872570 47547395 48757221 49874395 51189911 51759880 52279456 52134787 52128279 51764727
5523 51764727 50758794 49368260 47352918 46110307 45407836 44080344 41758510 40158939
5515 40158939 39848786 38002102 36964256 36180740 35812375 35994869 36002021 35612000 35082137
5506 35082137 34400417 33890988 34007050 33763372 33262229 32143007 30912363 29712681 28126243
5497 28126243 26495941 24718824 23598790 22266791 20454154 19960138 19056451 17528429
5489A7528429j919538l83555r64354r55042m81529l88750o83796M0595j24613
5480A1667847p28055o56388q19494k57945o81014m36411n88938k80668m81183
5471F737751o17832L86902l54207o68536N2228P64797q36895M9719J26985j158473
5461D482439K90592l13675n96828K46520M8301j77453m2149q0936m28798K19782
5451C647795K23497j80606k8003K34286l69057k44366J43097j26588L54744n68951
5441C085848m36269L6654Q941r1799k19950r2131K3507O07709K0726n39328O3140
5430B467048K9720J2331J52614N0386k68557n91656o6720J25269j26740k05491
5420A578204K14458K46473L05253p94001r1246j75068m21446J59989K66877J65673
$$ plain form
5489 17528429 15608891 15225336 14260982 13305940 12824411 12435661 11751865 11792460 11667847
5480 11667847 10939792 10283404 9463910 9205965 8524951 8088540 7499602 7218934 6737751
5471 6737751 6119919 6506821 6152614 5484078 5536306 6301103 5464208 5513927 5640912 4482439
5461 4482439 4773031 4459356 3862528 4109048 4157349 3979896 3937747 3856811 3428013 3647795
5451 3647795 3871292 3690686 3662683 3896969 3527912 3283546 3426643 3300055 3654799 3085848
5441 3085848 2649579 2686233 2695174 2603375 2383425 2291294 2314801 2922510 2943236 2403908 2467048
5430 2467048 2496768 2509099 2661713 2712099 2443542 1851886 1785166 1910435 1783695 1578204
5420 1578204 1792662 2039135 2344388 1550387 1459141 1284073 862627 1022616 1289493 1455166
5410A455166J01521m00273j83341N42359K17836j19088n96476k86869N8562l18891
5400D70506N50703P37459J4587m47060R5303J51985m92299L01332j76752m49932
5390G55832O7964N76529M5139q2442l81785L45889k76627p2721N75475k76523
5380A276730J53851n3814K80310J15098q2246p73877M15404M21528j91775q5670
5370A475539n46079j061424K11157P90062q8461m49958m0898L56564K42583j97186
5360F91899j89964p7079l4389L69850J92277k3017L85079l04398J10171o65190
5350D55239k83854J061784Q4201l67789j73627J72210j72189J16319J3949K13445
5340A119688l67979K04254O3559m20183Q2601L44085l54356k71731k8535m7668
$$ plain form
5410 1455166 1556687 1156414 973073 1515432 1733268 1614180 1017704 730835 789397 470506
5400 470506 1021209 1758668 1773255 1326195 1421498 1573483 1081184 1382516 1205764 755832
5390 755832 823796 1400325 1445464 1363022 981237 1327126 1050499 977778 1553253 1276730
5380 1276730 1430581 1376767 1657077 1772175 1689929 916052 1331456 1752984 1561209 1475539
5370 1475539 929460 -131964 79193 869255 780794 330836 289938 646502 889085 691899
5360 691899 501935 424856 390467 760317 952594 929577 1314656 1010258 1120429 455239
5350 455239 171385 1233169 1317370 949581 775954 948164 775975 892294 906243 1119688
5340 1119688 751709 955963 1019522 599339 681940 1026025 671669 399938 371403 323735
5330C23735j80773o4682N01026R1061L021J54165j51058O29788n6917p5324l33992
5319H40050J41461N29206R7578l50109J43002j23857j54746N6498j35497o74397
5309C69189J50888m87103k35936K26716O6240P16031M12909j57895j97921l86694
5299D76424j17082M41925L776l8250K95717o57659J65025m5830M2943Q00202j12000
5288A255191j32580J44011m29023L9934P6407k73063j34495K01331j73682L47007
5278I21038K96316m6257p36993L70938k768Q8791j23993K59173M49739k97489
5268A178495J19571l41266K72761m25015O27497j76380K60101n0126k62054n73518
5258F30066k00242L92289O59867K6268l30933L8963P3110n31691j12958j60356
$$ plain form
5330 323735 142962 78280 579306 670367 673388 827553 676495 1306283 1249366 1174042 840050
5319 840050 981511 1510717 1608295 1258186 1401188 1277331 1122585 1179083 1043586 369189
5309 369189 520077 32974 -202962 23754 89994 806025 1218934 1061039 863118 476424
5299 476424 359342 801267 805043 766793 1062510 404851 569876 524046 566989 1367191 1255191
5288 1255191 1122611 1266622 837599 877533 953940 680877 546382 747713 574031 921038
5278 921038 1217354 1171097 434104 805042 802274 891065 767072 1026245 1475984 1178495
5268 1178495 1298066 956800 1229561 804546 1432043 1255663 1515764 1465638 1203584 630066
5258 630066 429824 822113 1481980 1508248 1177315 1216278 1289388 757697 644739 484383
5248D84383J055170L50902n14102j0791m57954K67716J01472L1309k0644r1346
5238A196115k19300k36342j39621j86364K50946J9314N11811M76928o3651j57380
5228A452456M43607k64711K62792n35485J43747J65496l58552J71812O08695l98841
5218A691016L46652k78481p77942k94148M32581l26044L25704r6255K32383L41327
5208A596793j30902L68521o1078J31728m77008L92635M2126p43463J74859P92265
5198B086476K24979l12123p84569L27190M53854k21709j45998k09494K16679J34110
5188A769395o71246M12042j57745l55819l62944O27454k57219M80290K14774l09448
5178A389534k15712L16393M11044p62135k49023L7388L20999j70544m34940K79433
$$ plain form
5248 484383 1539553 1890455 1376353 1365562 907608 1175324 1276796 1308105 1287461 1196115
5238 1196115 976815 740473 600852 414488 665434 684748 1196559 1673487 1609836 1452456
5228 1452456 1896063 1631352 1894144 1358659 1502406 1667902 1309350 1481162 2089857 1691016
5218 1691016 2037668 1759187 981245 687097 1119678 793634 1119338 1023083 1255466 1596793
5208 1596793 1465891 1834412 1773334 1905062 1428054 1820689 1862815 1119352 1294211 2086476
5198 2086476 2311455 1999332 1214763 1541953 1995807 1774098 1628100 1418606 1635285 1769395
5188 1769395 1098149 1510191 1352446 996627 633683 1261137 1003918 1484208 1698982 1389534
5178 1389534 1173822 1490215 1901259 1139124 890101 927489 1248488 1077944 643004 922437
5168I22437Q71750p88631j52146N16853K23599k63393q10446q175L85962N20243
5158A418053l06230J06479o48953o40754o540O1326L56115R33534j22057P91371
5148A942344o57315l90593N97773m63999K45487J11677j31649j27102J28934k31792
5138A023765k56349M31035l0121L5828o53197J35369J40331J61753R6137m49762
5128F34789K49683j90255K49812l33529K06993J33609O73834m30286j13815K7100
5118A107935n61009K76981L55240m225L61658l85565r0934Q9408m30612L43790
5108A062667p3048j61103n36112O52595l27347k31149M04863O18273k27929o25974
5098E55736N88478J19618j59600J00715K21758K56354j1453Q0197m53785j89405
$$ plain form
5168 922437 1794187 1005556 853410 1370263 1593862 1330469 520023 511848 897810 1418053
5158 1418053 1111823 1218302 569349 -71405 -77945 -16619 339496 1273030 1150973 1942344
5148 1942344 1285029 894436 1492209 1028210 1273697 1385374 1253725 1126623 1255557 1023765
5138 1023765 767416 1198451 1168330 1204158 550961 686330 826661 988414 1084551 634789
5128 634789 884472 694217 944029 610500 817493 951102 1624936 1194650 1080835 1107935
5118 1107935 546926 823907 1179147 1174922 1536580 1151015 1060081 1149489 718877 1062667
5108 1062667 989619 828516 292404 944999 617652 386503 791366 1409639 1181710 555736
5098 555736 1144214 1263832 1104232 1204947 1426705 1683059 1671606 1751803 1298018 1108613
5088A108613K47612J42469j4376l55520k33306P5738q9228M00661j36318o80525
5078D65820K79933L8353P5985N28668n490J30243m33852Q4850O13628P9329j64880
5067A692587O1979j37384m06863N41026J28221J66592J04597p12085J7936n35715
5057I20891p2731N22659j27813J17964j64024L27797j66164k67961N69271l52571
5047A307318q5353N81570J44996j65615m89420n44306j10151P8388N39806R41220
5037B198453o28450L68439k55607J84717O38598n44316n93341K5434N13146K38620
5027B145693o39056O45903l30028m4559M59398O9296M8029n14451j04470J82080
5017A917835p12522J28128K06951Q81525J70507o86035M96424l98422O906n0832
$$ plain form
5088 1108613 1356225 1498694 1484318 1128798 895492 971230 882002 1282663 1146345 465820
5078 465820 745753 784106 860091 1388759 1383269 1513512 1079660 1164510 1778138 1857467 1692587
5067 1692587 1754566 1617182 1210319 1751345 1879566 2046158 2150755 1438670 1456606 920891
5057 920891 848160 1370819 1243006 1360970 1196946 1524743 1358579 1090618 1659889 1307318
5047 1307318 1221965 1803535 1948531 1782916 1293496 749190 639039 717427 1257233 2198453
5037 2198453 1570003 1938442 1682835 1867552 2506150 1961834 1368493 1393927 1907073 2145693
5027 2145693 1506637 2152540 1822512 1777953 2237351 2306647 2354676 1840225 1735755 1917835
5017 1917835 1205313 1333441 1540392 2421917 2592424 1906389 2402813 2004391 2011297 1960465
5007A960465P56035k15328K3636P3383q7476m8081P304J16666j31604J90309k40311
4996B404998J30545M1403p0386j14771K13641J39077k20908n0454J21277J93402
4986B787824k14148M2971Q15078k00484q735J33253l27972K48530O7190k15219
4976C128288k37566Q4103N99218K72029L8865J4940O11060J8810O5345j93580
4966D401512r60523l10161L81076M91754O67100J72618n419l68350k35411L21177
4956D555373j44344l46870Q04283L15225k10917r6178r699O19803l64281j76564
4946D945831Q42208Q87152q2127K19297k67203K44232j60874o48383M51489k0238
4936F411384k91183k00995O45294R22504O4089M83219o04165Q56951J077219p30978
$$ plain form
5007 1960465 2716500 2501172 2524808 2598191 2510715 2462634 2469938 2586604 2455000 2645309 2404998
4996 2404998 2535543 2576946 2506560 2391789 2605430 2744507 2523599 2473145 2594422 2787824
4986 2787824 2573676 2616647 3431725 3231241 3222506 3355759 3027787 3276317 3343507 3128288
4976 3128288 2890722 2974825 3574043 3846072 3884937 3899877 4510937 4529747 4595092 4401512
4966 4401512 3440989 3130828 3511904 4003658 4670758 4843376 4837957 4469607 4234196 4555373
4956 4555373 4411029 4064159 4868442 5183667 4972750 4876572 4866873 5486676 5122395 4945831
4946 4945831 5788039 6675191 6593064 6812361 6545158 6789390 6628516 5980133 6431622 6411384
4936 6411384 6120201 5919206 6564500 7487004 7551093 8034312 7430147 8287098 9364317 8633339
4926H633339q3844O08759j35723M61395P51453k010R73847M16000K37698K29792
4916A2090706M68188J031819P27872J62849L33532P56304M78994J68144j35197
4907A6083211J000342P09131J204582j43473J46136R03477P67252K18132R82885
4898B1871675N97916q6161j62894M82959J024851R16798M15255O50094K35302
4889B5945795J74647L49920N62024J527644O94170k37972M37288N94672N18536
4880C0566724q4829K46940N24741M48845J41556J77635J365406J57767L51417
4871C3896202o0365J8707L90606J70062M00910Q2530p6290N48182J62350N48504
4861C6081398m85188L92588L00378m53806m09639N44229n01002j57652l91276
$$ plain form
4926 8633339 8549495 9158254 9022531 9483926 10235379 10233369 11207216 11623216 11860914 12090706
4916 12090706 12558894 13590713 14318585 14481434 14814966 15571270 16050264 16218408 16083211
4907 16083211 17083553 17792684 18997266 18853793 18999929 19903406 20670658 20888790 21871675
4898 21871675 22469591 22383430 22220536 22703495 23728346 24645144 25060399 25710493 25945795
4889 25945795 26120442 26470362 27032386 28560030 29254200 29016228 29453516 30048188 30566724
4880 30566724 30481895 30728835 31253576 31702421 31843977 32021612 33387018 33544785 33896202
4871 33896202 33835837 33854544 34245150 34415212 34816122 34898652 34822362 35370544 35532894 36081398
4861 36081398 35596210 35988798 36289176 35835370 35425731 35969960 35468958 35311306 34920030
4852C4920030j29811L85829p4469l42946J5076l65552p21974n494n70975j45376
4842C2964338q58279m06323o97520k83455o49109K44201j03323p85186K1988l98615
4832B9048717j103828q35116p6582O4670j263057p12073j78508j32992r03789
4823B3907442q44849n30306j039461q71085p95776K51297l78170l21338q70466
4814A8507288m7506j367503j167336p86925j13115K03488j081261k92706M66176
4805A4320600j199836l84637n08615q46601O7910M6753n87891n14105q6799l12443
4795I994336p18816k23946k95929j92404j31775l67477k70861k98387l46169o7526
4785G081046J86435p47170l02262N9266m17968K22847J35887r43090m36476J26791
$$ plain form
4852 34920030 34790219 35176048 35101579 34758633 34773709 34408157 33686183 33680689 33109714 32964338
4842 32964338 32106059 31699736 31002216 30718761 30069652 30313853 30210530 29425344 29447332 29048717
4832 29048717 27944889 27109773 27033191 27097861 25834804 25122731 24944223 24811231 23907442
4823 23907442 23062593 22532287 21492826 20621741 19825965 20077262 19699092 19377754 18507288
4814 18507288 18459782 17092279 15924943 15138018 15024903 15228391 14147130 13854424 14320600
4805 14320600 13120764 12736127 12227512 11380911 11448821 11495574 10907683 10393578 10306779 9994336
4795 9994336 9275520 9051574 8755645 8563241 8431466 8063989 7793128 7494741 7148572 7081046
4785 7081046 7267481 6520311 6218049 6277315 5859347 6082194 6218081 5274991 4838515 4965306
4775D965306K33377n64867j55335J65621j20239P0517N044n15250J59861K56177
4765D500212m09348K23749M08223o94412J23769k57445o60820N21595N33423J91306
4755D480252n33806m44372L01363k22297K02847j19983j42983K56995j14973J29425
4745C792468j18971k24472J0935M5962M73132l88966N64456n71587J08828M70690
4735D162475p81237O4312O88360p2441q333j31895K26092j66314K98565O64415
4725D943999l10824J57821m38102J99521K09710n37426k14026P36539p1593o2466
4715D613153R7051k60214p21388L37677Q01163j50466n43843q579N47016L78021
4705E089591o01759L93667M03208M31156m64163o1478l2756J31973O5333j60860
$$ plain form
4775 4965306 5198683 4633816 4478481 4644102 4523863 4594380 4599424 4084174 4244035 4500212
4765 4500212 4090864 4314613 4722836 4028424 4152193 3894748 3233928 3755523 4288946 4480252
4755 4480252 3946446 3502074 3803437 3581140 3783987 3664004 3521021 3778016 3663043 3792468
4745 3792468 3673497 3449025 3459960 3505922 3979054 3590088 4154544 3582957 3691785 4162475
4735 4162475 3381238 3445550 4133910 4061469 4053136 3921241 4147333 3981019 4279584 4943999
4725 4943999 4633175 4790996 4352894 4552415 4762125 4224699 4010673 4747212 4675619 4613153
4715 4613153 4710204 4449990 3728602 4066279 4867442 4716976 4173133 4164554 4711570 5089591
4705 5089591 4487832 4881499 5284707 5715863 5251700 5190222 5157466 5289439 5354772 5193912
4695E193912P67256K28204l54755r632k9086L24294L69479J53108J12657l18127
4685F437310j00711o30198N00526M52306J23140L29987Q24585l73833j87755M67775
4675G843132K58873K91764m46887o0798K60609N73017J309964m11559o64749M00418
4665I353784O45479j94008N0846K87290L88866M31534K09020L40762K56166N46108
4655A2315847j8941n99409N71223M15453k81053O14491k7674J03752R14350L04415
4645A4312454J008239O6905K05400J045646Q5847L28399R96445M36949M52652
4636A8938936J041063J56182Q29449K29503O65280P35401P03892P75869O01378
4627B4676953J665854N49472J277900J054870L89701J661456J407950J341427
$$ plain form
4695 5193912 5961168 6189372 5834617 5824985 5795899 6120193 6489672 6642780 6755437 6437310
4685 6437310 6336599 5706401 6206927 6659233 6782373 7112360 7936945 7563112 7375357 7843132
4675 7843132 8102005 8393769 7946882 7886084 8146693 8719710 10029674 9618115 8953366 9353784
4665 9353784 9999263 9805255 9856101 10143391 10532257 10963791 11172811 11513573 11769739 12315847
4655 12315847 12296906 11697497 12268720 12684173 12403120 13017611 12989937 13093689 14008039 14312454
4645 14312454 15320693 15387598 15592998 16638644 16724491 17052890 18049335 18486284 18938936
4636 18938936 19979999 20136181 20965630 21195133 21860413 22595814 23299706 24075575 24676953
4627 24676953 26342807 26892279 28170179 29225049 29614750 31276206 32684156 34025583
4619C4025583K327044K448616J529048K256535K718418L385769M109127M552713
4611E7352853M970840O003415P378524O908075O858028N137654L796586L748763
4603A02154738N044336N970643R365732J1181682R627734N323522M89493j37864
4595A49020016m25181K341776O225509Q619910Q205778M126293l791830q903197
4587A65419074r657238q199967m799657j439984k84650m23889m786949r373766
4579A26452974j1374506j0077550q312828o021468m356168l481575m971336o650574
4571G1206969p533956p319260n972366n650881m571655l878864k821041k241639
4563C1217307k946588k277923j483374q74568q22752j690083r92717j615462r10288
$$ plain form
4619 34025583 36352627 38801243 40330291 42586826 45305244 48691013 52800140 57352853
4611 57352853 62323693 68327108 75705632 82613707 89471735 94609389 98405975 102154738
4603 102154738 107199074 113169717 122535449 133717131 143344865 148668387 149157880 149020016
4595 149020016 148594835 150936611 157162120 165782030 173987808 178114101 174322271 165419074
4587 165419074 155761836 147561869 142762212 141322228 141037578 140613689 135826740 126452974
4579 126452974 115078468 105000918 96688090 90666622 86310454 82828879 77857543 71206969
4571 71206969 63673013 56353753 50381387 44730506 40158851 36279987 33458946 31217307
4563 31217307 28270719 25992796 24509422 23634854 22812102 21122019 20129302 18513840 17603552
4554A7603552m90531r68378j087294J38799o41892q27113p54531j85638l46477
4545A2440497p23099J18074k84375J12166r58952j162148k52891O53406m04008
4536I538670K48621n99032j267046O63098J51070j282161k94145q5679n26993
4527F546403p858l73883M92439n13561m00392L33836k85333K768L91550l88752
4517E797217l9166r6549p01l99484j06956o09248J25216K49277l39493m67414
4507D112699K64572J21505p97840j0639J41497P95681m52056m01240p7050K82943
4497C980072k72622m32644K21930R09225L07221q78243m14621j43181O07931p57270
4487C127798n3610L98296m9303K29004M96955m21893o42411k00546N4032N44651
$$ plain form
4554 17603552 17113021 16144643 15057349 15196148 14554256 13727143 12972612 12786974 12440497
4545 12440497 11717398 11835472 11551097 11663263 10704311 9542163 9289272 9942678 9538670
4536 9538670 9787291 9188259 7921213 8584311 8735381 7453220 7159075 7073396 6546403
4527 6546403 6538545 6164662 6657101 6143540 5743148 6076984 5791651 5794419 6185969 5797217
4517 5797217 5758051 5661502 5660801 5261317 5154361 4545113 4670329 4919606 4580113 4112699
4507 4112699 4377271 4498776 3700936 3690297 3831794 4627475 4175419 3774179 3697129 3980072
4497 3980072 3707450 3274806 3496736 4405961 4713182 3834939 3420318 3277137 3885068 3127798
4487 3127798 3074188 3472484 3423181 3652185 4149140 3727247 3084836 2884290 2938322 3482973
4477C482973m37421k09953R0092o7725k73456M39953l08154O4765J3678M58596
4467C253348o88980q79527M77720J221731l20875j396947j52671O63292L96786
4458B573877o82882J10534Q87770M92301r03958k13999N5290m13907K69610K95292
4448B469928k6878O4318j64209j32719j06447l20261K0282J08620j26844J08770
4438A894560k23109k12670J30372N66980m70318p1822M94081J79881j46749P7937
4428B219143k16994n35509K03010J7592j112J99667J04646L6195K7342m66379
4418A587601j67120Q56150M22392l59728q8458J14441J20471K36741Q5786l58414
4408B449862P4782k79697n31260N39371L79868m77380L29993n32785k35736N3928
$$ plain form
4477 3482973 3045552 2835599 2925691 2857966 2584510 3024463 2716309 2781074 2794752 3253348
4467 3253348 2564368 1684841 2162561 3384292 3063417 1666470 1513799 2177091 2573877
4458 2573877 1890995 2001529 2889299 3381600 2477642 2263643 2318933 1905026 2174636 2469928
4448 2469928 2443050 2507368 2343159 2210440 2103993 1783732 1804014 1912634 1785790 1894560
4438 1894560 1671451 1458781 1589153 2156133 1685815 1613993 2108074 2287955 2141206 2219143
4428 2219143 2002149 1466640 1669650 1687242 1686130 1885797 1990443 2026638 2053980 1587601
4418 1587601 1420481 2276631 2699023 2339295 2250837 2365278 2485749 2722490 2808276 2449862
4408 2449862 2524644 2244947 1713687 2253058 2632926 2155546 2485539 1952754 1717018 1770946
4398A770946o5226K29046J15460K03406k12772O0497k80832m47984J57912K43184
4388A773637J86476J97229n93285j85653J86017L78644k931K8358J3933l16654
4378A665771n54352J014398P6873M56164m86300p31322K23697L07521J79295N248
4368B156993r9372p24919M60728M25408k52960M9213L65906J58670l17309o4691
4358B157667J56948j91633l2562M152K44190j46297M52912O24124k13761r89343
4348B066397j63731R36768o9959l44216P6236O16966Q8996l7069k65931q5386
4338B819071J61994o12543p9350O59190L86251q49149K65101j60221K04859o6064
4328B729139L44731K09792Q51712l57315k11284j80578p82637Q28669M60373o09399
$$ plain form
4398 1770946 1705720 1934766 2050226 2253632 2040860 2101357 1820525 1372541 1530453 1773637
4388 1773637 1960113 2157342 1564057 1378404 1564421 1943065 1940134 1968492 1982425 1665771
4378 1665771 1111419 2125817 2202690 2658854 2172554 1441232 1664929 1972450 2151745 2156993
4368 2156993 2057621 1332702 1793430 2218838 1965878 2015091 2380997 2539667 2222358 2157667
4358 2157667 2314615 2122982 2090420 2094572 2338762 2192465 2645377 3269501 3055740 2066397
4348 2066397 1902666 2839434 2769475 2425259 2501495 3118461 3207457 3170388 2904457 2819071
4338 2819071 2981065 2368522 2289172 2948362 3334613 2485464 2750565 2590344 2795203 2729139
4328 2729139 3073870 3283662 4135374 3778059 3566775 3386197 2603560 3432229 3892602 3283203
4318C283203j03942m61506l4948L93701p1415J05503N69114M8232M44156j6823
4308D155275n85796J45736P8088M12014n82405K6105R09082n3558M93178k6897
4298D970822k59593J61198J90687K31849O04741M42917j71669k22734K3513L67629
4288F339360N50492J33606n30117L94601j25808L09500K06744j76108R8945O74913
4278G876128M31212p50299K93143K11449n96347l01599M08219O33943N16243L14144
4268I036236O99730M64019k04864J58945l58038N60283J06897l52019j63054M99896
4258A0448031Q20718k14029O9748N07066j27902L92959K44681m7758K69365P47679
4248A3110558O5687O53356L81579J29362J188396M94491M93847O75772M77726
$$ plain form
4318 3283203 3179261 2717755 2682807 3076508 3005093 3110596 3679710 3727942 4172098 4155275
4308 4155275 3569479 3715215 3793303 4205317 3622912 3649017 4558099 4504541 4997719 4970822
4298 4970822 4711229 4872427 5063114 5294963 5899704 6342621 6170952 5948218 5971731 6339360
4288 6339360 6889852 7023458 6493341 6887942 6762134 7071634 7278378 7102270 7201215 7876128
4278 7876128 8307340 7557041 7850184 8061633 7465286 7163687 7571906 8205849 8722092 9036236
4268 9036236 9735966 10199985 9995121 10154066 9796028 10356311 10463208 10111189 9948135 10448031
4258 10448031 11268749 11054720 11124468 11631534 11503632 11896591 12141272 12093514 12362879 13110558
4248 13110558 13176245 13829601 14211180 14340542 15528938 16023429 16517276 17193048 17670774
4239A7670774O40681J043458L24026K14802J017341J180939J022327J18671R83177
4230B4216196N80806R94602J358162J337245J286727R33504J159550J115968J261077
$$ plain form
4239 17670774 18311455 19354913 19678939 19893741 20911082 22092021 23114348 23233019 24216196
4230 24216196 24797002 25791604 27149766 28487011 29773738 30707242 31866792 32982760 34243837
$$ [...]
##END NTUPLES=NMR SPECTRUM
##END=
