##TITLE=1H_CG-1194-x
 DMSO
 8 sc, 
 12.3.2024
##JCAMPDX= 6.0         $$ Bruker NMR JCAMP-DX V2.0
##DATA TYPE= NMR SPECTRUM
##DATA CLASS= NTUPLES
##ORIGIN= UXNMR, Bruker Analytische Messtechnik GmbH
##OWNER= root
$$ XWIN-NMR		Version 3.5
$$ Tue Mar 12 14:45:35 2024 Russian Standard Time (UT+4h)  she@DPX200
##.OBSERVE FREQUENCY= 200.1313
##.OBSERVE NUCLEUS= ^1H
##.ACQUISITION MODE= SIMULTANEOUS
##.ACQUISITION SCHEME= undefined
##.AVERAGES= 8
##.DIGITISER RES= 18
##SPECTROMETER/DATA SYSTEM= spect
##.PULSE SEQUENCE= zg30
##.SOLVENT NAME= DMSO
##.SHIFT REFERENCE= (INTERNAL, DMSO, 0, 15.4031)
##AUDIT TRAIL= $$ (NUMBER, WHEN, WHO, WHERE, WHAT)
$$ ##TITLE= Audit trail, XWIN-NMR		Version 3.5
$$ ##JCAMPDX= 5.01
$$ ##ORIGIN= Bruker BioSpin GmbH
$$ ##OWNER= she
$$ F:/spectra/data/she/nmr/H-F/1/pdata/1/auditp.txt
$$ ##AUDIT TRAIL=  $$ (NUMBER, WHEN, WHO, WHERE, WHAT)
(   1,<2024-03-12 14:43:25.03 +0400>,<she>,<DPX200>,
      <created by zg, POWCHK disabled, PULCHK disabled
       configuration hash MD5:
       00 E9 B6 7A A2 85 ED C7 34 08 36 98 17 FE 4E 26
       data hash MD5: 16K
       84 CA DC BE 6D 34 97 2F BF 1B 83 0F 3B 10 18 92>)
(   2,<2024-03-12 14:43:27.76 +0400>,<she>,<DPX200>,
      <Start of raw data processing
       efp BC_mod = 2 LB = 0.24 FT_mod = 6 PKNL = 1 PHC0 = -25305.22 PHC1 = 14.78731 SI = 16K 
       data hash MD5: 16K
       70 FC FF B4 46 51 EC 6B D6 6C 08 17 70 38 FC 2B>)
(   3,<2024-03-12 14:43:41.98 +0400>,<she>,<DPX200>,
      <pk PHC0 = 0.6254988 PHC1 = -4.2 
       data hash MD5: 16K
       A5 9A 6C 9A 6E 52 E1 2F 6D 1E B2 2B 94 8B BE 12>)
(   4,<2024-03-12 14:43:45.06 +0400>,<she>,<DPX200>,
      <abs ABSG = 5 
       data hash MD5: 16K
       22 24 10 84 1F 7A BB 2D C6 FB 2A 13 4C 6F A1 00>)
$$ ##END=
$$ 
$$ hash MD5
$$ 30 01 C5 F7 E7 2A DF 25 E1 2F F9 0E 7D 6D 1A 3C
##$RELAX= 
##$RELAX= 
##$RELAX= 
##$RELAX= 
##$RELAX= 
##$RELAX= 
$$ Bruker specific parameters
$$ --------------------------
##$DU= <F:/spectra>
##$EXPNO= 1
##$NAME= <H-F>
##$PROCNO= 1
##$TYPE= <nmr>
##$USER= <she>
##$AMP= (0..31)
100 100 100 100 100 100 100 100 100 100 100 100 100 100 100 100 100 100 
100 100 100 100 100 100 100 100 100 100 100 100 100 100 
##$AQSEQ= 0
##$AQ_mod= 1
##$AUNM= <au_zg>
##$AUTOPOS= <>
##$BF1= 200.13
##$BF2= 200.13
##$BF3= 200.13
##$BF4= 200.13
##$BF5= 200.13
##$BF6= 200.13
##$BF7= 200.13
##$BF8= 200.13
##$BYTORDA= 1
##$CFDGTYP= 0
##$CFRGTYP= 5
##$CHEMSTR= <none>
##$CNST= (0..31)
1 1 145 1 1 1 1 1 1 1 1 1 1 1 1 1 1 1 1 1 1 1 1 1 1 1 1 1 1 1 1 1 
##$CPDPRG= <>
##$CPDPRG1= <>
##$CPDPRG2= <>
##$CPDPRG3= <>
##$CPDPRG4= <mlev>
##$CPDPRG5= <mlev>
##$CPDPRG6= <mlev>
##$CPDPRG7= <mlev>
##$CPDPRG8= <mlev>
##$CPDPRGB= <>
##$CPDPRGT= <>
##$D= (0..31)
0 1.2 0 0 0 0 0 0 0 0.06 0 0.03 0 0 0 0 0.0002 0 0 0 0 0 0 0 0 0 0 0 0 
0 0 0 
##$DATE= 1710240204
##$DBL= (0..7)
120 120 120 120 120 120 120 120 
##$DBP= (0..7)
150 150 150 150 150 150 150 150 
##$DBP07= 0
##$DBPNAM0= <>
##$DBPNAM1= <>
##$DBPNAM2= <>
##$DBPNAM3= <>
##$DBPNAM4= <>
##$DBPNAM5= <>
$$ [...]
##$SUBNAM3= <"">
##$SUBNAM4= <"">
##$SUBNAM5= <"">
##$SUBNAM6= <"">
##$SUBNAM7= <"">
##$SUBNAM8= <"">
##$SUBNAM9= <"">
##$SW= 18.0517328524113
##$SWIBOX= (0..15)
0 0 2 0 0 0 0 0 0 0 0 0 0 0 0 0 
##$SW_h= 3612.71676300578
##$TD= 16384
##$TD0= 1
##$TE= 0
##$TE2= 300
##$TE3= 300
##$TEG= 300
##$TL= (0..7)
0 120 120 120 120 120 120 120 
##$TP= (0..7)
150 150 150 150 150 150 150 150 
##$TP07= 0
##$TPNAME0= <>
##$TPNAME1= <>
##$TPNAME2= <>
##$TPNAME3= <>
##$TPNAME4= <>
##$TPNAME5= <>
##$TPNAME6= <>
##$TPNAME7= <>
##$TPOAL= (0..7)
0.5 0.5 0.5 0.5 0.5 0.5 0.5 0.5 
##$TPOFFS= (0..7)
0 0 0 0 0 0 0 0 
##$TUNHIN= 0
##$TUNHOUT= 0
##$TUNXOUT= 0
##$USERA1= <user>
##$USERA2= <user>
##$USERA3= <user>
##$USERA4= <user>
##$USERA5= <user>
##$V9= 5
##$VALIST= <valist>
##$VCLIST= <CCCCCCCCCCCCCCC>
##$VD= 0
##$VDLIST= <DDDDDDDDDDDDDDD>
##$VPLIST= <PPPPPPPPPPPPPPP>
##$VTLIST= <TTTTTTTTTTTTTTT>
##$WBST= 1024
##$WBSW= 4
##$XGAIN= (0..3)
0 0 0 0 
##$XL= 0
##$YL= 0
##$YMAX_a= 148841
##$YMIN_a= -191324
##$ZGOPTNS= <>
##$ZL1= 120
##$ZL2= 120
##$ZL3= 120
##$ZL4= 120
##$ABSF1= 15.40312
##$ABSF2= -2.648727
##$ABSG= 5
##$ABSL= 3
##$ALPHA= 0
##$AQORDER= 0
##$ASSFAC= 0
##$ASSFACI= 0
##$ASSFACX= 0
##$ASSWID= 0
##$AUNMP= <proc_1d>
##$AZFE= 0.1
##$AZFW= 0.1
##$BCFW= 0
##$BC_mod= 2
##$BYTORDP= 0
##$COROFFS= 0
##$CY= -3
##$DATMOD= 1
##$DC= 0
##$DFILT= <>
##$DTYPP= 0
##$F1P= 0
##$F2P= 0
##$FCOR= 1
##$FTSIZE= 16384
##$FT_mod= 6
##$GAMMA= 0
##$GB= 0
##$INTBC= 1
##$INTSCL= 3.70164e-10
##$ISEN= 128
##$LB= 0.24
##$LEV0= 0
##$LPBIN= 0
##$MAXI= 10000
##$MC2= 0
##$MEAN= 0
##$ME_mod= 0
##$MI= 1.114404
##$NCOEF= 0
##$NC_proc= -5
##$NLEV= 6
##$NOISF1= 3.799351
##$NOISF2= 2.8
##$NSP= 0
##$NTH_PI= 0
##$NZP= 0
##$OFFSET= 15.40312
##$PC= 1
##$PHC0= -25304.6
##$PHC1= 10.58731
##$PH_mod= 1
##$PKNL= yes
##$PPARMOD= 0
##$PSCAL= 0
##$PSIGN= 0
##$REVERSE= no
##$SF= 200.130023730637
##$SI= 16384
##$SIGF1= 3
##$SIGF2= 2
##$SINO= 5.538805
##$SIOLD= 16384
##$SREGLST= <1H.CDCl3>
##$SSB= 0
##$STSI= 16384
##$STSR= 0
##$SW_p= 3612.71676300578
##$SYMM= 0
##$S_DEV= 0
##$TDeff= 16384
##$TDoff= 0
##$TI= <>
##$TILT= no
##$TM1= 0
##$TM2= 0
##$TOPLEV= 0
##$USERP1= <user>
##$USERP2= <user>
##$USERP3= <user>
##$USERP4= <user>
##$USERP5= <user>
##$WDW= 1
##$XDIM= 16384
##$YMAX_p= 413339326
##$YMIN_p= -156320
$$ End of Bruker specific parameters
$$ ---------------------------------
##NTUPLES= NMR SPECTRUM
##VAR_NAME=  FREQUENCY,     SPECTRUM/REAL,   SPECTRUM/IMAG
##SYMBOL=    X,             R,               I
##VAR_TYPE=  INDEPENDENT,   DEPENDENT,       DEPENDENT
##VAR_FORM=  AFFN,          ASDF,            ASDF
##VAR_DIM=   16384,         16384,           16384
##UNITS=     HZ,            ARBITRARY UNITS, ARBITRARY UNITS
##FACTOR=    0.220516191357247, 1,           1
##FIRST=     3082.62677930988, 0,            0
##LAST=      -530.089983695903, 0,           0
##MIN=       -530.089983695903, -156320,     0
##MAX=       3082.62677930988, 413339326,    0
$$ Real data points
##PAGE= N=1
##DATA TABLE= (X++(R..R)), XYDATA
$$ [...]
8857A3624J8319l1621m2792J0097K6247J3123j9786k1860p964J3791K6922p662
$$ 13624 31943 322 -42470 -32373 -6126 6997 -12789 -34649 -42613 -28822 -1900 -9562
8845i562k7601p113M5744L1807j8130j8088J1349k2691m5208k444M9167J060k0418
$$ -9562 -37163 -44276 1468 33275 15145 -2943 8406 -14285 -59493 -61937 -12770 -11710 -32128
8832c2128L1547r568n692j8657k0043O207k1460J3170J6032J13503j2262o3921
$$ -32128 -581 -10149 -15841 -34498 -54541 -48334 -69794 -56624 -40592 72911 60649 -3272
8820c272l0816K2870N2377m843o094J7695k2008N8766k1733k6570n6841l4120
$$ -3272 -34088 -11218 41159 36316 30222 47917 25909 84675 62942 36372 -20469 -54589
8808e4589P4721K8458k0808k0205J4670L5290q1728k7386J5230m2529N8021J8231
$$ -54589 20132 48590 27782 7577 22247 57537 -24191 -51577 -36347 -78876 -20855 -2624
8796b624k7057J1329n924o4442N5964L4619m2785k6987j8680k775k11L3203l260
$$ -2624 -29681 -18352 -24276 -88718 -32754 1865 -40920 -67907 -86587 -89362 -89573 -56370 -59630
8783e9630L695L7147n7738P3095j5121J5084M7181J0929n2865j3454j2681K8559
$$ -59630 -55935 -18788 -76526 -3431 -18552 -3468 43713 54642 1777 -11677 -24358 4201
8771D201j1435J1661n911n4370J8003N1334Q196l3644j3835j18816L7672J09607
$$ 4201 -7234 4427 -1484 -55854 -37851 13483 21679 -11965 -25800 -144616 -106944 2663
8759B663k8724m6822J0845L914O1508l4016j4059K0989j1161L9916l174n4060
$$ 2663 -26061 -72883 -62038 -58124 3384 -30632 -44691 -23702 -34863 5053 1879 -52181
8747e2181J3116L5530L9094o6661j3156K1919k2596m1595P7070j3435r00K2319
$$ -52181 -39065 -3535 35559 -31102 -44258 -22339 -44935 -86530 -9460 -22895 -23795 -1476
8735a476k0485J5498M2218J9048k3541o53K8290l0921l8131j7849p785j4249k1391
$$ -1476 -21961 -6463 35755 54803 31262 30609 58899 27978 -10153 -28002 -35787 -50036 -71427
8722g1427P6787p196o2635L775k2201M4003J5850j0897L656M5760K4517m9716
$$ -71427 5360 -1836 -64471 -60696 -82897 -38894 -23044 -33941 -30285 15475 39992 -9724
8710i724K065k4418n315O589m263L1554j2360J0325J2916n1379L8363n308k5555
$$ -9724 -7659 -32077 -37392 -30803 -35066 -3512 -15872 -5547 7369 -44010 -5647 -10955 -36510
8697c6510k0230j3080J1698K0454k8876q489n1234J6388Q6782j2173j4810Q027
$$ -36510 -56740 -69820 -58122 -37668 -66544 -75033 -126267 -109879 -23097 -35270 -50080 -42053
8685d2053m0577l0478Q4081M4854k6672J8951j1726m9080K9402k0704N0237m1139
$$ -42053 -82630 -113108 -29027 15827 -10845 8106 -3620 -52700 -23298 -44002 6235 -34904
8673c4904n86J07964n0541m2473j3630K9067J3666o614j7063M7610q2960l7706
$$ -34904 -35490 72474 21933 -20540 -34170 -5103 8563 1949 -15114 32496 -50464 -88170
8661h8170M5532K9182o8898Q327j2592J6984j163n2545R2214N7340N483n9486
$$ -88170 -42638 -13456 -82354 -74027 -86619 -69635 -70798 -123343 -31129 26211 31694 -27792
8649b7792n2695O5377p367n5209N0818K2915r250k0288K5198j8252P168M2654
$$ -27792 -80487 -15110 -22477 -77686 -26868 -3953 -13203 -33491 -8293 -26545 -19377 23277
8637B3277L6274P642j445l7227l5381K4105l3200L111m4630P0946l896k7232L1172
$$ 23277 59551 67193 65748 28521 -6860 17245 -15955 -12844 -57474 13472 9576 -17656 13516
8624A3516n3982n0619n078L6688K3288k7554M7575J2236j2433k16k0171J9897
$$ 13516 -40466 -91085 -96163 -59475 -36187 -63741 -16166 -3930 -16363 -16579 -36750 -16853
8612a6853k7853r888K632n1065K1654L9311r231j9253O5560j2594M733J6645J1475
$$ -16853 -44706 -54594 -51962 -103027 -81373 -42062 -51293 -70546 -4986 -17580 -12847 3798 15273
8599A5273J1406r5649l2133M8094N0822L6420m3050J6459O856n753q864M7021
$$ 15273 26679 -68970 -101103 -53009 -2187 34233 -8817 7642 14498 8745 -119 46902
8587D6902M0527m09q8967k369N794k4053O2848j01738M8524k8104K3188n996M4210
$$ 46902 87429 87020 -1947 -4316 1478 -22575 40273 -61465 -12941 -41045 -17857 -23853 20357
8574B0357o872K751n2886J3931K1621o6749N4465j7420n0922K9788Q314j2910
$$ 20357 13485 16236 -36650 -22719 -1098 -67847 -13382 -30802 -81724 -51936 -43622 -56532
8562e6532L2808N1475Q396j9305k3882p219j4356k1762K637O6560k7445k9752
$$ -56532 -23724 27751 36147 16842 -7040 -14259 -28615 -50377 -47740 18820 -8625 -38377
8550c8377m7347N0903k7020K625J8872l9608l169N2376L0415l2871J2781L7305
$$ -38377 -85724 -34821 -61841 -59216 -40344 -79952 -83121 -30745 -330 -33201 -20420 16885
8538A6885n4849P297m3670o237M6392M708J0670m1508J9751J1279j7263j0173
$$ 16885 -37964 -30667 -74337 -80574 -34182 -29474 -18804 -60312 -40561 -29282 -46545 -56718
8526e6718k4978m0123J6840P917M8741j1610K2970l7707P315J7369M767O3671
$$ -56718 -81696 -121819 -104979 -97062 -48321 -59931 -36961 -74668 -67353 -49984 -45217 18454
8514A8454k433K035k8540k8238r73M5508K4285m7089k2632k3049M5335J9558M0032
$$ 18454 16021 18056 -10484 -38722 -39695 5813 30098 -16991 -39623 -62672 -17337 2221 42253
8501D2253M822q0953J9212M8600p077j7101J2518m7940n494n36n1254M0559L9373
$$ 42253 47075 -33878 -14666 33934 26857 9756 22274 -25666 -31160 -31696 -82950 -42391 -3018
8488c018k604Q667m375k8856J6981O716k7810M291M7133N3769q3101o7989M7537
$$ -3018 -5622 3045 -1330 -30186 -13205 -6489 -34299 -30008 17125 70894 -12207 -80196 -32659
8475c2659J6338o704L1197R376L923j7554N777P440q9005K5725M3998r171q4676
$$ -32659 -16321 -23025 8172 17548 21471 3917 9694 17134 -71871 -46146 -2148 -11319 -95995
8462i5995m702L704N9812M1691m1391l7456K2763K8806P7527q067j3749m6049
$$ -95995 -100697 -96993 -37181 4510 -36881 -74337 -51574 -22768 54759 46692 32943 -13106
8450a3106K4083l5411k1422L1804k3873M5341O4342m4202n4124p4180J0704K0003
$$ -13106 10977 -24434 -45856 -14052 -37925 7416 71758 27556 -26568 -100748 -90044 -70041
8438g0041L4134M3760l4977J9651o0348L6877L0457n0493J273N364o5101n032
$$ -70041 -35907 7853 -27124 -7473 -67821 -30944 -487 -50980 -49707 -44343 -109444 -114476
8426a14476M381M957Q3902L9326l6226o1606M2330J4801n2668O0050l636p1006
$$ -114476 -110095 -105138 -21236 18090 -18136 -79742 -37412 -22611 -75279 -15229 -18865 -89871
8414h9871K5410K8837J0758L7311j5027K7695M859j0376m7540m6048m08J8573
$$ -89871 -64461 -35624 -24866 12445 -2582 25113 29972 19596 -27944 -73992 -74400 -55827
8402e5827k3492j5905N3846k539K7521K0459q6026L6038L1607k6628k5236M9270
$$ -55827 -79319 -95224 -41378 -43917 -16396 4063 -81963 -45925 -14318 -40946 -66182 -16912
8390a6912N1609n3803m9228n725Q627k1318L1758J4716k8787Q934k2305j3907
$$ -16912 34697 -19106 -68334 -74059 -65432 -86750 -54992 -40276 -69063 -60129 -82434 -96341
8378i6341M8182J4135o181l4819P935L8051j4159o620N0964l606m111n8239j8121
$$ -96341 -48159 -34024 -40205 -75024 -67089 -29038 -43197 -49817 1147 -2459 -6570 -64809 -82930
8365h2930P6853K218l868J3927K0612o3453M783K2185J6420k8399J4228J2656
$$ -82930 -6077 -3859 -7727 6200 26812 -36641 -31858 -9673 6747 -21652 -7424 5232
8353E232k5193j2761J810L9000K4197m7916l6128M5523P172m2964k4747M6475
$$ 5232 -19961 -32722 -30912 8088 32285 -15631 -51759 -6236 936 -42028 -66775 -20300
8341b0300K3855q117l5462r620J2608k3404L6757O674L0571J6630K326m0748r817
$$ -20300 3555 -4562 -40024 -49644 -37036 -60440 -23683 -17009 13562 30192 32518 -8230 -18047
8328a8047m150m7048m844L5231l6181N5974N9206j6991k606l2038l7725L1142
$$ -18047 -22197 -69245 -74089 -38858 -75039 -19065 40141 23150 20544 -11494 -49219 -18077
8316a8077J0157M8007J0164k0798k1060J8420l3925m4451K9453j1837m7479P1516
$$ -18077 -7920 40087 50251 29453 8393 26813 -7112 -51563 -22110 -33947 -81426 -9910
8304i910K0693o1099m3477j6189Q4737J8610L7784k9825k0963l066k244k0517
$$ -9910 10783 -50316 -93793 -109982 -25245 -6635 31149 1324 -19639 -22705 -24949 -45466
8292d5466o0069K3219J5082j7215J7054L380J102J7381l001j593O0999o6411Q427
$$ -45466 -105535 -82316 -67234 -84449 -67395 -64015 -62913 -45532 -48533 -50126 10873 -55538 -47111
8279d7111K8484N102m8219L746k3750J9098n631Q0557p905J0631K0439o6837L9081
$$ -47111 -18627 -13525 -61744 -57998 -81748 -62650 -68281 12276 4371 15002 35441 -31396 7685
8266G685k1854n9739J9120j5346O801L0545j0678O5462K7732k3648k5704k9061
$$ 7685 -14169 -73908 -54788 -70134 -63333 -32788 -43466 21996 49728 26080 376 -28685
8254b8685j7737P1989M1966l9135q8470q87j4514j211O6949j5508j9063N2N5389
$$ -28685 -46422 25567 67533 28398 -60072 -60959 -75473 -76684 -9735 -25243 -44306 -44254 11135
8241A1135j7405l347N3977m1184o890J1777n081j3642k3636L52M442k5674O8105
$$ 11135 -6270 -9617 44360 3176 -3714 8063 2982 -10660 -34296 -33944 -29502 -55176 12929
8228A2929J1636m8639J4228l8934j2355O6315j8213L7063o6243k7314P8777j8684
$$ 12929 24565 -24074 -9846 -48780 -61135 5180 -13033 24030 -42213 -69527 9250 -9434
8216i434k1482L8301o1889L469L9822N1360k1705n5752Q327L4406l9373O5371
$$ -9434 -30916 7385 -54504 -51035 -11213 40147 18442 -37310 -28983 5423 -33950 31421
8204C1421M2542l1236p0339j2783M770O872K0106O206k9483R4241K6128L89107
$$ 31421 73963 42727 -27612 -40395 -35625 -28753 -8647 -2441 -31924 62317 88445 477552
8192D77552N99768p72823k32137J2623m6522n5721o584K1212p3358L0770L0275
$$ 477552 1077320 304497 72360 84983 38461 -17260 -23844 -2632 -75990 -45220 -14945
8181a4945K8416j880Q311q5865N9807K7752k3381J1392J3212k5733n0207J9601
$$ -14945 13471 11591 19902 -65963 -6156 21596 -1785 9607 22819 -2914 -53121 -33520
8169c3520L9003q0710N5732L4579J3065n1553M045o1655J704K1223N9063m9812
$$ -33520 5483 -75227 -19495 15084 28149 -23404 -19359 -81014 -79310 -58087 976 -48836
8157d8836J17880l9143j05224O4471Q171l4251k507N4524M4154m6664j6211n1458
$$ -48836 69044 29901 -75323 -10852 -2681 -36932 -39439 15085 59239 12575 -3636 -55094
8145e5094k030P0311o3184l3573K6533M1301m5025K5263J7931j0566j7169K0724
$$ -55094 -57124 13187 -49997 -83570 -57037 -15736 -60761 -35498 -17567 -28133 -45302 -24578
8133b4578n6962O908M8500Q1187J0668q0736M024l695k9845J6L4857Q89k7568
$$ -24578 -81540 -74632 -26132 55055 65723 -15013 -10989 -14684 -44529 -44513 -9656 -8767 -36335
8120c6335P483L8846k5455o4926N5108M144m4538K8173p577k955M5409k7458P2079
$$ -36335 -28852 9994 -15461 -80387 -25279 -21135 -65673 -37500 -45077 -48032 -2623 -30081 41998
8107D1998m4185L3227K7642j611n768l6339k061J0333k423p4706M3878k2022M1610
$$ 41998 -2187 31040 58682 57071 51303 14964 12903 23236 20813 -53893 -10015 -32037 9573
8094I573m3351l4837O3515p36m9321L6399M5048m742l8413O5198O647J1987n8306
$$ 9573 -33778 -68615 -5100 -5836 -55157 -18758 26290 21548 -16865 48333 54980 66967 8661
8081H661j2675n551K9047o760q7201l4423L888J26500k8381j1415R051P116K589
$$ 8661 -4014 -9565 19482 12722 -74479 -108902 -105014 21486 -6895 -18310 -9259 -2143 446
8068D46o1073J6270J6046m500k1334J3900K0395M6829J6975n7179l9724J5842
$$ 446 -60627 -44357 -28311 -32811 -54145 -40245 -19850 26979 43954 -13225 -52949 -37107
8056c7107K5388j3364l3285j001m6047J1354J07756K3689p4734n3283P1393j4686
$$ -37107 -11719 -25083 -58368 -59369 -105416 -94062 13694 37383 -37351 -90634 -19241 -33927
8044c3927J055M548L15K8991N385L103r947l7186J2398j3334K276M4991K189p2697
$$ -33927 -32872 -28324 -28009 982 6367 9470 -477 -37663 -25265 -38599 -36323 8668 10857 -61840
8030f1840m9493L1339M7024j757p109q076P346J751K6129j1513n3855K2403L3330
$$ -61840 -111333 -79994 -32970 -34727 -41836 -49912 -42566 -40815 -14686 -26199 -80054 -57651 -24321
8017b4321n4795R357L5232N1964K5556m8702l9936j1311M4642K1814J3469p5771
$$ -24321 -79116 -69759 -34527 17437 42993 -5709 -45645 -56956 -12314 9500 22969 -52802
8005e2802J5013N19K2831m2969M651J7416j1589K8866n7470l1886L7221M2264
$$ -52802 -37789 -37270 -14439 -57408 -52757 -35341 -46930 -18064 -75534 -107420 -70199 -27935
7993b7935p645m0953K3800R17q457K6902R612K47Q5K9332J7592l3670j2986p015
$$ -27935 -35580 -76533 -52733 -51816 -60273 -33371 -23759 -23512 -23427 5905 23497 -10173 -23159 -30174
7979c0174p3045N6007K0490N0006k4671l8397J4570J2042l442J0650k722l6471
$$ -30174 -103219 -47212 -26722 23284 -1387 -39784 -25214 -13172 -16614 -5964 -8686 -45157
7967d5157k0391M6723N0562k796j6267j271n047J6086J6922n4789O691L3094J3388
$$ -45157 -65548 -18825 31737 28941 12674 11403 6356 22442 39364 -15425 -8734 24360 37748
7954C7748P143l0603k6129l1106J7794j3738j3099P1515j9219m7913N2776L8383
$$ 37748 44891 14288 -11841 -42947 -25153 -38891 -51990 19525 306 -47607 5169 43552
7942D3552P199j7966l1069K751P8846q1676L37m0337L7822J7621q4386Q994L5087
$$ 43552 50751 32785 1716 4467 83313 1637 1974 -38363 -541 17080 -67306 -58312 -23225
7929b3225R405p99n647k3827J3026J2121J9043k5362O599M6069o4262k1883J63
$$ -23225 -13820 -14619 -20266 -44093 -31067 -18946 97 -25265 -18666 27403 -36859 -58742 -58579
7916e8579l5728P9830L38M6830j6464J1397k7670m2212r210k919j1857K9653N1921
$$ -58579 -94307 -14477 -14139 32691 16227 27624 -46 -42258 -51468 -54387 -66244 -36591 15330
7903A5330M3514o8467k9955L7309L0493m6932L0573l2618j8495M3639k1790r037
$$ 15330 58844 -9623 -39578 -2269 28224 -18708 11865 -20753 -39248 4391 -17399 -26436
7891b6436m8907k0511L4526l3060J4902M096O4058M2294r2074M3923K8730K1566
$$ -26436 -75343 -95854 -61328 -94388 -79486 -75390 -11332 30962 -61112 -17189 11541 33107
7879C3107k7341M5522l8663l2495J2988L667J2693l4355j5303Q944l0753J3898
$$ 33107 5766 51288 12625 -19870 -6882 -3215 9478 -24877 -40180 -31236 -61989 -48091
7867d8091N4218j12388M5292Q512k0027N1144J7669M6887j7942o2406O5681Q0798
$$ -48091 6127 -106261 -60969 -52457 -72484 -21340 -3671 43216 25274 -37132 28549 109347
7855A09347l7734L692m8767n7186P587K826J5752K4067k264m7605K9526r310r424
$$ 109347 71613 75305 26538 -30648 -23061 -20235 -4483 19584 17320 -30285 -759 -10069 -19493
7842a9493p10j884o2551j7347O2441N0624L3110l866k7127M6210n0154o3253K6793
$$ -19493 -20203 -22087 -84638 -101985 -39544 11080 44190 40324 13197 59407 9253 -54000 -27207
7829b7207o094j9949L5133K0821k6234M259j5043O3487L9786l2185O868j7553
$$ -27207 -33301 -53250 -18117 2704 -23530 -19271 -34314 29173 68959 36774 43642 26089
7817B6089j8949o8674p202K4409J4515j4212J4922J0806m8814K2488j1752L6994
$$ 26089 7140 -61534 -68736 -44327 -29812 -44024 -29102 -18296 -67110 -44622 -56374 -19380
7805a9380p517p6031J2838k64N2662j0553O324J4015n1270J937m231R6329R332
$$ -19380 -26897 -102928 -90090 -90354 -37692 -48245 -41921 -27906 -79176 -77239 -81470 14859 24191
7792B4191K0679r6346N0281l4329M1354m4417p24O0986n1260L3275L2955k3337
$$ 24191 44870 -51476 -1195 -35524 5830 -38587 -39311 21675 -29585 3690 36645 13308
7780A3308p09L318r126m6022K0585K7484l669k6242R943j069k8992j8126L7623
$$ 13308 12599 15917 6791 -39231 -18646 8838 5169 -21073 -11130 -12199 -41191 -59317 -21694
7767b1694Q46k2483J5484j0500N9313j44M971k7672n0451J6055O9797L8568M936
$$ -21694 -20848 -43331 -27847 -38347 20966 20822 25793 -1879 -52330 -36275 33522 72090 77026
7754G7026l3627K0101l3378o0597n1384K8060O3277j2874L3548q679Q882K4763
$$ 77026 43399 63500 30122 -30475 -81859 -53799 9478 -3396 30152 21473 30355 55118
7742E5118R878n736M7557m1769n963N6140j20274l8167J5397L7165P574J3108
$$ 55118 64996 59260 106817 65048 59085 115225 -5049 -43216 -27819 9346 16920 30028
7730C0028j159k1549l7078j0301j1658J5607j240k0741L5136K7404M6081J8494
$$ 30028 28869 7320 -29758 -40059 -51717 -36110 -37350 -58091 -22955 4449 50530 69024
7718F9024n0531K4459k120r103M4936r292M749l3280k8786r837L3059j3895n67
$$ 69024 18493 42952 40832 31729 76665 67373 72122 38842 10056 219 33278 19383 18816
7705A8816k4723q1855O5622o876k555j7490k328L0255L9899M852l7458M990Q9705
$$ 18816 -5907 -87762 -22140 -29016 -31571 -49061 -51389 -21134 18765 23617 -13841 -8851 80854
7692H0854p4568K2273J2241Q69o5895j0419L457n0145Q81m5443O3595j0680p229
$$ 80854 6286 28559 40800 41669 -24226 -34645 -31188 -81333 -80452 -125895 -62300 -72980 -80209
7679h0209K9185P4515L0125n4546L2284o0610k7223K7945K232O5866j0928l1002
$$ -80209 -51024 23491 53616 -930 31354 -29256 -56479 -28534 -26302 39564 28636 -2366
7667b366j448o2795k2841J5971M2345L7626l4973L6486j290K0606j2726K8826
$$ -2366 -3814 -66609 -89450 -73479 -31134 6492 -28481 8005 6715 27321 14595 43421
7655D3421j1095l4002k7652k669l719L0516J3968n6336R918K7273J3934O1125
$$ 43421 32326 -1676 -29328 -31997 -35716 -5200 8768 -47568 -37650 -10377 3557 64682
7643F4682m6589k7893l2599L9880N10l6834j5321O248O1653r210M1662K3480j3718
$$ 64682 18093 -9800 -42399 -2519 -2009 -38843 -54164 -47916 13737 4527 46189 69669 55951
7630E5951J1152j6028p5060L8495l4708k7937K2912R4302R641p359m5595k6357
$$ 55951 67103 51075 -23985 14510 -20198 -48135 -25223 69079 78720 71361 25766 -591
7618e91j7679J4283L6790j4156n4580l1255L4778o326O2829k6797j9821j6566
$$ -591 -18270 -3987 32803 18647 -35933 -67188 -32410 -38736 24093 -2704 -22525 -39091
7606c9091K4487K5925j5414j6509l3231M7324J7586L512j9255Q512K5666L3170
$$ -39091 -14604 11321 -4093 -20602 -53833 -6509 11077 14589 -4666 3846 29512 62682
7594F2682P503j02073r998j8330M9832p390K9392m8514Q7996K0942o1876L3366
$$ 62682 70185 -31888 -41886 -60216 -10384 -17774 11618 -36896 51100 72042 10166 43532
7582D3532m5015j4574l9128N1920N021m8279L4611J8697k4164J9851j8418k479
$$ 43532 -1483 -16057 -55185 -3265 1756 -46523 -11912 6785 -17379 2472 -15946 -18425
7570a8425j1073L6236L602k9014p7769Q7312L001l8755J2305k110n551K4445k2150
$$ -18425 -29498 6738 10340 -18674 -96443 -9131 -6130 -44885 -32580 -34690 -40241 -15796 -37946
7557c7946k9120M810K3360M5164m7207k590N3141Q551o3540k1361J9687J4151
$$ -37946 -67066 -62256 -38896 6268 -40939 -43529 9612 18163 -45377 -66738 -47051 -32900
7545c2900K4536P6101n7943l2218L6932J771l6930J3318P768M195K8542l2380
$$ -32900 -8364 67737 9794 -22424 14508 16279 -20651 -7333 435 4630 33172 792
7533G92q3962O3159M5946M5688L9685j3138n9664m4276q2r53l1483M1589K4909
$$ 792 -83170 -20011 25935 71623 111308 98170 38506 -5770 -5852 -6805 -38288 3301 28210
7520B8210N8140o806K726j3166o7269j8875m100J2404r969q3561K1839N6214R910
$$ 28210 86350 79544 82270 69104 1835 -17040 -21140 -8736 -18705 -102266 -80427 -24213 -14303
7507a4303j4712J7619O0077m0074K9672l6236J1756K734l9691n9016L2354M3358
$$ -14303 -29015 -11396 48681 8607 38279 2043 13799 16533 -23158 -82174 -49820 -6462
7495f462m7117K423Q736M7170O0206l4205l2691n8251P3829R874k5290L4532j1889
$$ -6462 -53579 -51156 -42420 4750 64956 30751 -1940 -60191 13638 23512 -1778 32754 20865
7482B0865J114l606r893N6170j9503j7684j9338L2606k9875J325j9805L7287K422
$$ 20865 21979 18373 8480 64650 45147 27463 8125 40731 10856 12181 -7624 29663 32085
7469C2085j1226P4010J3054m4609l4936J0924k6702J7918l6650l0160j8655K1553
$$ 32085 20859 94869 107923 63314 28378 39302 12600 30518 -6132 -36292 -54947 -33394
7457c3394O7733J7940J1528m2095K6553L3572j7197K487l3898k6071L29j4804
$$ -33394 34339 52279 63807 21712 48265 81837 64640 67127 33229 7158 7487 -7317
7445g317J5086K8291j3959N8215n0518m3534j4089N9754q417L263J4931l0242
$$ -7317 7769 36060 22101 80316 29798 -13736 -27825 31929 23512 26775 41706 11464
7433A1464m5566J2571J5061p7023K2802L9002m2395M3920M3981L4215k5052l4846
$$ 11464 -34102 -21531 -6470 -83493 -60691 -21689 -64084 -20164 23817 58032 32980 -1866
7421a866n490p331k168K0917k1041j4128N0623P4309m6245n7786L5704o805O65
$$ -1866 -7356 -14687 -16855 4062 -16979 -31107 19516 93825 47580 -10206 25498 18693 19358
7408A9358J088J9307j531J2538Q377J5329m3422K1951m6657j7493n3543J7071
$$ 19358 20446 39753 38222 50760 59137 74466 31044 52995 6338 -11155 -64698 -47627
7396d7627R8065o205l403K1804P144j6070j8121p9238K3945M7102j6821J2156
$$ -47627 50438 44233 40830 62634 69778 53708 35587 -43651 -19706 27396 10575 22731
7384B2731N873J0710j2504J0821L6425m64L957p9199L0644k6355j6304K8274j9821
$$ 22731 28604 39314 26810 37631 74056 73592 77549 -1650 28994 2639 -13665 14609 -5212
7371e212J8017J4767l5926J479N2250L1738p151m5604j8839l3900N5593M1608
$$ -5212 12805 27572 -8354 -6875 45375 77113 69962 24358 5519 -28381 27212 68820
7359F8820j7712j1488L7625k4018j7189L893J6602m9354L622k9791J6066l6795
$$ 68820 51108 39620 77245 53227 36038 39931 56533 7179 10801 -18990 -2924 -39719
7347c9719M8055L7776j3740m9242K985M6642k1082k0505L626N2294m7210J0898
$$ -39719 8336 46112 32372 -16870 -13885 32757 11675 -8830 -5204 47090 -120 10778
7335A0778L7264L3000p776k3355J4135K438k5280J8826J2996J0665j21191J7077
$$ 10778 48042 81042 73266 49911 64046 66484 41204 60030 73026 83691 -37500 -20423
7323b0423K4770L7153k327L8826n7979q840L2947L3098Q297n8068j791k4276o3200
$$ -20423 4347 41500 39173 77999 20020 11180 44127 77225 85522 27454 25663 1387 -61813
7310f1813n6999Q0447Q8762j798k1091j0680p61j8582k0096n0890O36O6195K1052
$$ -61813 -118812 -38365 50397 48599 27508 16828 16067 -2515 -22611 -73501 -72865 -6670 14382
7297A4382O7279m0910m8908L9338M0366m7136K094J923K7003m3504j500N95M5052
$$ 14382 81661 40751 -8157 31181 71547 24411 26505 28428 55431 11927 10427 11022 56074
7284E6074J8889l6176K2054o9867K2664L5555J5999P354l3311O021L8919o30o4451
$$ 56074 74963 38787 60841 -9026 13638 49193 65192 72546 39235 45256 84175 83545 19094
7271A9094k1421O0578M3443j20879J988Q1566L514k8167k9585r116j5676Q4344
$$ 19094 -2327 58251 101694 -19185 -17197 64369 67883 39716 10131 1015 -14661 69683
7259F9683J0589j871m5432m3637M555J2933K1018O0480M230j9629m3904l7618
$$ 69683 80272 78401 32969 -10668 -6113 6820 27838 88318 92548 72919 29015 -8603
7247h603J0539L522K6498J9840P81l2604L49o342R320l3184j5100K7931J3552
$$ -8603 1936 5458 31956 51796 52577 19973 20322 13980 23300 -9884 -24984 2947 16499
7234A6499l9049k7245N4968j833M9559K2585K669N68n8976J2649j4643k8150k5446
$$ 16499 -22550 -49795 5173 3340 52899 75484 78153 78721 19745 32394 17751 -10399 -35845
7221c5845m117j1855M1616K1187j7539M9231J9477K329j7048J0199l064R454o2249
$$ -35845 -39962 -51817 -10201 10986 -6553 42678 62155 64484 47436 57635 54571 64025 1776
7208A776L0632M7180k12n1167k0554K7819k8387J5939j6757N133J5841k6670j7909
$$ 1776 32408 79588 79376 28209 7655 35474 7087 23026 6269 11402 27243 573 -17336
7195a7336K1198P1738k7901l1579L156j5780k9268K2975K204j4211M2553L929
$$ -17336 3862 75600 47699 16120 19276 3496 -25772 -2797 -593 -14804 27749 31678
7183C1678R8280K9425o5669p9077p750L4071K7202m3130N2852o604m1810j524
$$ 31678 129958 159383 93714 14637 6887 40958 68160 25030 77882 71278 29468 27944
7171B7944j0229j4765N917k1998M1233m402k3003L9559K9601n6294j5445K434
$$ 27944 17715 2950 8867 -13131 28102 23700 697 40256 69857 13563 -1882 552
7159E52q173O4144K1161m5420l6540m9430j1654J20488k0489r5937P8729K3655
$$ 552 -7621 56523 77684 32264 -4276 -53706 -65360 55128 34639 -61298 17431 41086
7147D1086l1761j1065J7704L2M0541P122o628J1538l5315J1894L83P3466n3334
$$ 41086 9325 -1740 15964 15996 56537 63659 57031 68569 33254 45148 45531 118997 65663
7134F5663k4753O799j0427K598m0116k0909K8328J5216P3733J514l9364m4726
$$ 65663 40910 47709 37282 39880 -236 -21145 7183 22399 96132 97646 58282 13556
7122A3556l8048n656J1306J2546J0681L572n2759l428k8258J9849J6562k6417
$$ 13556 -24492 -30148 -18842 -6296 4385 7957 -44802 -48230 -76488 -56639 -40077 -66494
7110f6494L9976q478M8549q954n5175J6618K8576k273J9674O2265m7243k5695
$$ -66494 -26518 -34996 13553 4599 -50576 -33958 -5382 -7655 12019 74284 27041 1346
7098A346K5698k7436K7709L6914J3411j3250j9103k2244M055q459j08n290Q565
$$ 1346 27044 -392 27317 64231 77642 64392 45289 23045 27100 18641 18533 13243 21808
7085B1808K944L3473O020j4316l0751p7298O1771P8577k7772k1647M8276l0983
$$ 21808 24752 58225 64245 49929 19178 -58120 3651 82228 54456 32809 81085 50102
7073E0102n2827N1023N0457N4058j7766o7714j2128k5005l6668J0770L5537L086
$$ 50102 -2725 48298 98755 152813 135047 67333 55205 30200 -6468 4302 39839 42925
7061D2925N21L161n3110L0861k8091K6220M485k5430J1871p0317p202L7568R6188
$$ 42925 43446 46607 -6503 24358 -3733 22487 26972 1542 13413 -56904 -64106 -26538 69650
7048F9650k0674L753p3602L0369j5189m671j2623L7265N476j4310L1471l7009
$$ 69650 48976 52729 -20873 9496 -5693 -10364 -22987 14278 19754 5444 36915 -94
7036i4m2785N6734M5363n2100J6627L0786N0573l8655K7921J16j0608k4041r022
$$ -94 -42879 13855 59218 7118 23745 54531 105104 66449 94370 94486 83878 59837 50815
7023E0815j1187j0372Q940K0931n7132M6925J1043M074l4302l1232J0007M8874
$$ 50815 39628 29256 38196 59127 1995 48920 59963 64037 29735 -1497 8510 57384
7011E7384l3612J3432L5375j5490l5995k9772M6758K0860l4123k5557P0433L5594
$$ 57384 23772 37204 72579 57089 21094 -8678 38080 58940 24817 -740 69693 105287
6999A05287M5722l6630p3069j5680P669m566L974L0860L0343n6954N030m125r039
$$ 105287 151009 114379 41310 25630 33299 28733 32707 63567 93910 36956 41986 37861 28822
6986B8822j4777K482N0399K6005N76l1456K2528J4826m6567p986l0506L5422J5463
$$ 28822 14045 16527 66926 92931 93507 62051 84579 99405 52838 44852 14346 49768 65231
6973F5231M4878m2409l3108l6249K2534j4931L4413l4453m4386Q999O9609L2935
$$ 65231 110109 67700 34592 -1657 20877 5946 40359 5906 -38480 -29481 40128 73063
6961G3063l561j0372n3327K7222Q10J5166k4402M0953P1256k322q5840j0489K2202
$$ 73063 69502 59130 5803 33025 33835 49001 24599 65552 136808 134486 48646 38157 60359
6948F0359L7444o8619k4315O7455j3553o9827K8718J8051m1799P5027P9754q7088
$$ 60359 97803 29184 4869 72324 58771 -11056 17662 35713 -6086 68941 148695 61607
6936F1607r259K9589j6453Q887J9231j109k5684l6802N901N7348l0784o675L1621
$$ 61607 52348 81937 65484 74371 93602 92493 66809 30007 35908 93256 62472 55797 87418
6923H7418L0538p657R505n3866m696J3512k5171r487K271L1327J4368j3793O310
$$ 87418 117956 110299 119804 65938 61242 74754 49583 40096 42367 73694 88062 74269 80579
6910H0579K4780l7566R679J6305l2712p9536K7386l682L0884k0803J5500J7260
$$ 80579 105359 67793 77472 93777 61065 -18471 8915 5233 36117 15314 30814 48074
6898D8074P5059l767q0810K7549N4562k7735l442Q242p2685l3742J4906R5919
$$ 48074 123133 119366 38556 66105 120667 92932 89490 97732 25047 -8695 6211 102130
6886A02130l45j110q041L9181m105J2402n2254k4148l3278J562k8140k8414K360
$$ 102130 101785 100675 92634 131815 127710 140112 87858 63710 30432 31994 3854 -24560 -22200
6873b2200J6423P1508l687L078m5425N1997Q481k8264j405Q759M6149L0089L793
$$ -22200 -5777 65731 62044 65122 19697 71694 80175 51911 50506 59265 105414 135503 139296
6860A39296l952J484l8181k1934O6197l9514p058k8966l8669N6849L5832K4548
$$ 139296 135344 136828 98647 76713 142910 103396 96338 67372 28703 85552 121384 145932
6848A45932Q225N690m9880J403J7301l8473l7780M1550j030K0316L0419j5902
$$ 145932 154157 159847 109967 111370 128671 90198 52418 93968 92938 113254 143673 127771
6836A27771J304L1109J2913k0151k8917j916M7412n0368j4386k4374Q1275N0213
$$ 127771 129075 160184 173097 152946 124029 122113 169525 119157 104771 80397 161672 211885
6824B11885j2108k6005p1568K1650N291l5667J7155Q3769l7809k1863j7139J8207
$$ 211885 199777 173772 102204 123854 129145 93478 110633 194402 156593 134730 117591 135798
6812A35798M2451m1076l0080j2472J3721K9158k454j4340J4481l6401l2872P679
$$ 135798 178249 137173 107093 94621 108342 137500 135046 120706 135187 98786 65914 73593
6800G3593N9325j007n6265p090P4306n2301j4342L0437N9178l070j7210K9476
$$ 73593 132918 131911 75646 68556 142862 90561 76219 106656 165834 162764 145554 175030
6788A75030r8790n4944K4727O6407M9844n153o4570M3123J1010o2879p8456N3574
$$ 175030 76240 21296 46023 112430 162274 157121 92551 135674 146684 83805 5349 58923
6776E8923P7460k740l5852n0868o613M4523K682N1219l7372r7028M1097M6127
$$ 58923 136383 133643 97791 46923 40310 84833 87515 138734 101362 4334 45431 91558
6764I1558k740m5614j5137K8217K0466J9037L4995M3054M4706k2926k5868q4422
$$ 91558 88818 43204 28067 56284 76750 95787 130782 173836 218542 195616 169748 85326
6752H5326l215j8110j7952q501K2750L8706L1597J5821l3191J5619m2750K2225
$$ 85326 82111 64001 46049 37548 60298 99004 130601 146422 113231 128850 86100 108325
6740A08325N1408l7038L132l9347l1761J7989P325R1539l2197R950m5744N95M0649
$$ 108325 159733 122695 125827 86480 54719 72708 80033 171572 139375 149325 103581 104176 144825
6727A44825J2074Q364r374m0523j2564K7073J9749R283L7710L925q269k1717l0536
$$ 144825 156899 165263 155889 115366 102802 129875 149624 158907 196617 200542 192273 170556 140020
6714A40020l565K3157k0153K9947J6088k7870L906k051n7034l964l2567R425r877
$$ 140020 136455 159612 139459 169406 185494 157624 161530 159479 102445 98481 65914 75339 65462
6701F5462k2366P4405k6313k3181K4439L9911N486L1766l9238N5374l5710J552
$$ 65462 43096 117501 91188 68007 92446 132357 137843 169609 130371 185745 150035 151587
6689A51587N8162J1225p0744j0799j1234N991M946j459M5511M2827K5310p2826
$$ 151587 209749 220974 150230 139431 128197 134188 139134 137675 183186 226013 251323 178497
6677A78497K7191K0915l0599k8014K1414n223J6478j5040j10465O4214R1871p864
$$ 178497 205688 226603 196004 167990 189404 184181 200659 185619 75154 139368 231239 223375
6665B23375k7775N6381n7834m1406K7943L1755J1327j3630O7377k355m3182k3179
$$ 223375 195600 251981 194147 152741 180684 212439 223766 210136 277513 275158 231976 208797
6653B08797K2919l6955K6579Q290j3874K4745M5223M6829p1025j2796q089K4817
$$ 208797 231716 194761 221340 229630 215756 240501 285724 332553 261528 248732 240643 265460
6641B65460l4156J3639m276p2403J4883N1830J6478m635O3897j4446j2309m259
$$ 265460 231304 244943 240667 168264 183147 234977 251455 246820 310717 296271 283962 279703
6629B79703K1990P5398O046n9395j7565n0624m7917J02130L2909m8225N9543m4642
$$ 279703 301693 377091 383137 323742 306177 255553 207636 309766 342675 294450 353993 309351
6617C09351J7223O9674j243n087l4807m632N5532P0501k8293n0408m4250M6008
$$ 309351 326574 396248 395005 389918 355111 350479 406011 476512 448219 397811 353561 399569
6605C99569k740M5425Q914j6733J9011M2440K0239l7192M4389r162M5908m902
$$ 399569 396829 442254 451168 434435 453446 495886 516125 478933 523322 514160 560068 555166
6593E55166q4474K4420J1053O2518K4382o547M9644l5288k1595K0965j0616L4219
$$ 555166 470692 495112 506165 568683 593065 586518 636162 600874 579279 600244 589628 623847
6581F23847K3144L869K0909j0033L2857M1597M6673L4643n4516l8866P445M9607
$$ 623847 646991 650860 671769 661736 694593 736190 782863 817506 762990 724124 731569 781176
6569G81176Q5260M6823M2658j7739N5091j9174K5876J3074P5419L7890q025M6662
$$ 781176 866436 913259 955917 938178 993269 974095 999971 1013045 1088464 1126354 1118329 1164991
6557A164991Q7696L4632P3808Q8609K8224N2459N3860J24875Q818M8663O7849
$$ 1164991 1252687 1287319 1361127 1449736 1477960 1530419 1584279 1709154 1717972 1766635 1834484
6546A834484Q3081K3710J19983J80756J77624Q9728J18183J64693J12139J09437
$$ 1834484 1917565 1941275 2061258 2242014 2419638 2509366 2627549 2792242 2904381 3013818
6536C013818J26288J47993J6087n242Q7423P0110J08730N5623J142M4246K0569
$$ 3013818 3140106 3288099 3304186 3298944 3386367 3456477 3565207 3620830 3621972 3666218 3686787
6525C686787j3230j5766K7528J01134K15842R3277Q9641J13525K26014J40988
$$ 3686787 3673557 3657791 3685319 3786453 4002295 4095572 4185213 4298738 4524752 4665740
6515D665740J00279J66702J76123K01853j3535L3070M437p9015r4169j48859j32139
$$ 4665740 4766019 4932721 5108844 5310697 5297162 5330232 5334669 5255654 5161485 5012626 4880487
6504D880487j87238k09784k02122j28841j45136j73904r2905o3167m9895k781
$$ 4880487 4693249 4483465 4281343 4152502 4007366 3833462 3740557 3677390 3627495 3624714
6494C624714l0524n3759k5711n6495P3214n1038p0223j0991p5678q6716j10917
$$ 3624714 3594190 3540431 3514720 3458225 3531439 3480401 3410178 3399187 3323509 3236793 3125876
6483C125876k28401j76704p5975j29082j58972j51288n2154j74803j43522j36903
$$ 3125876 2897475 2720771 2644796 2515714 2356742 2205454 2153300 1978497 1834975 1698072
6473A698072k6165j34283n1113q1886j00668n1298p4226k0099q1090m5545j4086
$$ 1698072 1671907 1537624 1486511 1404625 1303957 1252659 1178433 1158334 1077244 1031699 1017613
6462A017613k9811K2774j00257q3665K2143l3200k3877r3755K89n9684k7017k8773
$$ 1017613 987802 1010576 910319 826654 848797 815597 791720 697965 698254 638570 611553 582780
6450E82780J2286k8957J3264j6378k8161p51j2982l3841j716M1856k0499l2797
$$ 582780 595066 566109 579373 562995 534834 534083 521101 487260 485544 527400 506901 474104
6438D74104r208k6203n6513Q974J8909K4359l3650J2570K727j9147L840k1161
$$ 474104 464896 438693 382180 391154 410063 434422 400772 413342 416069 396922 400762 379601
6426C79601K9517J554p317P430p9117n0529M2393L0273J9617n3153n9468k2960
$$ 379601 409118 410672 403355 410785 331668 281139 323532 353805 373422 320269 260801 237841
6414B37841J0519j6624K5361k737k2050N0083j0943K6483l5932n7629R5221j9965
$$ 237841 248360 231736 257097 254360 232310 282393 271450 297933 262001 204372 299593 279628
6402B79628o9K7609k0333J6682l9265J4929p2099o326n644L4227k103l8494J8833
$$ 279628 279559 307168 286835 303517 264252 279181 207082 200756 195112 229339 227236 188742 207575
6389B07575P0465L3954k7512M6217L0144n7322q3257L0255J7106J087k0312J8770
$$ 207575 278040 311994 284482 330699 360843 303521 220264 250519 267625 268712 248400 267170
6377B67170l7846K513l9079j3767L6878M3892j7153J5720J8603p7200J8876J8829
$$ 267170 229324 231837 192758 178991 215869 259761 242608 258328 276931 199731 218607 237436
6365B37436J1781K1668n2732n7167k476M9594Q1882K9377j24363R216O9885p0744
$$ 237436 249217 270885 218153 160986 158510 208104 289986 319363 195000 204216 274101 203357
6353B03357l3617K156o0726N0409N8642q891r2011k7633P4123k1578j3681L4584
$$ 203357 169740 171896 111170 161579 220221 211330 119319 91686 165809 144231 130550 165134
6341A65134R3692n2865j3910J3529J3621L544K0075m4039o9779O9170K0806m6765
$$ 165134 258826 205961 192051 205580 219201 222745 242820 198781 129002 198172 218978 172213
6329A72213L1264j5122k0148l7833J6500M6874o3082L9734l1172M5648j8025j9228
$$ 172213 203477 188355 168207 130374 146874 193748 130666 170400 139228 184876 166851 147623
6317A47623M763n7270L2517N2399q348j7500r668k5749N0057P2347K5796k6717
$$ 147623 152386 95116 127633 180032 171684 154184 144516 118767 168824 241171 266967 240250
6305B40250n5988m8105N6477J7818l7218K2058N1070k4102k6289m4027P507K275
$$ 240250 184262 136157 192634 210452 173234 195292 246362 222260 195971 151944 159451 161726
6293A61726J6174m68p486k8681N263j2625J2983N5923L6484m9947J6114m1205
$$ 161726 177900 177432 169946 141265 146528 133903 146886 202809 239293 189346 205460 164255
6281A64255j8979m6247M98K0211J4910K0644k3899K8887o98n21L3021J0211K2090
$$ 164255 145276 99029 99527 119738 134648 155292 131393 160280 159582 159061 192082 202293 224383
6268B24383M8424j03479l1996j474L0828L7307m1179M0476J3352j8794J7455j5782
$$ 224383 272807 169328 137332 135858 166686 203993 162814 203290 216642 197848 215303 199521
6256A99521k1114m4701J8532j0739l8595M5259N9125J8893m7211L3676j4086m5814
$$ 199521 178407 133706 152238 141499 102904 148163 207288 226181 178970 212646 198560 152746
6244A52746J4601j6822n0541k9830L6450P9253n9412l7463N0328J8169m0998L3630
$$ 152746 167347 150525 99984 70154 106604 185857 126445 88982 139310 157479 116481 150111
6232A50111l5814K6224P3566R938n4424l6065L4727j677L8090n0469k9218j8908
$$ 150111 114297 140521 214087 224025 169601 133536 168263 166586 204676 154207 124989 106081
6220A06081K1551N937R6869o3374j1948M4356j1657o1959j5918K4540L2069N2433
$$ 106081 127632 133569 230438 167064 155116 199472 187815 125856 109938 134478 166547 218980
6208B18980M1308k3228l2715j6878N0804p7699L4476j7900M73L9012q303K6490
$$ 218980 260288 237060 204345 187467 238271 160572 195048 177148 177621 216633 208330 234820
6196B34820k5303m6733j8617L5375J3980l1404Q571m734K1484m3567n3249M0255
$$ 234820 209517 162784 144167 179542 193522 162118 170689 165955 187439 143872 90623 130878
6184A30878L4961k5315j3441m1295j2214P1861j3495j0425N3773J5545L3590L7711
$$ 130878 165839 140524 127083 85788 73574 145435 131940 121515 175288 190833 224423 262134
6172B62134p1406k112M9347j5845j2580k9497j8945J8185K9395m0344n4165q811
$$ 262134 190728 188616 237963 222118 209538 180041 161096 179281 208676 168332 114167 105356
6160A05356j7824P4875N635O586j0461j1167J6468Q353J1884l809M570m853m2428
$$ 105356 87532 162407 168042 174628 164167 153000 169468 177821 189705 185896 190466 185613 143185
6147A43185J1285n586Q219k2382l7350K260j1487k421O9253K153l1515K3638Q1589
$$ 143185 154470 148884 157103 134721 97371 99631 88144 85723 154976 157129 125614 149252 230841
6134B30841l7826k1615l2910L7571N443J3286n026j5553l0754O9547M5785k866
$$ 230841 193015 171400 138490 176061 181504 194790 189764 174211 143457 213004 258789 255923
6122B55923O41l9263j3798L9376n0109k8835M5158M0073o2702l3883M8705k3718
$$ 255923 256564 217301 203503 242879 192770 163935 209093 249166 186464 152581 201286 177568
6110A77568K8396o083l9938N4019l597k6699j8239J0356K4324R7899j6291m5453
$$ 177568 205964 199881 159943 213962 210365 183666 165427 175783 200107 298006 281715 236262
6098B36262p31R195j088j1798L9128j1170l4051r849j0407J9726j4522k3531J0728
$$ 236262 235531 244726 243638 231840 270968 259798 225747 215898 205491 225217 210695 187164 197892
6085A97892l5847j1265j6512O4145N3684P862m3718l6325R747M5286k0154r626
$$ 197892 162045 150780 134268 198413 252097 259959 216241 179916 189663 234949 214795 205169
6073B05169L4362j5785m3566K7431K043N0984o3282P1111J0046j4764J4328j6292
$$ 205169 239531 223746 180180 207611 209654 260638 197356 268467 278513 263749 278077 261785
6061B61785j1103q569n3934P8494j0267n3583L3918K0344o1306O304K3833K2025
$$ 261785 250682 242113 188179 266673 256406 202823 236741 257085 195779 202083 225916 247941
6049B47941l6699q205J1133J7108P756j3237m9816P63k7780j4206M1962J3791
$$ 247941 211242 203037 214170 231278 239034 225797 175981 176744 148964 134758 176720 190511
6037A90511N1247J606K9312n8080J3672m0129K0120M292m2647M524P6645j1936
$$ 190511 241758 243364 272676 214596 228268 188139 208259 212551 169904 174428 251073 239137
6025B39137p7748k837M4340K2628q781q0594L2287l8675k5304O9533M7367L2765
$$ 239137 161389 158552 202892 225520 216739 136145 168432 129757 104453 173986 221353 254118
6013B54118n1685M435J6549m7426l2083R214K2839K8335j8122J9766M8782j651
$$ 254118 202433 206868 223417 175991 143908 153122 175961 204296 186174 205940 254722 253071
6001B53071M588K6373o5102j4360L0941r8385K6632K3780N266j2636K1457K1382
$$ 253071 257659 284032 218930 204570 235511 137126 163758 187538 192804 180168 201625 223007
5989B23007K3338j8329n1236O6073l753p852m6071Q0715J0028k1589m9685m2861
$$ 223007 246345 228016 176780 242853 239100 231248 185177 265892 275920 254331 204646 161785
5977A61785J0257M0247K0780o2002l2390K637J02383p754j5546m8119q414Q1805
$$ 161785 172042 212289 233069 171067 138677 141314 243697 235943 220397 172278 163864 245669
5965B45669N9717k4723k3703J7858L0561l5825k2707P6620j9413j116j665J4748
$$ 245669 305386 280663 256960 274818 305379 269554 246847 323467 304054 302938 301273 316021
5953C16021M4863M206l242n0831P043j1570m1438O5645k799j565N7092m7926K577
$$ 316021 360884 365090 361848 311017 318060 306490 265052 330697 327898 326333 383425 335499 338076
5940C38076Q066j8326K7404J4251K2751j2139M292N3163l7986j9928L6686L5169
$$ 338076 346142 327816 355220 369471 392222 380083 384375 437538 399552 379624 416310 451479
5928D51479J292L950l5561J9433o2249P57N0631r8031k252L6286l043j7356J511
$$ 451479 452771 456721 421160 440593 378344 379101 429732 331701 329449 365735 362692 345336 346847
5915C46847M7983L1699l8099J3587m1084K74O358K7959L9288j8394P8961n1282
$$ 346847 394830 426529 388430 402017 360933 361207 367565 395524 434812 416418 495379 444097
5903D44097m3979P2393M087n6559k8574l787O7317l9862j0692L7709k9985R2104
$$ 444097 400118 472511 476598 420039 391465 387678 454995 415133 404441 442150 412165 504269
5891E04269K2290k6910O378l6404M2112M8388m8509j470M9799k3591O9496K2230
$$ 504269 526559 499649 506027 469623 511735 560123 511614 510144 559943 536352 605848 628078
5879F28078o0550N5827N9306j3669j7481p298n3870K3612J2507L2306L668m4119
$$ 628078 567528 623355 682661 668992 651511 644213 590343 613955 626462 658768 662436 618317
5867F18317K0946L5018Q6120K9970k8846L8890j460p509N6303K4694J1215L8681
$$ 618317 639263 674281 760401 790371 761525 800415 798955 791446 847749 872443 883658 922339
5855I22339M636L3584j1069k5810r147J00119K7913K11J0504L3870j0958j0956
$$ 922339 926975 960559 949490 923680 914533 1014652 1042565 1042776 1053280 1087150 1076192 1065236
5843A065236l5471P4691P9500k9711m9252L6015N4430L7360j3661L4591O4612
$$ 1065236 1029765 1104456 1183956 1154245 1104993 1141008 1195438 1232798 1219137 1253728 1318340
5832A318340J9115M9938O0441Q3659J8666M9403O302m5615N8580J34831K3814
$$ 1318340 1337455 1387393 1447834 1531493 1550159 1599562 1605864 1560249 1618829 1753660 1777474
5821A777474K0044M6142R0286Q2936J2489O1472J00734O1573J28563J98314O6136
$$ 1777474 1797518 1843660 1933946 2016882 2029371 2090843 2191577 2253150 2381713 2580027 2646163
5810B646163J82421K21687J05166J60079J32282J38325Q4839J50297J32460N1809
$$ 2646163 2828584 3050271 3155437 3315516 3447798 3586123 3670962 3821259 3953719 4005528
5800D005528J54432J6591J583j040p2791Q223J4347P0003j1995N3912J50340J35712
$$ 4005528 4159960 4176551 4178134 4177094 4104303 4112526 4126873 4196876 4184881 4238793 4389133 4524845
5788D524845P1057J21262J69879K09915J39121K17286K29795J17691R9661Q8138
$$ 4524845 4595902 4717164 4887043 5096958 5236079 5453365 5683160 5800851 5900512 5988650
5778E988650J6188o4527j05917j37384j99283k42012k04311k02444k90877j69968
$$ 5988650 6004838 5940311 5834394 5697010 5497727 5255715 5051404 4848960 4558083 4388115
5768D388115j60180p1506p8251j11800o6607n2880m8442l4770n209m5369j4593
$$ 4388115 4227935 4156429 4078178 3966378 3899771 3846891 3798449 3763679 3758470 3713101 3698508
5757C698508K7565k0924p6036j22409p7054m0362j81048j41938j60108k05208
$$ 3698508 3726073 3705149 3629113 3506704 3429650 3389288 3208240 3066302 2906194 2700986
5747B700986j55088j02852j30494j50061j13141k2995p9436j00641o5383k9259
$$ 2700986 2545898 2443046 2312552 2162491 2049350 2026355 1946919 1846278 1780895 1751636
5737A751636N196j10698j00238k172k7527p4499J369o3485q8798Q9148J7557n6985
$$ 1751636 1756832 1646134 1545896 1543724 1516197 1441698 1443067 1379582 1290784 1379932 1397489 1340504
5725A340504n516k1893j5294l2244p6153l2798k1167L0919J5617m8172n8929K2341
$$ 1340504 1334988 1313095 1297801 1265557 1189404 1156606 1135439 1166358 1181975 1133803 1074874 1097215
5713A097215j4890N6361K6753j1764J875p0291j5289l1803P1550L8891p9448K1396
$$ 1097215 1082325 1138686 1165439 1153675 1155550 1085259 1069970 1038167 1109717 1148608 1069160 1090556
5701A090556j4285l5858l460r428M5886K3655N023l3762k3127J3059L8495k2189
$$ 1090556 1076271 1040413 1036953 1027525 1073411 1097066 1102089 1068327 1045200 1058259 1096754 1074565
5689A074565K4208k466n6845n051P6172M9750r414l585l2526L9616Q421J0460
$$ 1074565 1098773 1096307 1039462 1034411 1110583 1160333 1150919 1147334 1114808 1154424 1162845 1173305
5677A173305l7211J5529j2593J4387r4368P7197m8p3010K1516k3542Q4362L5333
$$ 1173305 1136094 1151623 1139030 1153417 1059049 1136246 1136198 1063188 1084704 1061162 1145524 1180857
5665A180857M837K1784L7425O005M7530L2075o917L3731l9485l5466m1302J9658
$$ 1180857 1185694 1207478 1244903 1250908 1298438 1330513 1323596 1357327 1317842 1282376 1241074 1260732
5653A260732N0411L4252J8597n0697l410L6790L3699L1315l012N0827J6284j376
$$ 1260732 1311143 1345395 1363992 1313295 1309885 1346675 1380374 1411689 1408677 1459504 1475788 1474412
5641A474412N0789j3488l1413L3263p9L2608m4575p602O3031K8885M8711L6459
$$ 1474412 1525201 1511713 1480300 1513563 1513484 1546092 1501517 1493915 1556946 1585831 1634542 1671001
5629A671001k79n3470M4683L3239q013K6534N3469L2591O4091q012N4418N0228
$$ 1671001 1670722 1617252 1661935 1695174 1687161 1713695 1767164 1799755 1863846 1855834 1910252 1960480
5617A960480O5135m7603J8513P8380p07k5713N2775Q8219J17159R198j4590j677
$$ 1960480 2025615 1978012 1996525 2074905 2074198 2048485 2101260 2189479 2306638 2315836 2301246 2299569
5605B299569Q036L8774O6347N5336O5502J33463J2594M7863L1469j5915O7465
$$ 2299569 2307605 2346379 2412726 2468062 2533564 2667027 2679621 2727484 2758953 2743038 2810503
5594B810503M7390M1060L5096Q8468J21121P0744j389P0888J00483O9388M2325
$$ 2810503 2857893 2898953 2934049 3022517 3143638 3214382 3212993 3283881 3384364 3453752 3496077
5583C496077P7041K03503K01521J31332J17277J17185J63263K02333K56940K36146
$$ 3496077 3573118 3776621 3978142 4109474 4226751 4343936 4507199 4709532 4966472 5202618
5573E202618J65631J29776J18826J09928J28130J45687Q6003O5481L7116R9098
$$ 5202618 5368249 5498025 5616851 5726779 5854909 6000596 6086599 6152080 6189196 6288294
5563F288294N2973J8724K2572L8102J07603P8623J49974J37581K50155J93911
$$ 6288294 6341267 6359991 6382563 6420665 6528268 6606891 6756865 6894446 7144601 7338512
5553G338512K59204K30218K53761K35536J95520J16952M0032P4760o4775j41276
$$ 7338512 7597716 7827934 8081695 8317231 8512751 8629703 8669735 8744495 8679720 8538444
5543H538444j63301j75986j88547j80157k37774j96306j80894j18346j02880L1338
$$ 8538444 8375143 8199157 8010610 7830453 7592679 7396373 7215479 7097133 6994253 7025591
5533G025591J298k765O8789Q3205N4908J21816N0897R8073j6519K0109k5548N4666
$$ 7025591 7026889 7024124 7092913 7176118 7231026 7352842 7403739 7501812 7485293 7505402 7479854 7534520
5521G534520l0416j36779m5576j13864j09638k9386j33226q2353l9991k9765K6969
$$ 7534520 7504104 7367325 7321749 7207885 7098247 7068861 6935635 6853282 6813291 6783526 6810495
5510F810495j138Q3837K2601R0983J43684K2165P5677J47534J34728J63546J51627
$$ 6810495 6809357 6893194 6915795 7006778 7150462 7172627 7248304 7395838 7530566 7694112 7845739
5499G845739M0988L7648J35871J17435J818J13702J19677J39384J41793J63631
$$ 7845739 7886727 7924375 8060246 8177681 8179499 8293201 8412878 8552262 8694055 8857686
5489H857686K57915K54603J99205K11380L07231K15047K62278K16086K26744K08899
$$ 8857686 9115601 9370204 9569409 9780789 10088020 10303067 10565345 10781431 11008175 11217074
5479A1217074L16337K52003J92954K52792J76239K43233J99963K86316K67854
$$ 11217074 11533411 11785414 11978368 12231160 12407399 12650632 12850595 13136911 13404765
5470A3404765K11255K73403J87999K50670K72170L24876K40543K45865K70855
$$ 13404765 13616020 13889423 14077422 14328092 14600262 14925138 15165681 15411546 15682401
5461A5682401K44213L73520M33949M63106L58746M48521N01257M95965N16064
$$ 15682401 15926614 16300134 16734083 17197189 17555935 18004456 18505713 19001678 19517742
5452A9517742P95633Q14157P41624Q33979Q37944R43960R74998J001349J059635
$$ 19517742 20313375 21127532 21869156 22703135 23541079 24485039 25460037 26461386 27521021
5443B7521021J017700J088498J109233R71644J000204J046497J150962J014458
$$ 27521021 28538721 29627219 30736452 31708096 32708300 33754797 34905759 35920217
5435C5920217J094207J044563J096611J187396J228575J323031J533861J629754
$$ 35920217 37014424 38058987 39155598 40342994 41571569 42894600 44428461 46058215
5427D6058215J720608K006369K168948K415669K842660L262838L719844M297982
$$ 46058215 47778823 49785192 51954140 54369809 57212469 60475307 64195151 68493133
5419F8493133N006155N811590O933627Q284283R797425J1898682J4469819J7769627
$$ 68493133 73499288 79310878 86244505 94528788 104326213 116224895 130694714 148464341
5411A48464341K1962151K6918251L2630287L9794971M7763337N2031903L9811203
$$ 148464341 170426492 197344743 229975030 269770001 317533338 369565241 409376444
5404D09376444L962882l3640214n3711490n5803163m7471782l7314235k8726822
$$ 409376444 413339326 379699112 325987622 270184459 222712677 185398442 156671620
5397A56671620k2346174j7454156j3834790j1192539r103261p619414o506938
$$ 156671620 134325446 116871290 103036500 91843961 82740700 75121286 68614348
5390F8614348n568463m821251m113539l578552l047104k736096k518640k367736
$$ 68614348 63045885 58224634 54111095 50532543 47485439 44749343 42230703 39862967
5382C9862967k172877k075873j823902j723352j645213j505698j518779j488875
$$ 39862967 37690090 35614217 33790315 32066963 30421750 28916052 27397273 25908398
5374B5908398j405262j421338j252542j126302r81754q19261q00766q15270o52588
$$ 25908398 24503136 23081798 21829256 20702954 19721200 18901939 18101173 17285903 16633315
5365A6633315n97229o40260n82736n50371n82935m38861n31816m64013l99062
$$ 16633315 16036086 15395826 14813090 14262719 13679784 13240923 12709107 12245094 11846032
5356A1846032m11429l91839l20596k74572l60770l89241l81297l27108l24823
$$ 11846032 11434603 11042764 10722168 10447596 10086826 9697585 9316288 8989180 8664357
5347H664357l71178l40243k54665k59370k51697j87032k68095j92498j72630k46382
$$ 8664357 8293179 7952936 7698271 7438901 7187204 7000172 6732077 6539579 6366949 6120567
5337F120567j99578j60860j16775j33842k31162j43973j22933j18528j02332o1769
$$ 6120567 5920989 5760129 5643354 5509512 5278350 5134377 5011444 4892916 4790584 4728815
5327D728815r4947p9546o3957p1818j06577p2326K8574m9810j26722K7598J01091
$$ 4728815 4633868 4554322 4490365 4418547 4311970 4239644 4268218 4218408 4091686 4119284 4220375
5316D220375j13135o6867r8469j35426k08538q6272j00887j34853o1764q0942
$$ 4220375 4107240 4040373 3941904 3806478 3597940 3511668 3410781 3275928 3214164 3133222
5306C133222m2912j33875j06558j11385j01919o7040N4350J106j27695k8417q227
$$ 3133222 3090310 2956435 2849877 2738492 2636573 2569533 2623883 2624989 2497294 2468877 2460650
5295B460650j3347r2526k4239l3586l5757N681o4914j28932n4358L6646r391o2438
$$ 2460650 2447303 2354777 2330538 2296952 2261195 2266876 2201962 2073030 2018672 2055318 2045927 1983489
5283A983489o7118q5063p1282K3241L3329n5951N4086L4200M090m0798k4562k0497
$$ 1983489 1916371 1831308 1760026 1783267 1816596 1760645 1814731 1848931 1853021 1812223 1787661 1767164
5271A767164k9241q3481r8783j44898K633p4099o6995K5511J0140r4430K2763
$$ 1767164 1737923 1654442 1555659 1410761 1413394 1339295 1272300 1297811 1307951 1213521 1236284
5260A236284J5711n0326k125l3176q759m080j9522n6356k1063m7868m7266q2843
$$ 1236284 1251995 1201669 1199544 1166368 1157609 1153529 1134007 1077651 1056588 1008720 961454 878611
5248H78611k8983n1284l8163j1268P847M0114N3892L9338M8391P3397J342j3200
$$ 878611 849628 798344 760181 748913 756760 796874 850766 890104 938495 1011892 1013234 1000034
5236A000034j6044N7383N2712p554M7315q1285L6501n4925k8408K0002M1435j678
$$ 1000034 983990 1041373 1094085 1086531 1133846 1052561 1089062 1034137 1005729 1025731 1067166 1065488
5224A065488j3760n0932o1472L3639o7383j06814L5061L0805L996p1969r0494
$$ 1065488 1051728 1000796 939324 972963 905580 798766 833827 864632 868628 796659 706165
5213G06165L1859K0377M5133p6377o3947N1850K9767J131j00456k8645J09893
$$ 706165 738024 758401 803534 727157 663210 715060 744827 745958 645502 616857 726750
5202G26750M4110o1036o8011K1780j1464m2006L4252J6940n3057M6137J1670k0705
$$ 726750 770860 709824 641813 663593 652129 610123 644375 661315 608258 654395 666065 645360
5190F45360L501j2659P607l3187O7835m236n7304q78M7411o5859n2796L9415R301
$$ 645360 648861 636202 643809 610622 678457 674221 616917 616039 663450 597591 544795 584210 593511
5177E93511k7292l5863k282k4684L5624N276J7115n9766N647q4804j11992J16163
$$ 593511 566219 530356 528074 503390 539014 544290 561405 501639 507286 422482 310490 426653
5165D26653Q93m2298j00j1016n158L0971J0522m6082l5704j4053j2043K0474p0076
$$ 426653 427546 385248 385148 374132 368974 399945 410467 364385 328681 314628 302585 323059 252983
5152B52983J4646L752O0480L6917o0336N38j7841R1179K474j159j8681l4541K8582
$$ 252983 267629 271381 331861 368778 308442 308980 291139 382318 384792 383633 364952 330411 358993
5139C58993j9529l0838o2461o6529N8718O1236K3852l0170j8787L9786m1706p204
$$ 358993 339464 308626 246165 179636 238354 299590 323442 293272 274485 314271 272565 265361
5127B65361k895r4468m2354P8088R319N3788M6918o5672J496k7445L2713K3171
$$ 265361 262466 167998 125644 203732 213051 266839 313757 248085 249581 222136 254849 278020
5115B78020q717k5364J9678O0133j5712m5213l7624m5082o0059n96P7275o0157
$$ 278020 269303 243939 263617 323750 308038 262825 225201 180119 120060 119464 196739 136582
5103A36582P722K5297j2580k0963L9629l9073n458K5006J2550k5213k4324P2602
$$ 136582 144304 169601 157021 136058 175687 136614 131156 156162 168712 143499 119175 191777
5091A91777k7202j5561N0601J9142p5351O544K596m2390M0650J6350L4477K4347
$$ 191777 164575 149014 199615 218757 143406 149950 152546 110156 150806 167156 201633 225980
5079B25980K741m6679J8039K4143o6408r586J663J161k279J3490O9135j1337k611
$$ 225980 228721 182042 200081 224224 157816 148230 149893 151054 148775 162265 231400 220063 217452
5066B17452j3543j8561L4544J9196N6445n0229j383r1261N116J7869j7648m998
$$ 217452 203909 185348 219892 239088 295533 245304 243921 152660 157776 175645 157997 152999
5054A52999J4919j1963k266Q4774n885o8093n672M8636r575m8087M5076L2349
$$ 152999 167918 155955 153689 238463 232578 164485 158813 207449 197874 149787 194863 227212
5042B27212K592p0155q316M4284m388K3500j9578q2722O3349O1663j3071m2622
$$ 227212 229804 159649 151333 195617 191229 214729 195151 112429 175778 237441 224370 181748
5030A81748K2649m1025l4695J0245j0837o474J2534K6947Q43n3439J2390M4125
$$ 181748 204397 163372 128677 138922 128085 121611 134145 161092 161935 108496 120886 165011
5018A65011K695k8874n981R5566r558L9770K3481j06545O6116j899l4849J3240
$$ 165011 167706 138832 132851 228417 218859 258629 282110 175565 241681 239782 204933 218173
5006B18173J3556q5327n1213P6631M3520l3896m4928O8459L5189M5866j7688K6537
$$ 218173 231729 146402 95189 171820 215340 181444 136516 204975 240164 286030 268342 294879
4994B94879p5306N4066k1438k5442j0912k0758K7293K2515l7700k136K0759L6941
$$ 294879 219573 273639 252201 226759 215847 195089 222382 244897 207197 205061 225820 262761
4982B62761J1851l2543l9053L21P270m3957M822L5858k1297J9923J5121J4867
$$ 262761 274612 242069 203016 203337 210607 166650 171472 207330 186033 205956 221077 235944
4970B35944L0528n4201r309R0193k0866k6840L0953J6763K1866m828K5778k6883
$$ 235944 266472 212271 202962 293155 272289 245449 276402 293165 315031 310203 335981 309098
4958C09098k4007O288l1434m9505L3309m0496K6529M2898l4416R9006L953M4575
$$ 309098 285091 291379 259945 210440 243749 203253 229782 272680 238264 337270 341223 385798
4946C85798M7361J0355l6983L698M0762j6477Q0138L2477n4201k669P608N5754
$$ 385798 433159 443514 406531 410229 450991 434514 514652 547129 492928 490259 497867 553621
4934E53621K0855l568J9375l7659k66K3212N2561k8806K5320m904M7655n811J707
$$ 553621 574476 570908 590283 552624 552358 575570 628131 599325 624645 619741 667396 661585 663292
4921F63292N1154K3345J2890M7244O755M576K4995K8585K3942j4569m805O0508
$$ 663292 714446 737791 750681 797925 804680 809256 834251 862836 886778 872209 867404 927912
4909I27912Q2715M2744K1393R475K0513j6096Q355O2555M5527r96O1502K4549
$$ 927912 1010627 1053371 1074764 1084239 1104752 1088656 1097011 1159566 1205093 1204097 1265599 1290148
4897A290148J615k8551J00317M0051N4005J25302K0684R0140m1282M6495R0511
$$ 1290148 1291763 1263212 1363529 1403580 1457585 1582887 1603571 1693711 1652429 1698924 1789435
4886A789435O6229M1505j6934N1721J08159O0393P4954J5811J11562N8934J2570
$$ 1789435 1855664 1897169 1880235 1931956 2040115 2100508 2175462 2191273 2302835 2361769 2374339
4875B374339O4340L0571J35864R7000j5859M8596J31865O2959L6629M3619P6550
$$ 2374339 2438679 2469250 2605114 2702114 2686255 2734851 2866716 2929675 2966304 3009923 3086473
4864C086473L2310P4066L0007N5113N7752R5454J22978J6462k0625K2078M5769
$$ 3086473 3118783 3192849 3222856 3277969 3335721 3431175 3554153 3570615 3549990 3572068 3617837
4853C617837P7203P5089K6562K8234K0049k845M5648O2369n428k33M3866l7290
$$ 3617837 3695040 3770129 3796691 3824925 3844974 3842129 3887777 3950146 3944718 3944485 3988351 3951061
4841C951061m6453P747j8142R639k8248j4134m6132n1060p256q5461r657k9809
$$ 3951061 3904608 3912355 3894213 3903852 3875604 3861470 3815338 3764278 3757022 3671561 3661904 3632095
4829C632095j12331k60j3107o1041j30839j10991q0271k7300m225L2778j07189
$$ 3632095 3519764 3519504 3506397 3445356 3314517 3203526 3123255 3095955 3091730 3124508 3017319
4818C017319q1816o8135j04656o8989j01126p5086k6027n6091q8589p6589o5783
$$ 3017319 2935503 2867368 2762712 2693723 2592597 2517511 2491484 2435393 2346804 2270215 2204432
4807B204432K804o0373q2895q1163q9055j06342m9171q5079k0012L6327p7438
$$ 2204432 2207236 2146863 2063968 1982805 1893750 1787408 1738237 1653158 1633146 1669473 1592035
4796A592035r1561o5908j13123p0196m1480k6062k2555m1225m3723p0645k1072
$$ 1592035 1500474 1434566 1321443 1251247 1209767 1183705 1161150 1119925 1076202 1005557 984485
4785I84485M5767n3965K2809l5784p5932j5092m4390q414K4636j3451K1043p9318
$$ 984485 1030252 976287 999096 963312 887380 872288 827898 819484 844120 830669 851712 772394
4773G72394l2971J0968p6985l5771L80K0834K6107o1785k6875m8554J9366l7876
$$ 772394 739423 750391 673406 637635 638015 658849 684956 623171 596296 547742 567108 529232
4761E29232m4746N1479j0664L4508j9814N8N066n1507k6491M607j9274l1512M878
$$ 529232 484486 535965 525301 559809 539995 540053 545119 493612 467121 471728 452454 420942 425820
4748D25820N1113m6108l5399R3755k5172n2336m78J911n559M9341m6883j4619
$$ 425820 476933 430825 395426 489181 464009 411673 411195 413106 407547 456888 410005 395386
4736C95386O0579m39J3321J5265j4523n4187R0191m3736J600k0259R370m6551
$$ 395386 455965 455526 468847 484112 469589 415402 505593 461857 463457 443198 452568 406017
4724D06017o948k627K2831m4863k8546J6295o558o847N4651L4868J6503n0107
$$ 406017 399069 396442 419273 374410 345864 362159 355601 348754 403405 438273 454776 404669
4712D04669r810K4884m6600J3467R977R560L0321N0235j8182M2366m2501M2013
$$ 404669 394859 419743 373143 386610 396587 406147 436468 486703 468521 510887 468386 510399
4700E10399m4988o998J2266j620M2361L7295J4397l4349N4150j1596M0504k6388
$$ 510399 465411 458413 470679 469059 511420 548715 563112 528763 582913 571317 611821 585433
4688E85433n3605j1597O2767L8261L9537k3447l1330O7056Q5111R152k3615K7147
$$ 585433 531828 520231 582998 621259 660796 637349 606019 673075 758186 767338 743723 770870
4676G70870J27K1987J0243J9030j1681L6808k1841Q4151o4652K2514M2482M6997
$$ 770870 770997 792984 803227 822257 810576 847384 825543 909694 845042 867556 910038 957035
4664I57035M0425K9573N8573m9479k7110K0952P0552P68N1959O049L2758j6997
$$ 957035 997460 1027033 1085606 1036127 1009017 1029969 1100521 1101289 1153248 1159297 1192055 1175058
4652A175058O087P8111j1235N0044p8P8950L3642L7387R2643K0933q164O2195
$$ 1175058 1181145 1259256 1248021 1298065 1297987 1376937 1410579 1447966 1540609 1561542 1553378 1615573
4640A615573J06040M2026M9328r016O9369Q2578N1301J11916J03732M2294M0048
$$ 1615573 1721613 1763639 1812967 1803951 1873320 1955898 2007199 2119115 2222847 2265141 2305189
4629B305189O1126J15376Q4401O9156J12054O2503Q0551J13591J49346J53562
$$ 2305189 2366315 2481691 2566092 2635248 2747302 2809805 2890356 3003947 3153293 3306855
4619C306855J24559J57214K36154K41248L04201K73390K62260N07788N30679O61824
$$ 3306855 3431414 3588628 3824782 4066030 4370231 4643621 4905881 5413669 5944348 6606172
4609F606172O85444O84108O64175N71235L57338L55013N03001O55204Q39880J073062
$$ 6606172 7291616 7975724 8639899 9211134 9568472 9923485 10426486 11081690 11921570 12994632
4599A2994632J004484O43416K28841j14457j23192K00458N23675R31212R71881
$$ 12994632 13999116 14642532 14871373 14756916 14633724 14834182 15357857 16289069 17260950
4590A7260950N20429k53104q16226j029594r38135n35415j80831K4936k1761m00822
$$ 17260950 17781379 17528275 16712049 15682455 14744320 14208905 14028074 14053010 14031249 13630427
4580A3630427q48859j133156j080793q66539o37959m04453l70380m38588n48734
$$ 13630427 12781568 11648412 10567619 9701080 9063121 8658668 8288288 7849700 7300966
4571G300966o96187p43188o74895o19054m45079l69261l32058l03320j81004k52377
$$ 7300966 6604779 5861591 5186696 4567642 4122563 3753302 3421244 3117924 2936920 2684543
4561B684543j19191j99603j58951j48427j42615q9136L9552r2388p3989m7960
$$ 2684543 2565352 2365749 2206798 2058371 1915756 1826620 1866172 1773784 1699795 1651835
4551A651835p5856o2859j15547k9073l408p9597p3802p6304m6460k9004l3790
$$ 1651835 1575979 1513120 1397573 1368500 1365092 1285495 1211693 1135389 1088929 1059925 1026135
4540A026135n2857l7252J2658m5250o4425m0740r2509m429n123k2544J063j7386
$$ 1026135 973278 936026 948684 903434 839009 798269 705760 701331 696208 673664 674727 657341
4528F57341l631N2142M109k8251j6260N709o0728j0399j7935o1606L382l0763
$$ 657341 653710 705852 709961 681710 665450 671159 610431 600032 582097 520491 523873 493110
4516D93110l4328l2097P0394M36L3787l4122n744o8061k689K7451J6933j4876
$$ 493110 458782 426685 497079 497515 531302 497180 491436 423375 420686 448137 465070 450194
4504D50194k9107N802N9401O353l2147m7621r300l9445O1844m1588K4070R750
$$ 450194 421087 426889 486290 492643 460496 412875 403575 364130 425974 384386 408456 418206
4492D18206k4509l3498P490k502k8117R339l5670m4350o446J8585L2407J4750
$$ 418206 393697 360199 367689 365187 337070 346409 310739 266389 259943 278528 310935 325685
4480C25685K45J850j0586n0333j9003P1713L041r4084k8229P3149j5180n781j3114
$$ 325685 325930 327780 317194 266861 247858 319571 322612 228528 200299 273448 258268 252487 239373
4467B39373M724m8126k1993p371M6484L0758p949J8080l5244k7574K7611k1487
$$ 239373 244097 195971 173978 166607 213091 243849 235900 253980 218736 191162 218773 197286
4455A97286l6271q958J06010J8023j09348l1549J4115J0345K3983r959L411j1690
$$ 197286 161015 152057 258067 276090 166742 135193 149308 159653 183636 173677 177088 165398
4443A65398l452L2233o5941M570o1963O4414K5756J3231P162N750j5036o2565
$$ 165398 161946 194179 128238 132808 70845 135259 161015 174246 181408 187158 172122 109557
4431A09557j3745o2754P7687M7156P182j0481j4312Q9351m3769o576L1306k1833
$$ 109557 95812 33058 110745 157901 165083 154602 140290 229641 185872 179296 210602 188769
4419A88769K7376J4728j3159o6694M0749l8603j300J0782j2946m1523R1696j000
$$ 188769 216145 230873 217714 151020 191769 153166 151866 162648 149702 108179 199875 198875
4407A98875P621m1916J7155L559k1509j6147O735l223m8998M8818K1938j5966
$$ 198875 206496 164580 181735 185294 163785 147638 154373 151150 102152 150970 172908 156942
4395A56942J1074p1349L2068K4446M963R774J4285k1318m4896J01067n7101N597
$$ 156942 168016 96667 128735 153181 158144 167918 182203 160885 115989 217056 159955 165552
4383A65552Q081k6195l183J7613K6921k723M4093O567l0712J1215J740k6799n5550
$$ 165552 173633 147438 144255 161868 188789 186066 230159 236726 206014 217229 218969 192170 136620
4370A36620j0387k945j036K9834L9419K1942p224n9370j712J6265L8440K9131
$$ 136620 126233 123288 122252 152086 191505 213447 206223 146853 145141 161406 199846 228977
4358B28977Q493m2481Q791k693j7431j0342M1872J9972k5746n6562L4329Q7516
$$ 228977 237470 194989 203780 201087 183656 173314 215186 235158 209412 152850 187179 274695
4346B74695k9059J4790N8797k818j3775m2353l540J7605o339j2478k9203J949
$$ 274695 245636 260426 319223 316405 302630 260277 256737 274342 268003 255525 226322 228271
4334B28271L6423Q273o6907K9881K3481Q680K0663l8617M438P9420l6493K6226
$$ 228271 264694 272967 206060 235941 259422 268102 288765 250148 254586 334006 297513 323739
4322C23739Q202J4314l3488J1961O5412l5192k7026K5604M0943l4750P6506l7511
$$ 323739 331941 346255 312767 324728 390140 354948 327922 353526 394469 359719 436225 398714
4310C98714J6073J01598o7504k7518l540l2521O0723M229o863K4987J2283k1787
$$ 398714 414787 516385 448881 421363 417823 385302 446025 450254 443391 468378 480661 458874
4298D58874L1228p433L4166N2826N3915n1655L806K925n47L3209R494L3826l3015
$$ 458874 490102 482669 516835 569661 623576 571921 575727 578652 578105 611314 620808 654634 621619
4285F21619L0231J09826o700m4443J9167q321k3117N9609K9356K6008K7137L515
$$ 621619 651850 761676 754976 710533 729700 721379 698262 757871 787227 813235 840372 843887
4273H43887R9064m4479k2441q248j2943J4006N6391O3187j2867n623J7875j5255
$$ 843887 942951 898472 876031 867783 854840 868846 925237 988424 975557 969934 987809 972554
4261I72554O1412K8828L6701L4644P991K1183N8231Q1890J9153L4581N1187j830
$$ 972554 1033966 1062794 1099495 1134139 1142130 1163313 1221544 1303434 1322587 1357168 1408355 1406525
4249A406525K5921k2298O5221J13717J15499P4057L7633j7872J32803N9242m2066
$$ 1406525 1432446 1410148 1475369 1589086 1704585 1778642 1816275 1798403 1931206 1990448 1948382
4238A948382N3519J52745J30552J00928J33079j4055P7856J63299J51908Q2348
$$ 1948382 2001901 2154646 2285198 2386126 2519205 2505150 2583006 2746305 2898213 2980561
4228B980561J24285J37908J93380J83919J21467J58511J81312J78915J99730L03914
$$ 2980561 3104846 3242754 3436134 3620053 3741520 3900031 4081343 4260258 4459988 4763902
4218D763902K53474K56288K89382L97809L98837M44986O57385O83778Q66114M30954
$$ 4763902 5017376 5273664 5563046 5960855 6359692 6804678 7462063 8145841 9011955 9442909
4208I442909j68338m19561m10679k72588k6541n2207l3082O6630K9885R0404O7578
$$ 9442909 9274571 8855010 8444331 8171743 8145202 8092995 8059913 8126543 8156428 8246832 8314410
4197H314410N1996k1918l2418M3647J17163q66n4901k7159m3993j22502j39336
$$ 8314410 8366406 8344488 8312070 8355717 8472880 8472014 8417113 8389954 8345961 8223459 8084123
4186H084123p6655j14752r9930p6984j96965j10749j49149j62019j52763j97808
$$ 8084123 8007468 7892716 7792786 7715802 7518837 7408088 7258939 7096920 6944157 6746349
4176F746349k66843j94374k04212k21386j93327j82182k02294k08378j68511k15841
$$ 6746349 6479506 6285132 6080920 5859534 5666207 5484025 5281731 5073353 4904842 4689001
4166D689001k58192k63895j42874k46964j34198j44070j90830j32236j57618j68060
$$ 4689001 4430809 4166914 4024040 3777076 3642878 3498808 3307978 3175742 3018124 2850064
4156B850064j88019j25105r2707p6872j51784j08587q4323j15598j38152j11195
$$ 2850064 2662045 2536940 2444233 2367361 2215577 2106990 2022667 1907069 1768917 1657722
4146A657722j8057n7038n8052j16024k849j48166r4097N3804r5652r5829j9256
$$ 1657722 1639665 1582627 1524575 1408551 1405702 1257536 1163439 1217243 1121591 1025762 1006506
4135A006506l5941k4844j1030p335o1359l6621p49m856j8901k234m8351l9081
$$ 1006506 970565 945721 934691 927356 865997 829376 828627 823771 804870 802636 754285 715204
4123G15204r933L0588n3561k7167J3835l6550j7854j1280L1399m2017l540l1904
$$ 715204 705271 735859 682298 655131 668966 632416 614562 603282 634681 592664 589124 557220
4111E57220l4081K134K4970m7511K3521j9911j6128J5617k8598m472K8639k2362
$$ 557220 523139 525273 550243 502732 526253 506342 490214 505831 477233 472761 501400 479038
4099D79038J2687j107O935m6692l4994k3192L6332o014K8666K21j1333K0136K2206
$$ 479038 491725 490618 497553 450861 415867 392675 429007 422993 451659 451880 440547 460683 482889
4086D82889L4569k0901k8920m005P019m3777M2574N3686k3670n3016K5851n8623
$$ 482889 517458 496557 467637 463632 470651 426874 469448 523134 499464 446448 472299 413676
4074D13676l4813M4370k5269M5206N04O930N7806j9608K1066m448n022k0770K4078
$$ 413676 378863 423233 397964 443170 443674 450604 508410 488802 509868 505420 500398 479628 503706
4061E03706n202l032j0570j8864M4202l9507j6374l0632K9163N0638l1395Q2838
$$ 503706 498504 495472 484902 466038 510240 470733 454359 423727 452890 503528 472133 554971
4049E54971M654n6735l1520j1715m2956P4690M3499l0185J53494J2746j09559
$$ 554971 559625 502890 471370 459655 416699 491389 534888 504703 658197 670943 561384
4038E61384K4004N935N558l555p9118N796L784M5034Q4515r162k1271k2695M89
$$ 561384 585388 591323 596881 593326 514208 520004 523788 568822 653337 644175 622904 600209 600698
4025F00698j783N9774K697j9523K722K0495m1678j4875M385M8294J6587N1192
$$ 600698 598915 658689 661386 641863 644585 665080 623402 608527 612912 661206 677793 728985
4013G28985K7039K0582p6898j5305L3612n5365M2446o675Q7860o903j7543r945
$$ 728985 756024 776606 699708 684403 718015 662650 705096 698421 786281 779378 761835 751890
4001G51890J3597R405M1534k5486j379J7559j6979M1697O9509L0881o0456n4911
$$ 751890 765487 774892 816426 790940 789561 807120 790141 831838 901347 932228 871772 816861
3989H16861J7792N5730J5491j1230L2992K0838O7274O3734j6712r485n572j4004
$$ 816861 834653 890383 905874 894644 927636 948474 1015748 1079482 1062770 1053285 1047713 1033709
3977A033709L1546Q029M2332O5335k4190j5447N4383Q5336l8184Q2376N2051o7098
$$ 1033709 1065255 1073284 1115616 1180951 1156761 1141314 1195697 1281033 1242849 1325225 1377276 1310178
3965A310178k178m4798O0444Q8088P8621p8770M7979N2679P1655O7587K863r010
$$ 1310178 1308000 1263202 1323646 1411734 1490355 1411585 1459564 1512243 1583898 1651485 1654348 1645338
3953A645338l5182N7098L9979N8513O3899Q2287Q1890M4625Q614J7869N5537O8753
$$ 1645338 1610156 1667254 1707233 1765746 1829645 1911932 1993822 2038447 2047061 2064930 2120467 2189220
3941B189220l0377L1461M2765O1132N2201P8175R3555Q2255K7531R4729K0317
$$ 2189220 2158843 2190304 2233069 2294201 2346402 2424577 2518132 2600387 2627918 2722647 2742964
3930B742964O1271J03294P8387J15701P0214K5570L8682Q1152J79531J35173K5133
$$ 2742964 2804235 2907529 2985916 3101617 3171831 3197401 3236083 3317235 3496766 3631939 3657072
3919C657072J72154R9091J34257J38552J26744J68950J50296R8754J40170J40481
$$ 3657072 3829226 3928317 4062574 4201126 4327870 4496820 4647116 4745870 4886040 5026521
3909E026521J17209K32218J91685K27622K63549K58222K54717K57159K87199L92887
$$ 5026521 5143730 5375948 5567633 5795255 6058804 6317026 6571743 6828902 7116101 7508988
3899G508988L97303M12468M36954M61394N37861O04503O48223O28987P00154Q09939
$$ 7508988 7906291 8318759 8755713 9217107 9754968 10359471 11007694 11636681 12336835 13146774
3889A3146774Q72798Q58629Q29271Q38417Q34255P31342O82940N16848M81655
$$ 13146774 14019572 14878201 15707472 16545889 17380144 18111486 18794426 19311274 19792929
3880A9792929L57071K69160J95442O4539N3785o2792N120j26704j86738k24108
$$ 19792929 20150000 20419160 20614602 20679141 20732926 20670134 20675254 20548550 20361812 20137704
3870B0137704k61536l42908m91626n20125n91360o85044p26690r10755q25032
$$ 20137704 19876168 19533260 19041634 18521509 17930149 17245105 16518415 15607660 14782628
3861A4782628p43823p87139o94492p57313o58998o37612n13217m33743m29212
$$ 14782628 14038805 13251666 12557174 11799861 11140863 10503251 9990034 9556291 9127079
3852I127079m09427l04508k50721k76117k17686k60398k01475j68820r2614j43376
$$ 9127079 8717652 8413144 8162423 7886306 7668620 7408222 7206747 7037927 6945313 6801937
3842F801937k02445l1867m9987j32239r3152o4019n5762j23266p1065o7212q6725
$$ 6801937 6599492 6567625 6517638 6385399 6292247 6228228 6172466 6049200 5978135 5910923 5824198
3831E824198n0683j02100j03234j44701l7489K433p9662j49674k7280p4274j11034
$$ 5824198 5773515 5671415 5568181 5423480 5385991 5388424 5308762 5159088 5131808 5057534 4946500
3820D946500l5570r634j72449m9701J1175j3495l8l7507k2138m1609J6227K69
$$ 4946500 4910930 4901296 4728847 4679146 4690321 4676826 4676788 4639281 4617143 4575534 4591761 4592030
3808D592030K4476M3245L9618N5550P7484J41286J01866J16309R6985J03912J74726
$$ 4592030 4616506 4659751 4699369 4754919 4832403 4973689 5075555 5191864 5288849 5392761 5567487
3797E567487J82346J77631J95369K07385J77992K45325K53956J97953K13982K22648
$$ 5567487 5749833 5927464 6122833 6330218 6508210 6753535 7007491 7205444 7419426 7642074
3787G642074K31693K34557J91236K21952J73094J95068J47126K18508Q6692K13813
$$ 7642074 7873767 8108324 8299560 8521512 8694606 8889674 9036800 9255308 9342000 9555813
3777I555813J12869M3708R8360K430j9256K0278n7784q7695m4324m1077j04901
$$ 9555813 9668682 9712390 9810750 9813180 9793924 9814202 9756418 9668723 9624399 9583322 9478421
3766I478421j43546p3306n8859k4617k3570o7201j01971q4942K1077m938P2366
$$ 9478421 9334875 9261569 9202710 9178093 9154523 9087322 8985351 8900409 8921486 8916548 8988914
3755H988914m4119m6604m608k7502k1802k0572N0265L4854P3613L1576J03996
$$ 8988914 8944795 8898191 8893583 8866081 8844279 8823707 8873972 8908826 8982439 9014015 9118011
3744I118011m2178K4733O8692j1354p6904O064m1108j15205j07178n6635j04539
$$ 9118011 9075833 9100566 9169258 9157904 9081000 9087064 9045956 8930751 8823573 8766938 8662399
3733H662399j92093k03578j80332k32735j73955k04316k38858j55715j76579l23932
$$ 8662399 8470306 8266728 8086396 7853661 7679706 7475390 7236532 7080817 6904238 6580306
3723F580306k79155k18788k29850k43650k21719k81777j98259j83285j95337j34423
$$ 6580306 6301151 6082363 5852513 5608863 5387144 5105367 4907108 4723823 4528486 4394063
3713D394063j58908k40397j84944r3984j19555j42796j21627p5242r3844p7293
$$ 4394063 4235155 3994758 3809814 3715830 3596275 3453479 3331852 3256610 3162766 3085473
3703C085473p1114K8727j780O2920l1435j6737J8083j1960m6668j3557P321l7972
$$ 3085473 3014359 3043086 3041306 3104226 3072791 3056054 3074137 3062177 3015509 3001952 3009273 2971301
3691B971301L618j2751m5384K0461J9621M2275q830p465M8568o3765k6052j9151
$$ 2971301 2974919 2962168 2916784 2937245 2956866 2999141 2990311 2982846 3031414 2967649 2941597 2922446
3679B922446q1693r5803O6661m5176j13507p4397q7287n3449j70337p3664m7139
$$ 2922446 2840753 2744950 2811611 2766435 2652928 2578531 2491244 2437795 2267458 2193794 2146655
3668B146655r9194m2650p7256p3253n3218n6511o5038r9626n2414n9431l5370
$$ 2146655 2047461 2004811 1927555 1854302 1801084 1744573 1679535 1579909 1527495 1468064 1432694
3657A432694l6428n3449j69030o3615K8532q1216l0441k5869m9463J3003n6381
$$ 1432694 1396266 1342817 1173787 1110172 1138704 1057488 1027047 1001178 951715 964718 908337
3646I08337k1343M062n0336l7118n3665K0960l7337o3375M3419o5046o163j3576
$$ 908337 886994 891056 840720 803602 749937 770897 733560 670185 713604 648558 642395 628819
3634F28819j8873J0638m4850Q613R186j5172L8275m2982N856L8303n9380J963
$$ 628819 609946 620584 575734 584347 593533 578361 616636 573654 579510 617813 558433 560396
3622E60396m758n324M0408o1822k9644j1069K0646k1655j5189J7170m8052K1956
$$ 560396 555638 550314 590722 528900 499256 488187 508833 487178 471989 489159 441107 463063
3610D63063k8211j94O4956l8750l2201j0125L493k9153o179M9847k1580O2886
$$ 463063 434852 434658 499614 460864 428663 418538 422031 392878 386699 436546 414966 477852
3598D77852J3086o3668l0772O5970n7479L8349o8785p542J0338j5540p1565k8605
$$ 477852 490938 427270 396498 462468 404989 443338 374553 367011 377349 361809 290244 261639
3586B61639P0360q515M1020j1452j714m682M8350L8778k9049o4674n909K9337
$$ 261639 331999 323484 364504 353052 351338 346656 395006 433784 404735 340061 334152 363489
3574C63489l9085n021n196J7877J9266l3407L5271l6736l5927L7791n3628m8879
$$ 363489 324404 319383 314187 332064 351330 317923 353194 316458 280531 318322 264694 215815
3562B15815Q0272j0004J630K0234O350O621m0980k6830k536K5661o7220l6518
$$ 215815 296087 286083 287713 307947 314297 320918 279938 253108 250572 276233 209013 172495
3550A72495m7970N3430l9138K2418J425k836M7426M0196k2735K6972k0031n0274
$$ 172495 124525 177955 138817 161235 162660 159824 207250 247446 224711 251683 231652 181378
3538A81378J1047O898m567j6405K1509Q779j8569m7883k833M1278J8346j3819
$$ 181378 192425 199323 194756 178351 199860 208639 190070 142187 139354 180632 198978 185159
3526A85159M7346R552q8060p6656L7621j3850P4296j8378n8982L5350J2719n4492
$$ 185159 232505 242057 153997 77341 114962 101112 175408 157030 98048 133398 146117 91625
3514I1625M7853K2892k9981M113L3204l8578K6668L9815N965k3386k2492L1555
$$ 91625 139478 162370 132389 136502 169706 131128 157796 197611 203576 180190 157698 189253
3502A89253P386m1275M2990K863l6165M709l4732R229L0594j4012J1361j8818
$$ 189253 196639 155364 198354 201217 165052 169761 135029 144258 174852 160840 172201 153383
3490A53383K9234L5661M8778m4442K2972k3580l852n8280k5106l0897K332L823
$$ 153383 182617 218278 267056 222614 245586 222006 218154 159874 134768 103871 106203 110026
3478A10026K1733M4263j9033K4115m8050K1114L003k0147J5803R937M802k5757
$$ 110026 131759 176022 156989 181104 133054 154168 157171 137024 152827 162764 167566 141809
3466A41809J9809O1030n276n0370m1010K3748m853m608k0238L1422n763n3450
$$ 141809 161618 222648 217372 167002 125992 149740 144887 140279 120041 151463 145700 92250
3454I2250J4147J03190p602p9284J1840O9566n1539l1847Q8349m387J6718o2689
$$ 92250 106397 209587 201985 122701 134541 204107 152568 120721 209070 204683 221401 158712
3442A58712n1840j0839M2550J07938l2909K8917n1513O8532p0833L4665J5719
$$ 158712 106872 96033 138583 246521 213612 242529 191016 259548 188715 223380 239099
3431B39099J4546M5724o5558l4881m415J3901j431l6446K9971o497o3048m6090
$$ 239099 253645 299369 233811 198930 194515 208416 206985 170539 200510 194013 130965 84875
3419H4875k6792J2121J8380N6943N1245j6145K1410K3292o2799n2800K9027k9063
$$ 84875 58083 70204 88584 145527 196772 180627 202037 225329 162530 109730 138757 109694
3407A09694n2011k048L3836j6265M732O3350l154j3412l8966L7464K8096j09134
$$ 109694 57683 55635 89471 73206 77938 141288 138134 124722 85756 123220 151316 42182
3395D2182j0983L0319j4382L9094J5517l5212l9988M2682n5238j0597Q3276k6771
$$ 42182 31199 61518 47136 86230 101747 66535 26547 69229 13991 3394 86670 59899
3383E9899J8806M2199p0036J6196O0654l7473k5072M1289K6749n6602L8041L5318
$$ 59899 78705 120904 50868 67064 127718 90245 65173 106462 133211 76609 114650 149968
3371A49968k7589K332M82K9710M9367K4909n2978n4643L5687M4985N3761O749
$$ 149968 122379 124711 125193 154903 204270 229179 176201 121558 157245 202230 255991 262740
3359B62740r396N5307k9570l2942O6313k135r1846N8477k76n9139o0997J9305
$$ 262740 253344 308651 279081 246139 312452 310317 218471 276948 276672 217533 156536 175841
3347A75841J4405l1208m2215P7227n2538m0150k3316j9887L1647l038l2781J5492
$$ 175841 190246 159038 116823 194050 141512 101362 78046 58159 89806 86768 53987 69479
3335F9479l7059j2020l095k5608j0531K5007R2986P2854j8568m7003n9680L041
$$ 69479 32420 20400 17305 -8303 -18834 6173 99159 172013 153445 106442 46762 49803
3323D9803j4075n4916M0221P774N856N177N1221M228k3418k5550l3976N6848l7238
$$ 49803 35728 -19188 21033 28807 34663 39840 91061 95289 71871 46321 12345 69193 31955
3310C1955m2041K2799K2550J2459K8120L9085m2538l6803l4314M2424N768n8206
$$ 31955 -10086 12713 35263 47722 75842 114927 72389 35586 1272 43696 49464 -8742
3298h742P4873j931k9381j4037j8172L4163P0919k7731m0106J7653l0616R838
$$ -8742 66131 64200 34819 20782 2610 36773 107692 79961 39855 57508 26892 36730
3286C6730P2615k5376m4371k2652l1930M7199K8339K6399j8379n5042k4698L5203
$$ 36730 109345 83969 39598 16946 -14984 32215 60554 86953 68574 13532 -11166 24037
3274B4037K0556K7200m3808m289o4975J03684l0721J7208J3430n2264R572k7823
$$ 24037 44593 71793 27985 23696 -41279 62405 31684 48892 62322 10058 19630 -8193
3262h193l6651N5143O1811J6403j4682j22J0292j5670K778j3598K500M9666l7025
$$ -8193 -44844 10299 72110 88513 73831 73709 84001 68331 71109 57511 60011 109677 72652
3249G2652K4912k9048L0754j3141R598N6787j1791o6379n1182o370r249M5922
$$ 72652 97564 68516 99270 86129 95727 152514 140723 74344 23162 16792 7543 53465
3237E3465j784r430j5304O977l2915n0571r050K8780p261O3795N7095q514l8965
$$ 53465 51681 42251 26947 33924 1009 -49562 -58612 -29832 -37093 26702 83797 75283 36318
3224C6318R072L7017l7670k2578N3070p175K208j4829m3825l0871O9575j1342
$$ 36318 45390 82407 44737 22159 75229 68054 70262 55433 11608 -19263 50312 38970
3212C8970p2458m2948R1310L763j3599K4178M9547j668M319l6097J6136J6636
$$ 38970 -33488 -76436 14874 18637 5038 29216 78763 77095 81414 45317 61453 78089
3200G8089k2433j7582Q2579o5146n9151M8186J120o005l041l6329l5611M0897
$$ 78089 55656 38074 120653 55507 -3644 44542 45662 39657 36616 287 -35324 5573
3188E573M2634n023n4026K2387Q432J1359L2415J3277o8282K3244N2548r1392
$$ 5573 48207 43184 -10842 11545 19977 31336 63751 77028 8746 31990 84538 -6854
3176f854m1324O7568M3199m2812J7445N494k4520n304J707o042j3124L6830o3011
$$ -6854 -48178 19390 62589 19777 37222 42716 18196 12892 14599 8557 -4567 32263 -30748
3163c0748P5317j3068o6170K331k0686K0359M6208M0144M4048k3096l4946K3377
$$ -30748 44569 31501 -34669 -32338 -53024 -32665 13543 53687 97735 74639 39693 63070
3151F3070j650l1824r104L0471K0607k281l2308N0981L9629p4785k8799j1932
$$ 63070 61420 29596 20492 50963 71570 69289 36981 87962 127591 52806 24007 12075
3139A2075L9211J1854L2657J5162m7132Q000M6811l5433o2108J6257J4220k827
$$ 12075 51286 63140 95797 110959 63827 71827 118638 83205 21097 37354 51574 48747
3127D8747K8247K5638k0845J2654k8133p2597J0875J7061R157k834L3127K5988
$$ 48747 76994 102632 81787 94441 66308 -6289 4586 21647 30804 27970 61097 87085
3115H7085j1088M512K126K1208m7057J5463J6241r3541N527J2512N1486l8808
$$ 87085 75997 80509 82635 103843 56786 72249 88490 -5051 476 12988 64474 25666
3103B5666n0027L1737p202K5677K3623J5425k5368r72L6104q6379K7426J2351
$$ 25666 -24361 7376 174 25851 49474 64899 39531 38559 74663 -11716 15710 28061
3091B8061j4861K3731j0937J9131M1085m0646o1347j1966M4293M8560m6890j9072
$$ 28061 13200 36931 25994 45125 86210 45564 -15783 -27749 16544 65104 18214 -858
3079h58k1864N9083j2225j5229M4441K383k959L3111n4534l5941K9919o086J3250
$$ -858 -22722 36361 24136 8907 53348 55731 52772 85883 31349 -4592 25327 19241 32491
3066C2491l5604l6631M9896n992n7014O243P8440k0883m315L4058P4260m3998
$$ 32491 -3113 -39744 10152 4160 -52854 -46611 31829 10946 6631 40689 114949 70951
3054G0951j3951o5354j5487M6078k1766k6868M6141n792l7823L6752K0084o548
$$ 70951 57000 -8354 -23841 22237 471 -26397 19744 13952 -23871 12881 32965 26417
3042B6417n655J7973l7635k084K9106L0942o8011N5694j0982l4563J1442j1849
$$ 26417 20762 38735 1100 -984 28122 59064 -8947 46747 35765 1202 12644 795
3030G95j2621M5815j7905r395k926q875K8724k668j501r0225K2276L4577N060
$$ 795 -11826 33989 16084 6689 3763 -5112 23612 20944 19443 -70782 -48506 -13929 -8869
3017h869J8121L9602l2260k3250r552J224n6340j3143L4974m1875K467P5708L1641
$$ -8869 9252 48854 16594 -6656 -16208 -14984 -71324 -84467 -49493 -91368 -88901 -13193 18448
3004A8448k3813J899k4134L5675K0348J2934l3110o1571j2587J250L9274j3456
$$ 18448 -5365 -3466 -27600 8075 28423 41357 8247 -53324 -65911 -64661 -25387 -38843
2992c8843K591O427k2964J580Q723N6674k1982J2446Q33n2481J1587M2338l7950
$$ -38843 -36252 -29825 -52789 -51209 -42486 14188 -7794 4652 5485 -46996 -35409 6929 -31021
2979c1021K4291m0291k2142K6133K4797N5288l241Q605k500n3797m7413L9930
$$ -31021 -6730 -47021 -69163 -43030 -18233 37055 33814 42419 39919 -13878 -61291 -21361
2967b1361J8938J2964N8834j05169K2943M0869L8800n6785j1276M2750l3952j1133
$$ -21361 -2423 10541 69375 -35794 -12851 28018 66818 10033 -1243 41507 7555 -3578
2955c578N5665l2476m8189J3630j1874q191p870K800J040K3763n4896L1741M9172
$$ -3578 52087 19611 -28578 -14948 -26822 -35013 -42883 -40083 -39043 -15280 -70176 -38435 10737
2942A0737J5575m9032l9395k4643P7514k8875J4941L6607r905k0611m4612J2612
$$ 10737 26312 -22720 -62115 -86758 -9244 -38119 -23178 13429 3524 -17087 -61699 -49087
2930d9087L6705j7132j1109M7125j727J3812K5835l5074k4601l7768K355M8361
$$ -49087 -12382 -29514 -40623 6502 4775 18587 44422 9348 -15253 -53021 -50666 -2305
2918b305J3964j2446k5079k219J3460M2390m1596l1091J2188k727K5866j0584
$$ -2305 11659 -787 -25866 -28085 -14625 27765 -13831 -44922 -32734 -35461 -9595 -20179
2906b0179J6294J2846k9931o0483O8738Q238k6985K5748M2088j8225m2134K0134
$$ -20179 -3885 8961 -20970 -81453 -12715 -4477 -31462 -5714 36374 18149 -23985 -3851
2894c851L0512k4381m5970q837M5154K3256k245j849K8761o76k1758o3372J0797
$$ -3851 26661 2280 -43690 -52527 -7373 15883 13638 11789 40550 39874 18116 -45256 -34459
2881c4459O2583p402n6573m0770N5769k4877K326o3529L1675P8295m4835J7564
$$ -34459 28124 20722 -35851 -76621 -20852 -45729 -43403 -106932 -75257 3038 -41797 -24233
2869b4233M9748m3345M864N6781j8930J3803j9196N377k9582K5117K9227m9141
$$ -24233 25515 -17830 -12966 43815 24885 38688 19492 24869 -4713 20404 49631 490
2857D90m3721K4650l9705J7263N0865k5989O3377o5392K6982p5289M755O3703
$$ 490 -43231 -18581 -58286 -41023 9842 -16147 47230 -18162 8820 -66469 -61714 1989
2845A989m4761l3931O5076J8003m917k4142j1896K3168L3378j0612J1166p540
$$ 1989 -42772 -76703 -11627 6376 1459 -22683 -34579 -11411 21967 11355 22521 14981
2833A4981Q417k6296M7333N8298j7757k8740l1511J5483L5924N3347n0506n8208
$$ 14981 23398 -2898 44435 102733 84976 56236 24725 40208 76132 129479 78973 20765
2821B0765k9470L5282o2268Q417M9391k2167k7602L719M1515k7350P6213N076
$$ 20765 -8705 26577 -35691 -27274 22117 -50 -27652 -23933 17582 -9768 66445 71521
2809G1521n6797k1990j8618J3561J2677J3491o2379L1870J6701o87k2616O40k9513
$$ 71521 14724 -7266 -25884 -12323 354 13845 -48534 -16664 37 -650 -23266 -22626 -52139
2796e2139m7998M1487L7691M5338R686k6868l685j5556n576k32k3465j0161n534
$$ -52139 -100137 -58650 -20959 24379 34065 7197 3512 -12044 -17620 -17852 -41317 -51478 -57012
2783e7012M0232K6485L801j2604k6134o097n4837k220O4850K7131J8729M5747
$$ -57012 -16780 9705 13506 902 -25232 -31329 -86166 -88386 -23536 3595 22324 68071
2771F8071n9629m479M0286j5056M8171L2505q0287J3798J1119N1647l7825p2132
$$ 68071 8442 3963 44249 29193 77364 109869 29582 43380 54499 106146 68321 -3811
2759c811J9594K5177j9036L8364m6290k4968M1699J01o7664J7242J4197J5364
$$ -3811 15783 40960 21924 60288 13998 -10970 30729 30830 -36834 -19592 -5395 9969
2747I969J4628l0747j9206L2633L4272n696p3277q3115R3038l0367L3074J8556
$$ 9969 24597 -6150 -25356 7277 41549 35853 -37424 -120539 -27501 -57868 -24794 -6238
2735f238o6782j6893M1606J3809k7300P875q558J6351J9282l4984K5400O475J8707
$$ -6238 -73020 -89913 -48307 -34498 -61798 -53923 -62481 -46130 -26848 -61832 -36432 -29957 -11250
2722a1250O6824K979m5476l1967j0329P6211n803k9371j6176L8652p4171J9113
$$ -11250 55574 58553 13077 -18890 -29219 46992 41189 11818 -4358 34294 -39877 -20764
2710b0764O7447l8304r450k4001q93l6270k5150O6893L5082o6964M0343K9517
$$ -20764 46683 8379 -1071 -25072 -25965 -62235 -87385 -20492 14590 -52374 -12031 17486
2698A7486j8611J3636p5049L1204l1150q125m411L132J08251j031o7104Q5674
$$ 17486 -1125 12511 -62538 -31334 -62484 -70609 -75020 -71888 36363 35332 -31772 53902
2686E3902Q830l285l6525M3633n0323N651O010j7432j5533Q385J4585K682L8823
$$ 53902 62732 59447 22922 66555 16232 21883 27893 10461 -5072 3313 17898 20580 59403
2673E9403l4000P767j9660j9359n4912K0113k2734q302M9663L0943K1412N1517
$$ 59403 25403 33170 13510 -5849 -60761 -40648 -63382 -71684 -22021 8922 30334 81851
2661H1851o9457m8312j1565L9836N967m7090j1983J1566j148O3177Q51k3178j8772
$$ 81851 12394 -35918 -47483 -7647 -1680 -48770 -60753 -49187 -50335 12842 13693 -9485 -28257
2648b8257K5177J6151J6298l8502J724k9141j534J9600K3323M1521J9611l3139
$$ -28257 -3080 13071 29369 -9133 -7409 -36550 -38084 -18484 4839 46360 65971 32832
2636C2832n632N821q814j9455k3307j3368j283N0670k5223j7930k9532n3139J2022
$$ 32832 27200 33021 24207 4752 -18555 -31923 -33206 17464 -7759 -25689 -55221 -108360 -96338
2623i6338k0564Q035K9270J6981P4888N874p1928K5815M780L0436m325m3794q0002
$$ -96338 -116902 -108867 -79597 -62616 12272 18146 -53782 -27967 -23187 7249 2924 -40870 -120872
2610a20872L6559l7492J8481O2352K1792J8753q436J3124k1213m911J923j4429
$$ -120872 -84313 -121805 -103324 -40972 -19180 -427 -8863 4261 -16952 -21863 -19940 -34369
2598c4369L3384O393j9584m9718l5226Q0805j170L3555l1293m8829R285L1208
$$ -34369 -985 5408 -14176 -63894 -99120 -18315 -19485 14070 -17223 -66052 -56767 -25559
2586b5559k245K4608m6042L5125K0606K3060n7223N122K6355m9436K6506P0318
$$ -25559 -27804 -3196 -49238 -14113 6493 29553 -27670 -22548 3807 -45629 -19123 51195
2574E1195j9929m3277j0729m6998j8333P4446n827K7944N608j8679k4998K3801
$$ 51195 31266 -12011 -22740 -69738 -88071 -13625 -19452 8492 14100 -4579 -29577 -5776
2562e776K188j135j3734q542j3029K7486K6472m0352P0827N842k7164O272j3367
$$ -5776 -3588 -4723 -18457 -26999 -40028 -12542 13930 -26422 44405 50247 23083 29355 15988
2549A5988O460r788J9327M1071p4756m3077K3994k8570m8863j7993L4682L8754
$$ 15988 22448 12660 31987 73058 -1698 -44775 -20781 -49351 -98214 -116207 -81525 -42771
2537d2771R897j03222O8282R1272j29J36k7874K235o9940O2966M6712n095k5127
$$ -42771 -32874 -136096 -67814 23458 23329 23465 -4409 -2174 -72114 -9148 37564 32469 7342
2524G342l0662J5185M8435o2236Q2158R112k6790M3189r6114k8506O8016J5180
$$ 7342 -23320 -8135 40300 -21936 60222 69334 42544 85733 -10381 -38887 29129 44309
2512D4309J6628n6221q932K3145M749l3939p464L9377k2809O0008L099j19943
$$ 44309 60937 4716 -4216 18929 23678 -10261 -17725 21652 -1157 58851 61950 -57993
2500e7993k3593Q9609K0420k4044l3169K0364M3509l0171o0895L4952L8785n2189
$$ -57993 -81586 8023 28443 4399 -28770 -8406 35103 4932 -55963 -21011 17774 -34415
2488c4415J6312L7052l7379j5005Q0686k0243j67l7032p330l4851R95O6589k6877
$$ -34415 -18103 18949 -18430 -33435 47251 27008 26841 -10191 -17521 -52372 -51377 15212 -11665
2475a1665p0639l0191L2467L7126P8489K8223J662j6427J1103K327K0267q7270
$$ -11665 -82304 -112495 -80028 -42902 35587 63810 65472 49045 60148 62475 82742 -4528
2463d528j8908P8609R064m0883k6248n2295P2602j9038l774J703J4260m602j94
$$ -4528 -23436 55173 64237 23354 -2894 -55189 17413 -1625 -5399 -3696 10564 5962 5768
2450E768K399l6484l2353J5312K9836N2379M8008l0865m0019L4378J5517o3891
$$ 5768 8167 -28317 -60670 -45358 -15522 36857 84865 54000 13981 48359 63876 -15
2438a5M4962j9309L9127k9952k9782K7153k5828J0658K3266k1099l7664L9266
$$ -15 44947 25638 64765 34813 5031 32184 6356 17014 40280 19181 -18483 20783
2426B0783J5183m356L3778p4696J1234L1155K427J92m9610K3144M109J127K3861
$$ 20783 35966 31610 65388 -9308 1926 33081 35508 35700 -13910 9234 13343 14470 38331
2413C8331O424n529l3760l4643K1856N8358l0269M0655K7165k8268k0873l567
$$ 38331 44755 39226 5466 -29177 -7321 51037 20768 61423 88588 60320 39447 35880
2401C5880m8259k3247j7934l5365L9261K1227q187k3570K9682j6102j6996L3791
$$ 35880 -12379 -35626 -53560 -88925 -49664 -28437 -36624 -60194 -30512 -46614 -63610 -29819
2389b9819P451K2740k8712L7724m5713N267O361l8597K4328K4578j029l7175N1454
$$ -29819 -22368 372 -28340 9384 -36329 -31062 -24701 -63298 -38970 -14392 -15421 -52596 -1142
2376a142O1552n8670J957J0052m0714P745O479O379O7478o9428J031k5278l8748
$$ -1142 60410 1740 3697 13749 -26965 -19220 -12741 -6362 61116 -8312 -7281 -32559 -71307
2363g1307N88J5721P2694n7710L4820l448J3476n003M606o1847L1238K2801P49
$$ -71307 -70719 -54998 17696 -40014 -5194 -8642 4834 -169 4437 -57410 -26172 -3371 -2622
2350b622L4412K4881l9962n0114K0302j58L4319K8205o2901n1229O1524L4177
$$ -2622 31790 56671 16709 -33405 -13103 -13261 21058 49263 -13638 -64867 -3343 30834
2338C0834K3896j1498l5126M2127m7645r9443J6392M3268Q382J3807J6415Q360
$$ 30834 54730 43232 8106 50233 2588 -96855 -80463 -37195 -28813 -15006 1409 9769
2326I769L4703j8279o9040K9041K7402Q026L6301N8549m3240q6973O5596m6625
$$ 9769 44472 26193 -42847 -13806 13596 21622 57923 116472 73232 -13741 51855 5230
2314E230k1598M1971n6936j3162J8916J0988n338K0805l6304l7637M9257L7997
$$ 5230 -16368 25603 -31333 -44495 -25579 -14591 -19929 876 -35428 -73065 -23808 14189
2302A4189l1400L7271p771M2656m3535k8960R386j2055k184K0891J6452j0536
$$ 14189 -17211 20060 12289 54945 11410 -17550 -8164 -20219 -22403 -1512 14940 4404
2290D404L3977n825j6860o5595J988n7853L2423o873N4537Q9789r6417L3464k9568
$$ 4404 38381 32556 15696 -49899 -47911 -105764 -73341 -80214 -25677 64112 -32305 1159 -28409
2277b8409J4946L5730K9751k0027p0231K2928Q341L5061k4116j4361K8642l6976
$$ -28409 -13463 22267 52018 31991 -38240 -15312 -6971 28090 3974 -10387 18255 -18721
2265a8721m849Q627J7011m6712P0150j2959n2054L4441k5926L3460J0338R165
$$ -18721 -23570 -14943 2068 -44644 25506 12547 -39507 -5066 -30992 2468 12806 21971
2253B1971l1601k1377o03l4588N769P1763m2765N828K1190j7604M2156P2676m9884
$$ 21971 -9630 -31007 -31610 -66198 -60429 11334 -31431 -25603 -4413 -22017 20139 92815 42931
2240D2931j1231p127m2987L0533Q776J2573N1171n5980l7157N0022n9740M4882
$$ 42931 31700 24573 -18414 12119 20895 33468 84639 28659 -8498 41524 -18216 26666
2228B6666m4942m2636N5194m128j3228o406M7184P5470m4323m9487l4742n429
$$ 26666 -18276 -60912 -5718 -9846 -23074 -29480 17704 93174 48851 -636 -35378 -40807
2216d0807Q448j8687M5064J9832O1878j01950p202j2786j3581r947k4892Q1520
$$ -40807 -32359 -51046 -5982 13850 75728 -26222 -33424 -46210 -59791 -69738 -94630 -13110
2204a3110M3810L4209k3339q0856K3134M3456L3487m9239J9113m6352p040n409
$$ -13110 30700 64909 41570 -39286 -16152 27304 60791 11552 30665 -15687 -22727 -28136
2192b8136K6257O086J4886L5537J113k8958P00p583j2742K0344l8469K0545N6280
$$ -28136 -1879 4207 19093 54630 55743 26785 27485 19902 7160 27504 -10965 9580 65860
2179F5860k0802K0070J6126n5588R02n5927K5585m6632k0411j633J6308J914k2593
$$ 65860 45058 65128 81254 25666 26568 -29359 -3774 -50406 -70817 -72450 -56142 -54228 -76821
2166g6821L9277P1949k0686M7334k5283n2910M4671l7099N4152p2834p3570M0483
$$ -76821 -37544 34405 13719 61053 35770 -17140 27531 -9568 44584 -28250 -101820 -61337
2154f1337N3239R684k7178j1471R863J8525n2594k4103L6755J3166K070j115m129
$$ -61337 -8098 1586 -25592 -37063 -27200 -8675 -61269 -85372 -48617 -35451 -33381 -34496 -38625
2141c8625N7094l246L5057m7972n4044M9093L8604p4263K6128l0950M0580K9806
$$ -38625 18469 15223 50280 2308 -51736 -2643 35961 -38302 -12174 -43124 -2544 27262
2129B7262j1636r8560L2590K9586o386J7807o2532j7568L2371N4632k5111K659
$$ 27262 15626 -82934 -50344 -20758 -27144 -9337 -71869 -89437 -57066 -2434 -27545 -24886
2117b4886n855j9809J3626m182o5123J5808K9830O8935j19p0283K6466N9187O338
$$ -24886 -30741 -50550 -36924 -41106 -106229 -90421 -60591 8344 8225 -62058 -35592 23595 29933
2104B9933j57853M0941N2755L8520m1426l2641L9150K2513L7929k7664m0470J0495
$$ 29933 -127920 -86979 -34224 4296 -37130 -69771 -30621 -8108 29821 2157 -38313 -27818
2092b7818N7252n7135j3624k0651P3505K413l5891j1706O703N8445N1064l0872
$$ -27818 29434 -27701 -41325 -61976 11529 13942 -21949 -33655 -26952 31493 82557 51685
2080E1685o6216k8144L3474N9146K1695m4712q9893K4695N9467p3750l7410Q1046
$$ 51685 -14531 -42675 -9201 49945 71640 26928 -62965 -38270 21197 -52553 -89963 -8917
2068h917R228k7527O2115k610j0864M3259l9936j9653O6513o3386R814L2100j4582
$$ -8917 311 -27216 34899 32289 21425 64684 24748 5095 71608 8222 18036 50136 35554
2055C5554o5500N8612j8034m7527L4506p915m2901Q702N5070R171j248k7224m2472
$$ 35554 -29946 28666 10632 -36895 -2389 -10304 -53205 -44503 10567 19738 18490 -8734 -51206
2042e1206L16M5113M8279J8098n7431m3766j5785N7684N0954j24791K2490Q3335
$$ -51206 -50890 -5777 42502 60600 3169 -40597 -56382 1302 52256 -72535 -50045 33290
2030C3290k1930j6370o5680O5857O6044k1474l0432p5654K5913O7648o3147r190
$$ 33290 11360 -5010 -70690 -4833 61211 39737 9305 -66349 -40436 27212 -35935 -45125
2018d5125l9043n915N5785L4772k0340l0372K7732m613J8301L2653J0427l6083
$$ -45125 -84168 -90083 -34298 474 -19866 -50238 -22506 -27119 -8818 23835 34262 -1821
$$ [...]
##END NTUPLES=NMR SPECTRUM
##END=
