##TITLE=1H_CG-1193-by
 DMSO
 8 sc, 
 12.3.2024
##JCAMPDX= 6.0         $$ Bruker NMR JCAMP-DX V2.0
##DATA TYPE= NMR SPECTRUM
##DATA CLASS= NTUPLES
##ORIGIN= UXNMR, Bruker Analytische Messtechnik GmbH
##OWNER= root
$$ XWIN-NMR		Version 3.5
$$ Tue Mar 12 14:36:24 2024 Russian Standard Time (UT+4h)  she@DPX200
##.OBSERVE FREQUENCY= 200.1313
##.OBSERVE NUCLEUS= ^1H
##.ACQUISITION MODE= SIMULTANEOUS
##.ACQUISITION SCHEME= undefined
##.AVERAGES= 8
##.DIGITISER RES= 18
##SPECTROMETER/DATA SYSTEM= spect
##.PULSE SEQUENCE= zg30
##.SOLVENT NAME= DMSO
##.SHIFT REFERENCE= (INTERNAL, DMSO, 0, 15.4031)
##AUDIT TRAIL= $$ (NUMBER, WHEN, WHO, WHERE, WHAT)
$$ ##TITLE= Audit trail, XWIN-NMR		Version 3.5
$$ ##JCAMPDX= 5.01
$$ ##ORIGIN= Bruker BioSpin GmbH
$$ ##OWNER= she
$$ F:/spectra/data/she/nmr/H-F/1/pdata/1/auditp.txt
$$ ##AUDIT TRAIL=  $$ (NUMBER, WHEN, WHO, WHERE, WHAT)
(   1,<2024-03-12 14:35:02.39 +0400>,<she>,<DPX200>,
      <created by zg, POWCHK disabled, PULCHK disabled
       configuration hash MD5:
       00 E9 B6 7A A2 85 ED C7 34 08 36 98 17 FE 4E 26
       data hash MD5: 16K
       5B 07 05 EF F3 94 97 D7 C4 6C AB CB 8C C5 AB 25>)
(   2,<2024-03-12 14:35:08.17 +0400>,<she>,<DPX200>,
      <Start of raw data processing
       efp BC_mod = 2 LB = 0.24 FT_mod = 6 PKNL = 1 PHC0 = -25309.67 PHC1 = 9.38731 SI = 16K 
       data hash MD5: 16K
       9C 0C 64 F6 3F 47 91 2C D4 2D 2F 5A 55 69 42 F1>)
(   3,<2024-03-12 14:35:26.82 +0400>,<she>,<DPX200>,
      <pk PHC0 = 4.448838 PHC1 = 5.4 
       data hash MD5: 16K
       55 96 5C 58 F4 13 FF 66 D4 24 BB 7D 84 EF 6E 87>)
(   4,<2024-03-12 14:35:29.93 +0400>,<she>,<DPX200>,
      <abs ABSG = 5 
       data hash MD5: 16K
       BA 80 82 AC C7 A8 F6 00 ED 64 5C 87 58 B8 21 5C>)
$$ ##END=
$$ 
$$ hash MD5
$$ 41 D5 36 96 AB 61 56 CF 5C 57 8D 70 33 B1 53 5E
##$RELAX= 
##$RELAX= 
##$RELAX= 
##$RELAX= 
##$RELAX= 
##$RELAX= 
$$ Bruker specific parameters
$$ --------------------------
##$DU= <F:/spectra>
##$EXPNO= 1
##$NAME= <H-F>
##$PROCNO= 1
##$TYPE= <nmr>
##$USER= <she>
##$AMP= (0..31)
100 100 100 100 100 100 100 100 100 100 100 100 100 100 100 100 100 100 
100 100 100 100 100 100 100 100 100 100 100 100 100 100 
##$AQSEQ= 0
##$AQ_mod= 1
##$AUNM= <au_zg>
##$AUTOPOS= <>
##$BF1= 200.13
##$BF2= 200.13
##$BF3= 200.13
##$BF4= 200.13
##$BF5= 200.13
##$BF6= 200.13
##$BF7= 200.13
##$BF8= 200.13
##$BYTORDA= 1
##$CFDGTYP= 0
##$CFRGTYP= 5
##$CHEMSTR= <none>
##$CNST= (0..31)
1 1 145 1 1 1 1 1 1 1 1 1 1 1 1 1 1 1 1 1 1 1 1 1 1 1 1 1 1 1 1 1 
##$CPDPRG= <>
##$CPDPRG1= <>
##$CPDPRG2= <>
##$CPDPRG3= <>
##$CPDPRG4= <mlev>
##$CPDPRG5= <mlev>
##$CPDPRG6= <mlev>
##$CPDPRG7= <mlev>
##$CPDPRG8= <mlev>
##$CPDPRGB= <>
##$CPDPRGT= <>
##$D= (0..31)
0 1.2 0 0 0 0 0 0 0 0.06 0 0.03 0 0 0 0 0.0002 0 0 0 0 0 0 0 0 0 0 0 0 
0 0 0 
##$DATE= 1710239702
##$DBL= (0..7)
120 120 120 120 120 120 120 120 
##$DBP= (0..7)
150 150 150 150 150 150 150 150 
##$DBP07= 0
##$DBPNAM0= <>
##$DBPNAM1= <>
##$DBPNAM2= <>
##$DBPNAM3= <>
##$DBPNAM4= <>
##$DBPNAM5= <>
$$ [...]
##$SUBNAM3= <"">
##$SUBNAM4= <"">
##$SUBNAM5= <"">
##$SUBNAM6= <"">
##$SUBNAM7= <"">
##$SUBNAM8= <"">
##$SUBNAM9= <"">
##$SW= 18.0517328524113
##$SWIBOX= (0..15)
0 0 2 0 0 0 0 0 0 0 0 0 0 0 0 0 
##$SW_h= 3612.71676300578
##$TD= 16384
##$TD0= 1
##$TE= 0
##$TE2= 300
##$TE3= 300
##$TEG= 300
##$TL= (0..7)
0 120 120 120 120 120 120 120 
##$TP= (0..7)
150 150 150 150 150 150 150 150 
##$TP07= 0
##$TPNAME0= <>
##$TPNAME1= <>
##$TPNAME2= <>
##$TPNAME3= <>
##$TPNAME4= <>
##$TPNAME5= <>
##$TPNAME6= <>
##$TPNAME7= <>
##$TPOAL= (0..7)
0.5 0.5 0.5 0.5 0.5 0.5 0.5 0.5 
##$TPOFFS= (0..7)
0 0 0 0 0 0 0 0 
##$TUNHIN= 0
##$TUNHOUT= 0
##$TUNXOUT= 0
##$USERA1= <user>
##$USERA2= <user>
##$USERA3= <user>
##$USERA4= <user>
##$USERA5= <user>
##$V9= 5
##$VALIST= <valist>
##$VCLIST= <CCCCCCCCCCCCCCC>
##$VD= 0
##$VDLIST= <DDDDDDDDDDDDDDD>
##$VPLIST= <PPPPPPPPPPPPPPP>
##$VTLIST= <TTTTTTTTTTTTTTT>
##$WBST= 1024
##$WBSW= 4
##$XGAIN= (0..3)
0 0 0 0 
##$XL= 0
##$YL= 0
##$YMAX_a= 223818
##$YMIN_a= -342144
##$ZGOPTNS= <>
##$ZL1= 120
##$ZL2= 120
##$ZL3= 120
##$ZL4= 120
##$ABSF1= 15.40312
##$ABSF2= -2.648727
##$ABSG= 5
##$ABSL= 3
##$ALPHA= 0
##$AQORDER= 0
##$ASSFAC= 0
##$ASSFACI= 0
##$ASSFACX= 0
##$ASSWID= 0
##$AUNMP= <proc_1d>
##$AZFE= 0.1
##$AZFW= 0.1
##$BCFW= 0
##$BC_mod= 2
##$BYTORDP= 0
##$COROFFS= 0
##$CY= -3
##$DATMOD= 1
##$DC= 0
##$DFILT= <>
##$DTYPP= 0
##$F1P= 0
##$F2P= 0
##$FCOR= 1
##$FTSIZE= 16384
##$FT_mod= 6
##$GAMMA= 0
##$GB= 0
##$INTBC= 1
##$INTSCL= 3.70164e-10
##$ISEN= 128
##$LB= 0.24
##$LEV0= 0
##$LPBIN= 0
##$MAXI= 10000
##$MC2= 0
##$MEAN= 0
##$ME_mod= 0
##$MI= 1.114404
##$NCOEF= 0
##$NC_proc= -5
##$NLEV= 6
##$NOISF1= 3.799351
##$NOISF2= 2.8
##$NSP= 0
##$NTH_PI= 0
##$NZP= 0
##$OFFSET= 15.40312
##$PC= 1
##$PHC0= -25305.22
##$PHC1= 14.78731
##$PH_mod= 1
##$PKNL= yes
##$PPARMOD= 0
##$PSCAL= 0
##$PSIGN= 0
##$REVERSE= no
##$SF= 200.130023730637
##$SI= 16384
##$SIGF1= 3
##$SIGF2= 2
##$SINO= 5.538805
##$SIOLD= 16384
##$SREGLST= <1H.CDCl3>
##$SSB= 0
##$STSI= 16384
##$STSR= 0
##$SW_p= 3612.71676300578
##$SYMM= 0
##$S_DEV= 0
##$TDeff= 16384
##$TDoff= 0
##$TI= <>
##$TILT= no
##$TM1= 0
##$TM2= 0
##$TOPLEV= 0
##$USERP1= <user>
##$USERP2= <user>
##$USERP3= <user>
##$USERP4= <user>
##$USERP5= <user>
##$WDW= 1
##$XDIM= 16384
##$YMAX_p= 327343990
##$YMIN_p= -220236
$$ End of Bruker specific parameters
$$ ---------------------------------
##NTUPLES= NMR SPECTRUM
##VAR_NAME=  FREQUENCY,     SPECTRUM/REAL,   SPECTRUM/IMAG
##SYMBOL=    X,             R,               I
##VAR_TYPE=  INDEPENDENT,   DEPENDENT,       DEPENDENT
##VAR_FORM=  AFFN,          ASDF,            ASDF
##VAR_DIM=   16384,         16384,           16384
##UNITS=     HZ,            ARBITRARY UNITS, ARBITRARY UNITS
##FACTOR=    0.220516191357247, 1,           1
##FIRST=     3082.62677930988, 0,            0
##LAST=      -530.089983695903, 0,           0
##MIN=       -530.089983695903, -220236,     0
##MAX=       3082.62677930988, 327343990,    0
$$ Real data points
##PAGE= N=1
##DATA TABLE= (X++(R..R)), XYDATA
$$ [...]
$$ plain form
11720 12220 -13856 21133 41825 20933 18619 -30527 -61973 -9131 19370 -45972 -65062 -26831
11708 -26831 672 -12104 22802 67823 47426 36960 -4747 3582 28424 196 -5052 40919
11696 40919 78127 12162 -49730 -7563 22527 28386 20773 117705 41395 -46022 -70413 -64213
11684 -64213 -27600 -20181 35992 80456 50214 -1988 21144 13769 -7182 -31975 -15242 8843
11672 8843 17869 10888 17223 -44500 -22289 16031 -2894 -36309 -41917 -68358 -64201 -45952 -11312
11659 -11312 -4806 -42788 -21711 15678 -25852 16816 26927 31911 -4857 -15258 -28171 -2197
11647 -2197 36554 20777 49275 15437 -9020 15514 20734 50863 -474 -16354 13790 19113
11635 19113 -32625 -24718 28186 25899 24991 -10148 20520 16509 -38541 -57862 -52992 1904 32092
$$ packed form
11720A2220k6076L4989K0692k0892k314m9146l1446N2842K8501o5342j9090L8231
11708b6831K7503j2776L4906M5021k0397j0466m1707Q329K4842k8228n248M5971
11696D0919L7208o5965o1892M2167L0090N859p613R6932p6310q7417k4391O200
11684f4213L6613P419N6173M4464l0242n2202K3132p375k0951k4793J6733K4085
11672H843R026o981O335o1723K2211L8320j8925l3415n608k6441M157J8249L4640
11659a1312O506l7982K1077L7389m1530M2668J0111M984l6768j0401j2913K5974
11647b197L8751j5777K8498l3838k4457K4534N220L0129n1337j5880L0144N323
11635A9113n1738P907N2904k287r08l5139L0668m011n5050j9321M870N4896L0188
$$ plain form
11622 32092 18822 3857 13893 51658 3896 78118 39185 -11165 12921 76881 43872 1221
11610 1221 -51554 -40744 -393 20747 64768 66717 -9106 -14745 -23812 -86347 -15584 75721
11598 75721 -1407 -22936 8249 -6255 587 -14350 -28420 19671 28314 46944 72859 33525
11586 33525 24719 11508 -10959 -37374 -75334 24880 27316 -22704 -34128 -30311 -17844 -6827
11574 -6827 31985 -2630 -73248 -11947 44510 -485 43112 -13158 -54270 -23648 -10498 -28517
11562 -28517 -26817 -1998 13664 45856 -1240 21447 2378 -70256 -17395 -30452 -47467 -15783
11550 -15783 13520 -8586 15930 -8457 2304 -50896 -46169 -7609 5349 -21964 -40142 30419
11538 30419 18273 -13073 -25566 -54482 31 19416 28585 5598 -15723 -32905 -45783 -60189
$$ packed form
11622C2092j3270j4965J0036L7765m7762P4222l8933n0350K4086O3960l3009m2651
11610A221n2775J0810M0351K1140M4021J949p5823n639r067o2535P0763R1305
11598G5721p7128k1529L1185j4504O842j4937j4070M8091Q643J8630K5915l9334
11586C3525q806j3211k2467k6415l7960J00214K436n0020j1424L817J2467J1017
11574f827L8812l4615p0618O1301N6457m4995M3597n6270m1112L0622J3150j8019
11562b8517J700K4819J5662L2192m7096K2687j9069p2634N2861j3057j7015L1684
11550a5783K9303k2106K4516k4387J0761n3200M727L8560J2958k7313j8178P0561
11538C0419j2146l1346j2493k8916N4513J9385R169k2987k1321j7182j2878j4406
$$ plain form
11526 -60189 -55610 -15132 -33340 -27926 20061 22852 -10244 -19370 -4080 -17393 -37115 -35764 1418
11513 1418 -12271 -96800 -31532 -26762 -38613 -46307 -23092 -9970 -33617 -24897 -3053 88392
11501 88392 55426 36872 58631 -1991 37437 -7735 13484 5534 -3409 -7175 -32083 -9900
11489 -9900 7965 -20189 -35187 7425 -46753 -56396 -84526 -8061 51879 12182 -24331 -3980
11477 -3980 54308 -6294 -88170 -56411 -6825 79 -38278 -51899 -112444 -98691 -44276 -27323
11465 -27323 -7351 -9029 -55215 -7953 31060 58220 67053 53120 47536 -27050 -8966 -39152
11453 -39152 -57214 -14015 -52496 -22498 16788 -47201 -45757 -29524 -28223 -35022 11150 7017
11441 7017 -70463 -103601 -95684 -77345 -83261 -21159 -18563 -6685 11251 -9303 19251 77738
$$ packed form
11526f0189M579M0478j8208N414M7987K791l3096r126J5290j3313j9722J351L7182
11513A418j3689q4529O5268M770j1851p694K3215J3122k3647Q720K1844R1445
11501H8392l2966j8554K1759o0622L9428m5172K1219p950q943l766k4908K2183
11489i900J7865k8154j4998M2612n4178r643k8130P6465N9940l9697l6513K0351
11477c980N8288o0602q1876L1759M9586O904l8357j3621o0545J3753N4415J6953
11465b7323J9972j678m6186M7262L9013K7160Q833j3933n584p4586J8084l0186
11453c9152j8062M3199l8481K9998L9286o3989J444J6233J301o799M6172m133
11441G017p7480l3138P917J8339n916O2102K596J1878J7936k0554K8554N8487
$$ plain form
11429 77738 64552 12262 -6891 23112 37473 23664 6106 11759 -17412 -6747 27566 353
11417 353 24071 52002 26303 -18446 -14068 -4528 3059 8886 -15610 16216 59969 47426 16643
11404 16643 28469 20377 -61872 -52345 8938 11185 38345 -26129 -21507 30250 9019 -11146
11392 -11146 -57342 -25017 8648 21077 43805 76314 26256 30058 -90652 -38101 30624 54680
11380 54680 43397 45272 5375 -68998 -52350 -42008 -35199 -47355 -20646 22154 -16963 -39515
11368 -39515 -8456 -12470 9559 11742 -18483 15157 -7907 -54969 -15893 -4734 1714 -11909
11356 -11909 -42150 -47005 8926 68210 25628 30932 44317 -20638 -50326 -51180 -9291 43878
11344 43878 39203 57307 -51860 -57522 -58455 -40692 -30140 -3252 -10646 -44507 -35926 -26126 -26124 19993
$$ packed form
11429G7738j3186n2290j9153L0003J4361j3809j7558N653k9171J0665L4313k7213
11417C53K3718K7931k5699m4749M378R540P587N827k4496L1826M3753j2543l0783
11404A6643J1826q092q2249R527O1283K247K7160o4474M622N1757k1231k0165
11392a1146m6196L2325L3665J2429K2728L2509n0058L802j20710N2551O8725K4056
11380E4680j1283J875l9897p4373J6648J0342O809j2156K6709M2800l9117k2552
11368c9515L1059m014K2029K183l0225L3640k3064m7062L9076J1159O448j3623
11356a1909l0241m855N5931N9284m2582N304J3385o4955k9688q54M1889N3169
11344D3878m675J8104j09167n662r33J7763J0552K6888p394l3861Q581R800KM6117
$$ plain form
11330 19993 58997 48230 13079 10797 57044 40442 45212 33715 -7176 -66794 -24394 28851
11318 28851 12799 -10642 -25352 22962 69244 22907 39513 -7623 14399 2589 -7734 -48424
11306 -48424 -92801 -64906 43015 5798 17656 807 -30549 -12179 42852 51830 6469 -13584
11294 -13584 -65699 -18820 -5077 11355 12874 -13065 -34637 -40767 28617 -43507 -65309 -124598
11282 -124598 -132556 -96688 -39 -47192 -44016 -94837 -84231 -86136 -96734 -39402 -29728 -49531
11270 -49531 -81606 -54981 -11364 42880 13944 -11677 2231 -1791 -44776 -36286 -46531 -32567
11258 -32567 4249 -17979 -50942 -395 23513 69411 18185 -9471 7159 34611 -10087 20648
11246 20648 45409 -6019 48049 71309 36870 25642 15671 -13721 -62006 -54473 6069 -10182
$$ packed form
11330A9993L9004j0767l5151k282M6247j6602M770j1497m0891n9618M2400N3245
11318B8851j6052k3441j4710M8314M6282m6337J6606m7136K2022j1810j0323m0690
11306d8424m4377K7895J07921l7217J1858j6849l1356J8370N5031Q978m5361k0053
11294a3584n2115M6879J3743J6432J519k5939k1572o130O9384p2124k1802n9289
11282a24598p958L5868R6649m7153L176n0821J0606j905j0598N7332R674j9803
11270d9531l2075K6625M3617N4244k8936k5621J3908m022m2985Q490j0245J3964
11258c2567L6816k2228l2963N0547K3908M5898n1226k7656J6630K7452m4698L0735
11246B0648K4761n1428N4068K3260l4439j1228r971k9392m8285P533O0542j6251
$$ plain form
11234 -10182 -62755 -27129 -701 -52564 -87845 -36069 -38514 -52735 -30914 -4104 9051 20972
11222 20972 14620 48862 50277 10873 6371 12759 2183 9115 -19024 -58487 -56175 -29297 -5270
11209 -5270 -271 -12732 -18393 -13267 -16557 -62668 -48790 -54750 -36878 -90780 -109875 -76484 -67633
11196 -67633 -54438 -49005 -24927 19779 -55683 -107117 -72728 -56903 -15422 -17988 -12570 61317
11184 61317 47583 45161 61072 21319 -66174 -73491 -40891 -57791 -123731 -74587 -165 -46150
11172 -46150 -54900 -100237 -107823 -44108 -58086 -45415 -37933 -35106 -21232 -23609 3322 -36830 -10685
11159 -10685 38425 19554 38185 12540 -40853 -931 -31736 -37546 -7818 22572 3958 21928
11147 21928 -27035 -83783 -44578 -59525 -49972 -29247 -19655 33387 16605 13468 62068 110416
$$ packed form
11234a0182n2573L5626K6428n1863l5281N1776k445j4221K1821K6810J3155J1921
11222B0972o352L4242J415l9404m502O388j0576O932k8139l9463K312K6878K4027
11209e270M999j2461n661N126l290m6111J3878n960J7872n3902j9095L3391Q851
11196f7633J3195N433K4078M4706p5462n1434L4389J5825M1481k566N418P3887
11184F1317j3734k422J5911l9753q7493p317L2600j6900o5940M9144P4422m5985
11172d6150q750m5337p586O3715j3978J2671P482K827J3874k377K6931m0152K6145
11159a0685M9110j8871J8631k5645n3393L9922l0805n810K9728L0390j8614J7970
11147B1928m8963n6748L9205j4947R553K0725R592N3042j6782l137M8600M8348
$$ plain form
11135 110416 55053 -60428 -36074 -23078 -50799 -46751 -52742 -34837 -51560 -10634 6528 -19312
11123 -19312 -79942 -52126 -48284 -25848 -33784 -55238 -49946 -18273 34503 39215 55865 -5969
11111 -5969 -30269 -63629 -52411 15557 -566 14520 17930 -64062 -70701 -61500 -3182 39552
11099 39552 -62885 -84261 -33591 -13609 24359 35979 -11026 1779 30233 29766 -7503 15167
11087 15167 -9121 -73271 -48471 -80967 -19881 -9552 -36639 -38154 -30413 -27695 9476 20386
11075 20386 -45698 1673 6843 5420 -1806 -41879 11225 -22041 25039 35367 53215 87936
11063 87936 -11537 -9533 7110 -20473 -14628 -36015 -22747 -13983 -29614 7964 -16863 -55128
11051 -55128 -26682 16797 -21121 -17324 22701 8228 -11577 -54145 -77402 -44032 -16385 18521
$$ packed form
11135A10416n5363j15481K4354J2996k7721M048n991J7905j6723M0926J7162k5840
11123a9312o0630K7816L842K2436p936k1454N292L1673N2776M712J6650o1834
11111e969k4300l3360J1218O7968j6123J5086L410q1992o639R201N8318M2734
11099C9552j02437k1376N0670J9982L7968J1620m7005J2805K8454m67l7269K2670
11087A5167k4288o4150K4800l2496O1086J0329k7087j515P741K718L7171J0910
11075B0386o6084M7371N170j423p226m0073N3104l3266M7080J0328J7848L4721
11063H7936r9473K004J6643k7583N845k1387J3268Q764j5631L7578k4827l8265
11051e5128K8446M3479l7918L797M0025j4473j9805m2568k3257L3370K7647L4906
$$ plain form
11039 18521 -49964 -71906 -32592 -66175 -42663 -7898 -26668 -3370 8073 -31630 -64210 -35223
11027 -35223 5001 26426 34540 -1879 -38128 -57092 20755 45745 12413 -19368 127 -30203
11015 -30203 -21363 55517 17753 -25634 -50466 -22969 -20255 10796 -20742 -16207 -11179 7360
11003 7360 -19284 -32415 -64913 -42371 -60777 -48542 16441 -55094 -69459 -6503 66424 26054
10991 26054 67762 93792 86868 128343 110586 41445 24202 -8286 20569 -31046 -16461 60256
10979 60256 24998 26096 -16231 -16918 -9989 -28261 -23429 -1881 -29723 -39859 -15330 1644 51348
10966 51348 -4315 -35734 -51928 -16812 17099 -14181 7376 11169 -22927 23245 -36356 -51750
10954 -51750 -24823 -66094 -33366 -28399 8360 51440 -2083 -72108 -51306 -49672 -20933 -21898
$$ packed form
11039A8521o8485k1942L9314l3583K3512L4765j8770K3298J1443l9703l2580K8987
11027c5223M0224K1425Q114l6419l6249j8964P7847K4990l3332l1781J9495l0330
11015c0203Q840P6880l7764m3387k4832K7497K714L1051l1538M535N028J8539
11003G360k6644j3131l2498K2542j8406J2235O4983p1535j4365O2956P2927m0370
10991B6054M1708K6030o924M1475j7757o9141j7243l2488K8855n1615J4585P6717
10979F0256l5258J098m2327o87O929j8272M832K1548k7842j0136K4529J6974M9704
10966E1348n5663l1419j6194L5116L3911l1280K1557L793l4096M6172n9601j5394
10954e1750K6927m1271L2728M967L6759M3080n3523p0025K0802J634K8739r65
$$ plain form
10942 -21898 -58943 -33491 -11428 -54090 -31163 -20000 -4199 -11570 -15082 20904 43740 53205
10930 53205 -31554 -68001 -49545 -12935 -19142 12923 -11165 -77168 -75146 -1508 73950 30215
10918 30215 24044 22960 29003 43254 39591 12361 -19339 37991 -1878 -21338 -44750 -38825 -44373
10905 -44373 -27381 -3983 19227 -13756 -36991 -8591 -19026 -22485 5395 13026 -29888 -30454
10893 -30454 -41754 -19232 262 15188 -61186 -63756 18759 32199 18042 -41291 -52604 -53726
10881 -53726 43322 88344 66583 40881 22071 -36947 -22558 -12705 -16763 -68246 -7799 21489
10869 21489 -72405 -43351 -39048 -25412 -43016 -20092 -315 -585 29500 228 -65405 -29475
10857 -29475 1028 30162 -5298 16632 95604 15730 -11860 38004 -16125 -8393 15547 -2925
$$ packed form
10942b1898l7045K5452K2063m2662K2927J1163J5801p371l512L5986K2836R465
10930E3205q4759l6447J8456L6610o207L2065k4088o6003K022P3638P5458m3735
10918C0215o171j084O043J4251l663k7230l1700N7330l9869j9460k3412N925n548
10905d4373J6992K3398K3210l2983k3235K8400j0435l459K7880P631m2914n66
10893c0454j1300K2522J9494J4926p6374k570Q2515J3440j4157n9333j1313j122
10881e3726R7048M5022k1761k5702j8810n9018J4389R853m058n1483O0447K9288
10869B1489r3894K9054M303J3636j7604K2924J9777k70L0085k9272o5633L5930
10857b9475L0503K9134l5460K1930P8972p9874k7590M9864n4129P732K3940j8472
$$ plain form
10845 -2925 -6873 -27766 273 30651 -40542 31338 10097 -122372 -32958 24946 -18109 33039
10833 33039 54125 -20356 -9693 47732 34030 45223 2330 -49924 -4571 32310 -9791 18379
10821 18379 -16886 20287 -6736 22070 24545 -13389 -17902 -39588 -31660 -86179 -21932 -5798
10809 -5798 -9771 -8257 -16025 -20030 -44340 16751 58014 -18467 -59633 -36611 -16256 12692 -25151
10796 -25151 -12229 -33242 -25777 -39738 103 -72088 -65768 -55653 -69365 41653 -9027 -4408
10784 -4408 51732 -335 831 8705 9460 -25000 -16803 -51690 -82897 -54143 -22490 -4528 -80118
10771 -80118 -11635 -29296 -23802 -13478 -78141 -89639 -38990 -46546 6956 19561 12816 -27819
10759 -27819 3900 -45219 -68985 8011 -19349 -21957 -198 -33948 -10039 -127 -10343 -12699
$$ packed form
10845b925l948k0893K8039L0378p1193P1880k1241j32469Q9414N7904m3055N1148
10833C3039K1086p4481J0663N7425j3702J1193m2893n2254M5353L6881m2101K8170
10821A8379l5265L7173k7023K8806K475l7934m513k1686P928n4519O4247J6134
10809e798l973J514p768m005k4310O1091M1263p6481m1166K3022K0355K8948l7843
10796b5151J2922k1013P465j3961L9841p2191O320J0115j3712J11018n0680M619
10784d408N6140n2067J166P874P55l4460Q197l4887l1207K8754L1653J7962p5590
10771h0118O8483j7661N494J0324o4663j1498N0649p556N3502J2605o745m0635
10759b7819L1719m9119k3766P6996k7360k608K1759l3750K3909R912j0216k356
$$ plain form
10747 -12699 5456 4826 -2048 -17295 2925 15723 -25607 -2224 15872 14061 855 8325 -23537
10734 -23537 -35604 -36226 -47835 -20544 43313 63854 -17831 -67187 -22117 42616 -22185 -8697
10722 -8697 -45011 -51331 -26700 -21632 -83144 -65154 -53664 -41648 -42350 -45184 -9118 451 17810
10709 17810 30946 41005 20902 85138 24943 13048 -11461 -38585 -11322 34117 6427 -63699
10697 -63699 -46300 -20685 24542 -31553 -14712 3736 -16811 12761 16384 -7987 -27511 -3758
10685 -3758 73044 107816 58427 34321 50087 47013 80818 73898 -13685 36710 51160 1854
10673 1854 -16357 57904 79157 24587 29608 18537 8285 19321 17341 35588 6978 -3903
10661 -3903 -1205 13001 14868 19767 -46706 -61788 -23276 -40505 -91218 -63597 -25449 -21926 -68254
$$ packed form
10747a2699J8155o30o874j5247K0220J2798m1330K3383J8096j811j3206P470l1862
10734b3537j2067o22j1609K7291O3857K0541q1685m9356M5070O4733o4801J3488
10722h697l6314o320K4631N068o1512J7990J1490J2016p02k834L6066R569J7359
10709A7810J3136J0059k0103O4236o0195j1895k4509k7124K7263M5439k7690p0126
10697f3699J7399K5615M5227n6095J6841J8448k0547K9572L623k4371j9524K3753
10685c758P6802L4772m9389k4106J5766l074L3805o920q7583N0395J4450m9306
10673A854j8211P4261K1253n4570N021j1071j0252J1036j980J8247k8610j0881
10661c903K698J4206J867M899o6473j5082L8512j7229n0713K7621L8148L523m6328
$$ plain form
10648 -68254 -86034 -51484 -55980 1558 36907 60557 38230 6306 25204 -28471 -71759 -15202
10636 -15202 24897 -29055 -49804 -47573 -100952 -66708 -10441 22815 10794 -25505 -171 -4272
10624 -4272 23702 35998 17212 32574 -31272 -57701 -31150 23744 -255 -28596 21596 33554
10612 33554 34735 -7999 35833 15708 50463 64723 12159 -45159 -66937 -34211 -27616 -19638
10600 -19638 11776 1070 -19340 -86461 -110350 -57062 -53445 -15658 -11844 -18430 -31734 -38747
10588 -38747 -61760 -34827 -25037 7721 -34089 -87002 -66056 -31950 -20819 -15414 -9570 -23841
10576 -23841 8279 48265 18696 -4864 42896 1289 -58321 -36668 10625 -4361 19441 -13146
10564 -13146 -58174 -81956 -70613 36507 -32415 -44128 13 -4213 -8870 3102 -33439 -80783
$$ packed form
10648f8254j7780L4550m496N7538L5349K3650k2327l1924J8898n3675m3288N6557
10636a5202M0099n3952k0749K231n3379L4244N6267L3256j2021l6299K5334m101
10624d272K7974J2296j8786J5362o3846k6429K6551N4894k3999k8341N0192J1958
10612C3554J181m2734M3832k0125L4755J4260n2564n7318k1778L2726O595P978
10600a9638L1414j0706k0410o7121k3889N3288L617L7787L814o586j3304p013
10588c8747k3013K6933R790L2758m1810n2913K0946L4106J1131N405N844j4271
10576b3841L2120L9986k9569k3560M7760m1607n9610K1653M7293j4986K3802l2587
10564a3146m5028k3782J1343J07120o8922j1713M4141m226m657J1972l6541m7344
$$ plain form
10552 -80783 -40275 -41231 -45870 -29209 -9838 -23182 37057 31198 63887 63395 -22694 -27714 -35622
10539 -35622 -34735 -46336 -68863 -19359 -13362 -15593 -22016 -864 28900 -46646 -18921 -38816 -36683
10526 -36683 -1955 2386 -22125 3409 -24318 -78018 -30402 30553 64513 -35808 -31783 63084
10514 63084 43120 3346 37274 25580 41550 68570 80919 64820 11013 28901 51406 31347
10502 31347 -7117 7122 -80665 -76356 -7133 -6235 -43007 -45621 -31910 -2148 -735 -16929 93030
10489 93030 97027 106601 32244 -15944 -12960 7265 -9750 41393 32409 -49007 -48285 -38940 53093
10476 53093 -14100 -41853 -55515 -64980 -71449 -5184 -22356 13185 -26919 -33335 -47599 -24215
10464 -24215 50613 1051 34836 53277 16386 -61546 -33457 893 1053 -24895 37569 -12055
$$ packed form
10552h0783M0508r56m639J6661J9371j3344O0239n859L2689m92q6089n020p908
10539c5622Q87j1601k2527M9504N997k231o423K1152K9764p5546K7725j9895K133
10526c6683L4728M341k4511K5534k7727n3700M7616O0955L3960j00321M025R4867
10514F3084j9964l9774L3928j1694J5970K7020J2349j6099n3807J7888K2505k0059
10502C1347l8464J4239q7787M309O9223Q98l6772k614J3711K9762J413j6194J09959
10489I3030L997R574p4357m8188K984K0225j7015N1143q984q1416P22R345R2033
10476E3093o7193k7753j3662r465o469O6265j7172L5541m0104o416j4264K3384
10464b4215P4828m9562L3785J8441l6891p7932K8089L4350J60k5948O2464m9624
$$ plain form
10452 -12055 -41963 -40888 13281 14512 -29116 -41146 -61987 -53747 -81421 -18526 -41590 -75225
10440 -75225 -80211 -46813 -48986 -44863 -6293 47882 113133 59167 1133 -52091 -90676 -49383
10428 -49383 9922 88394 7758 -27705 28397 -18851 -8426 51998 50903 -23466 -22536 48223
10416 48223 31220 39208 44228 8360 -49768 4716 -23468 -44177 -14936 -50304 -33377 -15120
10404 -15120 3993 -27025 8471 70045 57534 47989 -21449 -61092 -31250 -16893 -19595 -3569
10392 -3569 -18790 19353 56067 -25326 -106037 -77699 -16849 30033 3552 -40415 -16360 -93568
10380 -93568 -41562 -12173 -19088 -48582 -62539 -99880 -15902 15083 -23214 -34103 11499 -23357
10368 -23357 -64383 -26136 -64625 13851 33241 -7899 -2722 35275 57265 -22350 16034 23194
$$ packed form
10452a2055k9908J075N4169J231m3628j2030k0841Q240k7674O2895k3064l3635
10440g5225m986L3398k173M123L8570N4175O5251n3966n8034n3224l8585M1293
10428d9383N9305P8472q0636l5463N6102m7248J0425O0424j095p4369R30P0759
10416D8223j7003P988N020l5868n8128N4484k8184k0709K9241l5368J6927J8257
10404a5120J9113l1018L5496O1574j2511r545o9438l9643K9842J4357k702J6026
10392c569j5221L8143L6714q1393q0711K8338O0850M6882k6481m3967K4055p7208
10380i3568N2006K9389o915k9494j3957l7341Q3978L0985l8297j0889M5602l4856
10368b3357m1026L8247l8489P8476J9390m1140N177L7997K1990p9615L8384P160
$$ plain form
10356 23194 20093 -14746 -33362 -41180 -22937 -29245 -24321 18783 -1248 22797 -11759 33522
10344 33522 21203 -38061 -9456 -29862 -36383 -3647 65152 44149 -3469 -1901 -20662 -49193
10332 -49193 -63386 -94879 -55345 -4441 45542 9961 20685 -21723 -66925 -11732 -10377 23072
10320 23072 2515 46665 33774 -1177 -73131 -49272 -20577 -45029 -38581 42691 91494 31389
10308 31389 -2030 41625 90760 89543 45528 53103 55940 7320 85008 59415 35631 32541
10296 32541 436 -16023 -30075 -25912 -47458 -24462 2791 -12086 -7352 -43249 -54231 10997
10284 10997 64524 69584 41319 22417 -10618 -1600 100069 97376 4278 5025 49439 11429
10272 11429 91886 152821 34868 13299 4178 22721 -3486 34176 20132 12713 -27753 -43171
$$ packed form
10356B3194l101l4839j8616p818J8243o308M924M3104k0031K4045l4556M5281
10344C3522j2319n9264K8605k0406o521L2736O8799k1003m7618J568j8761k8531
10332d9193j4193l1493L9534N0904M9983l5581J0724m2408m5202N5193J355L3449
10320B3072k0557M4150j2891l4951p1954K3859K8695k4452O448Q1272M8803o0105
10308C1389l3419M3655M9135j217m4015P575K837m8620P7688k5593k3784l090
10296C2541l2105j6459j4052M163k1546K2996K7253j4877M734l5897j0982O5228
10284A0997N3527N060k8265j8902l3035R018J01669k693r3098P47M4414l8010
10272A1429Q0457O0935j17953k1569r121J8543k6207L7662j4044p419m0466j5418
$$ plain form
10260 -43171 -34425 -16096 -35467 -35198 -23717 -35434 14407 65554 57347 -22628 -62834 -30302
10248 -30302 -13812 -48520 -56090 24335 -9692 -32876 -25229 -44140 -11272 15230 18745 62508
10236 62508 59465 83145 84789 38501 -3846 -25754 -1390 -10638 -3149 12144 -23362 -52543
10224 -52543 -12847 -780 13699 41903 25476 657 -10328 17899 13043 40808 45050 30993
10212 30993 38511 7589 -18244 90132 79986 -12420 -11003 1609 3979 2270 59695 69743
10200 69743 15882 -24342 -21211 -24523 -6489 20677 11137 35472 69058 57798 77238 28956
10188 28956 36469 47246 -7307 11676 22386 -3660 -20322 7715 72884 12026 22837 57407
10176 57407 50766 21007 -32939 -40000 16519 -8465 14031 -427 -16627 34593 43067 45135
$$ packed form
10260d3171Q746J8329j9371K69J1481j1717M9841N1147q207p9975m0206L2532
10248c0302J6490l4708p570Q0425l4027k3184P647j8911L2868K6502L515M3763
10236F2508l043K3680J644m6288m2347k1908K4364r248P489J5293l5506k9181
10224e2543L9696J2067J4479K8204j6427k4819j0985K8227m856K7765M242j4057
10212C0993P518l0922k5833J08376j0146r2406J417J2612K370j709N7425J0048
10200F9743n3861m0224L131l312J8034K7166r540K4335L3586j1260J9440m8282
10188B8956P513J0777n4553J8983J0710k6046j6662K8037O5169o0858J0811L4570
10176E7407o641k9759n3946p061N6519k4984K2496j4458j6200N1220Q474K068
$$ plain form
10164 45135 80290 86402 69715 8238 14214 30431 48586 66494 47786 61360 46179 39136
10152 39136 25690 46201 81414 18056 53100 5071 21563 104368 119489 46430 6890 -2011
10140 -2011 8593 36883 20444 29408 12482 42673 18526 22426 47435 43285 116508 26263
10128 26263 -9367 12662 -9177 7442 27525 5426 33199 69051 -2479 -19171 -2862 67862
10116 67862 59134 54794 7791 69543 100234 58866 72280 43298 42064 36559 74542 98756
10104 98756 81842 110049 83444 54294 129874 128230 75303 54826 71072 115929 110191 65096
10092 65096 86630 32455 -47675 -15171 19285 72340 140491 151369 131252 61728 24709 20935
10080 20935 29876 41690 16628 5840 24321 85843 171583 142378 157350 107063 -16053 68252
$$ packed form
10164D5135L5155O112j6687o1477N976J6217J8155J7908j8708J3574j5181p043
10152C9136j3446K0511L5213o3358L5044m8029J6492Q2805J5121p3059l9540q901
10140b011J0604K8290j6439Q964j6926L0191k4147L900K5009m150P3223r0245
10128B6263l5630K2029k1839J6619K0083k2099K7773L5852p1530j6692J6309P0724
10116F7862q728m340m7003O1752L0691m1368J3414k8982j234n505L7983K4214
10104I8756j6914K8207k6605k9150P5580j644n2927k0477J6246M4857n738m5095
10092F5096K1534n4175q0130L2504L4456N3055O8151J0878k0117o9524l7019l774
10080B0935Q941J1814k5062j0788J8481O1522Q5740k9205J4972n0287j23116Q4305
$$ plain form
10068 68252 90207 135695 152005 151797 109763 112627 74211 98326 128129 144736 98247 98711 104970
10055 104970 84064 81804 86009 109263 84427 44957 61034 153531 194139 132249 60459 35528
10043 35528 95696 71256 118892 127639 142747 167467 165804 149592 131789 132487 158444 233924
10031 233924 202803 244189 229742 164261 205694 209453 214640 261695 253230 238974 310485 262653
10019 262653 196103 285912 282598 251373 257838 220606 212846 243869 279454 328810 332992 286514
10007 286514 229401 275341 279567 308942 276353 272483 296602 277204 244172 266211 323917 389312
9995 389312 397163 378551 386735 360828 353882 372559 464314 482033 556648 598413 543804 609968
9983 609968 620670 622509 622997 747749 719018 621969 657527 696277 739521 814848 796201 799371
$$ packed form
10068F8252K1955M5488J6310k08m2034K864l8416K4115K9803J6607m6489M64O259
10055A04970k0906k260M205K3254k4836l9470J6077R2497M0608o1890p1790k4931
10043C5528O0168k4440M7636Q747J5108K4720j663j6212j7803O98K5957P5480
10031B33924l1121M1386j4447o5481M1433L759N187M7055q465j4256P1511m7832
10019B62653o6550Q9809l314l1225O465l7232p760L1023L5585M9356M182m6478
10007B86514n7113M5940M226K9375l2589l870K4119j9398l3032K2039N7706O5395
9995C89312P851j8612Q184k5907o946J8677R1755J7719P4615M1765n4609O6164
9983F09968J0702J839M88J24752k8731r7049L5558L8750M3244P5327j8647L170
$$ plain form
9971 799371 829934 795664 829853 920424 941790 901682 906735 924865 1007136 1078687 1090307 1136962
9959 1136962 1178442 1229044 1247686 1250131 1337651 1374928 1385646 1501740 1560167 1603255 1743006
9948 1743006 1816627 1893038 2034007 2233727 2376532 2519189 2665541 2894910 3189240 3497881
9938 3497881 3873151 4317102 4896094 5575747 6193182 6796503 7137791 7168550 7009132 6687699
9928 6687699 6489784 6562730 6698723 6831402 6878895 6670726 6212614 5502623 4740846 4057562
9918 4057562 3412637 3001220 2677781 2318410 2129279 1911800 1732119 1633590 1461625 1353546
9908 1353546 1332280 1290858 1246057 1076286 974730 937411 891033 855893 811467 790430 655256
9897 655256 617048 654102 657181 682937 606404 555522 543263 527270 522265 494152 458672 500256
$$ packed form
9971G99371L0563l4270L4189R0571K1366m0108N053J8130Q2271P1551J1620M6655
9959A136962M1480N0602J8642K445Q7520L7277J0718J16094N8427M3088J39751
9948A743006P3621P6411J40969J99720J42805J42657J46352K29369K94330L08641
9938C497881L75270M43951N78992O79653O17435O03321L41288L0759j59418l21433
9928F687699j97915P2946J35993J32679M7493k08169m58112p09991p61777o83284
9918D057562o44925m11417l23439l59371j89131k17479j79681r8529j71965j08079
9908A353546k1266m1422m4801j69771j01556l7319m6378l5140m4426k1037j35174
9897F55256l8208L7054L079K5756p6533n0882j2259j5993n005k8113l5480M1584
$$ plain form
9885 500256 479093 422913 421034 353111 381932 435893 417704 384873 383751 358974 364804 335066
9873 335066 347838 304465 305066 266016 237750 353514 318876 294839 244873 260607 310305 305194
9861 305194 218490 205536 191576 199896 142015 142927 155877 205042 216794 258360 230998 163214
9849 163214 189216 210189 190270 212923 210262 180534 172120 197279 230313 246346 307038 363428
9837 363428 286641 254177 199941 157012 219357 204569 152024 151603 181818 119462 122435 115774
9825 115774 111656 99021 83743 90522 145699 117251 113823 104946 117077 96365 81868 116789
9813 116789 145529 89866 83426 63087 40842 53594 109547 100525 82282 94648 177180 101659
9801 101659 80952 94195 60749 58310 90687 133086 101063 74345 91369 123222 97429 101268
$$ packed form
9885E00256k1163n6180j879o7923K8821N3961j8189l2831j122k4777N830k9738
9873C35066J2772m3373O01l9050k8266J15764l4638k4037m9966J5734M9698n111
9861C05194q6704j2954j3960Q320n7881R12J2950M9165J1752M1566k7362o7784
9849A63214K6002K0973j9919K2653k661k9728q414K5159L3034J6033O0692N6390
9837C63428p6787l2464n4236m2929O2345j4788n2545m21L0215o2356K973o661
9825A15774m118j2635j5278O779N5177k8448l428q877J2131k0712j4497L4921
9813A16789K8740n5663o440k0339k2245J2752N5953r022j8243J2366Q2532p5521
9801A01659k0707J3243l3446k439L2377M2399l2023k6718J7024L1853k5793L839
$$ plain form
9789 101268 87631 72213 50364 66197 58826 61407 89092 87377 83210 98395 75104 77064 80741
9776 80741 50032 87714 121785 119064 58717 28996 28442 36613 101664 29448 10434 28771 39109
9763 39109 96143 89145 26451 -15613 26830 52773 65667 14880 33590 2020 -5460 -47246
9751 -47246 -10625 62973 94174 74415 110966 53261 28702 102844 136561 83136 106431 162427
9739 162427 76261 -8081 42054 97345 67145 56028 111778 70433 66041 150847 91106 30854
9727 30854 58192 92206 75769 84019 83719 87163 59654 22204 30742 74988 49044 38081 25441
9714 25441 -30763 -14658 25275 12041 53001 14682 55760 60941 -246 10375 77049 7605
9702 7605 70504 35638 11351 67487 112961 99589 122989 90658 69024 115471 174584 126267
$$ packed form
9789A01268j3637j5418k1849J5833p371K581K7685j715m167J5185k3291J960L677
9776H0741l0709L7682L4071k721o0347k9721n54Q171O5051p2216j9014J8337J0338
9763C9109N7034o998o2694m2064M2443K5943J2894n0787J8710l1570p480m1786
9751d7246L6621P3598L1201j9759L6551n7705k4559P4142L3717n3425K3295N5996
9739A62427q6166q4342N0135N5291l0200j1117N5750m1345m392Q4806n9741o0252
9727C0854K7338L4014j6437Q250l00L444k7509l7450Q538M4246k5944j0963j2640
9714B5441n6204J6105L9933j3234M0960l8319M1078N181o1187J0621O6674o9444
9702G605O2899l4866k4287N6136M5474j3372K3400l2331k1634M6447N9113m8317
$$ plain form
9690 126267 91539 117042 121917 106687 125029 51385 3669 -12073 18098 -10278 50137 52041
9678 52041 106895 96999 41789 54651 95218 90142 59719 79197 52205 16489 -2166 -33321
9666 -33321 -73031 45296 102177 63494 19413 9993 72355 92869 72294 114709 101785 103424
9654 103424 55295 39022 56522 83673 139472 100775 34327 33306 68900 92962 48258 73371
9642 73371 14601 9581 11998 15795 40153 84926 63872 75421 63629 33616 72784 61097
9630 61097 -14171 6849 5373 27775 60037 45206 15678 -43583 -26651 7439 -39110 -30504
9618 -30504 -30001 14638 35010 -28091 -42010 -34474 -23293 -5760 3627 18882 -31579 -54259 -40803
9605 -40803 -65539 -70447 -7685 -9996 2427 14580 41916 -7496 24598 -11202 50819 75201
$$ packed form
9690A26267l4728K5503M875j5230J8342p3644m7716j5742L0171k8376O0415J904
9678E2041N4854r896n5210J2862M0567n076l0423J9478k6992l5716j8655l1155
9666c3321l9710J18327N6881l8683m4081r420O2362K0514k0575M2415j2924J639
9654A03424m8129j6273J7500K7151N5799l8697o6448j021L5594K4062m4704K5113
9642G3371n8770n020K417L797K4358M4773k1054J1549j1792l0013L9168j1687
9630F1097p5268K1020j476K2402L2262j4831k9528n9261J6932L4090m6549Q606
9618c0504N03M4639K0372o3101j3919P536J1181J7533R387J5255n0461k2680J3456
9605d0803k4736m908O2762k311J2423J2153K7336m9412L2094l5800O2021K4382
$$ plain form
9593 75201 62734 54902 74828 82409 80549 100390 77328 71538 45205 21085 88136 61308 10205
9580 10205 18143 -5865 25741 12142 29900 25003 6133 23028 49607 123944 160762 62563
9568 62563 84809 46712 58266 51711 22879 52222 83017 61955 78601 87014 43878 69310
9556 69310 73083 81357 91260 119718 126641 135454 124662 114856 96843 93284 152929 117869 114369
9543 114369 67571 69428 126897 65646 55205 92324 61954 35244 85811 71952 115551 106134
9531 106134 58211 105015 130240 178229 117359 139288 167107 173565 235347 249531 207703 221451
9519 221451 196725 121972 98667 147452 144699 176988 140669 142383 137112 112382 106227 86753
9507 86753 79655 35620 30560 106680 69637 85748 92785 60415 130677 114481 47166 85894
$$ packed form
9593G5201j2467p832J9926P581j860J9841k3062n790k6333k4120O7051k6828n1103
9580A0205P938k4008L1606j3599J7758m897j8870J6895K6579P4337L6818r8199
9568F2563K2246l8097J1554o555k8832K9343L0795k1062J6646Q413m3136K5432
9556F9310L773Q274R903K8458O923Q813j0792r806j8013l559N9645l5060l500
9543A14369m6798J857N7469o1251j0441L7119l0370k6710N0567j3859M3599r417
9531A06134m7923M6804K5225M7989o0870K1929K7819O458O1782J4184m1828J3748
9519B21451k4726p4753k3305M8785k753L2289l6319J714n271k4730o155j9474
9507H6753p098m4035n060P6120l7043J6111P037l2370P0262j6196o7315L8728
$$ plain form
9495 85894 66031 41834 19687 25859 51732 82662 -12597 -14891 -18215 -2673 45471 66055
9483 66055 81490 72958 80863 38539 83784 67308 66130 25857 -3453 27080 34937 48652 47128
9470 47128 -14936 38490 53790 91614 110489 83004 97264 18511 -359 69622 7348 1582
9458 1582 -35421 23852 2045 40067 36903 45516 15444 40438 12597 -5175 60179 48415
9446 48415 19864 17177 61413 84495 124640 59946 50913 3698 27178 51645 100778 76535
9434 76535 63083 123152 70726 41139 31482 65485 64273 53988 54565 10047 37387 61358 103544
9421 103544 102000 146555 89448 37514 29826 45310 64675 115306 113038 12725 45190 96496
9409 96496 77315 77909 49528 54194 58409 98267 79143 39437 49854 85557 127487 46347 10094
$$ packed form
9495H5894j9863k4197k2147O172K5873L0930r5259k294l324J5542M8144K0584
9483F6055J5435q532P905m2324M5245j6476j178m0273k9310L0533P857J3715j524
9470D7128o2064N3426J5300L7824J8875k7485J4260p8753j8870O9981o2274n766
9458A582l7003N9273k1807L8022l164Q613l0072K4994k7841j7772O5354j1764
9446D8415k8551k687M4236K3082M0145o4694r033m7215K3480K4467M9133k4243
9434G6535j3452O0069n2426k9587r657L4003j212j0285N77m4518K7340K3971M2186
9421A03544j544M4555n7107n1934p688J5484J9365N0631k268j00313L2465N1306
9409I6496j9181N94k8381M666M215L9858j9124l9706J0417L5703M1930q1140l6253
$$ plain form
9396 10094 17352 -23353 37502 41936 -9037 64556 100523 76355 66635 51889 60149 91028 28399
9383 28399 24226 -2721 -162 42705 75820 108069 117614 137377 101246 46841 13896 6041 56653
9370 56653 53075 80215 87296 60230 58300 83275 99490 75453 49646 106838 116720 48493 116144
9357 116144 132184 93829 155518 126257 94277 112341 94483 148499 153981 102247 117620 58108
9345 58108 79398 67733 67969 65837 101541 95706 47934 65381 85587 127555 100889 136182 131119
9332 131119 120652 131786 88718 118388 110026 195875 145626 104474 177709 146226 110256 141239
9320 141239 148559 55642 60384 -2351 25165 66114 71817 84150 96087 80561 101811 135457
9308 135457 116157 110912 126817 165058 122102 120690 127157 137792 115025 71779 118341 154701
$$ packed form
9396A0094P258m0705O0855M434n0973P3593L5967k4168r720j4746Q260L0879o2629
9383B8399m173k6947K559M2867L3115L2249R545J9763l6131n4405l2945p855N0612
9370E6653l578K7140P081k7066j930K4975J6215k4037k5807N7192R882o8227O7651
9357A16144J6040l8355O1689k9261l1980J8064j7858N4016N482n1734J5373n9512
9345E8108K1290j1665K36k132L5704n835m7772J7447K0206M1968k6666L5293n063
9332A31119j0467J1134m3068K9670q362Q5849n0249m1152P3235l1483l5970L0983
9320A41239P320r2917M742o2735K7516M0949N703J2333J1937j5526K1250L3646
9308A35457j9300n245J5905L8241m2956j412O467J0635k2767m3246M6562L6360
$$ plain form
9296 154701 125957 105021 50534 116282 187742 225786 206816 164386 120107 141770 129515 134024
9284 134024 199476 143155 104741 126251 146549 103947 108824 155277 123307 88202 122985 127819
9272 127819 154937 97176 18088 31478 97491 118052 165448 92932 94160 136485 146680 119186
9260 119186 143945 192268 120974 90353 110269 125810 143393 122603 128310 109457 161738 141834
9248 141834 143557 160138 154927 173920 144876 123931 162810 102284 79480 105052 114570 97707
9236 97707 124842 223627 247046 217092 192139 190991 262202 256590 256099 283858 229173 233086 240291
9223 240291 193435 225049 275528 240657 241113 293062 292734 261158 308499 341540 302700 314098
9211 314098 301918 307800 349795 277427 288717 280800 235164 272019 342534 366788 354535 302720
$$ packed form
9296A54701k8744k0936n4487O5748P1460L8044j8970m2430m4279K1663j2255M509
9284A34024O5452n6321l8414K1510K0298m2602M877M6453l1970l5105L4783M834
9272A27819K7118n7761p9088J3390O6013K0561M7396p2516J228M2325J0195k7494
9260A19186K4759M8323p1294l0621J9916J5541J7583k0790N707j8853N2281j9904
9248A41834J723J6581n211J8993k9044k0945L8879o0526k2804K5572R518j6863
9236I7707K7135R8785K3419k9954k4953j148P1211n612m91K7759n4685L913P205
9223B40291m6856L1614N0479l4871M56N1949l28l1576M7341L3041l8840J1398
9211C14098j2180N882M1995p2368J1290p917m5636L6855P0515K4254j2253n1815
$$ plain form
9199 302720 319730 293904 244097 280293 246657 231780 289685 220312 302630 333510 280757 255463
9187 255463 263206 284185 306215 349985 384793 386322 331338 276113 303501 351510 325984 352290
9175 352290 291787 297707 356347 334138 354240 390572 414768 424902 390862 360959 472218 429804
9163 429804 380169 367763 377400 387765 381866 393583 397131 364951 364305 405513 369031 432755 526908
9150 526908 533546 517472 480927 550817 542739 543234 549364 563368 665246 646524 598230 596092 644280
9137 644280 752024 703464 667733 698886 730882 705367 690521 689057 670077 662918 624510 655674
9125 655674 736103 696963 648230 714729 740012 805716 813421 769484 729724 754472 769741 794838
9113 794838 772291 761741 818533 829013 796864 872463 883334 834191 824092 846677 935693 938282
$$ packed form
9199C02720J7010k5826m9807L6196l3636j4877N7905o9373Q2318L0880n2753k5294
9187B55463P743K0979K2030M3770L4808J529n4984n5225K7388M8009k5526K6306
9175C52290o0503N920N8640k2209K0102L6332K4196J0134l4040k9903J11259m2414
9163D29804m9635j2406R637J0365n899J1717L548l2180o46M1208l6482O3724R4153
9150E26908O638j6074l6545O9890q078M95O130J4004J01878j8722m8294k138M8188
9137F44280J07744m8560l5731L1153L1996k5515j4846j464j8980p159l8408L1164
9125F55674Q0429l9140m8733O6499K5283O5704P705m3937l9760K4748J5269K5097
9113G94838k2547j0550N6792J0480l2149P5599J0871m9143j0099K2585Q9016K589
$$ plain form
9101 938282 971014 1052675 1059787 1121454 1203437 1226089 1258567 1218065 1212627 1358220 1403337 1498392
9089 1498392 1588410 1701964 1850627 2054960 2210946 2449776 2736460 2803214 2804070 2702255
9079 2702255 2660215 2593464 2600945 2703947 2806853 2840507 2866220 2834587 2640039 2493837 2316842
9068 2316842 2236813 2167555 2065100 2020236 1974187 1939642 1948241 1990464 2012834 2089550 2129077
9057 2129077 2117080 2194804 2308940 2445271 2503522 2593293 2767232 2902750 3179129 3477087
9047 3477087 3807989 4177201 4584386 5070971 5365141 5587055 5527219 5346852 5179999 5064809
9037 5064809 5089501 5305243 5511716 5562048 5391334 5011301 4510002 3921929 3524261 3221017
9027 3221017 2943321 2770750 2642383 2503800 2364749 2273543 2261872 2234112 2179394 2070736
$$ packed form
9101I38282L2732Q1661P112O1667Q1983K2652L2478m0502n438J45593M5117R5055
9089A498392R0018J13554J48663K04333J55986K38830K86684O6754Q56j01815
9079B702255m2040o6751P481J03002J02906L3654K5713l1633j94548j46202j76995
9068B316842q0029o9258j02455m4864m6049l4545Q599M2223K2370P6716L9527
9057B129077j1997P7724J14136J36331N8251Q9771J73939J35518K76379K97958
9047C477087L30902L69212M07185M86585K94170K21914n9836j80367j66853j15190
9037E064809K4692K15742K06473N0332j70714l80033n01299n88073l97668l03244
9027C221017k77696j72571j28367j38583j39051r1206j1671k7760n4718j08658
$$ plain form
9017 2070736 2083040 2060837 2064954 2023057 2044759 2029509 2044225 2091104 2114564 2126274 2109917 2157738
9005 2157738 2170120 2228749 2282142 2372801 2392986 2491744 2607732 2669836 2802530 2938124 3174848
8994 3174848 3471623 3797113 4175487 4610889 5170153 5780274 6389866 6851309 7091931 7081342
8984 7081342 6697318 6180800 5465343 4761688 4192155 3638556 3242306 2995875 2721034 2494881
8974 2494881 2413214 2300331 2205900 2171031 2057708 1962491 1885670 1814085 1798068 1772540 1736407
8963 1736407 1662975 1686689 1704178 1687932 1741052 1831503 1844804 1859932 1882212 1928993 2043721
8952 2043721 2161779 2377677 2605921 2874155 3066135 3204853 3267980 3225035 2996426 2682225
8942 2682225 2405481 2142693 1897977 1701350 1603719 1423579 1308014 1236322 1152208 1080942
$$ packed form
9017B070736J2304k2203M117m1897K1702j5250J4716M6879K3460J1710j6357M7821
9005B157738J2382N8629N3393R0659K0185R8758J15988O2104J32694J35594K36724
8994C174848K96775L25490L78374M35402N59264O10121O09592M61443K40622j0589
8984G081342l84024n16518p15457p03655n69533n53599l96250k46431k74841k26153
8974B494881q1667j12883r4431l4869j13323r5217p6821p1585j6017k5528l6133
8963A736407p3432K3714J7489j6246N3120R0451J3301J5128K2280M6781J14728
8952B043721J18058K15898K28244K68234J91980J38718O3127m2945k28609l14201
8942B682225k76744k62788k44716j96627r7631j80140j15565p1692q4114p1266
$$ plain form
8932 1080942 1020900 999946 977091 918582 882960 866518 893159 845119 782801 716814 704728
8921 704728 684625 702532 620509 661573 588708 632214 632080 602609 595187 590601 570556 537423
8909 537423 548954 537543 520590 451471 470911 478064 505136 447025 428041 419309 440790 398576
8897 398576 391211 410897 436801 492736 485973 454812 479138 405430 384488 405588 375857 394745
8885 394745 445384 422654 350928 343252 389927 285091 319679 387529 364289 348479 346180 337405
8873 337405 392657 390649 446403 356160 331553 338046 390140 414651 423540 394236 329279 349294
8861 349294 361296 334443 300565 311842 319457 356667 349195 333946 353813 382394 400428 385051
8849 385051 376369 360362 357424 371002 375531 395764 377943 426945 410805 366943 357018 388716
$$ packed form
8932A080942o0042k0954k2855n8509l5622j6442K6641m8040o2318o5987j2086
8921G04728k0103J7907q2023M1064p2865M3506j34k9471p422m586k0045l3133
8909E37423J1531j1411j6953o9119J9440P153K7072n8111j8984q732K1481m2214
8897C98576p365J9686K5904N5935o763l1161K4326p3708k0942K1100k9731J8888
8885C94745N0639k2730p1726p676M6675j04836L4588O7850k3240j5810k299q775
8873C37405N5252k008N5754r0243k4607O493N2094K4511Q889k9304o4957K0015
8861C49294J2002k6853l3878J1277P615L7210p472j5249J9867K8581J8034j5377
8849C85051q682j6007k938J3578M529K0233j7821M9002j6140m3862r925L1698
$$ plain form
8837 388716 412808 389429 366680 344317 333849 394576 418995 496831 421285 338345 338935 384200
8825 384200 432092 382914 340888 325707 334733 381395 427372 408850 371304 375089 344391 362671
8813 362671 405130 346840 353218 410076 388219 358431 389756 398078 390528 334825 311364 350209
8801 350209 334746 345291 377955 432061 365924 339338 389778 477654 480748 423683 370057 409998
8789 409998 475033 530070 521571 441752 443274 448628 443904 425708 439860 442923 473903 434082 428715
8776 428715 509776 498998 494196 406263 421596 462495 486472 503550 447774 442055 418181 399848
8764 399848 423991 422492 460509 465832 423223 412838 412157 435762 434557 474732 473512 451723 488249
8751 488249 457421 544638 571073 502955 493410 509881 575546 661450 613879 619421 624339 605314
$$ packed form
8837C88716K4092k3379k2749k2363j0468O0727K4419P7836p5546q2940N90M5265
8825C84200M7892m9178m2026j5181R026M6662M5977j8522l7546L785l0698J8280
8813C62671M2459n8290O378N6858k1857k9788L1325Q322p550n5703k3461L8845
8801C50209j5463J0545L2664N4106o6137k6586N0440Q7876L094n7065n3626L9941
8789D09998O5035N5037q499p9819J522N354m724j8196J4152L063L0980l9821n367
8776D28715Q1061j0778m802q7933J5333M0899K3977J7078n5776n719k3874j8333
8764C99848K4143j499L8017N323m2609j0385o81K3605j205M0175j220k1789L6526
8751D88249l0828Q7217K6435o8118r545J6471O5665Q5904m7571N542M918j9025
$$ plain form
8739 605314 597702 576363 576383 564770 578285 586634 507826 441050 459754 468287 519999 530625 603733
8726 603733 587267 563572 549102 571280 551093 573436 556418 499398 532229 588765 597590 618652
8714 618652 587238 613450 587653 610770 631226 564993 597007 607312 593402 626532 674098 683777
8702 683777 665418 621004 660461 644653 614956 598218 559593 557606 558294 614305 666072 668180
8690 668180 665432 622747 618174 606437 586091 591523 632101 640259 611563 589945 638883 635990 674558
8677 674558 736571 690873 702392 676284 650861 738579 812621 767822 731622 750425 829923 800806
8665 800806 779462 792065 757144 769586 773911 831504 855336 814676 807955 854503 928918 901498
8653 901498 911096 924662 922751 931822 977657 967181 971030 954694 923899 941144 966478 942899
$$ packed form
8739F05314p612k1339K0j1613J3515Q349p8808o6776J8704Q533N1712J0626P3108
8726F03733j6466k3695j4470K2178k0187K2343j7018n7020L2831N6536Q825K1062
8714F18652l1414K6212k5797K3117K0456o6233L2014J0305j3910L3130M7566R679
8702F83777j8359m4414L9457j5808k9697j6738l8625j987O88N6011N1767K108
8690F68180k748m2685m573j1737k0346N432M0578Q158k8696k1618M8938k893L8568
8677F74558O2013m5698J1519k6108k5423Q7718P4042m4799l6200J8803P9498k9117
8665H00806k1344J2603l4921J2442M325N7593K3832m0660o721M6548P4415k7420
8653I01498R598J3566j911R071M5835j0476L849j6336l0795J7245K5334k3579
$$ plain form
8641 942899 969053 964984 970152 937399 943812 1018495 1033561 1030333 1047922 1053157 1034053 1099619 1117721
8628 1117721 1089171 1104654 1095756 1114744 1126909 1121170 1185690 1208444 1156750 1158773 1180461 1196772
8616 1196772 1264505 1236746 1253446 1277772 1317403 1365033 1363686 1294079 1295614 1289704 1327878 1338237
8604 1338237 1397422 1384186 1354506 1426430 1467563 1477726 1457893 1416171 1472516 1520050 1486974
8593 1486974 1498242 1494656 1539996 1580482 1587897 1589965 1585450 1615116 1626950 1572247 1611223 1645598
8581 1645598 1605233 1685365 1711454 1753780 1776773 1803106 1832232 1865654 1867110 1886292 1820572 1849020
8569 1849020 1915816 1957195 1980351 1978620 2002093 1997903 2015636 2001643 2011750 2018019 2039632 2004313
8557 2004313 2077744 2136913 2154620 2149036 2214302 2284628 2288380 2290579 2292292 2324497 2335947 2390768
$$ packed form
8641I42899K6154m069N168l2753O413P4683J5066l228J7589N235j9104O5566J8102
8628A117721k8550J5483q898J8988J2165n739O4520K2754n1694K023K1688J6311
8616A196772O7733k7759J6700K4326L9631M7630j347o9607J535n910L8174J0359
8604A338237N9185j3236k9680P1924M1133J0163j9833m1722N6345M7534l3076
8593A486974J1268l586M5340M0486P415K068m515K9666J1834n4703L8976L4375
8581A645598m0365Q0132K6089M2326K2993K6333K9126L3422J456J9182o5720K8448
8569A849020O6796M1379K3156j731K3473m190J7733j3993J0107O269K1613l5319
8557B004313P3431N9169J7707n584O5266P0326L752K199J713L2205J1450N4821
$$ plain form
8545 2390768 2424815 2375857 2401873 2445846 2455593 2480289 2530925 2566701 2582483 2608601 2604732 2610870
8533 2610870 2582982 2583567 2659249 2721691 2673460 2667102 2647004 2756600 2805468 2715259 2781285 2845222
8521 2845222 2887901 2863023 2923099 2955615 2951349 2983832 3035348 3097325 3097235 3130668 3182857 3188738
8509 3188738 3258381 3285586 3337551 3321713 3382031 3429553 3461240 3466477 3495561 3543093 3605929 3664228
8497 3664228 3684785 3693797 3745049 3830292 3875336 3971946 3977948 3944678 3995334 4069683 4138365 4195520
8485 4195520 4180650 4240481 4287990 4371207 4446642 4490893 4582546 4644111 4647272 4725461 4793994 4838107
8473 4838107 4918325 5002171 5108574 5187922 5196931 5219290 5321756 5454408 5454884 5538649 5651620
8462 5651620 5734204 5803292 5836580 5884608 5966777 6063626 6149553 6202378 6211674 6271325 6326623 6404048
$$ packed form
8545B390768L4047m8958K6016M3973R747K4696N0636L5776J5782K6118l869O138
8533B610870k7888N85P5682O2442m8231o358k0098J09596M8868r0209O6026O3937
8521B845222M2679k4878O0076L2516m266L2483N1516O1977r0L3433N2189N881
8509C188738O9643K7205N1965j5838O0318M7522L1687N237K9084M7532O2836N8299
8497C664228K0557R012N1252Q5243M5044R6610O002l3270N0656P4349O8682N7155
8485D195520j4870N9831M7509Q3217P5435M4251R1653O1565L161P8189O8533M4113
8473D838107Q0218Q3846J06403P9348R009K2359J02466J32652M76Q3765J12971
8462E651620Q2584O9088L3288M8028Q2169R6849Q5927N2825R296N9651N5298P7425
$$ plain form
8450 6404048 6450264 6559924 6620863 6629197 6658079 6737238 6767301 6870190 7015837 7093724 7231836
8439 7231836 7309021 7394505 7508899 7635530 7724536 7809413 7889523 7964704 8066497 8213342 8302193
8428 8302193 8474220 8672217 8764809 8861776 9013841 9192483 9202053 9381890 9563486 9707250
8418 9707250 9869142 10035968 10216436 10437092 10665370 10756218 10947872 11176894 11348974 11569512
8408 11569512 11816176 12003290 12201717 12418846 12681274 12982226 13202127 13483877 13820306
8399 13820306 14059406 14327766 14595196 14888318 15198440 15467456 15804285 16153663 16524838
8390 16524838 16833105 17143939 17523540 17893654 18224134 18625037 19076718 19472498 19881981
8381 19881981 20249099 20619477 21090183 21564731 21960717 22376549 22837692 23304058 23770391
$$ packed form
8450F404048M6216J09660O0939Q334K8882P9159L0063J02889J45647P7887J38112
8439G231836P7185Q5484J14394J26631Q9006Q4877Q0110P5181J01793J46845Q8851
8428H302193J72027J97997R2592R6967J52065J78642R570J79837J81596J43764
8418I707250J61892J66826J80468K20656K28278R0848J91654K29022J72080K20538
8408A1569512K46664J87114J98427K17129K62428L00952K19901K81750L36429
8399A3820306K39100K68360K67430K93122L10122K69016L36829L49378L71175
8390A6524838L08267L10834L79601L70114L30480M00903M51681L95780M09483
8381A9881981L67118L70378M70706M74548L95986M15832M61143M66366M66333
$$ plain form
8372 23770391 24258934 24696381 25244639 25785526 26355274 26849652 27483119 28092559 28621716
8363 28621716 29192933 29797180 30453473 31058201 31778935 32457214 33210776 33897113 34635897
8354 34635897 35380058 36153106 37055282 37977707 38852671 39778365 40787222 41887131 43046426
8345 43046426 44198062 45330508 46563814 47887949 49355392 50880853 52355396 54004762
8337 54004762 55644405 57363168 59203085 61102207 63029462 65077947 67262018 69463636
8329 69463636 71717392 74072458 76642231 79254690 81974549 84873862 87875173 91095598
8321 91095598 94469315 97987301 101711533 105691451 109896577 114348641 119158452 124384892
8313 124384892 129841224 135680098 141993330 148819750 156090098 163890079 172373267 181458287
$$ packed form
8372B3770391M88543M37447N48258N40887N69748M94378O33467O09440N29157
8363B8621716N71217O04247O56293O04728P20734O78279P53562O86337P38784
8354C4635897P44161P73048R02176R22425Q74964R25694J008857J099909J159295
8345D3046426J151636J132446J233306J324135J467443J525461J474543J649366
8337E4004762J639643J718763J839917J899122J927255K048485K184071K201618
8329F9463636K253756K355066K569773K612459K719859K899313L001311L220425
8321I1095598L373717L517986L724232L979918M205126M452064M809811N226440
8313A24384892N456332N838874O313232O826420P270348P799981Q483188R085020
$$ plain form
8305 181458287 191169961 201540461 212542244 224168790 236392720 249004405 261731917
8298 261731917 274338654 286550247 297940021 308077016 316401777 322560883 326259379
8291 326259379 327343990 325710294 321570012 315259890 307065003 297376606 286500802 274772227
8283 274772227 262499634 250017346 237386000 224951785 212881003 201197398 190027170
8276 190027170 179389479 169388737 160022824 151197406 143025954 135361689 128171941 121565605
8268 121565605 115373265 109566587 104194698 99176354 94463741 90126752 85995419 82182521
8260 82182521 78593758 75216786 72070045 69045100 66229965 63613809 61195141 58894142
8252 58894142 56671790 54495984 52529141 50677266 48879313 47195618 45536200 44054971
$$ packed form
8305A81458287R711674J0370500J1001783J1626546J2223930J2611685J2727512
8298B61731917J2606737J2211593J1389774J0136995Q324761O159106L698496
8291C26259379J084611j633696m140282o310122q194887r688397j0875804j1728575
8283B74772227j2272593j2482288j2631346j2434215j2070782j1683605j1170228
8276A90027170j0637691j0000742r365913q825418q171452p664265p189748o606336
8268A21565605o192340n806678n371889n018344m712613m336989m131333l812898
8260H2182521l588763l376972l146741l024945k815135k616156k418668k300999
8252E8894142k222352k175806j966843j851875j797953j683695j659418j481229
$$ plain form
8244 44054971 42611108 41239633 39931532 38674921 37473785 36380047 35331889 34223710
8236 34223710 33179165 32246276 31322321 30414279 29617599 28818088 28003766 27222956 26488688
8227 26488688 25796795 25141796 24479876 23810213 23173614 22633915 22101029 21512163 20975693
8218 20975693 20494494 20012852 19554646 19077339 18634883 18201306 17734020 17291017 16970360
8209 16970360 16613292 16178525 15897206 15561150 15272748 14931550 14619481 14278214 13921528
8200 13921528 13658269 13424029 13142424 12947971 12700361 12486693 12258260 12267869 12074200 11370836
8190 11370836 11154744 10941042 10749772 10526404 10315114 10145968 9971914 9803180 9650121
8181 9650121 9514679 9368791 9138371 8998627 8871127 8737830 8534069 8422287 8336103 8143966
$$ packed form
8244D4054971j443863j371475j308101j256611j201136j093738j048158j108179
8236C4223710j044545r32889r23955r08042p96680p99511q14322p80810p34268
8227B6488688o91893o54999o61920o69663o36599n39699n32886n88866n36470
8218B0975693m81199m81642m58206m77307m42456m33577m67286m43003l20657
8209A6970360l57068m34767k81319l36056k88402l41198l12069l41267l56686
8200A3921528k63259k34240k81605j94453k47610k13668k28433R609j93669p03364
8190A1370836k16092k13702j91270k23368k11290j69146j74054j68734j53059
8181I650121j35442j45888k30420j39744j27500j33297k03761j11782q6184j92137
$$ plain form
8171 8143966 8028907 7956369 7854296 7730389 7537748 7400980 7302940 7167691 7056949 6951314
8161 6951314 6840358 6754234 6648820 6547167 6558447 6423846 6330623 6212639 6175622 6088541
8151 6088541 5925978 5820141 5764185 5688862 5668718 5560073 5500367 5459850 5313769 5237767 5194995
8140 5194995 5124606 5015616 4886240 4886067 4833667 4732232 4649189 4563145 4448246 4456291 4372635
8129 4372635 4261312 4098493 3962804 3921678 3908085 3822957 3737080 3714378 3701784 3592523 3538173
8118 3538173 3490376 3431870 3392138 3333053 3348277 3327425 3359429 3320907 3340030 3269072 3232044
8107 3232044 3175143 3184192 3167410 3154477 3117694 3076113 3016147 2987583 3016600 3028679 2931406 2888894
8095 2888894 2808578 2829110 2789943 2709794 2719278 2694280 2651837 2609346 2610240 2610199 2650287 2582365 2510100
$$ packed form
8171H143966j15059p2538j02073j23907j92641j36768r8040j35249j10742j05635
8161F951314j10956q6124j05414j01653J1280j34601r3223j17984l7017q7081
8151F088541j62563j05837n5956p5323k0144j08645n9706m0517j46081p6002m2772
8140E194995p0389j08990j29376j73n2400j01435q3043q6044j14899Q045q3656
8129D372635j11323j62819j35689m1126j3593q5128q5877k2702j2594j09261n4350
8118C538173m7797n8506l9732n9085J5224k0852L2004l8522J9123p0958l7028
8107C232044n6901R049j6782j2933l6783m1581n9966k8564K9017J2079r7273m2512
8095B888894q0316K0532l9167q0149R484k4998m2443m2491Q94m1M0088o7922p2265
$$ plain form
8082 2510100 2455521 2464808 2416589 2397655 2340870 2347307 2335209 2283661 2277067 2261013 2224935 2219858
8070 2219858 2220915 2122769 2227489 2225316 2133334 2083021 2007293 1998614 1994178 1971717 1995640 1969120
8058 1969120 2004290 1970179 1906504 1852255 1857234 1835824 1816257 1791197 1778781 1713615 1639835 1655619
8046 1655619 1621208 1611338 1567055 1593671 1571086 1560178 1571253 1622701 1559446 1503998 1479028 1463985
8034 1463985 1389332 1393077 1390785 1368613 1410726 1442950 1452831 1461099 1509101 1440603 1456687 1430374
8022 1430374 1400492 1392167 1357316 1351594 1343774 1349447 1313089 1257034 1230289 1232719 1297887 1290441 1188511
8009 1188511 1218452 1222274 1191321 1225349 1200483 1196798 1190242 1152805 1132497 1109412 1095492 1123198
7997 1123198 1065419 1124081 1122001 1050782 968619 983391 983638 1017291 1048255 1032168 1075461 1008975
$$ packed form
8082B510100n4579R287m8219j8934n6785O437j2098n1548o594j6054l6078n077
8070B219858J057r8146J04720k173r1982n0313p5728q679m436k2461K3923k6520
8058A969120L5170l4111o3675n4249M979k1410j9567k5060j2416o5166p3780J5784
8046A655619l4411r870m4283K6616k2585j0908J1075N1448o3255n5448k4970j5043
8034A463985p4653L745k292k2172M2113L2224R881Q268M8002o8498J6084k6313
8022A430374k9882q325l4851n722p820N673l6358n6055k6745K430O5168p446j01930
8009A188511K9941L822l0953L4028k4866l685o556l7437k0308k3085j3920K7706
7997A123198n7779N8662k080p1219q2163J4772K47L3653L0964j6087M3293o6486
$$ plain form
7985 1008975 982606 930583 938728 929509 934096 968043 916995 903202 892516 877340 900257 874754
7973 874754 901731 939033 959958 895145 929904 889225 828838 889377 831628 842010 865826 848612
7961 848612 854883 814102 816326 830453 829492 799359 778508 760000 716456 761789 723169 682579
7949 682579 724932 686786 721331 742108 816234 834779 811244 720009 682065 747174 730236 734564
7937 734564 704015 749140 706959 661905 663945 681014 698204 666987 653551 658173 681081 623115
7925 623115 600631 563279 580891 535777 598712 648803 606682 559324 567652 592658 635490 615649
7913 615649 644412 611792 574337 636805 606331 568948 645049 631226 576441 558865 619806 602086
7901 602086 614001 623361 617616 541933 536911 615590 572460 556343 516118 481828 511101 571283
$$ packed form
7985A008975k6369n2023Q145r219M587L3947n1048j3793j0686j5176K2917k5503
7973H74754K6977L7302K0925o4813L4759m0679o0387O0539n7749J0382K3816j7214
7961H48612O271m0781K224J4127r61l0133k0851j8508m3544M5333l8620m0590
7949F82579M2353l8146L4545K0777P4126J8545k3535r1235l7944O5109j6938M328
7937G34564l0549M5125m2181m5054K040J7069J7190l1217j3436M622K2908n7966
7925F23115k2484l7352J7612m5114O2935N0091m2121m7358Q328K5006M2832j9841
7913F15649K8763l2620l7455O2468l0474l7383P6101j3823n4785j7576O0941j7720
7901F02086J1915R360n745p5683n022P8679m3130j6117m0225l4290K9273O0182
$$ plain form
7889 571283 565661 634400 546477 493583 464092 484718 476624 425034 409814 423718 427047 444766
7877 444766 429854 484015 430061 449095 416603 376517 333357 325284 405721 402700 380725 384978
7865 384978 362580 410801 314247 280929 265487 230086 264164 261455 262273 325916 307910 348861
7853 348861 393449 375216 328582 299102 286672 297272 368274 357682 319222 274001 251890 280212
7841 280212 399234 340431 289761 277904 313629 313972 327926 435124 422341 344147 319110 280959
7829 280959 244491 246030 236173 291355 328011 280831 260419 282737 288357 269850 300969 319386
7817 319386 342162 332192 283429 244549 225151 282999 295756 289501 292610 270982 295516 291000
7805 291000 270595 297404 186430 162079 186892 216655 234160 212454 240469 271596 227866
$$ packed form
7889E71283n622O8739q7923n2894k9491K0626q094n1590j5220J3904L329J7719
7877D44766j4912N4161n3954J9034l2492m0086m3160q073Q0437l021k1975M253
7865C84978k2398M8221r6554l3318j5442l5401L4078k709Q18O3643j8006M0951
7853C48861M4588j8233m6634k9480j2430J0600P1002j0592l8460m5221k2111K8322
7841B80212J19022n8803n0670j1857L5725L43J3954J07198j2783p8194k5037l8151
7829B80959l6468J539r857N5182L6656m7180k0412K2318N620j8507L1119J8417
7817C19386K2776r970m8763l8880j9398N7848J2757o255L109k1628K4534m516
7805B91000k0405K6809j10974k4351K4813K9763J7505k1706K8015L1127m3730
$$ plain form
7794 227866 227940 281175 230858 265485 257838 271821 305813 303683 287546 258027 223451 287672 223283
7781 223283 171744 225378 250519 243197 269255 268418 212102 196290 165931 232093 197463 167768
7769 167768 212889 176542 150333 202708 203663 224534 284491 232342 228888 209105 246111 238497
7757 238497 221331 159322 154480 163557 191593 207515 192001 157480 135146 136952 200695 167055
7745 167055 94637 45961 104488 160200 204760 242957 253047 234785 160123 203911 124308 85012
7733 85012 110961 160925 192562 151473 183708 223682 180084 190669 160598 138349 124742 136040
7721 136040 127308 101107 124767 113234 140601 178766 190870 161997 193117 166900 73375 164705
7709 164705 198093 181126 102850 113389 171385 186746 226380 186984 155528 117310 126599 204136
$$ packed form
7794B27866P4N3235n0317L4627p647J3983L3992k130j6137k9519l4576O4221o4389
7781B23283n1539N3634K5141p322K6058q37n6316j5812l0359O6162l4630k9695
7769A67768M5121l6347k6209N2375R55K0871N9957n2149l454j9783L7006p614
7757B38497j7166o2009m842R077K8036J5922j5514l4521k2334J806O3743l3640
7745A67055p2418m8676N8527N5712M4560L8197J0090j8262p4662M3788p9603l9296
7733H5012K5949M9964L1637m1089L2235L9974m3598J0585l0071k2249j3607J1298
7721A36040q732k6201K3660j1533K7367L8165J2104k8873L1120k6217r3525R1330
7709A64705L3388j6967p8276J0539N7996J5361L9634l9396l1456l8218R289P7537
$$ plain form
7697 204136 129715 83611 116614 129405 102992 -7561 30778 96972 101238 75031 71151 69376
7685 69376 129061 163200 119986 20129 70621 95981 106769 110054 95032 99123 143024 182008
7673 182008 108133 68835 114513 123543 107683 77061 103478 151164 87322 85623 108848 122689
7661 122689 70805 92228 15154 4275 40118 49884 55163 151495 144470 161523 183382 103416
7649 103416 70910 86804 61916 25648 100089 88199 76998 88451 68898 58793 97876 129277
7637 129277 120599 87439 64911 67895 29716 117176 137749 147015 99562 125069 142889 96883
7625 96883 65362 89861 113759 72808 104602 72618 108761 138569 77639 83903 47670 64000
7613 64000 135542 102612 81628 74310 101841 159343 120069 131094 169209 136328 129082 194449
$$ packed form
7697B04136p4421m6104L3003J2791k6413j10553L8339O6194M266k6207l880j775
7685F9376N9685L4139m3214r9857N0492K5360J0788L285j5022M091M3901L8984
7673A82008p3875l9298M5678R030j5860l0622K6417M7686o3842j699K3225J3841
7661A22689n1884K1423p7074j0879L5843R766N279R6332p025J7053K1859p9966
7649A03416l2506J5894k4888l6268P4441j1890j1201J1453j9553j0105L9083L1401
7637A29277q678l3160k2528K984l8179Q7460K0573R266m7453K5507J7820m6006
7625I6883l1521K4499K3898m0951L1794l1984L6143K9808o0930O264l6233J6330
7613F4000P1542l2930k0984p318K7531N7502l9274J1025L8115l2881p246O5367
$$ plain form
7601 194449 120507 102508 80090 38587 67436 83142 -1841 25611 45466 63928 67701 100888
7589 100888 139278 95738 112852 30149 56281 61754 97322 42683 65878 10823 69938 63517
7577 63517 109822 93946 125333 71156 64454 62641 56270 61566 59318 140426 116057 82348 35684
7564 35684 30223 70314 66340 45709 96480 108682 49961 55919 -1671 -14148 34351 34607 54250
7551 54250 37396 58346 78942 40302 14485 21889 5522 81377 29916 36018 6846 52229
7539 52229 88993 57373 73254 50054 42067 77841 60240 53053 22565 36833 -16407 -5428
7527 -5428 3463 -12119 756 45668 32445 -52585 -26382 22143 6340 23408 27622 17118
7515 17118 41280 81619 97707 53580 34168 -10860 20651 70405 27652 9196 55455 91306
$$ packed form
7601A94449p3942j7999k2418m1503K8849J5706q4983K7452J9855J8462L773L3187
7589A00888L8390m3540J7114q2703K6132N473L5568n4639K3195n5055N9115o421
7577F3517M6305j5876L1387n4177o702j813o371N296k248Q1108k4369l3709m6664
7564C5684n461M0091l974k0631N0771J2202n8721N958n7590j2477M8499K56J9643
7551E4250j6854K0950K0596l8640k5817P404j6367P5855n1461O102k9172M5383
7539E2229L6764l1620J5881k3200p987L5774j7601p187l0488J4268n3240J0979
7527e428Q891j5582J2875M4912j3223q5030K6203M8525j5803J7068M214j0504
7515A7118K4162M0339J6088m4127j9412m5028L1511M9754m2753j8456M6259L5851
$$ plain form
7503 91306 29949 51400 58842 60368 58008 105375 116423 78085 6307 572 42611 32138 61079
7490 61079 32869 53366 80576 76365 18103 -8492 -12147 -55169 -76546 -17726 -24819 -12319
7478 -12319 29589 36926 21136 19187 -25910 -26776 -23902 63231 2875 -23132 -48317 -22705 15967
7465 15967 72215 51562 52498 109326 92494 53879 29203 -22844 -9355 16858 16572 -7855 -26279
7452 -26279 6246 57226 57250 -23067 -28982 -25364 -44118 -12233 -25153 60949 77963 24855 -5259
7439 -5259 22962 8722 26401 42107 -30219 -16542 6414 -5921 2059 23825 34853 -42098
7427 -42098 -80802 -72173 -54335 -33512 -47519 -47882 -131502 -116456 -47486 44185 4786 26250
7415 26250 49016 -12167 -55570 -81857 -103595 -52835 -77804 -93290 -44608 7327 -39246 -40351
$$ packed form
7503I1306o1357K1451P442J526k360M7367J1048l8338p1778n735M2039j0473K8941
7490F1079k8210K0497K7210m211n8262k6595l655m3022k1377N8820p093J2500
7478a2319M1908P337j5790j949m5097q66K874Q7133o0356k6007k5185K5612L8672
7465A5967N6248k0653R36N6828j6832l8615k4676n2047J3489K6213k86k4427j8424
7452b6279L2525N0980K4q0317n915L618j8754L1885j2920Q6102J7014n3108l0114
7439e259K8221j4240J7679J5706p2326J3677K2956j2335P980K1766J1028p6951
7427d2098l8704Q629J7838K0823j4007l63q3620J5046O8970R1671l9399K1464
7415B6250K2766o1183m3403k6287k1738N0760k4969j5486M8682N1935m6573j105
$$ plain form
7403 -40351 -77129 -75143 -83680 5061 26070 22157 -3634 -34332 -72984 -55666 11589 20332 -6079
7390 -6079 -6630 -39146 -32046 -34174 13042 12743 -8677 -51474 -43872 -16444 -15215 11017 31279 -20702
7376 -20702 14098 45915 10468 -13997 -10850 -45238 -14897 -10030 -40992 -29952 -82963 -50720
7364 -50720 -45769 -34801 -43860 -24172 57138 -8028 -29989 -44953 -18884 -6321 -66157 -91881
7352 -91881 -56261 31333 18861 17945 -33167 -21437 53264 56176 -20130 -5878 -18012 -11322 -16828
7339 -16828 24829 3072 -50832 -46062 -26058 -58085 -2546 55322 -12416 -52432 -43973 -45075
7327 -45075 -3255 14425 -59357 -47341 4962 -9030 -31915 -52959 -45636 -142689 -111041 -110498
7315 -110498 -146367 -99780 -75360 -10964 -11215 -12081 59653 36950 -12353 -44746 -24242 -22978 9003
$$ packed form
7403d0351l6778J986q537Q8741K1009l913k5791l0698l8652J7318O7255Q743k6411
7390f079n51l2516P100k128M7216k99k1420m2797P602K7428J229K6232K0262n1981
7376b0702L4800L1817l5447k4465L147l4388L0341M867l0962J1040n3011L2243
7364e0720M951J0968r059J9688Q1310o5166k1961j4964K6069J2563n9836k5724
7352i1881L5620Q7594j2472r16n1112J1730P4701K912p6306J4252j2134O690n506
7339a6828M1657k1757n3904M770K0004l2027N5539N7868o7738m0016Q459j102
7327d5075M1820J7680p3782J2016N2303j3992k2885k1044P323r7053L1648N43
7315a10498l5869M6587K4420O4396k51q66P1734k2703m9303l2393K0504J264L1981
$$ plain form
7302 9003 -63195 -105373 -80914 -54122 -84827 -97026 -33744 -19526 23508 38466 -17756 -62573
7290 -62573 -26930 -14676 -41945 14397 22927 -27611 -69294 -7977 -32923 -83321 -76290 -9657
7278 -9657 15599 44051 22516 -37856 -19718 19433 39692 22658 4087 12263 296 -39320
7266 -39320 -63290 -28164 -51760 -73685 -141895 -90044 -103434 -45035 -51995 -89466 -40001 -38954
7254 -38954 15078 12756 2399 -58168 -18611 258 17595 7744 29059 30200 28307 -26280 1429
7241 1429 7787 47376 32350 49015 69029 9006 27717 53699 46039 78338 61821 33424
7229 33424 5024 -46027 -70630 -96185 -72151 -111480 -68253 -12616 -90514 -75988 -60725 30516
7217 30516 32271 950 -4673 2498 -32295 10266 6960 -15125 3158 -31724 -72793 -51350 -53666
$$ packed form
7302I003p2198m2178K4459K6792l0705j2199O3282J4218M3034J4958n6222m4817
7290f2573L5643J2254k7269N6342Q530n0538m1683O1317k4946n0398P031O6633
7278i657K5256K8452k1535o0372J8138L9151K0259j7034j8571Q176j1967l9616
7266c9320k3970L5126k3596k1925o8210N1851j3390N8399o960l7471M9465J047
7254c8954N4032k322j0357o0567L9557J8869J7337r851K1315J141j893n4587K7709
7241A429O358L9589j5026J6665K0014o0023J8711K5982p660L2299j6517k8397
7229C3424k8400n1051k4603k5555K4034l9329M3227N5637p7898J4526J5263R1241
7217C0516J755l1321n623P171l4793M2561l306k2085J8283l4882m1069K1443k316
$$ plain form
7204 -53666 -30588 -2943 -5317 -64862 -68757 -92749 -99953 -39628 -18821 -21041 -15331 -24043 -19825
7191 -19825 -5718 -13494 -29556 -53830 -49581 -23875 -13663 8867 -1699 22522 8594 -56566
7179 -56566 -58178 -57965 -21361 -19651 14241 -46988 3753 -4419 -19236 36663 82143 68835 -6520
7166 -6520 6152 3728 -58337 -13446 34325 -35356 -54662 -71980 -25214 -57044 -32503 -3996
7154 -3996 -345 17241 1151 -35011 -10761 -22833 -1865 -6656 47499 87841 6523 -58441
7142 -58441 -101603 -129908 -51837 21015 -4039 -7062 12177 19472 -3228 28794 8583 42295
7130 42295 6182 -153546 -45672 -22500 -64102 -34012 -27686 -107822 -62783 7653 -11687 13586
7118 13586 -73470 -59872 -57324 -28801 -1044 43844 -36646 -73952 -105273 -96732 -52800 -16892
$$ packed form
7204e3666K3078K7645k374n9545l895k3992p204O0325K0807k220N710q712M218
7191a9825J4107p776j6062k4274M249K5706J0212K2530j0566K4221j3928o5160
7179e6566j612K13L6604J710L3892o1229N0741q172j4817N5899M5480j3308p5355
7166f520J2672k424o2065M4891M7771o9681j9306j7318M6766l1830K4541K8507
7154c996L651J7586j6090l6162K4250j2072K0968m791N4155M0342q1318o4964
7142e8441m3162k8305P8071P2852k5054l023J9239P295k2700L2022k0211L3712
7130D2295l6113j59728J07874K3172m1602L0090O326q0136M5039P0436j9340K5273
7118A3586q7056J3598K548K8523K7757M4888q0490l7306l1321Q541M3932L5908
$$ plain form
7106 -16892 -19694 -33258 -83991 -31256 -28206 -12489 10658 -15308 -34736 3227 27082 84491
7094 84491 21505 -14821 22905 -16984 -27329 -28368 -69557 -28106 31332 14074 11543 -20993
7082 -20993 -60788 -47693 -128982 -134980 -191371 -220236 -100192 -26149 -44223 -69251 -87119 -64298
7070 -64298 -70200 -73527 -59466 -52253 -29357 -63104 -73880 -77933 -32467 -67230 -84354 -8278 -13799
7057 -13799 -102523 -94099 -92766 -24207 -65146 -46954 -46269 -64579 -14224 -967 -17518 -12618 -2746
7044 -2746 -34100 28599 -16984 -23600 -60223 -71164 -68139 -72257 -37547 -16176 -60445 -68079 -5417
7031 -5417 -33430 -41880 -62513 -73955 -30048 -113386 -33494 33306 -2492 -75950 -75015 -36701 -49435
7018 -49435 -19982 -71680 -20861 -68928 -61074 -74545 -52992 -68590 -28133 -36871 -55489 -64382
$$ packed form
7106a6892k802j3564n0733N2735L050J5717K3147k5966j9428L7963K3855N7409
7094H4491o2986l6326L7726l9889j0345j039m1189M1451N9438j7258k531l2536
7082b0993l9795J3095q1289n998n6391k8865J20044P4043j8074k5028j7868K2821
7070f4298n902l327J4061P213K2896l3747j0776m053M5466l4763j7124P6076n521
7057a3799q8724Q424J333O8559m0939J8192O85j8310N0355J3257j6551M900R872
7044b746l1354O2699m5583o616l6623j0941L025m118L4710K1371m4269p634O2662
7031e417k8013q450k0633j1442M3907q3338P9892O6800l5798p3458R35L8314j2734
7018d9435K9453n1698N0819m8067P854j3471K1553j5598M0457q738j8618q893
$$ plain form
7006 -64382 -80414 -32151 -17568 2669 24007 -32220 -29688 -135951 -63113 -10307 -42877 -66883
6994 -66883 -29295 12143 -6102 -9562 -41511 -47104 -27211 -59303 -26185 -5784 -69228 -77620
6982 -77620 -55628 -44487 -59255 -62741 -35008 5322 -33690 -36674 -57052 -29808 -63617 -33330
6970 -33330 -83631 -62070 -18396 -9907 2911 -72246 -94821 -65989 -76000 -105958 -95035 -81985
6958 -81985 -75181 -71666 -40698 -63725 -72388 -35535 -58642 -58396 -76963 -88384 -45602 -65474 -71231
6945 -71231 -75923 -28727 -63009 -70103 -64809 -42007 -32705 -27212 -43006 -29997 -20521 -7248 -25759
6932 -25759 -67 -33052 -34408 -43764 -128234 -86994 -66521 -9399 37410 56192 46373 3152
6920 3152 -57444 -131575 -74586 -41169 -97205 -85118 -106778 -84859 -58752 -29845 -95167 -122645
$$ packed form
7006f4382j6032M8263J4583K0237K1338n6227K532j06263P2838N2806l2570k4006
6994f6883L7588M1438j8245l460l1949n593J9893l2092L3118K0401o3444q392
6982g7620K1992J1141j4768l486K7733M0330l9012k984k0378K7244l3809L0287
6970c3330n0301K1561M3674Q489J2818p5157k2575K8832j0011k9958J0923J3050
6958h1985O804L515L0968k3027q663L6853k3107K46j8567j1421M2782j9872n757
6945g1231m692M7196l4282p094N294K2802R302N493j5794J3009R476J3273j8511
6932b5759K5692l2985j356r356q4470M1240K0473N7122M6809J8782r819m3221
6920C152o0596p4131N6989L3417n6036J2087k1660K1919K6107K8907o5322k7478
$$ plain form
6908 -122645 -82626 -10199 -18800 -55438 -89258 -89433 -106977 -110824 -84906 -76023 -73953 -59649 -89617
6895 -89617 -6262 19617 -29223 -36464 -4442 -32107 -48058 -57029 -107869 -135638 -56669 -31664
6883 -31664 -55189 -82255 -66884 -17628 703 -98647 -155691 -107737 -82563 -58753 -75431 -698
6871 -698 44753 -22333 -60868 -32544 -50209 -84526 -58284 -69540 -124038 -84399 -100843 -84547
6859 -84547 -17975 -52284 -119466 -164999 -109821 -58613 -141187 -135072 -136771 -118935 -73970 -15918
6847 -15918 -11110 -56232 -32116 -20125 -81243 -76134 -107588 -68288 -7121 -37835 -82943 -72771
6835 -72771 -23473 -15525 -44300 -87286 -6684 -54589 -71827 -63367 -35203 -40437 -24589 -15738 -17278
6822 -17278 -51010 -98618 -101753 -76160 -39782 -61007 -62397 -81182 -74837 -28200 -56694 -38748
$$ packed form
6908a22645M0019P2427q601l6638l3820j75j7544l847K5918Q883K070J4304k9968
6895h9617Q3355K5879m8840p241L2022k7665j5951q971n0840k7769P8969K5005
6883c1664k3525k7066J5371M9256J8331r9350n7044M7954K5174K3810j6678P4733
6871f98M5451o7086l8535K8324j7665l4317K6242j1256n4498L9639j6444J6296
6859h4547O6572l4309o7182m5533N5178N1208q2574O115j699J7836M4965N8052
6847a5918M808m5122K4116J1991o1118N109l1454L9300O1167l0714m5108J0172
6835g2771M9298P948k8775m2986Q0602m7905j7238Q460K8164n234J5848Q851j540
6822a7278l3732m7608l135K5593L6378k1225j390j8785O345M6637k8494J7946
$$ plain form
6810 -38748 -66818 -83256 -64547 -50103 -83941 -69536 -53463 -71539 -78004 -49807 -27304 -67823
6798 -67823 -50942 -49047 -66925 -63327 -43179 -101779 -77639 -101887 -28374 -42456 -42055 -66464 -38305
6785 -38305 -60500 -104436 -101304 -53698 -16510 -61964 -78109 -56557 -32223 -65046 -33466 -21797
6773 -21797 -27161 -35555 -11923 -12177 -56917 -21605 -98418 -124502 -93864 -78958 -97696 -84665 -51987
6760 -51987 -32816 3335 -26372 -105974 -91133 -53972 -79785 -71958 -157 -19348 -119333 -79155
6748 -79155 -15306 -60977 -138078 -104140 -82519 -53024 -56102 -102167 -62273 -6119 -36987 -11821
6736 -11821 -3942 1495 11591 -63700 -36762 -5472 15777 -22157 -64834 -65550 -36721 -25973 -30776
6723 -30776 -68103 -74314 -76832 -38022 -40441 -38351 -22181 -77220 -79518 -58406 -41721 -99036 -78770
$$ packed form
6810c8748k8070j6438J8709J4444l3838J4405J6073j8076o465K8197K2503m0519
6798f7823J6881J895j7878L598K0148n8600K4140k4248P3513j4082M01k4409K8159
6785c8305k2195m3936L132M7606L7188m5454j6145K1552K4334l2823L1580J1669
6773b1797n364q394K3632k54m4740L5312p6813k6084L0638J4906j8738J3031L2678
6760e1987J9171L6151k9707p9602J4841L7161k5813P827P1801j9191r9985M0178
6748g9155O3849m5671p7101L3938K1621K9495l078m6065L9894N6154l0868K5166
6736a1821P879N437J0096p5291K6938L1290K1249l7934m2677p16K8829J0748m803
6723c0776l7327o211k518L8810k419K090J6170n5039k298K1112J6685n7315K0266
$$ plain form
6710 -78770 -55149 8600 -8664 -44201 4710 44042 4244 -3791 16538 42827 26054 67684
6698 67684 -3640 -18937 -58409 -70559 -381 -38749 19012 2568 -24478 -3413 13707 -4148
6686 -4148 -46726 -83478 -60789 -39088 -49148 -42784 -46221 -2664 2080 24514 15008 777 -17213
6673 -17213 -97132 -128177 -111036 -106961 -47283 -32383 -4586 -28579 -45343 -18854 -50072 -5326
6661 -5326 -21577 -11689 -14696 20254 5568 -54621 -148882 -159892 -94508 -37031 -20262 -43325
6649 -43325 -43684 -53206 -55055 -46057 -8831 -17531 58411 25741 -40160 -1898 46850 -2709 -13343
6636 -13343 -36406 -56973 -97711 -152041 -131995 -60539 -58495 -29566 -59065 -72800 -21418 -70441
6624 -70441 -54883 21706 18659 14508 12594 15568 27527 17013 23392 36332 45032 -52489 -73154
$$ packed form
6710g8770K3621O3749j7264l5537M8911L9332l9798q035K0329K6289j6773M1630
6698F7684p1324j5297l9472j2150P0178l8368N7761j6444k7046K1065J7120j7855
6686d148m2578l6752K2689K1701j0060O364l437M3557M744K2434r506j4231j7990
6673a7213p9919l1045J7141M075N9678J4900K7797k3993j6764K6489l1218M4746
6661e326j6251R888l007L4950j4686o0189r4261j1010O5384N7477J6769k3063
6649d3325l59r522j849Q998L7226q700P5942l2670o5901L8262M8748m9559j0634
6636a3343k3063k0567m0738n4330K0046P1456K044K8929k9499j3735N1382m9023
6624g0441J5558P6589l047m151j914K974J1959j0514O379J2940Q700r7521k0665
$$ plain form
6611 -73154 -95220 -26784 5892 -24397 5403 -26413 -62602 -24943 5935 52091 14336 6014
6599 6014 37572 -20358 -33106 -60797 -50133 -18669 -14344 -8189 -20891 22501 -25194 -20022 -46736
6586 -46736 -46996 -15755 1903 -17835 -72978 -46671 -36278 -80015 -33107 -37241 6088 18287
6574 18287 21488 20331 -5828 -9409 24414 74868 25348 -25348 -39230 -17534 -39040 -31035 -46400
6561 -46400 -5433 26183 -33244 34558 55505 30496 79603 111318 69917 1123 11850 -29988
6549 -29988 -22400 -14212 -40146 -65014 -21624 -5118 -3422 -7358 -16810 -60379 -27139 -49112 -99911
6536 -99911 -32707 15059 21647 -17554 -22594 -57687 -10284 79348 30315 -18567 16694 19538
6524 19538 19534 57780 -756 33085 57741 47220 -13440 -8575 32080 -32917 -38007 -24179 -16389
$$ packed form
6611g3154k2066O8436L2676l0289K9800l1816l6189L7659L0878M6156l7755q322
6599F014L1558n7930j2748k7691J0664L1464M325O155j2702M3392m7695N172k6714
6586d6736k60L1241J7658j9738n5143K6307J0393m3737M6908m134M3329J2199
6574A8287L201j157k6159l581L3823N0454m9520n0696j3882K1696k1506Q005j5365
6561d6400M0967L1616n9427O7802K0947k5009M9107L1715m1401o8794J0727m1838
6549b9988P588Q188k5934k4868M3390J6506J696l936r452m3569L3240k1973n0799
6536i9911O7204M7766O588l9201n040l5093M7403Q9632m9033m8882L5261K844
6524A9538mL8246n8536L3841K4656j0521o0660M865M0655o4997n090J3828P790
$$ plain form
6511 -16389 22991 -23965 -4441 10628 -39917 -71946 -53385 -54497 -52632 -71722 -52891 -37067
6499 -37067 -75953 -15806 -9622 64471 9988 -54008 -58943 3873 36408 18020 -6034 67926
6487 67926 107893 132100 69555 34444 17607 -10954 -15927 -12364 -6751 -13775 -50526 -69731 -73579
6474 -73579 -19881 16110 14221 2328 -11562 -3903 19984 17670 -8914 50141 29402 8778
6462 8778 9762 44464 73797 70576 78832 117609 111086 94537 36921 22414 -16643 -1447 8586
6449 8586 35594 23668 35371 105145 60677 46440 111152 105392 106051 67481 80968 84300 87642
6436 87642 74268 144929 108422 45589 71341 74607 19129 46658 102009 36529 96228 125653
6424 125653 55898 79177 87781 83095 122602 107798 95415 161171 179971 154409 114923 67814
$$ packed form
6511a6389L9380m6956J9524J5069n0545l2029J8561j112J865j9090J8831J5824
6499c7067l8886O0147O184P4093n4483o3996m935O2816L2535j8388k4054P3960
6487F7926L9967K4207o2545l5111j6837k8561m973L563N613p024l6751j9205l848
6474g3579N3698L5991j889j1893j3890P659K3887k314k6584N9055k0739k0624
6462H778R84L4702K9333l221Q256L8777o523j6549n7616j4507l9057J5196J0033
6449H586K7008j1926J1703O9774m4468j4237O4712n760O59l8570J3487L332L342
6436H7642j3374P0661l6507o2833K5752L266n5478K7529N5351o5480N9699K9425
6424A25653o9755K3279Q604m686L9507j4804j2383O5756J8800k5562l9486m7109
$$ plain form
6412 67814 152224 136339 101359 109896 197213 192246 148014 137744 174291 145044 116032 175479
6400 175479 131797 128458 161756 96194 105158 122292 153573 196277 299674 276430 230353 220394
6388 220394 196699 225935 282283 282314 208823 201091 199323 249826 276235 216950 233951 275249 252931
6375 252931 219974 282311 326074 275557 267631 227390 201503 259042 303738 331129 332393 279019
6363 279019 301454 359723 402972 444656 452467 432585 395312 365312 329933 396405 441420 429727
6351 429727 434950 496805 478690 472861 464261 444973 492953 569493 625085 632942 666699 649460
6339 649460 675889 670593 725590 718126 753619 784899 734508 791667 861907 950634 1016840 1045255
6327 1045255 1049638 1099709 1175986 1202847 1250367 1326232 1374451 1431498 1555003 1656442 1799132
$$ packed form
6412F7814Q4410j5885l4980Q537Q7317m967m4232j0270L6547k9247k9012N9447
6400A75479m3682l339L3298o5562Q964J7134L1281M2704J03397k3244m6077r959
6388B20394k3695K9236N6348L1p3491p732j768N0503K6409n9285J7001M1298k2318
6375B52931l2957O2337M3763n0517p926m0241k5887N7539M4696K7391J264n3374
6363B79019K2435N8269M3249M1684P811j9882l7273l0000l5379O6472M5015j1693
6351D29727N223O1855j8115n829q600j9288M7980P6540N5592P857L3757j7239
6339F49460K6429n296N4997p464L5493L1280n0391N7159P0240Q8727O6206K8415
6327A045255M383N0071P6277K6861M7520P5865M8219N7047J23505J01439J42690
$$ plain form
6316 1799132 1804668 1923996 2022116 2076009 2170114 2257240 2329593 2308300 2328133 2354600 2383811
6305 2383811 2341299 2399815 2522905 2513157 2543945 2612565 2667222 2718496 2760155 2850003 2967021
6294 2967021 3086588 3150616 3225918 3329541 3417367 3522452 3480719 3484274 3445087 3365720 3289317
6283 3289317 3155344 3047570 2926015 2816245 2755355 2620321 2527165 2497906 2508011 2522331
6273 2522331 2431444 2421136 2355357 2357399 2385121 2380085 2343029 2285307 2254975 2169065 2135582 2008260
6261 2008260 1913604 1834180 1662036 1571173 1432248 1352612 1334197 1293998 1241442 1125056 1037049
6250 1037049 1022513 969844 930940 830250 754136 730238 766760 738003 651851 636378 611469
6239 611469 586667 580291 586729 541597 476403 472941 457272 479591 447146 424329 384108 344028
$$ packed form
6316A799132N536J19328R8120N3893R4105Q7126P2353k1293J9833K6467K9211
6305B383811m2512N8516J23090r748L0788O8620N4657N1274M1659Q9848J17018
6294B967021J19567O4028P5302J03623Q7826J05085m1733L555l9187p9367p6403
6283C289317j33973j07774j21555j09770o0890j35034r3156k9259J0105J4320
6273B522331r0887j0308o5779K042K7722n036l7056n7722l0332q5910l3483j27322
6261B008260r4656p9424j72144r0863j38925p9636j8415m0199n2556j16386q8007
6250A037049j4536n2669l8904j00690p6114k3898L6522k8757q6152j5473k4909
6239F11469k4802o376O438m5132o5194l462j5669K2319l2445k2817m0221m0080
$$ plain form
6227 344028 310959 313122 317070 295257 307509 279692 311297 305572 260613 292491 245135 204528
6215 204528 182669 188390 293803 256367 178731 154963 177398 171260 174469 165174 106665 115450
6203 115450 84920 2664 79046 149710 117400 120239 34787 108778 113464 153766 130800 161283
6191 161283 115119 101600 127206 118628 98299 100179 96366 49692 102809 93206 68273 80930
6179 80930 66672 64522 143907 61310 24308 21844 85354 79944 60339 54377 45340 45321 40903 58489
6165 58489 84854 27579 67653 34176 47137 18804 24956 85455 13144 -6936 50310 90068
6153 90068 52110 18577 58275 57485 53887 94670 82597 42902 -21613 -32298 35494 74087
6141 74087 37048 -7043 37762 -24642 3693 -29401 15661 27142 -6726 16531 48551 -398
$$ packed form
6227C44028l3069K163L948k1813J2252k7817L1605n725m4959L1878m7356m0607
6215B04528k1859N721J05413l7436p7636k3768K2435o138L209r295n8509Q785
6203A15450l0530q2256P6382P0664l2310K839q5452P3991M686M0302k2966L0483
6191A61283m6164j3519K5606q578k0329J880l813m6674N3117r603k4933J2657
6179H0930j4258k150P9385q2597l7002k464O3510n410j9605n962r037j9m418J7586
6165E8489K6365n7275M0074l3477J2961k8333O152O0499p2311k0080N7246L9758
6153I0068l7958l3533L9698p90l598M0783j2073l9695o4515j0685O7792L8593
6141G4087l7039m4091M4805o2404K8335l3094M5062J1481l3868K3257L2020m8949
$$ plain form
6129 -398 -33916 12304 12015 -18542 -54824 -26014 -28603 57996 96975 55004 29827 -16171 -84036
6116 -84036 -52793 -73214 -51699 4794 -23476 -41751 -22643 38771 20197 26235 26036 -8848
6104 -8848 30352 48127 79148 59345 58755 4404 -52494 -21643 -36713 -30687 5636 -14671 26732
6091 26732 -52617 -28759 -13607 -11233 -36034 1964 -16115 1031 -7066 2417 55630 30001
6079 30001 56207 1148 4023 43307 27665 25456 30206 -4303 26516 -14986 -13554 -31047 -3924
6066 -3924 -18684 -20815 -31730 -60251 -97216 -51268 -12410 9549 21888 -2378 -16492 -23788
6054 -23788 -39163 -88694 -67209 -70470 -15905 -6441 -33963 -39601 -23569 -41387 -82902 -116333
6042 -116333 -86516 -62830 -22085 -12894 -51614 -36021 -59064 -30476 -42819 -25753 -27097 -73804
$$ packed form
6129c98l3518M6220k89l0557l6282K8810k589Q6599L8979m1971k5177m5998o7865
6116h4036L1243k0421K1515N6493k8270j8275J9108O1414j8574O038j99l4884
6104h848L9200J7775L1021j9803n90n4351n6898L0851j5070O026L6323k0307M1403
6091B6732p9349K3858J5152K374k4801L7998j8079J7146q097R483N3213k5629
6079C0001K6206n5059K875L9284j5642k209M750l4509L0819m1502J432j7493K7123
6066c924j4760k131j0915k8521l6965M5948L8858K1959J2339k4266j4114p296
6054b3788j5375m9531K1485l261N4565R464k7522n638J6032j7818m1515l3431
6042a16333K9817K3686M0745R191l8720J5593k3043K8588j2343J7066j344m6707
$$ plain form
6030 -73804 -382 49405 -27548 -19711 1511 -25122 -2210 6595 -38629 -59753 -40826 -34440
6018 -34440 -30468 -98939 -73350 -45297 -40355 -62856 -95558 -81645 -86385 -111445 -81824 21055
6006 21055 19387 -47053 -3894 -3822 36240 -20673 -41978 -70280 -90956 -74542 -4312 61791 -265
5993 -265 -47794 -48047 -1455 29141 2531 -16628 -57728 -32364 35881 53980 47373 48128 33802
5980 33802 -12960 -57791 -53756 -23583 2532 -843 24603 48439 27807 46163 63374 117092
5968 117092 145734 97315 64755 43437 13723 -6207 -37148 -7751 6762 63993 79083 48625
5956 48625 71628 93021 31640 29029 -25865 -20456 -21604 11746 25817 -44212 -45074 -37860 -45182
5943 -45182 -100312 -96357 -1332 -26022 -61565 23746 38257 -4426 31405 -48723 -70861 -48111
$$ packed form
6030g3804P3422M9787p6953P837K1222k6633K2912Q805m5224k1124J8927O386
6018c4440L972o8471K5589K8053M942k2501l2702J3913m740k5060K9621J02879
6006B1055j668o6440M3159P2M0062n6913k1305k8302k0676J6414P0230O6103o2056
5993b65m7529k53M6592L0596k6610j9159m1100K5364O8245J8099o607P55j4326
5980C3802m6762m4831M035L0173K6115l375K5446K3836k0632J8356J7211N3718
5968A17092K8642m8419l2560k1318k9714j9930l0941K9397J4513N7231J5090l0458
5956D8625K3003K1393o1381k611n4894N409j148L3350J4071p0029q62P214p322
5943d5182n5130L955R5025k4690l5543Q5311J4511m2683L5831q0128k2138K2750
$$ plain form
5931 -48111 -1332 62165 41642 -26656 -74338 -35271 -20004 951 22877 71701 47242 -30331
5919 -30331 44781 70053 -26160 -22039 8239 -6468 15868 -3156 -9324 18645 -14193 26001
5907 26001 66294 -42881 -69592 -16715 10984 1106 -51079 -76874 -64107 16143 16676 -7509
5895 -7509 -38606 -70603 -46276 -56949 -56790 -75699 -6523 58674 68562 45152 31485 -8180 36207
5882 36207 88009 26866 -30893 -30753 -9314 -40770 -26089 23603 -3933 -33530 -55121 -69552
5870 -69552 -86562 -38324 -32483 -51705 -46218 -541 51030 34238 59164 29268 -17969 -16160
5858 -16160 -1280 -12029 -4013 -45446 -1661 29026 18897 -21324 -48346 -31000 -44310 -50189
5846 -50189 -26512 -33925 -12421 -26475 -16456 -17580 44699 31001 -36079 -48829 -12012 1792
$$ packed form
5931d8111M6779O3497k0523o8298m7682L9067J5267K0955K1926M8824k4459p7573
5919c0331P5112K5272r6213M121L0278j4707K2336j9024o168K7969l2838M0194
5907B6001M0293j09175k6711N2877K7699r878n2185k5795J2767Q0250N33k4185
5895g509l1097l1997K4327j0673J59j8909O9176O5197R888k3410j3667l9665M4387
5882C6207N1802o1143n7759J40K1439l1456J4681M9692k7536k9597k1591j4431
5870f9552j7010M8238N841j9222N487M5677N1571j6792K4926k9896m7237J809
5858a6160J4880j0749Q016m1433M3785L0687j0129m0221k7022J7346j3310n879
5846e0189K3677p413K1504j4054J0019j124O2279j3698o7080j2750L6817J3804
$$ plain form
5834 1792 -37288 -25914 -61444 -76773 -60895 -93720 -115352 -85280 -45778 -2690 1278 -13825
5822 -13825 -32831 -32399 -35369 -75348 -26513 -21753 -85084 -41218 -16036 -63102 -49920 -14366 -10132
5809 -10132 17618 83450 93903 30330 29873 128 -19813 -4653 -2786 -38565 -43982 35921 -26173
5796 -26173 2292 46819 70959 92152 7482 21534 94937 124428 90998 73203 26802 31199
5784 31199 47381 18167 32834 29213 85658 48905 110022 59286 34326 92312 109963 56535
5772 56535 66674 85336 115024 121731 70059 82555 55209 58701 33730 44649 85615 59397
5760 59397 -12359 49828 121048 96017 67708 85506 173536 146659 100277 87252 133812 153546
5748 153546 99357 106237 84167 86637 79224 131355 97458 81168 103220 116266 149653 138284
$$ packed form
5834A792l9080J1374l5530j5329J5878l2825k1632L0072L9502M3088L968j5103
5822a3825j9006M32k970l9979M8835M760o3331M3866K5182m7066J3182L5554M234
5809a0132K7750O5832J0453o3573m57k9745j9941J5160J867l5779n417P9903o2094
5796b6173K8465M4527K4140K1193q4670J4052P3403K9491l3430j7795m6401M397
5784C1199J6182k9214J4667l621N6445l6753O1117n0736k4960N7986J7651n3428
5772E6535J0139J8662K9688O707n1672J2496k7346L492k4971J0919M0966k6218
5760E9397p1756O2187P1220k5031k8309J7798Q8030k6877m6382j3025M6560J9734
5748A53546n4189O880k2070K470p413N2131l3897j6290K2052J3046L3387j1369
$$ plain form
5736 138284 120362 177369 186149 151524 134028 217583 133508 100774 169755 157797 165533 157634
5724 157634 102398 132721 227008 200788 192966 247146 256021 222631 184391 241073 271889 265236
5712 265236 325234 339228 266269 274934 271753 330545 349940 314171 321046 323428 331635 402211 374387
5699 374387 411689 399634 371114 389503 449251 477701 508031 502068 551198 563447 577742 615825
5687 615825 605477 605477 607607 613750 635939 697460 704156 700061 723650 760567 760917 831233 892622 952474
5673 952474 943272 1001972 1048296 1088706 1171613 1237060 1324935 1378871 1386304 1465677 1562587 1689657
5661 1689657 1757475 1826521 1950280 2054364 2124691 2239579 2348414 2417181 2511436 2625869
5651 2625869 2649194 2637441 2678920 2682829 2653487 2698372 2667348 2673937 2686366 2710295 2755351 2824038
$$ packed form
5736A38284j7922N7007Q780l4625j7496Q3555q4075l2734O8981j1958P736p899
5724A57634n5236L0323R4287k6220p822N4180Q875l3390l8240N6682L0816o653
5712B65236N9998J3994p2959Q665l181N8792J9395l5769O875K382Q207P0576k7824
5699C74387L7302j2055k8520J8389N9748K8450L0330n963M9130J2249J4295L8083
5687F15825j0348%K130O143K2189O1521O696m095K3589L6917L50P0316O1389N9852
5673I52474r202N8700M6324M0410Q2907O5447Q7875N3936P433P9373R6910J27070
5661A689657O7818O9046J23759J04084P0327J14888J08835O8767R4255J14433
5651B625869K3325j1753M1479L909k9342M4885l1024O589J2429K3929M5056O8687
$$ plain form
5639 2824038 2985024 3093506 3145559 3241481 3365591 3494430 3567392 3624637 3694917 3768259 3780185
5628 3780185 3730514 3660501 3537119 3389911 3292931 3116012 2939249 2799316 2776617 2702595
5618 2702595 2592766 2505737 2411422 2349893 2379892 2300991 2271849 2293072 2253125 2226258 2157232
5607 2157232 2161922 2059983 2016116 1998279 1858868 1818231 1659853 1509203 1446292 1341803 1307967
5596 1307967 1204697 1139638 1070122 968700 901948 867247 835083 764635 729257 686075 632189
5585 632189 653065 678034 666836 605599 532004 562799 547407 481462 452604 471563 451412 393716
5573 393716 389717 372438 396741 366854 399635 330398 268775 276935 281748 341692 371617 322137
5561 322137 337119 370953 343132 287618 281140 244894 186253 194026 241348 220983 211238 232818
$$ packed form
5639B824038J60986J08482N2053R5922J24110J28839P2962N7245P0280P3342J1926
5628C780185m9671p0013j23382j47208r6980j76919j76763j39933k2699p4022
5618B702595j09829q7029r4315o1529K9999p8901k9142K1223l9947k6867o9026
5607B157232M690j01939m3867j7837j39411m0637j58378j50650o2911j04489l3836
5596A307967j03270o5059o9516j01422o6752l4701l2164p0448l5378m3182n3886
5585F32189K0876K4969j1198o1237p3595L0795j5392o5945k8858J8959k0151n7696
5573C93716l999j7279K4303k9887L2781o9237o1623Q160M813N9944K9925m9480
5561C22137J4982L3834k7821n5514o478l6246n8641P773M7322k0365r745K1580
$$ plain form
5549 232818 231593 189372 153227 168592 115089 185751 171997 153696 111858 114683 171002 182447
5537 182447 137275 131210 162947 188324 211256 193108 128025 74437 66630 91428 115089 92373
5525 92373 106857 168382 230641 186600 150928 162726 120530 54884 71125 23789 53530 39612
5513 39612 34593 88558 127968 112660 71587 57371 37388 23087 31534 10600 16302 11986 34724
5500 34724 56197 79036 14969 6574 9737 5388 49996 37033 74096 56566 70531 104953
5488 104953 34239 63290 59088 37187 35885 59494 68837 91007 93008 72434 110939 145174
5476 145174 102691 69663 26382 60004 99009 32289 -10913 10003 27441 39150 68879 -27782
5464 -27782 -41493 3244 24717 23025 51184 12914 -55488 -45622 24311 49692 25634 14187
$$ packed form
5549B32818j225m2221l6145J5365n3503P0662j3754j8301m1838K825N6319J1445
5537A82447m5172o065L1737K5377K2932j8148o5083n3588p807K4798K3661k2716
5525I2373J4484O1525O2259m4041l5672J1798m2196o5646J6241m7336K9741j3918
5513C9612n019N3965L9410j5308m1073j4216j9983j4301Q447k0934N702m316K2738
5500C4724K1473K2839o4067q395L163m349M4608j2963L7063j7530J3965L4422
5488A04953p0714K9051m202k1901j302K3609R343K2170K001k0574L8505L4235
5476A45174m2483l3028m3281L3622L9005o6720m3202K0916J7438J1709K9729r6661
5464b7782j3711M4737K1473j692K8159l8270o8402R866O9933K5381k4058j1447
$$ plain form
5452 14187 8553 11695 65004 26745 18538 -4086 41917 87679 62998 89955 64237 90428
5440 90428 21881 43969 102352 24734 2677 17176 26754 61407 30651 -38172 -16910 20333
5428 20333 63281 63662 53300 -19546 274 1036 -4245 8230 24621 -20174 55854 88443 66589
5415 66589 15439 14834 43864 104448 84029 20324 48970 108528 2094 -14916 1329 -28030
5403 -28030 -3336 10695 32013 37243 96540 79240 86321 35221 24271 49263 76523 46393
5391 46393 -30346 -27079 36710 60659 70478 40334 73664 47546 77075 78342 77272 94702 150822
5378 150822 52890 47284 84090 126429 172544 122411 45414 -47531 13896 -8704 -12579 38179
5366 38179 84321 72080 124607 130640 84815 39545 33721 112250 122711 102354 33834 22049
$$ packed form
5452A4187n634L142N3309l8259q207k2624M6003M5762k4681K6957k5718K6191
5440I0428o8547K2088N8383p7618k2057J4499R578L4653l0756o8823K1262L7243
5428B0333M2948L81j0362p2846J9820P62n281J2475J6391m4795P6028L2589k1854
5415F6589n1150o05K9030O0584k0419o3705K8646N9558j06434j7010J6245k9359
5403b8030K4694J4031K1318N230N9297j7300P081n1100j0950K4992K7260l0130
5391D6393p6739L267O3789K3949R819l0144L3330k6118K9529J267j070J7430N6120
5378A50822r7932n606L6806M2339M6115n0133p6997r2945O1427k2600l875N0758
5366C8179M6142j2241N2527O033m5825m5270n824P8529J0461k0357o8520j1785
$$ plain form
5354 22049 -18190 -5202 44010 68241 74219 49036 71785 1011 27338 68644 103629 36287
5342 36287 -30925 33038 2594 48215 114864 104547 37362 -11326 -4689 -4177 9618 60643
5330 60643 87335 46889 24653 31461 63693 54527 36373 29940 81516 82142 68123 41222 -11996
5317 -11996 -11159 17192 3129 9730 -10276 -496 -8841 -25611 3713 11201 71829 79763 56285
5304 56285 17877 20960 47160 109509 77806 33423 89266 138515 99076 27730 -17787 -7237
5292 -7237 -35601 -5321 17106 42910 22095 46243 18192 17128 -698 43909 49158 34958
5280 34958 25511 7865 63591 89147 106719 19855 -24346 15699 60634 47673 22980 4325
5268 4325 17701 980 41366 75767 23180 26264 54034 57379 21058 79280 155231 79088
$$ packed form
5354B2049m0239J2988M9212K4231N978k5183K2749p0774K6327M1306L4985o7342
5342C6287o7212O3963l0444M5621O6649j0317o7185m8688O637N12J3795N1025
5330F0643K6692m0446k2236O808L2232r166j8154o433N1576O26j4019k6901n3218
5317a1996Q37K8351j4063O601k0006R780q345j6770K9324P488O0628P934k3478
5304E6285l8408L083K6200O2349l1703m4383N5843M9249l9439p1346m5517J0550
5292g237k8364L0280K2427K5804k0815K4148k8051j064j7826M4607N249j4200
5280C4958r447j7646N5726K5556J7572q6864m4201M0045M4935j2961k4693j8655
5268D325J3376j6721M0386L4401n2587L084K7770L345l6321N8222P5951p6143
$$ plain form
5256 79088 97610 73347 41019 104406 71215 40353 93983 64977 95635 87979 62648 35038
5244 35038 39041 8041 10069 12336 84572 90240 77858 96918 113635 112283 53170 108076 44044
5231 44044 62434 127894 83194 75779 105931 103073 147738 119975 95193 109037 121655 138161
5219 138161 81024 105827 127317 116649 94593 133358 173478 145179 71604 45169 48139 25582
5207 25582 10063 23638 84973 53997 29302 17474 13444 63785 117231 66839 66693 40460
5195 40460 40664 69460 84606 122271 65428 58311 100707 64943 55169 -16788 24900 34472 39567
5182 39567 67453 21578 -1767 -31022 -43261 -13282 23642 -3427 45529 17202 29684 55904
5170 55904 76532 60091 10843 -2841 44495 10699 19916 14242 2065 34250 3615 14919
$$ packed form
5256G9088J8522k4263l2328O3387l3191l0862N3630k9006L0658p656k5331k7610
5244C5038M003l1000K028K267P2236N668j2382J9060J6717j352n9113N4906o4032
5231D4044J8390O5460m4700p415L0152k858M4665k7763k4782J3844J2618J6506
5219A38161n7137K4803K1490j0668k2056L8765M0120k8299p3575k6435K970k2557
5207B5582j5519J3575O1335l0976k4695j1828m030N0341N3446n0392j46k6233
5195D0460K04K8796J5146L7665n6843p117M2396l5764r774p1957M1688R572N095
5182C9567K7886m5875k3345k9255j2239K9979L6924k7069M8956k8327J2482K6220
5170E5904K0628j6441m9248j3684M7336l3796R217n674j2177L2185l0635J1304
$$ plain form
5158 14919 58053 41419 -4605 44355 39201 -37764 -15422 -26068 -10766 43050 76585 59980
5146 59980 52006 -13710 -62645 -16443 -12151 -27465 19257 35245 30036 1416 -15007 -16174 -37400
5133 -37400 2258 30218 50628 39975 -62206 -59416 9318 57483 25304 -17188 -14435 28682
5121 28682 94086 90338 55865 80825 65666 66015 94681 54421 51782 77072 46680 9530 39657
5108 39657 50932 35074 7525 88946 75414 95229 101428 98224 59700 65419 24160 36954
5096 36954 31359 18774 26263 30592 -3844 19525 22668 -4146 -7513 23696 17990 29138 51977
5083 51977 42071 74391 -20819 -54081 16738 46156 44670 -1514 -69657 -38803 -12208 2126
5071 2126 -8810 -105 24436 12634 88449 22507 -24292 -39545 12125 -12692 7751 28595
$$ packed form
5158A4919M3134j6634m6024M8960n154p6965K2342j0646J5302N3816L3535j6605
5146E9980p974o5716m8935M6202M292j5314M6722J5988n209k8620j6423j167k1226
5133c7400L9658K7960K0410j0653j02181K790O8734M8165l2179m2492K753M3117
5121B8682O5404l748l4473K4960j5159L49K8666m0260k639K5290l0392l7150L0127
5108C9657J1275j5858k7549Q1421j3532J9815O199l204l8524N719m1259J2794
5096C6954n595j2585P489M329l4436K3369L143k6814l367L1209n706J1148K2839
5083E1977r906L2320r5210l3262P0819K9418j486m6184o8143L0854K6595J4334
5071B126j0936Q705K4541j1802P5815o5942m6799j5253N1670k4817K0443K0844
$$ plain form
5059 28595 -2083 26792 -1786 2209 12505 -19319 -39379 27467 48699 -12152 -90072 -48370
5047 -48370 42890 36377 75320 111123 12274 4983 4619 -6315 8701 44752 20028 29693 19924
5034 19924 16980 31058 68679 60382 121617 114045 131242 92058 94348 114461 65111 47013 130298
5021 130298 129978 29310 -25401 -25783 35 62784 41217 9155 -20927 29739 23915 -49846
5009 -49846 -28176 10640 46515 15685 24128 17243 18549 -7400 26798 23936 25670 5041 18662
4996 18662 42046 53098 54018 61644 82534 71130 116146 102765 97585 39867 40672 58680 26068
4983 26068 -25348 94225 123392 53880 8263 2976 23970 -11713 34318 22898 -7138 40837
4971 40837 16122 -37899 3498 30526 -12859 2701 -10511 11369 49337 61096 83767 52122
$$ packed form
5059B8595l0678K8875k8578L995J0296l1824k0060O6846K1232o0851p7920M1702
5047d8370R1260o513L8943L5803r8849p291l64j0934J5016L6051k4724R665r769
5034A9924k944J4078L7621q297O1235p572J7197l9184K290K0113m9350j8098Q3285
5021A30298l20j00668n4711l82K5818O2749k1567l2062l0082N0666n824p3761
5009d9846K1670L8816L5875l0830Q443o885J306k5949L4198k862J734k0629J3621
4996A8662K3384J1052R20P626K0890j1404M5016j3381n180n7718Q05J8008l2612
4983B6068n1416J19573K9167o9512m5617n287K0994l5683M6031j1420l0036M7975
4971D0837k4715n4021M1397K7028m3385J5560j3212K1880L7968J1759K2671l1645
$$ plain form
4959 52122 63609 85744 84848 100783 84854 23307 69940 65550 72939 33737 50841 120801 137120
4946 137120 120391 152059 177692 202651 182855 185746 200319 247313 263063 270097 316209 365164
4934 365164 383753 401461 504607 675609 779457 846008 812350 725197 612224 542335 461360
4923 461360 369392 337820 292185 217539 203574 205683 186073 179576 219419 232113 234387 185940
4911 185940 137733 129027 159329 94147 107873 131615 170546 154932 199646 221979 178282 148137
4899 148137 203682 147389 112834 135593 151660 203316 160042 145812 173751 188470 155931 137927
4887 137927 166644 109680 66632 161727 129712 116317 87583 52941 45998 63731 21776 81522
4875 81522 43398 32650 25611 76242 104285 94636 43105 69194 51060 86038 60058 67712
$$ packed form
4959E2122J1487K2135q96J5935j5929o1547M6633m390P389l9202J7104O9960J6319
4946A37120j6729L1668K5633K4959j9796K891J4573M6994J5750P034M6112M8955
4934C65164J8589J7708J03146J71002J03848O6551l3658q7153j12973o9889q0975
4923D61360r1968l1572m5635p4646j3965K109j9610o497L9843J2694K274m8447
4911A85940m8207q706L0302o5182J3726K3742L8931j5614M4714K2333m3697l0145
4899A48137N5545n6293l4555K2759J6067N1656m3274j4230K7939J4719l2539j8004
4887A37927K8717n6964m3048R5095l2015j3395k8734l4642o943J7733m1955N9746
4875H1522l8124j0748p039N0631K8043r649n1531K6089j8134L4978k5980P654
$$ plain form
4863 67712 15473 13375 5696 5541 72992 141807 92000 53813 6749 -2682 49383 60095 49491
4850 49491 41155 46386 62265 109185 23957 48017 59251 65026 50781 25546 21152 50468 42207
4837 42207 52369 129082 95322 76071 96735 73156 56009 112172 116149 120673 85561 73790
4825 73790 100084 98662 97841 147281 136309 79100 41104 14377 23616 -5564 -10313 42727 158684
4812 158684 216185 172792 153525 170633 119086 98519 131131 145163 140887 128003 137064 171604
$$ packed form
4863F7712n2239k098p679j55O7451O8815m9807l8187m7064r431N2065J0712j0604
4850D9491q336N231J5879M6920q5228K4060J1234N775j4245k5235m394K9316q261
4837D2207J0162P6713l3760j9251K0664k3579j7147N6163L977M524l5112j1771
4825G3790K6294j422q21M9440j0972n7209l7996k6727R239k9180m749N3040J15957
4812A58684N7501m3393j9267J7108n1547k0567L2612J4032m276j2884R061L4540
$$ [...]
##END NTUPLES=NMR SPECTRUM
##END=
