##TITLE=1H_CG-1193-b1
 DMSO
 8 sc, 
 11.3.2024
##JCAMPDX= 6.0         $$ Bruker NMR JCAMP-DX V2.0
##DATA TYPE= NMR SPECTRUM
##DATA CLASS= NTUPLES
##ORIGIN= UXNMR, Bruker Analytische Messtechnik GmbH
##OWNER= root
$$ XWIN-NMR		Version 3.5
$$ Mon Mar 11 14:10:47 2024 Russian Standard Time (UT+4h)  she@DPX200
##.OBSERVE FREQUENCY= 200.1313
##.OBSERVE NUCLEUS= ^1H
##.ACQUISITION MODE= SIMULTANEOUS
##.ACQUISITION SCHEME= undefined
##.AVERAGES= 8
##.DIGITISER RES= 18
##SPECTROMETER/DATA SYSTEM= spect
##.PULSE SEQUENCE= zg30
##.SOLVENT NAME= DMSO
##.SHIFT REFERENCE= (INTERNAL, DMSO, 0, 15.4031)
##AUDIT TRAIL= $$ (NUMBER, WHEN, WHO, WHERE, WHAT)
$$ ##TITLE= Audit trail, XWIN-NMR		Version 3.5
$$ ##JCAMPDX= 5.01
$$ ##ORIGIN= Bruker BioSpin GmbH
$$ ##OWNER= she
$$ F:/spectra/data/she/nmr/H-F/1/pdata/1/auditp.txt
$$ ##AUDIT TRAIL=  $$ (NUMBER, WHEN, WHO, WHERE, WHAT)
(   1,<2024-03-11 14:09:16.75 +0400>,<she>,<DPX200>,
      <created by zg, POWCHK disabled, PULCHK disabled
       configuration hash MD5:
       00 E9 B6 7A A2 85 ED C7 34 08 36 98 17 FE 4E 26
       data hash MD5: 16K
       E1 0D FC B1 32 00 86 9A 16 BA 22 AD A9 D8 FC 01>)
(   2,<2024-03-11 14:09:41.85 +0400>,<she>,<DPX200>,
      <Start of raw data processing
       efp BC_mod = 2 LB = 0.24 FT_mod = 6 PKNL = 1 PHC0 = -25303.8 PHC1 = 11.78731 SI = 16K 
       data hash MD5: 16K
       4A 0C 3E 51 9C 38 3A E0 48 F5 9C 42 98 7A 2D 9B>)
(   3,<2024-03-11 14:10:00.84 +0400>,<she>,<DPX200>,
      <pk PHC0 = -2.001837 PHC1 = 3.2 
       data hash MD5: 16K
       05 B2 06 46 51 86 17 20 4D 6A 55 5B 99 67 F5 0F>)
(   4,<2024-03-11 14:10:04.43 +0400>,<she>,<DPX200>,
      <abs ABSG = 5 
       data hash MD5: 16K
       7E 32 3B F0 09 1A F5 89 45 FB EB 22 0E 94 17 99>)
$$ ##END=
$$ 
$$ hash MD5
$$ F6 13 63 77 46 E1 D7 30 70 5D 90 F9 43 E1 3F 51
##$RELAX= 
##$RELAX= 
##$RELAX= 
##$RELAX= 
##$RELAX= 
##$RELAX= 
$$ Bruker specific parameters
$$ --------------------------
##$DU= <F:/spectra>
##$EXPNO= 1
##$NAME= <H-F>
##$PROCNO= 1
##$TYPE= <nmr>
##$USER= <she>
##$AMP= (0..31)
100 100 100 100 100 100 100 100 100 100 100 100 100 100 100 100 100 100 
100 100 100 100 100 100 100 100 100 100 100 100 100 100 
##$AQSEQ= 0
##$AQ_mod= 1
##$AUNM= <au_zg>
##$AUTOPOS= <>
##$BF1= 200.13
##$BF2= 200.13
##$BF3= 200.13
##$BF4= 200.13
##$BF5= 200.13
##$BF6= 200.13
##$BF7= 200.13
##$BF8= 200.13
##$BYTORDA= 1
##$CFDGTYP= 0
##$CFRGTYP= 5
##$CHEMSTR= <none>
##$CNST= (0..31)
1 1 145 1 1 1 1 1 1 1 1 1 1 1 1 1 1 1 1 1 1 1 1 1 1 1 1 1 1 1 1 1 
##$CPDPRG= <>
##$CPDPRG1= <>
##$CPDPRG2= <>
##$CPDPRG3= <>
##$CPDPRG4= <mlev>
##$CPDPRG5= <mlev>
##$CPDPRG6= <mlev>
##$CPDPRG7= <mlev>
##$CPDPRG8= <mlev>
##$CPDPRGB= <>
##$CPDPRGT= <>
##$D= (0..31)
0 1.2 0 0 0 0 0 0 0 0.06 0 0.03 0 0 0 0 0.0002 0 0 0 0 0 0 0 0 0 0 0 0 
0 0 0 
##$DATE= 1710151756
##$DBL= (0..7)
120 120 120 120 120 120 120 120 
##$DBP= (0..7)
150 150 150 150 150 150 150 150 
##$DBP07= 0
##$DBPNAM0= <>
##$DBPNAM1= <>
##$DBPNAM2= <>
##$DBPNAM3= <>
##$DBPNAM4= <>
##$DBPNAM5= <>
$$ [...]
##$SUBNAM3= <"">
##$SUBNAM4= <"">
##$SUBNAM5= <"">
##$SUBNAM6= <"">
##$SUBNAM7= <"">
##$SUBNAM8= <"">
##$SUBNAM9= <"">
##$SW= 18.0517328524113
##$SWIBOX= (0..15)
0 0 2 0 0 0 0 0 0 0 0 0 0 0 0 0 
##$SW_h= 3612.71676300578
##$TD= 16384
##$TD0= 1
##$TE= 0
##$TE2= 300
##$TE3= 300
##$TEG= 300
##$TL= (0..7)
0 120 120 120 120 120 120 120 
##$TP= (0..7)
150 150 150 150 150 150 150 150 
##$TP07= 0
##$TPNAME0= <>
##$TPNAME1= <>
##$TPNAME2= <>
##$TPNAME3= <>
##$TPNAME4= <>
##$TPNAME5= <>
##$TPNAME6= <>
##$TPNAME7= <>
##$TPOAL= (0..7)
0.5 0.5 0.5 0.5 0.5 0.5 0.5 0.5 
##$TPOFFS= (0..7)
0 0 0 0 0 0 0 0 
##$TUNHIN= 0
##$TUNHOUT= 0
##$TUNXOUT= 0
##$USERA1= <user>
##$USERA2= <user>
##$USERA3= <user>
##$USERA4= <user>
##$USERA5= <user>
##$V9= 5
##$VALIST= <valist>
##$VCLIST= <CCCCCCCCCCCCCCC>
##$VD= 0
##$VDLIST= <DDDDDDDDDDDDDDD>
##$VPLIST= <PPPPPPPPPPPPPPP>
##$VTLIST= <TTTTTTTTTTTTTTT>
##$WBST= 1024
##$WBSW= 4
##$XGAIN= (0..3)
0 0 0 0 
##$XL= 0
##$YL= 0
##$YMAX_a= 143636
##$YMIN_a= -137159
##$ZGOPTNS= <>
##$ZL1= 120
##$ZL2= 120
##$ZL3= 120
##$ZL4= 120
##$ABSF1= 15.40312
##$ABSF2= -2.648727
##$ABSG= 5
##$ABSL= 3
##$ALPHA= 0
##$AQORDER= 0
##$ASSFAC= 0
##$ASSFACI= 0
##$ASSFACX= 0
##$ASSWID= 0
##$AUNMP= <proc_1d>
##$AZFE= 0.1
##$AZFW= 0.1
##$BCFW= 0
##$BC_mod= 2
##$BYTORDP= 0
##$COROFFS= 0
##$CY= -3
##$DATMOD= 1
##$DC= 0
##$DFILT= <>
##$DTYPP= 0
##$F1P= 0
##$F2P= 0
##$FCOR= 1
##$FTSIZE= 16384
##$FT_mod= 6
##$GAMMA= 0
##$GB= 0
##$INTBC= 1
##$INTSCL= 3.70164e-10
##$ISEN= 128
##$LB= 0.24
##$LEV0= 0
##$LPBIN= 0
##$MAXI= 10000
##$MC2= 0
##$MEAN= 0
##$ME_mod= 0
##$MI= 1.114404
##$NCOEF= 0
##$NC_proc= -5
##$NLEV= 6
##$NOISF1= 3.799351
##$NOISF2= 2.8
##$NSP= 0
##$NTH_PI= 0
##$NZP= 0
##$OFFSET= 15.40312
##$PC= 1
##$PHC0= -25305.8
##$PHC1= 14.98731
##$PH_mod= 1
##$PKNL= yes
##$PPARMOD= 0
##$PSCAL= 0
##$PSIGN= 0
##$REVERSE= no
##$SF= 200.130023730637
##$SI= 16384
##$SIGF1= 3
##$SIGF2= 2
##$SINO= 5.538805
##$SIOLD= 16384
##$SREGLST= <1H.CDCl3>
##$SSB= 0
##$STSI= 16384
##$STSR= 0
##$SW_p= 3612.71676300578
##$SYMM= 0
##$S_DEV= 0
##$TDeff= 16384
##$TDoff= 0
##$TI= <>
##$TILT= no
##$TM1= 0
##$TM2= 0
##$TOPLEV= 0
##$USERP1= <user>
##$USERP2= <user>
##$USERP3= <user>
##$USERP4= <user>
##$USERP5= <user>
##$WDW= 1
##$XDIM= 16384
##$YMAX_p= 403380968
##$YMIN_p= -407147
$$ End of Bruker specific parameters
$$ ---------------------------------
##NTUPLES= NMR SPECTRUM
##VAR_NAME=  FREQUENCY,     SPECTRUM/REAL,   SPECTRUM/IMAG
##SYMBOL=    X,             R,               I
##VAR_TYPE=  INDEPENDENT,   DEPENDENT,       DEPENDENT
##VAR_FORM=  AFFN,          ASDF,            ASDF
##VAR_DIM=   16384,         16384,           16384
##UNITS=     HZ,            ARBITRARY UNITS, ARBITRARY UNITS
##FACTOR=    0.220516191357247, 1,           1
##FIRST=     3082.62677930988, 0,            0
##LAST=      -530.089983695903, 0,           0
##MIN=       -530.089983695903, -407147,     0
##MAX=       3082.62677930988, 403380968,    0
$$ Real data points
##PAGE= N=1
##DATA TABLE= (X++(R..R)), XYDATA
$$ [...]
8903A74849j1778K4048m0352k2197L4311J9060j4711j7345j3309M6792l0514l7745
8891A11109q974K1307L1492m6533k9755J48j7567M7436o4080J3282O2019j2190
8879A07694j7646l5771K2196o689M879P8227M0959k7568m3954q7777P1184O317
8867A12051l7146j8634L8183j0778j5697P1n0055N8309L3256J6533n9465K3399
8855I0027O3305M280k5544n4135J6307j5957k9361K47N0001j7490R901J9073l7729
8842G2925O470q619r8001J3863L7551J9407m382n4651q872j5538N1909L1647k3256
8829B0453l4016M9049L5562J5120M700J4365j0960n1974j1261O4086m890j3204
8817G7030m3664N9956L7875q502m3671n2516K5046N006j7834Q114L1824q974k347
$$ plain form
8903 174849 163071 187119 146767 124570 158881 177941 163230 145885 132576 179368 148854 111109
8891 111109 102135 123442 154934 108401 78646 78794 61227 108663 44583 57865 119884 107694
8879 107694 90048 54277 76473 69784 74663 152890 193849 166281 122327 34550 105734 112051
8867 112051 74905 56271 94454 83676 67979 68050 17995 76304 109560 126093 66628 90027
8855 90027 153332 157612 132068 77933 94240 78283 48922 49169 99170 81680 91581 110654 72925
8842 72925 79395 70776 -27225 -13362 24189 43596 39214 -15437 -24309 -39847 12062 43709 20453
8829 20453 -13563 35486 71048 86168 90868 105233 94273 42299 31038 95124 90234 77030
8817 77030 33366 93322 131197 122695 79024 26508 51554 56560 38726 46840 78664 69690 67343
8804F7343m0304l0513J5437M0727P436m1385M6466j3797o5613L5663K1864P526
8792E0850J6746m2590J2583N2351k8797r781j2527l7427n3562L1048N5668m0293
8780e731l651K0083j2508O8867k4207n2504k6317O2958N0007n4502n4144J7062
8768a4587L6963M286k9712l8563k0042M3789M9233k4980k4155k1887l3355M5534
8756b7476J5757k0501m3403J8025k24q04R5191m2401O488L7506k7168L5511K5712
8743G2213l4773k793n0730m415j6322M6584J898p1178M0417k0216J0377K8416
8731e22n0648l539j052J5516K8882M706j4751O473J4526K3717j6681P861m2972
8718b8484L3662O6335o3620J2759M7640l206K0824J4321r6120n6738K2101j879
$$ plain form
8804 67343 27039 -3474 11963 52690 60126 18741 65207 51410 -14203 21460 43324 50850
8792 50850 67596 25006 37589 89940 61143 51362 38835 1408 -52154 -21106 34562 -5731
8780 -5731 -9382 10701 -1807 67060 42853 -9651 -35968 26990 76997 22495 -31649 -14587
8768 -14587 22376 26662 -3050 -41613 -61655 -17866 31367 6387 -17768 -39655 -73010 -27476
8756 -27476 -11719 -32220 -75623 -57598 -57822 -58626 36565 -5836 652 38158 10990 46501 72213
8743 72213 37440 34647 -16083 -20498 -36820 9764 11662 -59516 -19099 -39315 -28938 -522
8731 -522 -51170 -54709 -55761 -40245 -11363 -6657 -21408 -14935 -409 23308 6627 14488 -28484
8718 -28484 5178 71513 7893 20652 68292 65086 85910 100231 4111 -52627 -30526 -32405
8706c2405n5679J7736j5567M9074L768k2417P2994l0647N3392Q277q378j544p8701
8693d0097Q08J9257J5975Q244M0736m7811l5411K825K1501L7537L309o0637p478
8680d1242k3874P887M7881k1343q543j4803Q7691p844k9526j5765n933O2163n277
8667C1472m1230J249l2891L08L5469m3780o1011J21680K5446o200R040M3588K1383
8654A04523o6672m1218j8935J8607k9989j7644r676L9813M7149l5385k5542K5101
8642i868N3276L6857m5464n428j8234P717k691l6214p5982R7098K6233o3801K3806
8629a2695q776J8560j3951k3747M7301q725M154N8905k3020o353m9637j0428j5930
8616d4342r410K0953k4974L5238j5016p618N7922l0486m6637m8114o575N8142
$$ plain form
8706 -32405 -88084 -70348 -85915 -36841 -33073 -55490 17504 -13143 40249 48526 40148 38604 -40097
8693 -40097 -39289 -20032 -4057 4187 44923 -2888 -38299 -35474 -13973 23564 26873 -33764 -41242
8680 -41242 -65116 -57229 -9348 -30691 -39234 -54037 33654 25810 -3716 -19481 -25414 36749 31472
8667 31472 -9758 -8509 -41400 -41092 -5623 -49403 -110414 11266 36712 30512 39552 83140 104523
8654 104523 37851 -3367 -22302 -3695 -33684 -51328 -61004 -21191 25958 -9427 -34969 -9868
8642 -9868 43408 80265 34801 29373 11139 18856 16165 -20049 -96031 1067 27300 -36501 -12695
8629 -12695 -21471 -2911 -16862 -40609 6692 -2033 2121 61026 38006 31653 -17984 -28412 -44342
8616 -44342 -53752 -32799 -57773 -22535 -37551 -45169 12753 -17733 -64370 -112484 -119059 -60917
8604f0917O8281P356n9235P5044k5501o79j5238o4757J9856J472P018N9609k3810
8591a1501p9299J9610q445P3719N1117r4439L228r6294j7272J39261P4644j1847
8579D2482n2711L6695P918m2823o112Q0171p6697M6352j2782J4318J8447j20164
8567f4906L727J488P1847l0537k002M2937K8992K1599k4067l4760l1411r203l1253
8554e7549N6716K618l5147M7125n3590o1902k5107O1679J3126n8070L8436P3165
8542A500k8011q300N5043o8371J6173J1734k94L3403k2907l7166K6375j5894k5601
8529f2316N198K4946l3938j849L9806O465n923n1167m0504O645P8595l4468j9348
8516h7858O1207P625O596j4855J3746l873m1087K515O8372k3541q553M3545o911
$$ plain form
8604 -60917 7364 14720 -44515 30529 5028 4349 -10889 -75646 -55790 -54318 -47300 12309 -11501
8591 -11501 -90800 -71190 -79635 -5916 45201 -49238 -46010 -142304 -159576 -20315 54329 42482
8579 42482 -10229 26466 34384 -8439 -14551 65620 -11077 35275 22493 36811 55258 -64906
8567 -64906 -61179 -59691 12156 -18381 -20383 22554 51546 73145 49078 14318 -17093 -26296 -57549
8554 -57549 -833 1785 -33362 13763 -39827 -101729 -126836 -65157 -52031 -110101 -71665 1500
8542 1500 -26511 -34811 20232 -48139 -31966 -20232 -20526 12877 -10030 -47196 -20821 -36715 -62316
8529 -62316 -57118 -32172 -66110 -67959 -28153 -21688 -27611 -78778 -119282 -112637 -34042 -68510 -87858
8516 -87858 -26651 -19026 -12430 -27285 -13539 -17412 -58499 -55984 12388 -11153 -19706 23839 16928
8503A6928l1728m5565o731N2450O935p2673l3710N6049N7801N185O643r643k9989
8490b8048L9375j9281j4252M2994J1933L384m2482k6584K5275m674j5775K9798
8478A663m2656M909N4616k9908n1127M0088L6986p0446M8036L8753o2885M647
8466b7324m9916L4756m1243Q057K1887j6220L6033J785P256k2096L3532j7465
8454c0958L5486l7752k760M0750j129k004J0258j450j8494L1439J4844j8590J1033
8441C0673o4304L3610N495m6160J8773L470j3415K3456J4208k9890k3457j9507
8429f7048J2404N6499J6084r1418K5507K3206J1321j3283K7056L1126n4083K465
8417b0164N3283j8736L5086m4548m5016o5590O9564K8658j877j0119M9474k1422
$$ plain form
8503 16928 -14800 -60365 -67096 -14646 -7711 -80384 -114094 -58045 -244 4941 11584 1941 -28048
8490 -28048 11327 -7954 -22206 20788 32721 36105 -6377 -32961 -7686 -12360 -28135 1663
8478 1663 -40993 -36084 18532 -11376 -62503 -22415 14571 -55875 -7839 30914 -31971 -27324
8466 -27324 -77240 -42484 -83727 -75670 -53783 -70003 -33970 -32185 -24929 -47025 -13493 -30958
8454 -30958 4528 -33224 -35984 4766 3637 1633 11891 10441 -8053 23386 38230 19640 30673
8441 30673 -33631 -21 5474 -40686 -21913 -18443 -31858 -8402 5806 -24084 -47541 -67048
8429 -67048 -54644 1855 17939 -73479 -47972 -24766 -13445 -26728 328 31454 -22629 -20164
8417 -20164 33119 14383 49469 4921 -40095 -105685 -36121 -7463 -9340 -19459 30015 8593
8405H593k0052l0341k4698k0548O361M8304J2048K9153r095J8097Q92n2498j0795
8392d4579L2839K61J1399j2400j8663r3131N5811Q3718n9165o2870M0874j836
8380f7742J3214L7074j139J608n8622Q612K9200L0458m1468N17O7030J3849o3533
8367c0942J904L8552K60J9271n7877J9831o125k8849j559j324L0934M4326n0362
8354b1960k2116o0174K0547M489R6502J2216n7100N0552m2233m9118R7387O3158
8342I2150r4494q807J3071j9750M736n3832P674K9390O580l1990R125K5523r668
8329c0292j4972J2995M2822j2853m3463q549Q941j0858N0113L564l9724N6973
8317A4697J1221O5677J2970o6913k3361q430K02J0486j0934J4820l0917j2969
$$ plain form
8405 8593 -11459 -41800 -66498 -87046 -80685 -32381 -20333 8820 -275 17822 18714 -33784 -44579
8392 -44579 -11740 -11479 -80 -12480 -31143 -124274 -68463 15255 -43910 -106780 -65906 -67742
8380 -67742 -54528 -17454 -18593 -16985 -75607 -66995 -37795 -7337 -48805 -48288 18742 32591 -30942
8367 -30942 -29038 9514 9774 29045 -28832 -9001 -15126 -43975 -45534 -46858 -15924 28402 -21960
8354 -21960 -44076 -104250 -83703 -79214 17288 29504 -27596 22956 -19277 -68395 28992 92150
8342 92150 -2344 -11151 1920 -17830 -13094 -66926 -59252 -29862 -23282 -55272 -46147 -20624 -30292
8329 -30292 -45264 -32269 10553 -2300 -45763 -54312 -45371 -56229 -6116 -2552 -42276 14697
8317 14697 25918 91595 104565 37652 14291 5861 6063 16549 5615 20435 -10482 -23451
8305b3451M6216o3424n0832L2065Q6231n716o6400L3079J5187p353k5463n3162
8293h3023M2038L1838k5567l4792j8212M2032K2340n1270K4071j9327l547J8501
8281e4918M3592L4493m0588n054L7076K0314M5370k1278n8916P922Q733J9831
8269C6577N9030j12649k3636N8478q90P995n2258k9579J5372P745N1305p425n3374
8256d3309k7389M9616L8331j4456l633m710q418j1772l1454n957L0694L2283P999
8243G825j578k7456j4262p919J1569p21j5369l9361k6309P7846M4934k1469O944
8230e326j0247n3992R5144K6039l5648M53j11705n243P6799n7544J7244M5316
8218a8710k2618n236M4807j4249l2392q916L7871j2544L2423q9428j5469l410
$$ plain form
8305 -23451 22765 -40659 -91491 -59426 26805 21089 -45311 -12232 2955 -4398 -29861 -83023
8293 -83023 -40985 -9147 -34714 -69506 -87718 -45686 -23346 -74616 -50545 -69872 -73419 -54918
8281 -54918 -11326 23167 -17421 -22475 14601 34915 80285 59007 91 8013 16746 36577
8269 36577 95607 -17042 -40678 17800 16910 24905 -27353 -56932 -41560 -33815 17490 10065 -43309
8256 -43309 -70698 -21082 17249 2793 -840 -5550 -13968 -25740 -57194 -63151 -32457 -174 7825
8243 7825 6247 -21209 -35471 -43390 -31821 -32542 -47911 -87272 -113581 -35735 9199 -12270 -5326
8230 -5326 -15573 -69565 25579 51618 15970 16423 -95282 -100525 -23726 -81270 -64026 -18710
8218 -18710 -41328 -46564 -1757 -16006 -48398 -57314 -19443 -31987 436 -88992 -104461 -107871
8206a07871M0983K3831o637j7644K3138j5337k2473L83p790j4411N82m1686k7005
8193a71937k35210K2551N05947q5437o9986J7054R8833k1383l2426O319L3776
8182F8101m5928J4087J30l1690n773P399l3653r240l7573J3419K0443J2336k6329
8169e4271o4877M5058M2633L3919l2610p62L6176K890j1714o248l8992K2595p877
8156c4080r725K9778M2992k8918M803o295q968j8034N5301P873m0177k4274l927
8143c3651J44M8664L1780j7381P357m2645l9466j0315l6940J24373K2341m1028
8131A3233l2560k1373L9967L6467k5305o6668N394K4155J0518k5499l5387K1185
8119e5873L9113p8106J1969J14533j4338l8884K0633m7091l1598O1797k940j5427
$$ plain form
8206 -107871 -66888 -43057 -49694 -67338 -44200 -59537 -82010 -81627 -89417 -103828 -103246 -144932 -171937
8193 -171937 -407147 -384596 121351 35914 -34072 -17018 81815 60432 28006 34325 68101
8182 68101 22173 36260 36390 4700 -1073 6326 -27327 -36567 -74140 -60721 -40278 -27942 -54271
8169 -54271 -119148 -74090 -31457 2462 -30148 -30910 5266 8156 -3558 -9806 -48798 -26203 -34080
8156 -34080 -43805 -14027 28965 47 4850 -1445 -10413 -28447 26854 34727 -5450 -29724 -33651
8143 -33651 -33507 15157 46937 29556 36913 -5732 -45198 -55513 -92453 31920 54261 13233
8131 13233 -19327 -40700 -733 35734 10429 -56239 -50845 -26690 -16172 -41671 -77058 -55873
8119 -55873 -16760 -94866 -82897 31636 17298 -21586 -953 -48044 -79642 -17845 -20785 -36212
8107c6212p939L5400j88N2361J5042m5556K0510n590j2629J4397J1162m4789p2478
8094g6509L2817N5646m7257p259j4340J2944K4502M8451q08o4085J1551k2450
8082d6797N5957N1151p6167p197j1051n317K9691N011r3730p317R271N0457M0994
8069e044o5241L7414K4753j6482l2768j2645J6898J4208J3634n991J725J6205
8057a3334K8838k7849N0743m8655J7171L8585j9492J22m0904m288l588O697o9457
8044h5411L2195R275K5784o6666m362O2682R450k2648M618N8080R29P222J2405
8031D3553l9547p0820l295P5617J8776l2160K0485K1888l1529J4655K8853J0398
8019E6874J7278m2058N950m5010j1023J3669O7795o498o9439q180l883j3514m6878
$$ plain form
8107 -36212 -44151 -8751 -8939 43422 58464 12908 33418 27828 15199 29596 40758 -4031 -76509
8094 -76509 -43692 11954 -35303 -42562 -56902 -43958 -19456 28995 28187 -35898 -24347 -46797
8082 -46797 9160 60311 -15856 -23053 -34104 -39421 -9730 -4719 -98449 -105766 -96495 -46038 -5044
8069 -5044 -70285 -32871 -8118 -24600 -57368 -70013 -53115 -38907 -25273 -31264 -29539 -13334
8057 -13334 15504 -12345 38398 -10257 6914 45499 26007 26129 -14775 -19063 -22651 -15954 -85411
8044 -85411 -53216 -43941 -18157 -84823 -89185 -26503 -17053 -39701 -35083 22997 23926 31148 43553
8031 43553 4006 -66814 -70109 5508 24284 -7876 12609 34497 2968 17623 46476 56874
8019 56874 74152 32094 38044 -6966 -17989 -4320 63475 56977 -12462 -20642 -24525 -38039 -84917
8006h4917k8052Q3012j6437L0458N2003m2542k8391M433M4058m2449N1806k4094
7994a112m1942l3182P803k0369R48O9210j1748J0236n5058L2073l643j7198j2901
7981g6883M2399l918K7032q174k4299J3616m1557L4348k5805N2859K8887m151
7969A4354j49k5399j4994j0257K3984l0232l2738k4888K8231j2305N835k3878
7957a02436M4667M6732k4450m8881M1459P0722L6832K560N310p564p9009k423
7945a6481P5102Q408o6640r420r741l9337K3322O4188o1270O9685l1271J1192
7933A7737m6142j1634P3902j6068m3521k9464k4914N0732O4811n6053l2817K6165
7921b7266k363L0138m3354J6728K2030n7663j5355O5669N042n702n3498K5006
$$ plain form
8006 -84917 -112969 -29957 -46394 -15936 36067 -6475 -34866 -30433 13625 -28824 22982 -1112
7994 -1112 -43054 -76236 -68433 -88802 -87854 -18644 -30392 -20156 -75214 -43141 -46784 -63982 -76883
7981 -76883 -34484 -38402 -11370 -19544 -43843 -30227 -71784 -37436 -63241 -10382 18505 14354
7969 14354 14205 -11194 -26188 -36445 -12461 -42693 -75431 -100319 -72088 -84393 -78558 -102436
7957 -102436 -57769 -11037 -35487 -84368 -42909 27813 64645 67205 72515 64951 -14058 -16481
7945 -16481 58621 67029 389 -9031 -18772 -58109 -34787 29401 -31869 37816 6545 17737
7933 17737 -28405 -40039 33863 17795 -25726 -55190 -80104 -29372 35439 -20614 -53431 -27266
7921 -27266 -29629 509 -42845 -26117 -4087 -61750 -77105 -11436 -6394 -12096 -65594 -40588
7909d0588L5226Q315K2437p793m0559k6991j0088M4664K813l8124J034k0637K7774
7896d2517k3558N861j5045J01399J5479m9026j00449K232Q014K5101m5670O2993
7884e5186O8879r456n0218l3988K6333J9625J6219M4190r2631O28O6082j00958
7872a00481K5306K1478O1091N4950n8630l5470L2154J2072k9994k6486l3264L8390
7860c8884j8873l0671P8895n6010m518j9305K729Q2208M153J3859J2086o4011
7848c8342J1948K3590q236q00J4354l1405m0738O4784O1485L8364m7958n8947
7836a1901r938N7172r122o8685m3583L089m064Q149P1698l236O183n7380L6220
7823b5398K9220l9192n4865l2682J04641L2812j8130l0862k6269L7698k4404J227
$$ plain form
7909 -40588 -5362 2953 25390 17597 -22962 -49953 -60041 -15377 -12564 -50688 -49654 -70291 -42517
7896 -42517 -66075 -60214 -75259 26140 41619 -7407 -107856 -105624 -97610 -72509 -118179 -55186
7884 -55186 13693 4237 -45981 -79969 -53636 -34011 -17792 26398 -66233 -65605 477 -100481
7872 -100481 -75175 -53697 7394 62344 3714 -31756 398 12470 -17524 -44010 -77274 -38884
7860 -38884 -57757 -88428 -9533 -65543 -70061 -89366 -86637 -4429 -276 13583 25669 -38342
7848 -38342 -26394 -2804 -11040 -11840 2514 -28891 -69629 -4845 56640 95004 47046 -11901
7836 -11901 -21839 35333 26211 -42474 -86057 -82968 -87032 -78883 -7185 -10421 -4238 -61618 -25398
7823 -25398 3822 -35370 -90235 -122917 -18276 14536 -3594 -34456 -60725 -23027 -47431 -46204
7811d6204P649M3984k2139j1275K174k5408n5491O8768o9123k2846R9794L560
7799b6557O635k3835K2129k0421L0106M4811K2182j6988n4343n206L4096l4960
7787b2351N0029o6320k4738L2866J3969j2343l5151L9173L5483m4047L4491l0270
7775b9209n0075O6073j066M5237j7753k6700l0733M612J5632K9582l3329j7628
7763d5357K8796n010K3762k7372j4686J0536l9991K5532M3710k1875n5772r540
7751h7267R206k847R5683J2284r525l5383j8318q451k1862k5718Q0804K1156r4298
7738h4536p63L3932L8840M6902l9835m0678M8460j1143r419m8238j9771P1864
7726a4385n1455O4539K3613j0624N072j06910o245L8354L4735K5965n0661j9216
$$ plain form
7811 -46204 -38555 5429 -16710 -27985 -25811 -51219 -106710 -37942 -107065 -129911 -30117 -26557
7799 -26557 -19922 -43757 -21628 -42049 -11943 32868 55050 38062 -16281 -21487 12609 -22351
7787 -22351 27678 -38642 -63380 -30514 -16545 -28888 -64039 -24866 10617 -33430 1061 -29209
7775 -29209 -79284 -13211 -14277 30960 13207 -13493 -44226 -39614 -23982 5600 -27729 -45357
7763 -45357 -16561 -21571 2191 -25181 -39867 -29331 -69322 -43790 -80 -21955 -77727 -87267
7751 -87267 -78061 -80908 14775 27059 17534 -17849 -36167 -44618 -66480 -92198 -11394 9762 -84536
7738 -84536 -85299 -51367 -12527 34375 -5460 -46138 2322 -8821 -18240 -66478 -86249 -14385
7726 -14385 -65840 -1301 22312 11688 16760 -90150 -96395 -58041 -23306 2659 -48002 -67218
7714f7218o6861j8357R5670K2646J4906l0970J2416P139j05j7136j1470L8290
7702b1050k4186k1205O2022l958r360K857L3886j2490m2171k0060J6646J8773
7690b0296p4669L8009L9642l4627M1544J9405o2308J9476Q7119k4989N369J6412
7678E0087n5079j4669n369Q5424j2607l3345N0083l2481p3647m354l8318m097
7666h8372J7041M2160L3732M323j5433K4846j7562J9743J6707l7670O1666m6980
7654A4201m6042k8718M8130Q010m9297Q8375l0843o8188O5977P338J7202k4452
7642A693n550j8438j3645m166o00j2794p34k478N3536J4383O592n013K8698p5956
7628c4472k1560N4992k9897q709L8488j3070n3122J6904L070P994K1661j2414
$$ plain form
7714 -67218 -134079 -152436 -56766 -34120 -19214 -50184 -37768 -30629 -30734 -47870 -59340 -21050
7702 -21050 -45236 -66441 -4419 -8377 -17737 -14880 19006 6516 -35655 -55715 -39069 -20296
7690 -20296 -94965 -56956 -17314 -51941 -10397 9008 -53300 -33824 53295 28306 33675 50087
7678 50087 -4992 -19661 -25030 60394 47787 14442 64525 32044 -41603 -45957 -84275 -88372
7666 -88372 -71331 -29171 4561 8884 -6549 18297 735 20478 37185 -485 61181 14201
7654 14201 -31841 -60559 -12429 -4419 -53716 34659 3816 -64372 1605 8943 26145 1693
7642 1693 -3857 -22295 -35940 -40106 -40706 -53500 -54234 -56712 -3176 11207 17799 12786 41484 -34472
7628 -34472 -56032 -1040 -30937 -39646 -1158 -14228 -67350 -50446 -47376 -39382 -17721 -30135
7616c0135M444k931p9269J1618O8678R505J3560R035j8055k9658J967r513J3238
7603c7516K6450J0080o2307K3554R710R742K4193k8798M1072k6841K5587J5529
7591C0455J0153M951J459l0694j0121P97j3223O586m7810J3669M1515o542Q276
7578I471P818K3627m0934J1352m1283K8911k9778j349m312l0548N4361L4032j5040
7565F328k0273O593J2190l2922m0554N3214K2338J6470k6648k6185l06O2835N7508
7552I0588l7772J5448q0414m970p9366J0040Q8400l9552K054K4076M4837m7787
7540a4418n4416L7088m3607q520J578K0130J8699k0264L8100k607n2618J2505
7528f8350O6282k2231k2156J2037L977M628K1207m4291M470M0924j8073J044N4912
$$ plain form
7616 -30135 -25691 -28622 -107891 -96273 -27595 -18090 -4530 4505 -13550 -43208 -41241 -50754 -37516
7603 -37516 -11066 -986 -63293 -39739 -30029 -20287 3906 -24892 16180 -10661 14926 30455
7591 30455 40608 45559 47018 16324 6203 7000 -6223 363 -47447 -33778 7737 1195 9471
7578 9471 17289 40916 -18 11334 -29949 -1038 -30816 -32165 -36477 -67025 -12664 21368 6328
7565 6328 -13945 -7352 4838 -28084 -68638 -15424 6914 23384 -3264 -29449 -29755 33080 90588
7552 90588 52816 68264 -12150 -17120 -96486 -86446 1954 -37598 -35544 -11468 33369 -14418
7540 -14418 -68834 -31746 -75353 -83873 -82295 -62165 -43466 -63730 -25630 -28237 -80855 -68350
7528 -68350 -2068 -24299 -46455 -34418 -30441 -25813 -4606 -48897 -44427 -3503 -21576 -20532 34380
7515C4380K17k8088m8557Q6800j1527m0262K5490o02j9799l9787j626O332L9234
7502B205L4076m7313L6578p296m090j6529m202k1826k316L1497o798k5594O5385
7489C3777k2746l5265Q8221p1180K4871l9303k634k6403m0452J4097L3201m1149
7477h4965k3416O5034k7732Q690M241j6994K4074K8900K1960J5294r4018J2317
7465f6615K260l84O9137o9799Q0845N657o6631m0175K9582O0814M453P9827k5226
7452F3745l3318j6014j5080J7471l0414k7692M9895l090k1961O7091o876K0170
7440F3927n2809l6329k0182P9132K505p6851j2579j2520N3821o1055K8128j2344
7428e7156O5730J217n003M6629k7090j8043j0907j1488J8917P977j262p7572N184
$$ plain form
7515 34380 34597 6509 -42048 44752 33225 -7037 18453 17851 -1948 -41735 -43361 -37029 2205
7502 2205 36281 -11032 25546 18250 14160 -2369 -6571 -28397 -30713 784 -6014 -31608 33777
7489 33777 11031 -24234 63987 -7193 17678 -21625 -24259 -50662 -91114 -77017 -43816 -84965
7477 -84965 -108381 -43347 -71079 -62389 -58148 -75142 -51068 -22168 -208 15086 -78932 -66615
7465 -66615 -64355 -64739 4398 -65401 15444 21101 -45530 -85705 -56123 4691 9144 88971 63745
7452 63745 30427 14413 -667 16804 -13610 -41302 8593 5503 -16458 50633 43757 63927
7440 63927 11118 -25211 -45393 33739 36244 -40607 -53186 -65706 -11885 -72940 -44812 -57156
7428 -57156 8574 9791 4788 51417 24327 6284 -4623 -16111 2806 10783 9521 -68051 -62867
7415f2867k0545O0642p696q496M003n174O8316N90K6785p6112j6649L5987J494
7402B78l3223J0514J6750J128j5026j9636J3426J2388l5904J3230K8591l9114
7390d6598m2308K0065N062Q783L5214k9941q5337L0913O4469N5856M448p5628
7378e5002n080L8000O974m2183m5266M5030M4374N6912n4450r879n568o449j8093
7365e0680J2195K8064l5949k6915K4726O543k1646q116L2663k8847J78R7310K4300
7352E3826p9748m0509K3396K4359M5197K8300M694j452j9486n4131l6218l231
7340e5003K1507O531N63l5343K5959M1865J3895j8611l0067j1707k192M0222j9134
7327b1515o211k1914K9413l914k402J5970j520L828L514j0170K548J3504J4744
$$ plain form
7415 -62867 -83412 -22770 -30466 -38962 -34959 -40133 28183 28773 55558 -20554 -37203 -1216 278
7402 278 -32945 -22431 -5681 -4553 -19579 -39215 -25789 -13401 -49305 -36075 -7484 -46598
7390 -46598 -88906 -68841 -63779 -54996 -19782 -49723 -135060 -104147 -39678 16178 20626 -55002
7378 -55002 -60082 -22082 -15108 -57291 -102557 -57527 -13153 43759 -10691 -20570 -26138 -32587 -50680
7365 -50680 -38485 -10421 -46370 -73285 -48559 -42016 -63662 -71778 -39115 -67962 -67784 29526 53826
7352 53826 -25922 -66431 -43035 -18676 26521 54821 59515 58063 38577 -15554 -51772 -55003
7340 -55003 -33496 -26965 -26402 -61745 -35786 6079 19974 1363 -28704 -40411 -42603 -2381 -21515
7327 -21515 -27726 -49640 -20227 -24141 -26543 -10573 -12093 -8265 -4751 -14921 -12373 1131 15875
7314A5875J275k0587K2730n4383k6636k2285L4593l305M1438J813R55K5005n557
7301A0931j1896j5291L712M393j1001M934q298J8549J2015R578K6645p915o1211
7288b4855J4762K3847l1617O593K2656L1506j1167q414J6899l9975K1155n1238
7276b9848k6263N2964l2171N169K0334J0468M7405k5531l3713k8830L9136m1731
7264d2611N9671k6772J5540J2228l4965l4705m2517J01926K4203k7318Q519J7952
7252C1151k0697r586m8450K7507M720j2864L838J4691K4068J4540L950N3267m6074
7239D0061l3218R787J4558p9648O838N7744k0032m1556P1573m5649K3174M0371
7227D4003j9924q1571R527N2601k9264j6683K0420L5440l5801K7979K8223p5215
$$ plain form
7314 15875 17150 -3437 19293 -35090 -61726 -84011 -49418 -52723 -11285 -9472 -8517 16488 10931
7301 10931 -965 -16256 -12544 -8151 -19152 -14218 -22516 -3967 8048 17626 44271 36356 -24855
7288 -24855 -10093 13754 -17863 -11270 11386 42892 31725 23311 40210 235 21390 -29848
7276 -29848 -56111 -3147 -35318 -30149 -9815 653 48058 22527 -11186 -40016 -880 -42611
7264 -42611 17060 -9712 5828 18056 -16909 -51614 -94131 7795 31998 4680 13199 31151
7252 31151 10454 868 -47582 -20075 -15355 -28219 -24381 -9690 14378 28918 32868 86135 40061
7239 40061 6843 16630 31188 -48460 -41622 16122 -3910 -45466 26107 -19542 3632 44003
7227 44003 24079 -57492 -47965 4636 -24628 -41311 -20891 14549 -21252 6727 34950 -40265
7215d0265N0195K5388m7458M181K0451r471j564M3622m6675M7548r535k6357l5941
7202b5881L1266j4508n0619M2978J2428J552j1918j1403r706l2070O2479J7506
7190A2104j3569L043k6794O2097n1166o1878j201M800J718L5488o1404L1704J5527
7177d9531k0257K2187J9636M5784o0075K5191l0908K9642K4220O654j6325J3654
7165I872m9950L008K5513p70k6518J8869k138J1888N7114q2629O0912n4007Q935
7152a9901P544o8777R541M6976L7842o448J83J927k2430m3731R916K1695j3053
7139c8716J2032L6467N24n4584p503j690p282j1149M7636J1476j1131j8175J414
7126d0681R0885n7850J2941l979K7562M1959k8622p4705P061N9957l8731l735
$$ plain form
7215 -40265 9930 35318 -12140 -7959 12492 3021 1457 45079 -1596 45952 36417 10060 -25881
7202 -25881 5385 -9123 -59742 -16764 -4336 -2784 -14702 -26105 -35811 -67881 -5402 12104
7190 12104 -1465 1578 -25216 36881 -14285 -76163 -77364 -72564 -70846 -35358 -96762 -65058 -49531
7177 -49531 -69788 -47601 -27965 17819 -42256 -17065 -47973 -18331 5889 12543 -3782 9872
7165 9872 -40078 -37070 -11557 -12327 -38845 -19976 -22114 -10226 46888 -35741 25171 -28836 -19901
7152 -19901 -12357 -81134 -71593 -24617 13225 6777 6960 8887 -13543 -57274 -47358 -25663 -38716
7139 -38716 -26684 9783 10307 -44277 -51780 -53470 -60752 -71901 -24265 -12789 -23920 -42095 -40681
7126 -40681 50204 -7646 5295 1316 28878 70837 42215 -32490 -25429 34528 -4203 -7938
7114g938l2881p361O3667o8699j9163o412N7883L5005j3671l5408J9929K4479
7102I430j1933j2673K1165K680o1122P4321K9302m2772N184N2016m310q069p7611
7089b4392K1810L6390l9666n7130O948P6361r434K2476m0513o1976M5064K5724
7077A662J341K4931k2825j8256j9607M2026L1206j8112m0025J9804n326M9613
7065D6432m2730O533J933p0643j986K0907J2896m1078O2317n5323N268N7523J9030
7052B1079j9603J2269k62n301p337j1073o190J0424L6343j3667j0626P262L807
7039A7125o9261l7035J9254Q9012N9548o2937L2316J1319j4215L0583M704n6500
7027B3913Q013r7158K3506M2560l8102l5935N849J6119j6191J2903J5671p318
$$ plain form
7114 -7938 -40819 -48180 15487 -53212 -72375 -78787 -20904 14101 430 -34978 -15049 9430
7102 9430 -2503 -15176 5989 8669 -52453 21868 51170 8398 13582 65598 61288 53219 -24392
7089 -24392 -2582 33808 -5858 -62988 -56040 20321 10887 33363 -7150 -69126 -24062 1662
7077 1662 3003 27934 5109 -13147 -32754 9272 40478 22366 -17659 2145 -3181 46432
7065 46432 3702 10235 12168 -58475 -60461 -39554 -26658 -67736 -5419 -60742 -55474 2049 21079
7052 21079 1476 13745 13483 8182 845 -10228 -16418 -5994 30349 16682 6056 13318 17125
7039 17125 -52136 -89171 -69917 19095 78643 15706 48022 59341 45126 75709 80413 23913
7027 23913 31926 -65232 -41726 834 -37268 -73203 -67354 -51235 -67426 -54523 -38852 -46170
7015d6170m3746K0638K3927O081L1846n3275k8047N0595J00762j48279J0290N9910
7003a5468j8792J3135R227N8239K0083m3138o6356p698k4976N0628M6905j2717
6991I072l6620j6548L7692K7889P233n6548p0219N6536J8243J271n011O5415j0360
6978B8045Q832k5421j2755m2448Q756J0917N7996k0865n7723L6937j7935l2972
6966e8636J2150j4445K5903k8155N0868L4163O649k8139p0346K8308M9670P311
6954A5301J8731K292m5208N6002L5896j6719M331j2200p2252J0593K7172j421
6942B2518J83l6225n071m5640O220M6853L4738o208l0318L0403k8343L447j8552
6929b5995l2896K2716K1554j2308j410l3312l1716O847N8141P0346q9447M102
$$ plain form
7015 -46170 -89916 -69278 -45351 -39270 -7424 -60699 -88746 -38151 62611 -85668 -75378 -15468
7003 -15468 -34260 -21125 -11898 46341 66424 23286 -43070 -50768 -75744 -25116 21789 9072
6991 9072 -27548 -44096 -6404 21485 28718 -27830 -98049 -41513 -23270 -21999 -27010 38405 28045
6978 28045 36877 11456 -1299 -43747 -34991 -24074 33922 13057 -44666 -7729 -25664 -58636
6966 -58636 -46486 -60931 -35028 -63183 -12315 21848 28497 358 -69988 -41680 7990 15301
6954 15301 34032 36324 -8884 47118 83014 66295 70626 58426 -13826 -3233 23939 22518
6942 22518 22701 -13524 -18595 -64235 -58015 -11162 23576 17368 -12950 17453 -10890 -7443 -25995
6929 -25995 -58891 -36175 -14621 -26929 -28339 -61651 -93367 -86520 -28379 41967 -47480 -43378
6917d3378Q4318o760n6247l5768L3653j6450J5387j7746K0631N3648n5585o2110
6905h6407O0382N0553j5537m4383O20p4842K4742N4732j9668Q0595n5207K9671
6893E251O8202l6960m376m4244m8750L9346P2171Q753j1566o5885J0748K0571
6881A3261n263R337J2278J3603L1614n0793l0162K730m3606N7960j3289m664j9851
6868b6845k5753o267R001P1640J6494k2520o1950K7873M3297j4759l5316n9406
6856h4511N4051J1206J3673m343K594K7580l6954J2804j6456K8244N671l4066
6844b0507L6932K0519l3036m9731K5725K5624L0250k3701j4250K3535L2775l2585
6832B1550m5061L2982J3373K0307l5141J5550P96j2605p173p301j5270K0342q829
$$ plain form
6917 -43378 40940 34180 -22067 -57835 -24182 -40632 -25245 -42991 -22360 31288 -24297 -86407
6905 -86407 -26025 24528 8991 -35392 -34772 -109614 -84872 -30140 -49808 30787 -24420 5251
6893 5251 73453 36493 32117 -12127 -60877 -21531 50640 59393 47827 -18058 -7310 13261
6881 13261 7998 17335 29613 43216 74830 24037 -6125 -3395 -47001 10959 -2330 -6994 -26845
6868 -26845 -52598 -58865 -49864 21776 38270 15750 -46200 -18327 24970 10211 -25105 -84511
6856 -84511 -30460 -19254 -5581 -9924 -7330 20250 -16704 -3900 -20356 7888 13559 -20507
6844 -20507 16425 36944 3908 -45823 -20098 5526 35776 12075 -2175 21360 54135 21550
6832 21550 -23511 9471 22844 43151 8010 23560 24356 11751 4578 -2723 -17993 2349 -6480
6819f480J9484J9083j00958k2J5357j3884Q25K7540L2429j3092o060J6502K292
6806f984n7923K6606L4876o3549J6144l5666N7159K5590M950L2534p1772N037
6794c2998L1655L4292q0163j7579L3792k9396L6009L6783j421J1621k8415P933
6782B113M0892l9996N5370K7603r401p9688l6525P9469R708k361q491m7878k1021
6769c0206M6946J7958N942K748K4429j3348P351o6521M4927P395l0941l5390l3070
6756e1780P4881o7857k059k54m17J2468K2720k9562l3219J9479P7353k299L118
6743B2572J7737p9732Q924k8575j767L1484k0635N6605N1596p7729M9367l8990
6731i143k6842O912k2764P6171l3832L0771m868j3949q193j9759O9327m0980j865
$$ plain form
6819 -6480 13004 32087 -68871 -68893 -53536 -67420 -66595 -39055 -6626 -19718 -25778 -9276 -6984
6806 -6984 -64907 -38301 -3425 -66974 -50830 -86496 -29337 -3747 1203 33737 -38035 -32998
6794 -32998 -1343 32949 -47214 -64793 -31001 -60397 -24388 12395 10974 22595 -5820 2113
6782 2113 43005 3009 58379 85982 76581 -3107 -39632 39837 49545 47184 38693 -9185 -30206
6769 -30206 16740 34698 40640 43388 67817 54469 61820 -4701 40226 47621 16680 -18710 -51780
6756 -51780 23101 -44756 -46815 -47069 -47486 -35018 -12298 -41860 -75079 -55600 21753 19454 22572
6743 22572 40309 -39423 -30499 -59074 -60841 -29357 -49992 6613 58209 -19520 29847 -9143
6731 -9143 -35985 -29073 -51837 24334 -9498 21273 16405 2456 -5737 -25496 43831 2851 986
6718I86J2298n92j398l7943K1799K7337M6098l7447L3657j7127Q553j4300q0076
6705c8155m1560J9627P9050j2045M444J6637k6153J2904M6195L5155K6901n8501
6693F4499l6132P27m7093M8825j8324o7263O7669o659K2558k7830P328n5966l2391
6680h0052N6281K5976l891j3615P87J4420O7016l1639o8575M3737J9902o6117
6668c5770j4378K6927R4104K3204k8360n9585L1064J4729k9311k2m238L6551K2104
6655G7019j4619J5070l9447J6296M9231m0286j1165M5082o0691m8567R494R677
6643G094j1048j5637J15331n0436k4989K354p542m0435K8304L8318n4294M5695
6631C2715L0344r512m3536M539j5805J2374N0540N0280k3380O861m5221M1823
$$ plain form
6718 986 13284 12692 11294 -26649 -4850 22487 68585 31138 64795 47668 56221 41921 -38155
6705 -38155 -79715 -60088 18962 6917 11361 27998 1845 14749 60944 96099 123000 64499
6693 64499 28367 29094 -17999 30826 12502 -54761 12908 6249 28807 977 8305 -47661 -80052
6680 -80052 -23771 2205 -1686 -15301 -14514 -94 66922 35283 -33292 10445 30347 -35770
6668 -35770 -50148 -23221 70883 94087 65727 6142 37206 51935 22624 22602 18364 54915 77019
6655 77019 62400 77470 38023 54319 103550 63264 52099 97181 36490 -12077 -2583 7094
6643 7094 -3954 -19591 95740 45304 20315 22669 15127 -25308 2996 41314 -12980 32715
6631 32715 63059 53547 10011 14550 -1255 11119 61659 111939 88559 95420 50199 92022
6619I2022O3534p968p5623k8480R571k6281J8917K9517L073m1368M8379l9907
6607D5386o1535l2101N0695K9210p001m72M0418K0087K129k063r7R077j6528j7019
6593F0186L2838m7544l9862P0950k4380J3468J1859o1874J7615J4151J1848j6708
6581D2547L975j1173N769L0875K3803j9929n3245K2653K4112K3767m0324k7221
6569B5609j7387p4978M546J16593K7243q9588J3649M3544k7784K6627J3055j1179
6557D9950O171J1643o372m506K367Q976j7865K1993k6947O9661O687M231J7913
6544A43902n0302k6002k9484k2962J1557N9579j9724K2597J1631K2746p3221l8219
6532A2098P4734J6474k0879j2933l248K5698j6460K8820j9121m141l9677j6688
$$ plain form
6619 92022 155556 147588 71965 43485 53056 26775 45692 75209 78282 36914 85293 45386
6607 45386 -16149 -48250 2445 31655 24654 24182 64600 84687 86816 84753 84656 93733 77205 60186
6593 60186 93024 45480 5618 76568 52188 65656 77515 15641 33256 47407 59255 42547
6581 42547 46522 35349 41118 71993 95796 75867 22622 45275 69387 93154 52830 25609
6569 25609 8222 -66756 -62210 54383 81626 -7962 5687 49231 21447 48074 61129 49950
6557 49950 56121 67764 61392 56886 59253 68229 50364 72357 45410 115071 121758 125989 143902
6544 143902 93600 67598 38114 15152 26709 86288 66564 89161 100792 123538 50317 12098
6532 12098 86832 103306 82427 69494 66246 91944 75484 104304 85183 81042 41365 24677
6520B4677l9779L7258N2816P682m9827L4005k5707K5096M8902l8263J8174J2439
6508A07473J1186j1152m0416L351K5849n0223K8908m6417j7242P241P0515j0936
6496G8137k4452j338r003O4719K1406Q487P974j6765k0453j3517m022K1238N243
6483A17654J880K267q980M450m625K0553j6753J9504N757M2864K5871j7066p0439
6470A22937n3729L601J8662O4407J9679l5530K8481M6167o2546k4177j380O946
6458A33518j1312R350L6584J7345N7672n2131L9494l2024m2906Q5323k1021j8445
6446B01447L5913l0689l4682p786L8365O2442M7419p6648L8917j4279n4150R190
6434B15459L968N0591q797l6599J5199j0389L7087L3264o956M8541l3545q2429
$$ plain form
6520 24677 -15102 22156 74972 82654 32827 66832 41125 66221 115123 76860 95034 107473
6508 107473 118659 107507 67091 70442 96291 46068 74976 28559 11317 18558 89073 78137
6496 78137 53685 52347 43344 108063 129469 137956 145930 129165 108712 95195 91173 112411 117654
6483 117654 119534 121801 112821 117271 112646 133199 116446 135950 141707 184571 210442 193376 122937
6470 122937 69208 72809 91471 155878 175557 140027 168508 214675 152129 127952 126572 133518
6458 133518 122206 131556 168140 185485 243157 191026 230520 198496 155590 240913 219892 201447
6446 201447 237360 206671 171989 164203 202568 265010 312429 235781 274698 260419 206269 215459
6434 215459 219427 270018 261221 224622 239821 229432 266519 299783 292827 341368 307823 225394
6422B25394J5864j0465J5869K9777O29J5560L9873n7288l3501O165N9189J197
6410C08263m2924N6258L6818k8921m715K6525k2459K4097j0091L9902O2572K1449
6398D66774o9324l0201j6014L7805M455K6631R383R887n202j0147K6143M8737
6386D98927J2982L1829k2046l2586J5008K4561j2928k1838K5550M6680j2779K7498
6374E80858k3762j6012K8896J2171J2820m0671k2029O7561M5460j58o9012M3200
6362F19322M6233K7844O55O4145P3825j0867k6868P124N5099L7425J9708k3934
6350H89711k4386J5163O0274P7442M2984j4800Q1454M5348L3128R6157N1296M4608
6338A398379L9054P2545R1330M5121j0058Q8351R2753R5626J24896J13904J00105
$$ plain form
6422 225394 241258 230793 246662 276439 277068 292628 332501 275213 241712 247877 307066 308263
6410 308263 265339 321597 358415 329494 324779 351304 328845 352942 342851 382753 445325 466774
6398 466774 397450 367249 351235 389040 393495 420126 429509 439396 434194 424047 450190 498927
6386 498927 511909 543738 521692 489106 504114 528675 515747 493909 519459 566139 553360 580858
6374 580858 557096 541084 569980 582151 594971 554300 532271 599832 645292 645134 576122 619322
6362 619322 665555 693399 694054 758199 832024 821157 794289 801413 856512 893937 913645 889711
6350 889711 865325 880488 940762 1018204 1061188 1046388 1127842 1173190 1206318 1302475 1353771 1398379
6338 1398379 1437433 1509978 1601308 1646429 1636371 1724722 1817475 1913101 2037997 2151901 2252006
6327B252006Q7571J16559J02468R4184Q5378J03595L0382k6842n463O0242N5721
6316B955801k5813J9618O1598N4563O3000J27072P8671R1057Q6315J35030Q2639
6305C729551J09308J41715J16634R5299M9563L5192p1785k7851p7350o0324j64042
6294C875910j13634q2906j29197j65643o9324r7338j10302j02316p3435m7462
6284B884353M4274n2105L3367R665o0449r679l8021p1910j06304o4872o9413q2933
6272B415973o5879j40222j35265j29645j09879j33823r7921r8929j08324l7877
6262A358209q8255n4863o8201n1083k3975p9976L1464o6205p5346p5756r0748
6251G15265M5866k9720n6241Q869l2998r660n3116k4470p474q932r167M339l4565
$$ plain form
6327 2252006 2339577 2456136 2558604 2652788 2738166 2841761 2872143 2845301 2839838 2900080 2955801
6316 2955801 2929988 2949606 3011204 3065767 3128767 3255839 3334510 3425567 3511882 3646912 3729551
6305 3729551 3838859 3980574 4097208 4192507 4242070 4277262 4205477 4177626 4100276 4039952 3875910
6294 3875910 3762276 3679370 3550173 3384530 3315206 3217868 3107566 3005250 2931815 2884353
6284 2884353 2928627 2876522 2909889 2919554 2859105 2849426 2811405 2739495 2633191 2568319 2498906 2415973
6272 2415973 2350094 2209872 2074607 1944962 1835083 1701260 1603339 1504410 1396086 1358209
6262 1358209 1269954 1215091 1146890 1095807 1071832 991856 1023320 957115 881769 806013 715265
6251 715265 761131 731411 675170 684039 651041 641381 588265 563795 556321 547389 538222 542561 507996
6238E07996k3336L43l5986k1699j2870l0711L7176K7913m3364l2135l1231k2964
6226C19132k2623K1353j5001L7515L060L9161l3605m1429j2597m942l8188J2656
6214B64492m408l0830J5417L9407j8863o6346j5230J08431k2362n6279j6420q0
6202A96929J7361n5220k8623L0424p120O6792J2271j6810j7696K6135J6891j1214
6190B30120J7563K6082n1721j1887M7486k3260p7262k5247K8206j5640k9726O2739
6178A77453L7076m2569j487o646J4535r978k6047K753n2080o5963R688J7468O254
6165F0457Q1728m2511m9692M1564K0510l4405K0098L9424k761O568l0323l2100
6153G8557j7980j9250R4378N0309n7898m5707K2609J6048k0163Q540Q364o124
$$ plain form
6238 507996 484660 485003 449017 427318 414448 383737 420913 448826 405462 373327 342096 319132
6226 319132 296509 317862 302861 340376 343436 382597 348992 307563 294966 290024 251836 264492
6214 264492 260084 229254 244671 284078 265215 198869 183639 292070 269708 213429 197009 196929
6202 196929 214290 159070 130447 160871 153751 220543 232814 216004 198308 224443 241334 230120
6190 230120 247683 273765 222044 210157 257643 234383 157121 131874 160080 144440 114714 177453
6178 177453 214529 171960 170473 163827 178362 168384 142337 145090 93010 27047 36735 54203 60457
6165 60457 142185 99674 49982 91546 112056 77651 97749 137173 134412 140980 110657 78557
6153 78557 60577 41327 135705 186014 128116 82409 105018 121066 100903 109443 117807 111683
6141A11683K6811K2060j4305r560j1457L5043m2054K8225j3545M8862j3171q0202
6129H8390j0244m2874L037R526m993K6915M0774K9455K8632k2334o8382k3429
6117E4473p882r558K6336L7442k0961M3079j1070m352r69J149J7426m4556k2736
6104E7821k6697j7646P2828m920L820K1783K9861k0695M1264j020l2856k5821
6092I7722m0792n401M0276M3543j7712m5539q141j849j305n3329M6994K3546N5960
6079A33973J3376R99J0297M094n0234L881Q2620o8804J7103O6205o802m6909n042
6066A54757m6998J7219K9604j8507l745j5922l6391M5257k7824M08R5862J1036
6054B04756m8166J0077m9363J9465n3844J5580K4659q655k1270N164m1661J8944
$$ plain form
6141 111683 138494 160554 146249 136689 125232 160275 118221 146446 132901 181763 168592 88390
6129 88390 78146 35272 38309 47835 42842 69757 110531 139986 168618 146284 77902 54473
6117 54473 46591 37033 63369 100811 79850 122929 111859 107507 106538 107687 125113 80557 57821
6104 57821 31124 13478 86306 81386 85206 106989 136850 116155 157419 156399 123543 97722
6092 97722 56930 51529 91805 135348 117636 72097 63956 62107 60802 7473 54467 78013 133973
6079 133973 147349 148348 158645 162739 112505 116386 199006 130202 147305 213510 206708 159799 154757
6066 154757 107759 124978 154582 136075 132330 116408 80017 125274 97450 97858 193720 204756
6054 204756 156590 166667 117304 136769 82925 98505 123164 114509 93239 98403 56742 75686
6042G5686M6405l3082p3933O0337L1041k6172j4915J0805j099L8086l5669k5481
6030E2009N1610k2099M3479Q94N1524q0022n623k0684k4276p59K4256N0655j977
6017A18987l551o5141N008j7230N0000M1963l3309K585J675M8927l0243k7627
6005I2044M8486M108N0360l629q2996J255Q193M9181k6978l528j8246l3809J3452
5992I7893j6169o376M556n480N9853l7323K2068L0144k8314M856J7025l0248O0147
5979A72632l8440n9042M7209K3981N685o2595K228L1566N0695K8138l6228k5180
5967A40649K2440K2703J1146m3063j1935M7603k655j1198k5375m4443K7943O017
5955A39832l1189L4564L6299j6538j8178r477K996m4256K5341j0635o654J6952
$$ plain form
6042 75686 122091 89009 15076 75413 106454 80282 65367 76172 75073 113159 77490 52009
6030 52009 103619 81520 124999 125893 177417 97395 91772 71088 46812 46053 70309 120964 118987
6017 118987 115436 50295 55303 38073 88073 130036 96727 99312 100987 149914 119671 92044
6005 92044 140530 144638 194998 191369 108373 109628 117821 167002 140024 136496 118250 84441 97893
5992 97893 81724 75348 79904 74424 134277 96954 119022 149166 120852 125708 142733 112485 172632
5979 172632 134192 75150 122359 146340 152025 89430 91658 123224 173919 202057 165829 140649
5967 140649 163089 185792 196938 153875 141940 189543 186888 175690 150315 105872 133815 139832
5955 139832 108643 143207 179506 162968 144790 135313 138309 94053 119394 108759 102105 119057
5943A19057l9272N2346J02602p8607p2240R519L1701K5551J0432n5144O3911j6672
5931A53184K1042O606o1817k3445l8547k4939Q6679K870L227K127K4226j4156
5919A37057m4742j0261J4162K5448n9302k6975J3880Q8960K1660M858l1053j0540
5907A23152L487m1279O1150N5040o9466M548M247K3546R67K0625K192o781k1383
5894A60045R598O06J4320K336j8453P795K0868k2575O076L5952n9662M640N0957
5881B12503J6232m0850l9427j764o6254P3195J0273p691L2959j6318j7448J5111
5869A70521J9293k201n4742J5490Q563K2316J800n120k3356j9818N4267P4341
5857B61354l7353n3821q07k4916J09186o3710j6685n4255j4842L9509l422l5705
$$ plain form
5943 119057 79785 132131 234733 156126 83886 93405 125106 150657 161089 105945 169856 153184
5931 153184 174226 180832 119015 95570 57023 32084 118763 121633 124860 126987 151213 137057
5919 137057 92315 82054 96216 121664 62362 35387 49267 138227 159887 164745 133692 123152
5907 123152 126639 85360 146510 201550 132084 136632 140879 164425 165392 186017 188209 181428 160045
5894 160045 169643 170249 184569 186905 168452 176247 197115 174540 180616 216568 156906 161546 212503
5881 212503 228735 187885 148458 146694 80440 153635 163908 156217 189176 172858 155410 170521
5869 170521 189814 187613 132871 148361 156924 179240 181040 175920 152564 132746 187013 261354
5857 261354 224001 170180 169373 144457 253643 189933 173248 118993 104151 143660 140238 104533
5845A04533L3633M0365l7201M9314O62M3157j3293M1163k5875N934O284n6269
5833A92407Q487p717k1209J516o451l397L3487M9831L022j0972L3932R000k9946
5820B51990q586l6656L1239O7508l3038Q7Q902k6442R064j8945J0859K8000J9919
5807C03901O1387n1568j482R341O434K6139j2235L148l0039m6947O9036k2185
5795C14930j0991J8598o1060L8003P0228o3520m2719N6843n8745k7552Q0342J6116
5783C30473Q2174m3608p3517K1450l0701J684N4770K7581Q308M1068J3518O923
5771D40123o3407r107K1482J3243k7171K8563P6167o8463N1210J6588m0883N510
5759D43855j6390J4264O4041m1615K7619Q694n3248p9L3371l165P9444q550n217
$$ plain form
5845 104533 138166 178531 141330 190644 191306 234463 221170 262333 236458 242392 248676 192407
5833 192407 200894 193177 171968 173484 167033 163636 197123 246954 249976 239004 272936 281936 251990
5820 251990 243404 206748 237987 305495 272457 272544 281446 255004 264068 245123 255982 283982 303901
5807 303901 365288 313720 312238 321579 328013 354152 341917 345065 315026 268079 337115 314930
5795 314930 303939 322537 261477 299480 369708 306188 263469 320312 261567 234015 314357 330473
5783 330473 412647 369039 295522 316972 286271 287955 342725 370306 378614 419682 433200 440123
5771 440123 376716 367609 389091 402334 375163 403726 479893 411430 462640 479228 438345 443855
5759 443855 427465 441729 505770 464155 491774 500468 447220 447141 480512 477347 556791 548241 543024
5746E43024R904R512o503o903m649J5445P0558M6556M2214j8534q6419m9948q154
5733E56103J8098P6920K8171L0914J3293L1181r298m0132m3881j1275j7438Q3908
5721G16564N1188l6664K1094K2482J2284P1680J3169L5254J4137J0939J2171k8564
5709I15734K8663N6182J905J2442L1001M0005l9079J1703J5567R234l5719Q6461
5697A134099K8786j2146l3513N8109J01836j0822K708N1869N800N2654P2565m5825
5685A406120M263J13053M0507n9773R8046R2216J8799M985M6897O4343J1139M0726
5673A881321P3875M9753Q2200N5836L5781R6076J05203J01288J45524P5240P1956
5662B774053J25896J75410J05652J13853J12249J33429R8523J51983N0015N6742
$$ plain form
5746 543024 552928 562440 555937 549034 544385 559830 630388 676944 719158 700624 614205 564257 556103
5733 556103 574201 651121 679292 710206 723499 754680 745382 705250 661369 650094 632656 716564
5721 716564 767752 731088 752182 774664 786948 858628 871797 907051 921188 932127 944298 915734
5709 915734 944397 1000579 1002484 1014926 1045927 1085932 1046853 1058556 1074123 1083357 1047638 1134099
5697 1134099 1162885 1150739 1117226 1175335 1277171 1266349 1269057 1320926 1326726 1379380 1451945 1406120
5685 1406120 1410383 1523436 1563943 1504170 1602216 1694432 1713231 1718216 1765113 1829456 1840595 1881321
5673 1881321 1955196 2004949 2087149 2142985 2178766 2274842 2380045 2481333 2626857 2702097 2774053
5662 2774053 2899949 3075359 3181011 3294864 3407113 3540542 3639065 3791048 3841063 3897805
5652C897805Q1965J3508Q696M0706J2095J3793K9126L4512J9889L0920K6679N0586
5640D260280J69309J13577R4065J06779J60351J89245J15590J28703J13446l7244
5630E414101K7271o3003r4413j26624k61216j38332j53737j17796j22762q4478
5620D279011r2274j09230j2619o0568p8986l0772L2958p0740j1760j7833n6513
5609C770674l0109r3915n6153m0296q1460j19569j18107n8493r8173j08681o1328
5598B904390p3957r7105k9550q4956o1757p2908m0461l0283o9183Q702j04949
5587B247983o6537L1839l4320p1373j06368J1692l2165k3782R9603k6400k7972
5576B002200O6391j7289R245M7116O94J5334P2881l9517k2794K5080O4324J06406
$$ plain form
5652 3897805 3979770 3993278 4001974 4042680 4054775 4068568 4097694 4132206 4152095 4183015 4209694 4260280
5640 4260280 4429589 4543166 4637231 4744010 4904361 5093606 5209196 5337899 5451345 5414101
5630 5414101 5441372 5378369 5283956 5157332 4896116 4757784 4604047 4486251 4363489 4279011
5620 4279011 4186737 4077507 4064888 4004320 3925334 3894562 3927520 3856780 3845020 3827187 3770674
5609 3770674 3740565 3646650 3590497 3550201 3468741 3349172 3231065 3172572 3074399 2965718 2904390
5598 2904390 2830433 2733328 2703778 2618822 2557065 2484157 2443696 2413413 2344230 2352932 2247983
5587 2247983 2181446 2213285 2178965 2107592 2001224 2012916 1980751 1956969 2056572 2030172 2002200
5576 2002200 2068591 2051302 2060547 2107663 2108357 2123691 2196572 2157055 2134261 2159341 2223665 2330071
5564B330071N545M283J1824J6111j3394K634P3951J0163P9527K9226j9731L4602
5552B564812Q8406L5137o9444N8038L8317O0579j4427K1366L5352l5549J3362
5541B795949R2956P7881j9206J9204M3340N5851R0484m48P3249J09966Q3396L1174
5529C453796j8076k3892L5386J1505L1898J7700N7540N9347Q1340L8993Q5737
5518C831274k574j815N5055L4924R3652J36256R3330P3939O4715K6054R3830O5630
5506D564270R8009R1058J21785O7468O4087J85096J10026J47006J30006J80257
5496E759068J40565J99257J62160K47201K15898K26985K39972J64318J78427O5980
5486G599831J44127K40237K59380K59298K02661J81699J64571O5219J05230J18121
$$ plain form
5564 2330071 2335616 2339899 2351723 2367834 2354440 2357074 2431025 2441188 2520715 2549941 2530210 2564812
5552 2564812 2653218 2688355 2618911 2676949 2715266 2775845 2761418 2782784 2818136 2782587 2795949
5541 2795949 2888905 2966786 2947580 2966784 3010124 3065975 3156459 3156011 3229260 3339226 3422622 3453796
5529 3453796 3435720 3411828 3447214 3458719 3490617 3508317 3565857 3625204 3706544 3745537 3831274
5518 3831274 3828700 3826885 3881940 3916864 4010516 4146772 4240102 4314041 4378756 4404810 4498640 4564270
5506 4564270 4662279 4753337 4875122 4942590 5006677 5191773 5301799 5448805 5578811 5759068
5496 5759068 5899633 6098890 6261050 6508251 6724149 6951134 7191106 7355424 7533851 7599831
5486 7599831 7743958 7984195 8243575 8502873 8705534 8887233 9051804 9117023 9222253 9340374
5476I340374J61814J84831J86248J20647J57826R3146R1295L8393K24969J72607
5466A0772150K11959K84083K14973J84654K68570K78526K27696K40660K53410
5457A2936681K77911L06769K84662L41199L22651M12448L89250L62265M21622
5448A6055458N16627N76619O13467O72463N78389O64035O55005P34132P87212
5439B1853407R15124J036571J117378J121726J005256J030624R76865J003865
5431C0060816J073288J113227J130090J029487J008273J129192J175678J358483
5423C9078534J396669J474747J456823J554680J506724J787399K120009K577874
5415E2953459K967389L483261L899306M466728N313234O331126P089990Q249061
$$ plain form
5476 9340374 9502188 9687019 9873267 9993914 10151740 10244886 10336181 10374574 10599543 10772150
5466 10772150 10984109 11268192 11483165 11667819 11936389 12214915 12442611 12683271 12936681
5457 12936681 13214592 13521361 13806023 14147222 14469873 14882321 15271571 15633836 16055458
5448 16055458 16572085 17148704 17762171 18434634 19013023 19677058 20332063 21066195 21853407
5439 21853407 22768531 23805102 24922480 26044206 27049462 28080086 29056951 30060816
5431 30060816 31134104 32247331 33377421 34406908 35415181 36544373 37720051 39078534
5423 39078534 40475203 41949950 43406773 44961453 46468177 48255576 50375585 52953459
5415 52953459 55920848 59404109 63303415 67770143 73083377 79414503 86504493 94753554
5407I4753554R631742J1589689J4047501J7033465K0876556K5952185L2891962
5400B26776654M2554790N3169736N5335280K5544508k6853608n6746839n7546879
5393B62233642m6533634l5982552k7875335k1970615j7141560j3413363j0724190
5386H8592393q853989p309962o200808n279692m618530l942473l403985k950919
5378D6032035k536046k180847k251400k360802k104295j766780j599498j530928
5370B9701439j414931j344030j316686j315794j182730j111946r40026r76083
5362B0099213r53846q40107p13457p27732o69674n82891n30128m96406m99269
5353A4085703n12499n51066m84003m04704n03862l55619l15553l28777k96022
$$ plain form
5407 94753554 104385296 115974985 130022486 147055951 167932507 193884692 226776654
5400 226776654 269331444 322501180 377836460 403380968 376527360 319780521 262233642
5393 262233642 215700008 179717456 151842121 129871506 112729946 99316583 88592393
5386 88592393 79738404 72428442 66227634 60947942 56329412 52386939 48982954 46032035
5378 46032035 43495989 41315142 39063742 36702940 34598645 32831865 31232367 29701439
5370 29701439 28286508 26942478 25625792 24309998 23127268 22015322 21075296 20099213
5362 20099213 19145367 18305260 17591803 16864071 16194397 15611506 15081378 14584972 14085703
5353 14085703 13573204 13022138 12538135 12133431 11629569 11273950 10958397 10629620 10333598
5344A0333598k95115k73830k78209k82137k15709k72648l27520k85513j84531
5335G918386k66304k25271k04859k36887k14734j43491p5098l6337j71766j32271
5325F211368j36816k34589j57308k00107j81907j46014k17905j24698r9283m7780
5315D664961k17115j73497j90299p0022l6536M1340M6025l9135j21516j52991
5305C751215l6511j08282q7947k9659M2400J1153j4571o0515q1811j44007q5078
5294C156387q9096r4390l2176K479n369j42732j14767o4348o8724r4984j15105
5283B337175j06752K5601j9221j9676r242j2609o2519m0604j9226q8639n7877
5272A926411j0334p8302n962p4576j1623P475j28467p4044K48l3044Q828N2776
$$ plain form
5344 10333598 10038483 9764653 9486444 9204307 8988598 8715950 8388430 8102917 7918386
5335 7918386 7652082 7426811 7221952 6985065 6770331 6626840 6551742 6515405 6343639 6211368
5325 6211368 6074552 5839963 5682655 5482548 5300641 5154627 4936722 4812024 4712741 4664961
5315 4664961 4447846 4274349 4084050 4014028 3977492 4018832 4064857 4025722 3904206 3751215
5305 3751215 3714704 3606422 3518475 3488816 3531216 3542369 3527798 3467283 3385472 3241465 3156387
5294 3156387 3067291 2972901 2940725 2943204 2937835 2795103 2680336 2615988 2547264 2452280 2337175
5283 2337175 2230423 2256024 2236803 2217127 2207885 2195276 2132757 2092153 2072927 1984288 1926411
5272 1926411 1916077 1837775 1831813 1757237 1745614 1753089 1624622 1550578 1550826 1517782 1526610 1579386
5260A579386l1314J5201m3847m0250k2928Q0076J013p5529l9335M4110q8022M3019
5248A421580l0162n1422k553n8269J2966K2742J6134k0278l0299j7686J2181j6143
5236A258791K7551j04605k6894M0437R250M7318J0521l8242m654P2068j0531j9658
5224A261352l3252l1725n8361J582M6225M596j8683J5084r703L5674p379j8915
5212A186495J4343r5808q4013M7012j5456j11244r3978L078M9143l963j7958p6347
5200H01304l4506j4515N0563J2186o6269m2901M6019K6955j6589K3629p3850j2731
5188F99295K2329L1975k922J3958M856p1233k2580J1707j829p5385J639R88L1279
5175F44077O5998m8229J7985l7478l9793L5387K1186p2216j5849N5858J5615m2718
$$ plain form
5260 1579386 1548072 1563273 1519426 1479176 1456248 1536324 1537337 1461808 1422473 1466583 1378561 1421580
5248 1421580 1391418 1339996 1337443 1279174 1292140 1314882 1331016 1310738 1280439 1262753 1274934 1258791
5236 1258791 1286342 1181737 1154843 1195280 1204530 1251848 1262369 1224127 1219473 1291541 1281010 1261352
5224 1261352 1228100 1196375 1138014 1139596 1185821 1190417 1171734 1186818 1177115 1212789 1205410 1186495
5212 1186495 1200838 1105030 1021017 1068029 1052573 941329 847351 850429 899572 895609 877651 801304
5200 801304 766798 752283 802846 815032 748763 705862 751881 778836 762247 785876 712026 699295
5188 699295 721624 753599 750677 764635 769491 698258 675678 687385 685556 610171 611810 612798 644077
5175 644077 710075 661846 679831 642353 602560 637947 659133 586917 571068 626926 642541 599823
5163E99823o0567k7595P234l9193M2006L6125L2001O6931p2199m3525l5039n7409
5151D48593L5053N4205M062K361o2785m3403K4068k234R1223p275l0362R940j00454
5138D22992M0649L4606L1268o2474k8071J06845r186j0698N588m8425l2423o510
5126D44161J7454K570K1807k9801l6572r393J6251k0810k2975L2860n3289J0436
5114C72699m765k8794Q803J8841k5275M3014k3283J6309J5851M876m0072o7199
5102B91005J12653k9327o8914m744J1029j8812L7104Q0902j286j07278L2022K058
5090C36412R887m2736J9886m6707N0778j7562l8096j9035Q663O286L6159O29q4947
5077B19617N8301M6192o984K792k1212j0460K4587l3405L7165m0025J4160N5887
$$ plain form
5163 599823 539256 511661 518895 479702 521708 557833 589834 656765 584566 541041 506002 448593
5151 448593 483646 537851 541913 544274 481489 438086 462154 459920 551143 543868 513506 523446 422992
5138 422992 463641 498247 529515 467041 438970 545815 536629 525931 531519 483094 450671 444161
5126 444161 461615 464185 485992 456191 419619 410226 426477 405667 382692 415552 362263 372699
5114 372699 367934 339140 347943 366784 341509 384523 361240 377549 393400 398276 358204 291005
5102 291005 403658 374331 305417 300673 311702 292890 329994 410896 409610 302332 334354 336412
5090 336412 346299 303563 323449 276742 327520 309958 271862 252827 261490 267776 303935 304564 219617
5077 219617 277918 324110 317126 319918 298706 288246 312833 279428 316593 276568 290728 346615
5065C46615l4917l0710m9160P615K8828m9099O0498J2526j5382k5779K2927M306
5053B78268n1617J5727J05884N9973p2544k6897J2608j4932l1905N850L6425j0785
5041C06055m5249q606j5271j2873M2520K5993K2657l6461m4246j9827J416Q469
5029B24577K9971n5324k4932L9520N3248m2137M0844L6125l9476k6164p5375k00
5017A60677m395J7503L6949K3822M4689k6957l250k4614K6483m6209K8980R0861
5005C24539n5717n7522o980J0646k8759M8180P969L1667l8060l0686l0867J8919
4993A93329L2485j4674K9941k4464J9020l3592K4111L2593N2117j3986j7947k3660
4981B55273k3277L2318j3951L4150k7294J6169l8256J8126J0096l7288M9675K1553
$$ plain form
5065 346615 311698 280988 231828 239443 268271 219172 279670 292196 276814 251035 273962 278268
5053 278268 226651 242378 348262 408235 335691 308794 321402 306470 274565 280415 316840 306055
5041 306055 260806 252200 236929 224056 266576 292569 315226 278765 234519 214692 216108 224577
5029 224577 254548 199224 174292 213812 267060 224923 265767 301892 262416 236252 160877 160677
5017 160677 156282 173785 210734 234556 279245 252288 249038 224424 250907 204698 233678 324539
5005 324539 268822 211300 204320 214966 186207 234387 242356 274023 235963 205277 174410 193329
4993 193329 225814 211140 241081 216617 235637 202045 226156 258749 310866 296880 278933 255273
4981 255273 231996 264314 250363 284513 257219 273388 235132 253258 263354 226066 275741 297294
4969B97294n5529j4372P9755j6269R093k4982M3996P6378k8420o5596k7336m612
4957B69400j7833m901J8252K2485M362N858J8540K9299p849R9430J1321L6327
4945D84691P0459Q1246L4127R7212J12489J04154J6842j07951r74j08338r6042
4934F87915q0883j22285j12010n3012K4425L2308j8865p2976k0781J3673M098
4923B81607J0312J037n0502L8202J6480p1074R689N2243p1249J1291J0228J1391
4911B49655K5929k2957l4411P0J3483N644L769O9038n9150n9882K2142q70k7616
4898A84844N1019Q3365o8230M9144m8434j7783q3662Q412L2040j096L3846K3201
4886B46666p751n3077m8943k4321J3245J5824M0105m1759o4004R4326J0971K8588
$$ plain form
4969 297294 241765 227393 307148 290879 299972 274990 318986 395364 366944 301348 274012 269400
4957 269400 251567 246666 264918 287403 291765 297623 316163 345462 337613 437043 448364 484691
4945 484691 555150 636396 670523 767735 880224 984378 1001220 893269 892295 783957 687915
4934 687915 607032 484747 372737 319725 344150 376458 357593 284617 263836 277509 281607
4923 281607 291919 292956 242454 280656 297136 226062 235751 287994 216745 228036 238264 249655
4911 249655 275584 252627 218216 218286 231769 237413 241182 310220 251070 191188 213330 212460 184844
4898 184844 235863 319228 250998 300142 251708 233925 150263 158675 190715 189619 223465 246666
4886 246666 238915 185838 136895 112574 125819 141643 181748 139989 75985 170311 181282 209870
4874B09870m7466K336L6290l6539K387J3044J2730n1333L1444J2007K9770l449
4862B11091o5168l9791K8180k328K8359o2797R948J4166O0817j2452j9986k0431
4850A29608M3730L0659j0796O3200q0166l0736j9154J7361j748J7717n917L5465
4838A89223J462m9787K1194J9097Q298n1220l4246O8063R2590n0698l4675j0470
4826A68831o9426O8842k0645J6002M8160J9016m8849l0993R5337M6890N637l6932
4814B61870k2998P3973r113j8412o8732O679P4651R2586m9872K797N450J280l1126
4801C19033J44N5683L0216J87357R0652R5207K2922M5850M3732r6612q4061n6661
4789F53462q7287r6086k6509n737j26043J7963L3191k0864p540Q659k8825K892
$$ plain form
4874 209870 162404 164740 201030 164491 166878 179922 192652 141319 172763 184770 214540 211091
4862 211091 145923 106132 134312 131984 160343 97546 107494 121660 182477 170025 150039 129608
4850 129608 173338 203997 193201 256401 176235 145499 126345 143706 141958 159675 153758 189223
4838 189223 190685 140898 162092 181189 189487 138267 104021 172084 264674 213976 179301 168831
4826 168831 99405 168247 147602 163604 211764 230780 181931 150938 246275 293165 298802 261870
4814 261870 238872 312845 303732 285320 216588 223267 297918 390504 340632 343429 348879 350159 319033
4801 319033 319177 374860 405076 592433 683085 778292 801214 847064 890796 794184 710123 653462
4789 653462 566175 470089 443580 437843 311800 329763 362954 342090 334550 343209 314384 317276
4777C17276o5391j8013k9039N3729L6409j7534J7829j9778p289j920m086l3936
4765B28257K505K3682m3265L571j870J195k8820J387J3258J9723o877k1608k4108
4752A67030J142j8766K7097N09m713K1983k2691j466L5889M7226o1568J7516M9058
4739B58246k6427J2741J7921R428j909J3159k4536m5183o437j9200O2648N1265
4727C01716m370K1602m0193k3491N1512K103L4454L1247o995m6494k8708j2241
4715B80142J5154J1676n300l4250J6036L0625L7840k3174K3693J3241M0110j3885
4703C91908K6735P5712l2411j9100Q422K6621N3202p8750N5125q6376Q7646P9645
4691E88379m3712M8920o1631N3612L0675m3029N5357L2204l5444k1896P4686j429
$$ plain form
4777 317276 251885 233872 204833 258562 294971 277437 295266 275488 268199 266279 262193 228257
4765 228257 230762 254444 211179 214750 212880 214075 185255 186642 199900 219623 212746 191138 167030
4752 167030 168172 149406 176503 177012 172299 194282 171591 170125 206014 253240 191672 209188 258246
4739 258246 231819 244560 262481 271909 270000 283159 258623 213440 207003 187803 250451 301716
4727 301716 297346 318948 278755 255264 306776 308879 343333 374580 367585 321091 292383 280142
4715 280142 295296 306972 301672 267422 283458 314083 351923 328749 352442 365683 405793 391908
4703 391908 418643 494355 461944 442844 451266 477887 531089 452339 507464 421088 508734 588379
4691 588379 544667 593587 531956 585568 616243 573214 628571 660775 625331 603435 678121 676692
4679F76692l8566k0814M9194O7914M281K2370M0444K7515k998J091K8947J0236
4667H66306K3158N2998L3745o649m5576Q5308J4580m9305M6310L8733l2524J02406
4655A129490O463k1823o1671R9124P4913n1933L3489K4935J9867J07335O7087
4644A427276k755P4080L5487M3386J23303P4835J9569J7969O1091J12196L542
4633A989979Q1432J7460P4185R1367O1210J30031J19250Q0391O8578J42768J48080
4622C004731J22050J54561J61541N4964J68634K02074K60688K51100K39565L64598
4612D984506M88662M61881N43791O26716O17462O31355N14287L38428L90303M30762
4602A0028153O16686Q01750R00281R06248O71796J82911j3607l2832K23234M00183
$$ plain form
4679 676692 638126 617312 666506 734420 738701 761071 801515 829030 826032 827123 856070 866306
4667 866306 889464 942462 976207 969558 923982 1009290 1023870 974565 1020875 1059608 1027084 1129490
4655 1129490 1135953 1114130 1052459 1151583 1226496 1174563 1208052 1232987 1252854 1360189 1427276
4644 1427276 1424521 1498601 1534088 1577474 1700777 1775612 1795181 1813150 1874241 1986437 1989979
4633 1989979 2071411 2088871 2163056 2254423 2315633 2445664 2564914 2645305 2713883 2856651 3004731
4622 3004731 3126781 3281342 3442883 3497847 3666481 3868555 4129243 4380343 4619908 4984506
4612 4984506 5473168 5935049 6478840 7105556 7723018 8354373 8868660 9207088 9597391 10028153
4602 10028153 10644839 11446589 12346870 13253118 13924914 14107825 14094218 14061386 14284620 14684803
4592A4684803O55075P60175M61763j17168o69857p90869p62064n57743j75440
4583A3488675N57j51590m03926p10552q71713q75291p74767n82041m81766m19332
4573H218254m48748n24620o00835p16266o27503n30428m32884l65937l23591k80274
4563C367168k03461k35983j66548j56160j33233j54026j32675q2072q3015r3733
4553A926262j32198k8265j28127q7719o7055n018n8429p7006J9327p2680j04320
4542A184772q5222j0296l5455j040m9563l7045j7822k7428k4811l6411l9616m962
4530H15101P227R377n9671n8190q3383L5928j0110J4605o8408k1111j0620J8079
4518E88824l8785r698J3204n0702l2124m9387J2755N8512j7960n3566R301K2172
$$ plain form
4592 14684803 15339878 16100053 16561816 16444648 15774791 14983922 14221858 13664115 13488675
4583 13488675 13489232 13337642 12933716 12223164 11351451 10476160 9701393 9119352 8637586 8218254
4573 8218254 7769506 7244886 6644051 5927785 5300282 4769854 4336970 3971033 3647442 3367168
4563 3367168 3163707 2927724 2761176 2605016 2471783 2317757 2185082 2103010 2019995 1926262
4553 1926262 1794064 1765799 1637672 1549953 1482898 1477880 1419451 1342445 1361772 1289092 1184772
4542 1184772 1099550 1089254 1053799 1052759 1003196 966151 948329 920901 896090 859679 820063 815101
4530 815101 822328 831705 772034 713844 630461 666389 656279 670884 602476 581365 570745 588824
4518 588824 550039 540341 553545 502843 470719 421332 434087 492599 474639 421073 430374 452546
4506D52546J2747Q18k2730o707m4255o4207O7751J0650j08561j2304m1020n959
4494B38769K0036l1061P550O24O6716m7824m2643k4857K4936J02526l6752O852
4482B84872j7785o2320K2770J7528k487m412n0821k6348o039J7510j5871J0612
4470A67209N0412m4315r144j6686M9734L1359l2323m0216n1744k2761K2005M3790
4458A47320k7675k9942J2807J8367M1645l73K4206k9659P246n4159K8458m6155
4446I2086R0827k937q3592J9337j5480J4643L8183r767m8012q938K8007l7045
4434G7312j0086l995R239L0807K9999k2129l708j2875l4104R2056j7027M1799
4422A77288n4539K2550l105j9188l3815K0608k9712l696L7005k8343l9241L5891
$$ plain form
4506 452546 465293 466111 443381 436674 392419 328212 395963 406613 298052 285748 244728 238769
4494 238769 258805 227744 235294 235918 302634 254810 212167 187310 212246 314772 278020 284872
4482 284872 267087 204767 227537 245065 242578 238166 187345 160997 154958 172468 156597 167209
4470 167209 217621 173306 164162 147476 197210 228569 196246 156030 104286 81525 103530 147320
4458 147320 119645 89703 102510 120877 162522 162149 186355 156696 163942 109783 138241 92086
4446 92086 182913 179976 96384 115721 100241 114884 153067 143300 95288 86350 114357 77312
4434 77312 67226 63231 72470 103277 133276 111147 107439 94564 60460 152516 135489 177288
4422 177288 122749 145299 142194 123006 89191 109799 80087 76391 113396 85053 45812 81703
4410H1703M1010l0842J8153p197L1643m0161m27J5910J4934k3419n8714M821P7357
4397A24771M1766m8174j2246K4430q5787M4199j6393M128K3384k5305L966J8026
4385I6765o129m4296N6526r072n4648O716k2896N5308M9406K5164J911j2124m3345
4372I9286J4201j848j08787J3173O0600J1669l5801Q222o8171k8274J12221J4126
4360I0617J006o0070j5244L5452l1762J0346l4598L568M9745j4641o0585l8498
4348f4664R0092P475k4152l9608m7189J54919m3095J9387k2613j2688L5308m4316
4336H856L6157N5445L6966j9497p7253J5755M8283J4084p0422K2378l4675j9801
4324A6276N4165N0896p068Q668o0406m4884k0582m03K0147j2084J8814M8100o408
$$ plain form
4410 81703 122713 91871 110024 102827 134470 94309 93882 109792 124726 101307 42593 47414 124771
4397 124771 166537 118363 106117 130547 44760 88959 72566 76694 100078 74773 78739 96765
4385 96765 90636 46340 102866 93794 39146 45862 22966 78274 127680 152844 154755 142631 99286
4372 99286 113487 111639 2852 16025 76625 88294 52493 60715 -7456 -35730 76491 90617
4360 90617 91623 31553 16309 51761 19999 30345 -4253 -685 49060 34419 -26166 -64664
4348 -64664 25428 32903 8751 -30857 -78046 76873 33778 53165 30552 17864 53172 8856
4336 8856 45013 100458 137424 117927 40674 56429 104712 118796 48374 70752 36077 16276
4324 16276 70441 121337 114269 122937 62531 17647 -2935 -3338 16809 4725 23539 71639 65231
4311F5231k0257K5163j3954j346L1270L0224o7583L1563M743k6251J0591M1479
4299A10873k6511R108o9736l3213R953K9671M8378K361L3309j276m7986N2713
4287A17644P954K462j7694J5253k168j9617K9946K4270J0012o7589L4211J9700
4275A54384l0173j9021k034n2093L3873M6636n7264O364K5041o577L6933L2020
4263A68089q6166M714k3319k0570K5068k2897j1687k3991k5091K9353L7038p755
4251D2786k7038J397l6343m6179K5670N2347Q410J9037l4571P544M1730q4974
4239c0184N1657L8802l6457l5089R2876p9845K9805M6652n5944n0771J6441K3474
4227A1417l5726M6760L8871M7371q081j2495o3562k851k6155o256j6224j5364
$$ plain form
4311 65231 44974 70137 56183 54837 86107 116331 48748 80311 85054 58803 69394 110873
4299 110873 84362 93470 23734 -9479 474 30145 78523 80884 114193 112917 64931 117644
4287 117644 125598 128060 110366 125619 123451 103834 133780 158050 168062 100473 134684 154384
4275 154384 124211 105190 103156 51063 84936 131572 74308 80672 105713 99136 136069 168089
4263 168089 81923 86637 63318 42748 67816 44919 33232 9241 -15850 13503 50541 42786
4251 42786 15748 17145 -19198 -65377 -39707 12640 21050 40087 5516 13060 54790 -30184
4239 -30184 21473 60275 23818 -11271 81605 1760 31565 78217 22273 -28498 -12057 11417
4227 11417 -24309 22451 61322 108693 100612 88117 24555 21704 -4451 -10707 -26931 -42295
4215d2295P6977M3688M7842p5967k2082K1314j6887m3890K4829k4574J4445J9974
4203B3374M6196K9362l0479r942K4324o3852r770J2215j4482k1386k9016J09187
4191F5731j9861P424n5302Q2439R74l9698o8341l276Q1671J3046j7012j9685k0845
4178G265J3601N8173L1220o8293j322J0043l9271J32L7095Q424l6787o9191K6945
4165b1966j5165L9378L2014k1948J0866k9872j617J2433O329k2672n1893M2329
4153b1784N4666p4810r30J8871l6200M710K0269k4258m4426J58N9653m4908K04
4140h8785j0442M0433L1581k2320J4700j1644O2118n275m545j9037J332l0902
4128d2786l9383O1956L25K7460L9242K1805J6722p8176o8504K5037O567L7999
$$ plain form
4215 -42295 34682 78370 126212 50245 28163 49477 32590 -11300 13529 -11045 3400 23374
4203 23374 69570 98932 68453 58511 82835 18983 9213 21428 6946 -14440 -43456 65731
4191 65731 45870 53294 -2008 80431 81405 41707 -26634 -29910 51761 64807 47795 28110 7265
4178 7265 20866 79039 110259 41966 40644 50687 11416 11548 48643 57067 20280 -48911 -21966
4165 -21966 -37131 2247 34261 12313 23179 -6693 -8310 4123 10452 -12220 -64113 -21784
4153 -21784 32882 -41928 -42858 -23987 -60187 -55477 -35208 -59466 -103892 -103734 -44081 -88989 -88785
4140 -88785 -99227 -58794 -27213 -49533 -34833 -46477 15641 10366 5821 -13216 -11884 -42786
4128 -42786 -82169 -20213 -19888 7572 46814 68619 85341 7165 -61339 -36302 -29735 8264
4116H264k073j8897M825q6197J0353J10651l7262m1625R338J0629J3275J667k3916
4103d0968K5835k8008q6523J26279Q053K4783O8245o9042l7890j3760l8730m452
4091f6178P9329k3680J9211L1078p0897k7787N3706j5356k943m879J8825R694
4079A23n034M0993K3168L690q355m1961J794m4715K7195l1303N5553M5985n3901
4066A3232K1690m8836J2681K2256j4245k4857J622j0995J1730M1525K2149j5031
4054C2921n347j2478K2447J0607j5852k7799J700L6297j8133j1627l3248J3607
4042f905m174K2782m5687Q073N833J1973q80p9698M3306K5956K2597N530l8957
4029c0251m1827K9760R439J2639j9972J2031J8353J0276Q990r187L3992m857J2785
$$ plain form
4116 8264 6191 -12706 -7881 -94078 -83725 26926 -10336 -51961 -42623 -31994 -18719 -17052 -40968
4103 -40968 -15133 -43141 -129664 -3385 4668 29451 97696 28654 -9236 -22996 -61726 -66178
4091 -66178 13151 -10529 8682 39760 -31137 -58924 -5218 -20574 -23517 -28396 -9571 123
4079 123 -4911 36082 59250 62940 54585 12624 14418 -30297 -3102 -34405 21148 67133 13232
4066 13232 34922 -13914 -1233 21023 6778 -18079 -16457 -27452 -15722 25803 47952 32921
4054 32921 27574 15096 37543 48150 32298 4499 6199 42496 24363 12736 -20512 -6905
4042 -6905 -11079 11703 -33984 -25911 -20078 -8105 -8985 -88683 -45377 -19421 3176 8706 -30251
4029 -30251 -72078 -42318 -32879 -20240 -40212 -28181 -9828 448 9438 251 34243 29386 42171
4016D2171j603n6779n1121P1494l4762M5578l2765o9786N1464L8188m776k1976
4004b4673o507L063L9049N3207k6833n7569L8086j1195K0970l007n652J1296L2738
3991F2973J638n9190j13156O7237Q947n926K7464j4732k569K2579k3255J4349
3979a3641N5133q519l4193o247q865n469L9898m3597J433L6543K2256l9307k5391
3966b9966L5199O1027o1096J3389k4432j5816J2739K525J1669l9014k3855L1765
3954b5866M6199J1356o713M831L8804n5632o6819J3072K2140j2549J1107K977
3942a7093L9086L2333J6480r6280M9172q633j4803j8662J4378J9445l7311m552
3930b6440L6371j635M9949k7615k763M2295k0357m973J303l1233n335n0775l0212
$$ plain form
4016 42171 40568 -16211 -67332 4162 -30600 14978 -17787 -87573 -36109 2079 -2697 -24673
4004 -24673 -31180 -28117 10932 64139 37306 -20263 17823 6628 27598 24591 18939 30235 62973
3991 62973 64611 5421 -107735 -40498 -31551 -37477 -10013 -24745 -27314 -4735 -27990 -13641
3979 -13641 41492 32973 -1220 -7467 -16332 -21801 18097 -25500 -24067 12476 34732 -4575 -29966
3966 -29966 5233 66260 5164 18553 -5879 -21695 -8956 -6431 5238 -33776 -57631 -25866
3954 -25866 20333 31689 24976 29807 68611 12979 -53840 -40768 -18628 -31177 -20070 -17093
3942 -17093 21993 54326 70806 -25474 23698 15065 262 -18400 -4022 15423 -21888 -26440
3930 -26440 9931 8296 58245 30630 27867 70162 49805 44832 46135 14902 9567 -41208 -71420
3917g1420Q9642L0627o500j2852k2216p802K0314L3510n9812L1274n2587l9608
3905f7430Q0633o2205k2312k053K281M4538N1142L5027l7983o26K9754n1103Q995
3892H658q878j7945m9049O5437l5919m2364K4559m3595r062O6523Q898n4978R234
3879g8481K5056M4164J6341r324J1834J6072K7150l5240J3472m3483M3160k2838
3867G883J029l3603J0977K8976l9709k313J9647l1394N167K3541j1133Q3400J2520
3854G4988p6742N731n741P689J0221j4725J8184n6404n0423O2101K8490Q967q149
3841D187n4010M8747K9892o7925m1779R573J3771Q1821n5885L447L2818j9867
3829a5210N8197n8045L8102M904k8401J5222l1335M1620P894k3804q346j5087
$$ plain form
3917 -71420 18222 48849 42349 29497 7281 -521 19793 53303 -6509 24765 -27822 -67430
3905 -67430 13203 -49002 -71314 -73367 -71086 -26548 24594 59621 21638 21012 50766 -337 8658
3892 8658 -220 -18165 -67214 -1777 -37696 -80060 -55501 -99096 -108158 -41635 -32737 -87715 -78481
3879 -78481 -53425 -9261 7080 -2244 9590 25662 52812 17572 31044 -12439 30721 7883
3867 7883 8912 -24691 -13714 15262 -24447 -26760 -7113 -38507 -33340 -9799 -20932 62468 74988
3854 74988 -1754 3977 -1764 5925 16146 1421 19605 -36799 -87222 -25121 3369 12336 4187
3841 4187 -49823 -1076 28816 -39109 -80888 -71315 -57544 24277 -31608 -28161 4657 -15210
3829 -15210 42987 -15058 23044 27948 -453 14769 -16566 25054 32948 9144 798 -14289
3817a4289L9222k3133L8746m646j1559l9258L2308M6893r696l8446l9021N7685
3805C4806k1477j3324j02j7442L2789J459L8778K1608j9466o8187q1319k327n935
3792a00139N4899M2680l0978j3345O7506p890K3138l9429j6315M8313m7080L2452
3780A3812O1708l1809P94j3084j466j2004N4008J5698m8361j7488J1418Q73M0797
3767G4896o2280J2355M5958j6760p1418N1823K9860k3762K3861j2886m7148M1702
3755D6201K0605q1628l2527J1198L3606J776j0780L552j2333L1796o4852L9831
3743a3555M8863j5487q449R932L0912n1013J9024J7864M3119j3425r016q971P762
3730E7560n8721m8057P1461K6069M929l3284L2053m125J0592o0985q67L4753m1801
$$ plain form
3817 -14289 24933 1800 40546 35900 24341 -14917 17391 64284 54588 16142 -22879 34806
3805 34806 13329 5 -97 -17539 15250 16709 55487 77095 57629 -10558 -91877 -94204 -100139
3792 -100139 -45240 -2560 -33538 -46883 20623 12733 35871 -3558 -19873 28440 -18640 13812
3780 13812 75520 43711 44505 31421 29955 17951 71959 87657 39296 21808 33226 34099 74896
3767 74896 12616 24971 70929 54169 -17249 34574 64434 40672 64533 51647 4499 46201
3755 46201 66806 -14822 -47349 -36151 -2545 -769 -11549 -7997 -20330 11466 -53386 -13555
3743 -13555 35308 19821 11372 21304 52216 1203 20227 38091 81210 67785 58769 49798 57560
3730 57560 -1161 -49218 22243 48312 53241 19957 52010 47885 58477 -2508 -3375 31378 -10423
3717a0423K9981n275J0403M1809O2335l691o4135J4306l7657K0519K727p6317
3705a5418J6566p06J4286r2917M9704J03741q552l5684K459P5231n2053n2283
3693D374J5342L5812r750j7360q897k6851M1116K8156Q353j5120O963n1031m481
3680F626r905N072L1608n378Q947j694L7759J6973l4147j8551r372k4244m3430
3667c9736O86p984P5972J9919m4887J961N9548l8040l4094P8380L879m0403l3899
3654A302J5006k0518L8281R0457m9353l4400m2060M2162l9258R861J5034J8696
3642D5210N9930K5881m8921m969L7663k7877l2393J7624k0548l5421o757J142
3630A0564l8263k6501j6794J6845N9492K5869j5624N1791Q470p4986r353j2425
$$ plain form
3717 -10423 19558 14283 24686 66495 128830 125139 61004 75310 37653 58172 60899 -15418
3705 -15418 1148 442 14728 -78189 -28485 75256 66704 31020 33479 108710 56657 4374
3693 4374 19716 55528 45778 28418 19521 -7330 33786 61942 70295 55175 62138 11107 6626
3680 6626 -3279 1793 33401 28023 36970 35276 73035 90008 55861 37310 27938 3694 -39736
3667 -39736 -39050 -47034 28938 48857 3970 5931 65479 27439 -6655 71725 75604 35201 1302
3654 1302 16308 -4210 34071 124528 75175 40775 -1285 40877 1619 11480 26514 45210
3642 45210 105140 131021 82100 77131 114794 86917 54524 72148 51600 16179 9422 10564
3630 10564 -27699 -54200 -70994 -54149 5343 31212 15588 67379 75849 863 -8490 -20915
3618b0915M77K4923N6769n6016p922M5027j2888J0111k5741l30k2300q292L1752
3605A4655q242M0692K2187k2989m7781l8434L9446K8091L5840N6893r248J8024
3593A29134q3956K766k2526j3728J266P1859r986o036P7179o1077m7366l4428
3581C101m1365j6634M9861O1781k4398P4112K6993L7594m4720M856M5046j3236
3569A62991l3894k2859m8269M7397L2637k2862m0632l2153j5605J6874L4363o8724
3557I264l0655j8026K8302M5231J2118K3493M4237j8215j8873l2885K5660N9786
3545A29437q698l2727K8534o3953J9727J14013j9966n3058k1007j5611p819k4570
3533D4302m1675L5194J8137N8926r433o1289M4359j7157P143j6103Q364J6700
$$ plain form
3618 -20915 -20438 4485 61254 5238 -2684 42343 29455 39566 13825 13495 -8805 -17097 14655
3605 14655 6413 47105 69292 46303 -1478 -39912 -466 27625 63465 120358 111110 129134
3593 129134 45178 47944 25418 11690 12956 84815 74829 68793 145972 84895 37529 3101
3581 3101 -38264 -54898 -5037 56744 32346 106458 133451 171045 126325 131181 176227 162991
3569 162991 129097 106238 57969 105366 138003 115141 74509 42356 26751 43625 77988 9264
3557 9264 -21391 -39417 -11115 34116 46234 69727 113964 95749 76876 43991 69651 129437
3545 129437 120739 88012 116546 52593 72320 186333 166367 113309 92302 76691 68872 44302
3533 44302 2627 37821 55958 114884 105451 44162 88521 71364 78507 62404 70768 87468
3521H7468M3469m1518n8501J5197n5959K1887j7760m606M3127J2567N5298k838
3509I7831j19m1124o950P0411j9171j619K984j7387J969Q887l5765J0420Q021
3496G8388k1866J7534j1836k9053N525l5445Q324N4703k3489j6171O0447M5452
3484A32513q056n0786l454n80n1619J9701K3832k6914J4739N755N076K2560M8246
3471A31013K5269l1970K8875J5888J2726p0344L2764l5104l61N3578o6980l3042
3459F2312L9182m227N5750n607n2365j1884O7417J574k5392k597o9654R845O3402
3446A27756K1866q2402r045L3915M8607N7626P031o6274M7317M9109k5630m876
3434B05000J3032o378K0120k5571J2022k5565m8216o528m6174O7072K5836k2422
$$ plain form
3521 87468 130937 89419 30918 46115 -9844 12043 -5717 -10323 32804 45371 100669 97831
3509 97831 97712 56588 49638 120049 100878 99259 102243 84856 86825 95712 59947 70367 78388
3496 78388 56522 74056 62220 33167 38692 3247 11571 66274 42785 26614 87061 132513
3484 132513 124457 73671 70217 69637 18018 37719 61551 34637 49376 55131 60207 82767 131013
3471 131013 156282 124312 153187 169075 181801 111457 144221 109117 108756 162334 95354 62312
3459 62312 101494 97267 153017 147410 95045 83161 150578 152152 126760 124163 54509 64354 127756
3446 127756 149622 67220 58175 92090 140697 198323 205354 139080 186397 235506 209876 205000
3434 205000 218032 211654 231774 206203 218225 192660 144444 137916 91742 158814 184650 162228
3422A62228L91K1126K9086m2881j1068Q423l9605j739p243n846M8282L885r4578
3409G0461k9578R634m81j6527M4359J6663K4968k6757O643o02j7769L3078o025
3396A08067n6703K5760J2231m3623M2744k6276j4271l9994J0881p449l232K3745
3384C1880m6671K4699J6716n220J9237k242O28l2591L3982M3620k8295m143O9762
3371A21362j7148K2903K0432O209K219n2884O8467L8451k2953L0129j7140l9548
3359A60499m9911K4501L6982L9137L7458n1515l6227J3130j5094M0499r891m5993
3347A43575j7398l5010l5097j6366M8678k7084m3078L8129L1300l3244K4013L559
3335H1977O203m1417j5841K8978J76K443j1339n669j6590r352M9278m2725L993
$$ plain form
3422 162228 162619 183745 212831 169950 158882 167305 127700 125961 118718 112872 161154 165039 70461
3409 70461 40883 50517 50036 33509 77868 94531 119499 92742 99385 98783 81014 114092 108067
3396 108067 51364 77124 89355 45732 88476 62200 47929 7935 18816 11367 8135 31880
3384 31880 -14791 9908 26624 21404 40641 38399 39027 6436 40418 84038 55743 51600 121362
3371 121362 104214 127117 147549 153758 155977 103093 171560 210011 187058 217187 200047 160499
3359 160499 110588 135089 172071 211208 248666 197151 160924 174054 158960 199459 189568 143575
3347 143575 126177 91167 56070 39704 88382 61298 18220 56349 87649 54405 78418 81977
3335 81977 88180 46763 30922 59900 60076 62519 51180 45511 28921 19569 68847 26122 30115
3322C0115K7205j4447L9745m4410n5661K0501J1993P280K9586o7517L5266K9769
3310D9425J4484J9160K4743L8111k9859r9355l7616p6374O7566N3821l8718N559
3298i053N1276j2189L6172O3914n4960n6875M0608j4980j01862L9491L7105K8724
3286D7371m5891K0539K3279l1283L0473j0406P846k2451J1362L2016k2183k549
3274C8123l6043J5521p231m312L3401J070n808j8375j5017K1480k8587J0813O7349
3261G2384k4300J1748M0649j32132K6035J303L4729M4375p2665L521m313K6172
3249B7506L1280L7985k0303k3297p706L9045l3814m6613J6948q298J8245l3529
3237b551L1076l4553j2770r137J6852K0410L6613L36N220K3227j8592m2813k4309
$$ plain form
3322 30115 57320 42873 82618 38208 -17453 3048 15041 22321 51907 -15610 19656 49425
3310 49425 63909 83069 107812 145923 116064 16709 -20907 -97281 -29715 24106 -14612 -9053
3298 -9053 42223 30034 66206 130120 75160 18285 58893 43913 -57949 -18458 18647 47371
3286 47371 1480 22019 45298 14015 44488 34082 41928 19477 30839 62855 40672 38123
3274 38123 2080 17601 10370 6058 39459 40529 34721 16346 1329 22809 -5778 5035 72384
3261 72384 48084 59832 100481 -31651 -5616 -4313 30416 74791 2126 5647 1334 27506
3249 27506 58786 96771 76468 53171 45465 84510 50696 4083 21031 12733 30978 -2551
3237 -2551 28525 -6028 -18798 -27935 -11083 9327 45940 46276 51496 74723 56131 13318 -10991
3224a0991J8482k9923j4224M4453O401K1412R639M409j096l8535K7283l0437K6588
3211C3461Q366L0864j9434m6810J96l1054J669R931q637J2229J1722L9463l694
3198C8272p7197M746L8070K56O003j0380m0335J0147l7663j7207M6461L0423M403
3185d001K7124o2682l674M9920J1700J8575j5592n3575k5518L7487L08N2486J1295
3172D3853l2842K1304J7526l4179j8592J202Q443j156K1228M22k7406l4994O0649
3159B5458j0818j3570J3059m6734N5415j4248m3292O5397P892K3482L341j5762
3147D9620k4709K2652J9571n4440M3219K8363k1832n7412K9675j6727J1845O2695
3135I2520k1983J5899L3409L7782q6751j0911N9614L5824K6809j354m4746n0498
$$ plain form
3224 -10991 7491 -22432 -36656 7797 14198 35610 45249 49658 48562 10027 37310 6873 33461
3211 33461 41827 72691 53257 6447 6643 -24411 -22742 -12811 -21448 -9219 2503 41966 38272
3198 38272 -38925 -34179 3891 4147 10150 -230 -40565 -30418 -68081 -85288 -38827 -8404 -4001
3185 -4001 23123 -39559 -43233 6687 18387 36962 21370 -32205 -57723 -20236 -19928 32558 43853
3172 43853 11011 32315 49841 15662 -2930 -1728 6715 5559 26787 27209 -197 -35191 25458
3159 25458 14640 1070 14129 -32605 22810 8562 -34730 30667 38559 62041 65382 49620
3147 49620 24911 47563 67134 12694 55913 84276 62444 5032 34707 17980 29825 92520
3135 92520 70537 86436 119845 157627 70876 59965 119579 155403 182212 180858 136112 85614
3123H5614M329N3753O7597l5392K2690m5438j12661L6854J5400K6703q741k0586
3111I0122j7267N7434K102o1699M8640K1774M2969o871j1179m9320K3973Q3170
3099B23848n4695j2011M177r732p5000J8886M2775M2382j3048l0313R072m8451
3087I7890l9554k9814J054N8984m0464k4304K7600L6433N6955o377j8962L6611
3075A56052j4435l1280k6124l397k3124L4407N237k9821N2127n3682Q4292k5913
3063A24339o1565r158q229M4150L8915k6018o2241l6398J1364J1243M5737r1039
3051a8900q099J8787L5170J026K5272Q398k8829o3477P9436k7347n7825O711j720
3038c1397L0987L8244M1237m5680j8795J461R5139q87k3100o3803j2772K3041
$$ plain form
3123 85614 89943 143696 211293 175901 198591 153153 40492 77346 92746 119449 110708 90122
3111 90122 72855 130289 132391 70692 119332 141106 184075 177204 166025 116705 140678 223848
3099 223848 169153 157142 161319 151587 76587 95473 138248 180630 167582 137269 146341 97890
3087 97890 58336 28522 29576 88560 48096 23792 51392 87825 144780 138403 119441 156052
3075 156052 141617 110337 84213 80816 57692 92099 97336 67515 119642 65960 150252 124339
3063 124339 62774 53616 45387 89537 128452 102434 40193 3795 15159 26402 72139 -18900
3051 -18900 -26999 -8212 26958 27984 53256 61654 32825 -30652 48784 21437 -36388 -29677 -31397
3038 -31397 -410 37834 79071 33391 14596 16057 111196 110309 87209 23406 10634 33675
3026C3675n76N416r812K7418K1586J1573r826n2063K7258m3182J4340K6802k9945
3013B2664M5063m6104r8601l5764L588P0421P3442k3711P434K7515n0571L0207
3001B5583K0495O6281o8292k7290j5699k1844K7725J5726K5410P213J4453j5371
2989E4390n544l4178j163m7068K0468J5988l4213M903k4529k949p635K4803k6600
2976f3327J6763O6750m5188J4194O3332j2103o8440n1025K7705L0928N6777O316
2964D2682j8028n4095J0693N8998p5199M095L6617K042k0058m2795k5407L3084
2952d7371J7484j4783O902P3951n7193m3197M465J4857k6030N691M2446o8186
2940i0964R9415l5053k7367P9682k1013l0842K5483K3294J3455j4184k1152O0584
$$ plain form
3026 33675 33099 38515 28703 56121 77707 89280 79454 27391 54649 11467 25807 52609 22664
3013 22664 67727 21623 -76978 -112742 -109154 -38733 34709 10998 18432 45947 -4624 25583
3001 25583 46078 112359 44067 16777 1078 -20766 6959 22685 48095 55308 69761 54390
2989 54390 48846 14668 13505 -33563 -13095 2893 -31320 -26417 -50946 -53895 -61530 -36727 -63327
2976 -63327 -46564 20186 -25002 -10808 52524 40421 -28019 -79044 -51339 -20411 36366 42682
2964 42682 24654 -29441 -18748 40250 -34949 -30854 5763 7805 -12253 -55048 -80455 -47371
2952 -47371 -29887 -44670 -37768 36183 -21010 -64207 -59742 -44885 -70915 -65224 -22778 -90964
2940 -90964 8451 -26602 -53969 25713 4700 -26142 -659 22635 36090 21906 754 61338
2928F1338J6470m5212n6602o3139J9108Q1910k2426K0170K0824p2262O09l696
2916d2908J5238j7105k7786p138J6688N2682k587o6157l2860M9633J1324N155
2904d5821k2780J9698m1889O2684K0875l1559N4815K4200j9366N362j8671j1647
2892d099r573j7577N1123K7317q5058l2938N4932J6699L2534k3300k0774k9392
2880d0106J313K4980q205O7323k5846k393M5334m0880n7190O7834j8598o203P144
2867A4507O321K7409n2468O207n3546J8933K5646j7485J5345P058o0937j9391
2855h2401Q9753K5673m3003k3542l0647N4634r096M7692K7324j9109r7866l6109
2843i6697K5607R6286m2248K0444J5917l3506j5734J1113K827M025J4359l8709
$$ plain form
2928 61338 77808 32596 -24006 -87145 -68037 13873 -8553 11617 32441 -39821 -39212 -42908
2916 -42908 -27670 -44775 -72561 -79699 -63011 -10329 -12916 -79073 -111933 -62300 -50976 -45821
2904 -45821 -68601 -48903 -90792 -28108 -7233 -38792 16023 40223 20857 26219 7548 -4099
2892 -4099 -13672 -31249 19874 47191 -37867 -70805 -15873 826 33360 10060 -10714 -40106
2880 -40106 -38793 -13813 -22018 45305 19459 17066 62400 21520 -35670 32164 13566 7363 14507
2867 14507 20828 48237 -4231 1976 -51570 -32637 -6991 -24476 -9131 -2073 -63010 -82401
2855 -82401 7352 33025 -9978 -33520 -64167 -9533 -18629 29063 56387 37278 -60588 -96697
2843 -96697 -71090 25196 -17052 3392 19309 -14197 -29931 -18818 -15991 -11966 2393 -36316
2831c6316L84j6004N505k0892k0102K3387K0994N6230k8010j5040J7557J2643
2819C36K9562k3516J3267k5773n910R82N5630j7318o2292j2176L4303L9176K6496
2806E2767k8801L6782j9205q4041j1999J4833r729L350k3653N4632J7188K2823
2794B4947k7369M4671j1043l8595j7765J9283k1360k319N1360k7082J900k4636
2782b8008q608N807L3712n0806K5916K1092j5056l0423M1312r559j9360O068Q200
2769a9713L9181J3935m9481j0387j4227j8253O8758n8334L9878l987P5741j8188
2757D4923k5713q306N1295Q08o1735j5574L285l6320K5742M1651j00518l522J4868
2744f9116J0808J6704k7974j0264L9035P918K438j124j6881O0749M5725m3495
$$ plain form
2831 -36316 -35932 -51936 -46431 -67323 -87425 -64038 -43044 13186 -14824 -29864 -12307 336
2819 336 29898 6382 19649 -6124 -12034 -11052 44578 27260 -35032 -47208 -12905 26271 52767
2806 52767 23966 60748 41543 -42498 -54497 -39664 -49393 -46043 -69696 -15064 2124 24947
2794 24947 -2422 42249 31206 -7389 -25154 -5871 -27231 -29550 21810 -5272 -3372 -28008
2782 -28008 -36616 -30809 2903 -47903 -21987 -895 -15951 -46374 -5062 -14621 -33981 -27913 -19713
2769 -19713 19468 33403 -16078 -26465 -40692 -58945 9813 -48521 -8643 -12630 63111 44923
2757 44923 19210 10904 62199 63007 1272 -14302 -11017 -47337 -21595 20056 -80462 -83984 -69116
2744 -69116 -58308 -41604 -69578 -79842 -40807 -32889 -30451 -31575 -48456 12293 58018 14523
2732A4523m4250LP476J2158K6847j2404l5038q1575K0854O6141N1260K373M1721
2719G0089k7115n3257k2156J1992l6497k6039J7859N3874p206k127R810j198l621
2706a5592n1634O3098N881m9831J4179J1192N6390o169K2106q2384L4730K5638
2694B7604k7921m8359p480L5084m984K9447N958m3534P7335j210p5462N7722J1275
2681C5475l1180n1597L072M9539M6874L843l8453n343O661k3345P2j9946q2652
2668a06980J8407P729J7441L835l0619K5393K0011K8556q89M94r661L1568l3715
2655b8430K6618n1043j3742K1260J9825Q8598o108j4643l6154q3924K0433L6729
2643b0581M7227j4010p143o821q7548K6211m391j3310O2400J4672J66K5827J9572
$$ plain form
2732 14523 -29727 -29724 -22248 -10090 16757 4353 -30685 -112260 -91406 -25265 25995 28368 70089
2719 70089 42974 -10283 -32439 -20447 -56944 -82983 -65124 -11250 -18456 -20583 -10773 -11971 -15592
2706 -15592 -67226 -4128 1753 -48078 -33899 -22707 33683 27514 49620 -32764 1966 27604
2694 27604 -317 -48676 -56156 -21072 -26056 3391 9349 -34185 43150 41940 -33522 24200 35475
2681 35475 4295 -47302 -44230 5309 52183 56026 17573 12230 18891 -4454 -4382 -24328 -106980
2668 -106980 -88573 -80844 -63403 -59568 -90187 -64794 -44783 -16227 -17116 -16622 -26283 5285 -28430
2655 -28430 -1812 -52855 -66597 -45337 -25512 63086 56978 42335 6181 -77743 -57310 -20581
2643 -20581 26646 12636 5493 -1328 -88876 -62665 -67056 -80366 -17966 -3294 -3128 22699 42271
2630D2271p1741m2032n221K724o1419K9528P3676O1564J2596o8306p8855P4943
2618c0272K2994J7325L5916r5773j2649M3365N2570J8651j10669L1258l1262k6524
2606h5070K9607k7260M355M1935J09772q2787J2500J2564J2653j0889K9058m5435
2594A003M0693L0561p6277m6886Q238l896L4811L9160j9924K9359O236n6851k4830
2581c8603M2011l986L6782R90J5261n3581N2322n4063J3295J4274n3524k3940
2569e2762J2194l0364o941k5704N5040N4371n3457L7009K9958M7321j8454n8134
2557i923m887m4035L54L1120j7981n6154k563P7766L3969l1950k1754Q0825k2185
2544A2602n5082O717L9582j7967m620L2292L8864r0642K4100K8061p6523J3192
$$ plain form
2630 42271 -29470 -71502 -76723 -73999 -135418 -105890 -32214 29350 41946 -26360 -105215 -30272
2618 -30272 -7278 10047 45963 -49810 -62459 -19094 33476 52127 -58542 -27284 -58546 -85070
2606 -85070 -55463 -82723 -78368 -36433 73339 -9448 3052 15616 28269 17380 46438 1003
2594 1003 41696 72257 -4020 -50906 -42668 -46564 -11753 27407 7483 36842 43078 -13773 -38603
2581 -38603 3408 -578 36204 37194 52455 -1126 51196 -2867 10428 24702 -28822 -52762
2569 -52762 -40568 -70932 -77873 -103577 -48537 5834 -47623 -10614 19344 66665 48211 -9923
2557 -9923 -14810 -58845 -58491 -27371 -45352 -101506 -104069 -26303 7666 -24284 -46038 34787 12602
2544 12602 -42480 -35763 3819 -14148 -18768 13524 52388 -38254 -14154 13907 -62616 -49424
2532d9424P4608J4150k8714o0959J4717J11472m3635j06053K1935J469j4071K1591
2520d2914J3451R14j0066k1635k7031J8120L7501M6072N805j63010M4821O7420
2508c0552q551N851O049J8598p6446M2753k457r270N4993k1540j0639J948L2797
2495C534m3662m1462O894N1647L0377K1314j1609p2969m1302M0759M6941k4118
2483c3656R714k010r401R336M4414K581o492J993o6907k5095N8205k1138K1598
2470a6858l4342n6042N1430k623K549R691P458K9345q187k3818m2232K7531m5541
2457a01639N6197R369n0816J0885m1291L3863J1187P3274k7612J0351L8658m5690
2445b3264l1922R065L1365N5822J2727l436k9088k5632k132m644j9140p1986J13402
$$ plain form
2532 -49424 25184 39334 10620 -50339 -35622 75850 32215 -73838 -51903 -50434 -64505 -42914
2520 -42914 -29463 -28549 -38615 -60250 -87281 -69161 -31660 14412 20217 -142793 -97972 -30552
2508 -30552 -39103 -33252 -27203 -8605 -85051 -42298 -44755 -54025 968 -20572 -31211 -29263 3534
2495 3534 -40128 -81590 -74696 -23049 7328 28642 17033 -55936 -97238 -56479 -9538 -33656
2483 -33656 -23942 -25952 -35353 -26017 18397 20978 14486 16479 -50428 -75523 -17318 -38456 -16858
2470 -16858 -51200 -107242 -55812 -58435 -55886 -46195 -38737 -9392 -17579 -41397 -83629 -56098 -101639
2457 -101639 -45442 -36073 -86889 -76004 -117295 -83432 -72245 1029 -26583 -16232 22426 -23264
2445 -23264 -55186 -46121 -14756 41066 53793 50357 21269 -4363 -6495 -11139 -30279 -102265 11137
2432A1137n512o2880O8179R238Q369m1335l5821k6633M8846P9941J5878o4828
2420D579n5249L3164M3831J1439l6366k5590m9314J784N3510J211l016j9587m0185
2407g9789J9660M6670j1692K4062k6275n714Q9639n534l6367j10815P3917L6242
2395A4004l2378j7202L1919K5228p685j1753J1025m3389k9203M0848q074m405
2383c1065j1334l3130J5092Q619M8648n112J4955J2122L0185m7214j6838m4685
2371e9757K7717P8419m7800J4951l5349j2856L2930k964j0596j2372n8540L8802
2359d7415m5135j783L0161K2209Q401O625l3343j721M6703J8256J6372l8718M5394
2346B6006K2041N472j9299n5725l0765q605k0440L5301K1401k021K2162k3838
$$ plain form
2432 11137 5625 -57255 10924 20162 28531 -12804 -48625 -75258 -26412 53529 69407 4579
2420 4579 -50670 -17506 26325 37764 1398 -24192 -73506 -71722 -18212 -17001 -20017 -39604 -79789
2407 -79789 -60129 -13459 -25151 -1089 -27364 -33078 56561 51027 14660 -96155 -22238 14004
2395 14004 -18374 -35576 -3657 21571 13886 2133 13158 -30231 -59434 -18586 -26660 -31065
2383 -31065 -42399 -75529 -60437 -51818 -3170 -8282 6673 18795 48980 1766 -15072 -59757
2371 -59757 -32040 46379 -1421 13530 -21819 -34675 -1745 -4709 -15305 -27677 -86217 -47415
2359 -47415 -92550 -94333 -64172 -41963 -33562 -26937 -60280 -62001 -15298 2958 19330 -19388 26006
2346 26006 48047 53519 34220 -21505 -52270 -60875 -81315 -46014 -24613 -26634 -4472 -28310
2334b8310R5481q3346m6459M2318j5388L5453k6819r061N599k7710j1107O7791
2322a558N786j6950O1525J9219m096n3838M6816k1137n3992j7146O9673l2418
2310A884L5253j1258k3476Q599n2702M385j4079N6717Q272k7084k2660L1698P6178
2297G1727l5310o7368m9835j3892M2572N8462l2792n8961j5661L3817L6659j00
2285c0682p641K9370L4828k6584j8384m695m6388k4504O3167m872k685k4065J1527
2272e1608J7145L9790n371k4027m8123j5736L8916K3608N8964m1026l791O5602
2260E4343P389j6731k9900l2373J3311L7634J592n3826n1076K1736K1864J2797
2248a3240P1960P998l8248l6568L1955l4508j2036N0955K5152j555o0715n026
$$ plain form
2334 -28310 67171 -16175 -62634 -20316 -35704 -251 -27070 -36131 -30532 -58242 -69349 -1558
2322 -1558 4228 -12722 48803 68022 63926 10088 56904 35767 -18225 -35371 34302 1884
2310 1884 37137 25879 2403 11002 -41700 -37315 -51394 5323 13595 -13489 -36149 -4451 71727
2297 71727 36417 -30951 -80786 -94678 -52106 6356 -26436 -85397 -101058 -67241 -30582 -30682
2285 -30682 -38323 -8953 25875 -709 -19093 -23788 -70176 -94680 -31513 -36385 -39070 -63135 -51608
2272 -51608 -34463 5327 -44 -24071 -72194 -87930 -49014 -25406 33558 -7468 -11259 54343
2260 54343 61732 45001 15101 -17272 -3961 33673 35265 -18561 -69637 -47901 -26037 -13240
2248 -13240 58720 66718 28470 -8098 23857 -10651 -22687 28268 53420 51865 -8850 -13876
2236a3876m9492j6624M0993J1628l8578j9505L8544j2166L72J1884O6402N4692
2224G4274q9183j8244j4156n29J3074n824k5086L0714L8246p5848L1440L0870
2212a0252m1715K9370k5197j1366K8777n2751L7650M6838k3839J0692k7124O4211
2200B5294R295M897n3865k0201Q429J0535P735l029k6029j0942N8862k6332n0069
2187f5420K7373L2152K9592m8308m0207K0473J1288J9311k7919j0336k3199N0081
2175b5119n0897N6936j9777l5656J2033l0172R6251L774K8479j7783o1512L7962
2163e481J2611L3772J1315q4903O5061K544O207p1940j8048K3686j5715m254M9048
2150C903K4476J8846n098q0450J686N185L084L9611K5729m2121j8511L5040L7492
$$ plain form
2236 -13876 -63368 -79992 -38999 -27371 -65949 -85454 -46910 -59076 -58704 -46820 19582 74274
2224 74274 -14909 -33153 -47309 -47838 -34764 -40588 -65674 -34960 3286 -72562 -41122 -10252
2212 -10252 -51967 -22597 -47794 -59160 -30383 -83134 -45484 1354 -22485 -11793 -38917 25294
2200 25294 34589 39486 -14379 -34580 -26151 -15616 -7881 -10910 -36939 -47881 10981 -15351 -65420
2187 -65420 -38047 -5895 23697 -24611 -64818 -44345 -33057 -13746 -41665 -52001 -75200 -25119
2175 -25119 -76016 -19080 -38857 -74513 -62480 -92652 3599 7373 35852 18069 -43443 -5481
2163 -5481 7130 40902 52217 -32686 32375 34919 41126 -30814 -48862 -25176 -40891 -45145 3903
2150 3903 28379 47225 42127 -38323 -36637 -31452 -28368 11243 36972 -5149 -23660 11380 48872
2137D8872L2244o3164p2856M5026m1128j49J6632M157K6564k0091L5344K7770
2125C9221m5488n4551l72K7874l74J0312K1561o1907m660M2196j5349O690l4475
2112f9322L4192j5737Q687K5415j236k7803J6574j4607J9487K6403K8035l0140
2100e2j6707J4159J0072p0641j5528P3815M7158o0890m6959M2705j2398l347J7296
2087b1317R342K9958J7652K7707p2954k0460P745L3317M4724p4034j2962K8985
2075b297K4017K183R620p868k2171J5102j2316K6743l74k9871k5788n3178l2911
2062a09109P1769O6147n3980k3303M4737j889M1731k4661n3615R7104p1968j5395
2050c2432K3578j8794j8089L5060M2673r67l2028J6505l1469N4871K4071l8204
$$ plain form
2137 48872 81116 17952 -54904 -9878 -51006 -51155 -34523 -30366 -3802 -23893 11451 39221
2125 39221 -6267 -60818 -61190 -33316 -33690 -23378 -1817 -63724 -68384 -26188 -41537 -34847 -69322
2112 -69322 -35130 -50867 -42180 -16765 -18001 -45804 -29230 -43837 -24350 2053 30088 -52
2100 -52 -16759 -2600 7472 -63169 -78697 -4882 42276 -18614 -65573 -22868 -35266 -38613 -21317
2087 -21317 -11975 17983 35635 63342 -9612 -30072 -22327 10990 55714 -18320 -31282 -2297
2075 -2297 21720 23903 33523 25655 3484 18586 6270 33013 32639 2768 -23020 -76198 -109109
2062 -109109 -37340 28807 -25173 -48476 -3739 -5628 36103 11442 -42173 54931 -17037 -32432
2050 -32432 -8854 -27648 -45737 -10677 31996 31029 -999 15506 -15963 38908 62979 24775
2038B4775k6663J4247M3208l5144n1024J5034J2548K1416k7770J2012K1319m2481
2026a8523J770J3885p601q359K6290o3628L0938L0958r7397o160R4306j4808k5640
2013d3969M967K4047N1712o6175j2764J10362L4557m7201l2879L989J5870K998
2001D5514m986P307q20j307k5351l9116j1351M8284j7962J4718J2176q133l6427
1988a7454J1718L1966j4340j2670L9017l9712p1780L785K1256N4374l5191k6676
1976e5707m5768M8276N2151p381j5912J9078q230M8428Q978n9939l9772O4570
1964H772l5467O4326r292p2223L6880k54n8077P763P3265m7258K9878j1714p3262
1951h6663q443Q7384l4001k4295O7492m5135J1921L4299L2138q2966J4569k340
$$ plain form
2038 24775 -1888 12359 55567 20423 -30601 -15567 -3019 18397 -9373 2639 23958 -18523
2026 -18523 -16753 -2868 -10469 -18828 7462 -56166 -25228 5730 -91667 -97827 -3521 -18329 -43969
2013 -43969 -39002 -14955 36757 -29418 -42182 68180 102737 55536 22657 26646 42516 45514
2001 45514 40528 47835 47015 45708 20357 -18759 -30110 18174 212 14930 27106 18973 -17454
1988 -17454 -5736 26230 11890 -780 38237 -1475 -73255 -69470 -48214 6160 -29031 -55707
1976 -55707 -101475 -53199 -1048 -8429 -24341 -5263 -13493 34935 43913 -16026 -55798 8772
1964 8772 -26695 37631 28339 -43884 -7004 -7258 -65335 -57572 15693 -31565 -1687 -13401 -86663
1951 -86663 -95106 -7722 -41723 -66018 1474 -43661 -31740 2559 34697 -48269 -33700 -36040
1939c6040j0746O3018l7167l3137k7862P439j7855N8401k9293M9888l8115k5792
1927g7261K0813N8405j6478j6301j0625L383R922K7510m1314k4738Q4611p9603
1915f1676n7597j8160O6937l3701O3727M0649j2169j0573p173M37M4326j8056
1903c029K560k3498k7976j677K3957Q6256q6891P773J7837M8131J4078j2965m7812
1890c256P6729m3783j6475p866j4366m9888l3925O0431o621l333n1870o660k3928
1877a24811P1906K8423O2358k1323J4972n7947k3254M916p812r640K8805O432
$$ plain form
1939 -36040 -46786 16232 -20935 -54072 -81934 -74495 -92350 -33949 -63242 -13354 -51469 -77261
1927 -77261 -56448 1957 -14521 -30822 -41447 -38064 -28142 -632 -41946 -66684 17927 -61676
1915 -61676 -119273 -137433 -70496 -104197 -40470 179 -11990 -22563 -29736 -29299 15027 -3029
1903 -3029 -469 -23967 -51943 -53620 -29663 56593 -30298 -22525 -4688 43443 57521 44556 -3256
1890 -3256 73473 29690 13215 5349 -9017 -58905 -92830 -32399 -39020 -42353 -94223 -100883 -124811
1877 -124811 -52905 -24482 37876 16553 31525 -26422 -49676 -44760 -52572 -62212 -33407 -26975
$$ [...]
##END NTUPLES=NMR SPECTRUM
##END=
