##TITLE=1H_CG-1193-b
 DMSO-d6
 8 sc, 
 5.3.2024
##JCAMPDX= 6.0         $$ Bruker NMR JCAMP-DX V2.0
##DATA TYPE= NMR SPECTRUM
##DATA CLASS= NTUPLES
##ORIGIN= UXNMR, Bruker Analytische Messtechnik GmbH
##OWNER= root
$$ XWIN-NMR		Version 3.5
$$ Tue Mar  5 14:21:23 2024 Russian Standard Time (UT+4h)  she@DPX200
##.OBSERVE FREQUENCY= 200.1313
##.OBSERVE NUCLEUS= ^1H
##.ACQUISITION MODE= SIMULTANEOUS
##.ACQUISITION SCHEME= undefined
##.AVERAGES= 8
##.DIGITISER RES= 18
##SPECTROMETER/DATA SYSTEM= spect
##.PULSE SEQUENCE= zg30
##.SOLVENT NAME= CDCl3
##.SHIFT REFERENCE= (INTERNAL, CDCl3, 0, 15.4064)
##AUDIT TRAIL= $$ (NUMBER, WHEN, WHO, WHERE, WHAT)
$$ ##TITLE= Audit trail, XWIN-NMR		Version 3.5
$$ ##JCAMPDX= 5.01
$$ ##ORIGIN= Bruker BioSpin GmbH
$$ ##OWNER= she
$$ F:/spectra/data/she/nmr/H-F/1/pdata/1/auditp.txt
$$ ##AUDIT TRAIL=  $$ (NUMBER, WHEN, WHO, WHERE, WHAT)
(   1,<2024-03-05 14:20:29.12 +0400>,<she>,<DPX200>,
      <created by zg, POWCHK disabled, PULCHK disabled
       configuration hash MD5:
       00 E9 B6 7A A2 85 ED C7 34 08 36 98 17 FE 4E 26
       data hash MD5: 16K
       02 8E 22 CC C6 0B 54 84 93 AE DA C7 96 FC 0E BD>)
(   2,<2024-03-05 14:20:31.43 +0400>,<she>,<DPX200>,
      <Start of raw data processing
       efp BC_mod = 2 LB = 0.24 FT_mod = 6 PKNL = 1 PHC0 = -24944.34 PHC1 = 7.65264 SI = 16K 
       data hash MD5: 16K
       14 39 C4 3A DA FA 1B E9 3A 5E B8 EB 0C 2A F7 C9>)
(   3,<2024-03-05 14:20:46.39 +0400>,<she>,<DPX200>,
      <pk PHC0 = -3.043152 PHC1 = 2 
       data hash MD5: 16K
       12 9F F8 95 EC 19 D5 B5 3B 99 54 3D 78 FA 0D A8>)
(   4,<2024-03-05 14:20:50.23 +0400>,<she>,<DPX200>,
      <abs ABSG = 5 
       data hash MD5: 16K
       66 98 0D 66 02 86 E3 7F 51 2F 80 5A ED D3 D6 81>)
$$ ##END=
$$ 
$$ hash MD5
$$ 84 50 77 49 37 C0 64 93 C7 87 7B E3 8D 51 B6 DB
##$RELAX= 
##$RELAX= 
##$RELAX= 
##$RELAX= 
##$RELAX= 
##$RELAX= 
$$ Bruker specific parameters
$$ --------------------------
##$DU= <F:/spectra>
##$EXPNO= 1
##$NAME= <H-F>
##$PROCNO= 1
##$TYPE= <nmr>
##$USER= <she>
##$AMP= (0..31)
100 100 100 100 100 100 100 100 100 100 100 100 100 100 100 100 100 100 
100 100 100 100 100 100 100 100 100 100 100 100 100 100 
##$AQSEQ= 0
##$AQ_mod= 1
##$AUNM= <au_zg>
##$AUTOPOS= <>
##$BF1= 200.13
##$BF2= 200.13
##$BF3= 200.13
##$BF4= 200.13
##$BF5= 200.13
##$BF6= 200.13
##$BF7= 200.13
##$BF8= 200.13
##$BYTORDA= 1
##$CFDGTYP= 0
##$CFRGTYP= 5
##$CHEMSTR= <none>
##$CNST= (0..31)
1 1 145 1 1 1 1 1 1 1 1 1 1 1 1 1 1 1 1 1 1 1 1 1 1 1 1 1 1 1 1 1 
##$CPDPRG= <>
##$CPDPRG1= <>
##$CPDPRG2= <>
##$CPDPRG3= <>
##$CPDPRG4= <mlev>
##$CPDPRG5= <mlev>
##$CPDPRG6= <mlev>
##$CPDPRG7= <mlev>
##$CPDPRG8= <mlev>
##$CPDPRGB= <>
##$CPDPRGT= <>
##$D= (0..31)
0 1.2 0 0 0 0 0 0 0 0.06 0 0.03 0 0 0 0 0.0002 0 0 0 0 0 0 0 0 0 0 0 0 
0 0 0 
##$DATE= 1709634028
##$DBL= (0..7)
120 120 120 120 120 120 120 120 
##$DBP= (0..7)
150 150 150 150 150 150 150 150 
##$DBP07= 0
##$DBPNAM0= <>
##$DBPNAM1= <>
##$DBPNAM2= <>
##$DBPNAM3= <>
##$DBPNAM4= <>
##$DBPNAM5= <>
$$ [...]
##$SUBNAM3= <"">
##$SUBNAM4= <"">
##$SUBNAM5= <"">
##$SUBNAM6= <"">
##$SUBNAM7= <"">
##$SUBNAM8= <"">
##$SUBNAM9= <"">
##$SW= 18.0517328524113
##$SWIBOX= (0..15)
0 0 2 0 0 0 0 0 0 0 0 0 0 0 0 0 
##$SW_h= 3612.71676300578
##$TD= 16384
##$TD0= 1
##$TE= 0
##$TE2= 300
##$TE3= 300
##$TEG= 300
##$TL= (0..7)
0 120 120 120 120 120 120 120 
##$TP= (0..7)
150 150 150 150 150 150 150 150 
##$TP07= 0
##$TPNAME0= <>
##$TPNAME1= <>
##$TPNAME2= <>
##$TPNAME3= <>
##$TPNAME4= <>
##$TPNAME5= <>
##$TPNAME6= <>
##$TPNAME7= <>
##$TPOAL= (0..7)
0.5 0.5 0.5 0.5 0.5 0.5 0.5 0.5 
##$TPOFFS= (0..7)
0 0 0 0 0 0 0 0 
##$TUNHIN= 0
##$TUNHOUT= 0
##$TUNXOUT= 0
##$USERA1= <user>
##$USERA2= <user>
##$USERA3= <user>
##$USERA4= <user>
##$USERA5= <user>
##$V9= 5
##$VALIST= <valist>
##$VCLIST= <CCCCCCCCCCCCCCC>
##$VD= 0
##$VDLIST= <DDDDDDDDDDDDDDD>
##$VPLIST= <PPPPPPPPPPPPPPP>
##$VTLIST= <TTTTTTTTTTTTTTT>
##$WBST= 1024
##$WBSW= 4
##$XGAIN= (0..3)
0 0 0 0 
##$XL= 0
##$YL= 0
##$YMAX_a= 151769
##$YMIN_a= -166920
##$ZGOPTNS= <>
##$ZL1= 120
##$ZL2= 120
##$ZL3= 120
##$ZL4= 120
##$ABSF1= 15.40643
##$ABSF2= -2.645417
##$ABSG= 5
##$ABSL= 3
##$ALPHA= 0
##$AQORDER= 0
##$ASSFAC= 0
##$ASSFACI= 0
##$ASSFACX= 0
##$ASSWID= 0
##$AUNMP= <proc_1d>
##$AZFE= 0.1
##$AZFW= 0.1
##$BCFW= 0
##$BC_mod= 2
##$BYTORDP= 0
##$COROFFS= 0
##$CY= -3
##$DATMOD= 1
##$DC= 0
##$DFILT= <>
##$DTYPP= 0
##$F1P= 0
##$F2P= 0
##$FCOR= 1
##$FTSIZE= 16384
##$FT_mod= 6
##$GAMMA= 0
##$GB= 0
##$INTBC= 1
##$INTSCL= 3.70164e-10
##$ISEN= 128
##$LB= 0.24
##$LEV0= 0
##$LPBIN= 0
##$MAXI= 10000
##$MC2= 0
##$MEAN= 0
##$ME_mod= 0
##$MI= 1.114404
##$NCOEF= 0
##$NC_proc= -7
##$NLEV= 6
##$NOISF1= 3.799351
##$NOISF2= 2.8
##$NSP= 0
##$NTH_PI= 0
##$NZP= 0
##$OFFSET= 15.40643
##$PC= 1
##$PHC0= -24947.38
##$PHC1= 9.652639
##$PH_mod= 1
##$PKNL= yes
##$PPARMOD= 0
##$PSCAL= 0
##$PSIGN= 0
##$REVERSE= no
##$SF= 200.130023068741
##$SI= 16384
##$SIGF1= 3
##$SIGF2= 2
##$SINO= 5.538805
##$SIOLD= 16384
##$SREGLST= <1H.CDCl3>
##$SSB= 0
##$STSI= 16384
##$STSR= 0
##$SW_p= 3612.71676300578
##$SYMM= 0
##$S_DEV= 0
##$TDeff= 16384
##$TDoff= 0
##$TI= <>
##$TILT= no
##$TM1= 0
##$TM2= 0
##$TOPLEV= 0
##$USERP1= <user>
##$USERP2= <user>
##$USERP3= <user>
##$USERP4= <user>
##$USERP5= <user>
##$WDW= 1
##$XDIM= 16384
##$YMAX_p= 453975136
##$YMIN_p= -765626
$$ End of Bruker specific parameters
$$ ---------------------------------
##NTUPLES= NMR SPECTRUM
##VAR_NAME=  FREQUENCY,     SPECTRUM/REAL,   SPECTRUM/IMAG
##SYMBOL=    X,             R,               I
##VAR_TYPE=  INDEPENDENT,   DEPENDENT,       DEPENDENT
##VAR_FORM=  AFFN,          ASDF,            ASDF
##VAR_DIM=   16384,         16384,           16384
##UNITS=     HZ,            ARBITRARY UNITS, ARBITRARY UNITS
##FACTOR=    0.220516191357247, 1,           1
##FIRST=     3083.28924022789, 0,            0
##LAST=      -529.427522777893, 0,           0
##MIN=       -529.427522777893, -765626,     0
##MAX=       3083.28924022789, 453975136,    0
$$ Real data points
##PAGE= N=1
##DATA TABLE= (X++(R..R)), XYDATA
$$ [...]
10621 162405 -49447 -4949 99065 394696 206886 248017 -6648 -143428 110996 437037
10611 437037 302476 144443 201861 -39064 -179181 -227321 -81677 -3963 150691 309955
10601 309955 -38686 -133144 -104407 -172030 189156 282214 200378 15808 -15909 -182757 -99813
10590 -99813 215108 140921 148967 249864 312919 222499 226422 143250 325012 430642 254596
10579 254596 144659 83652 -112229 -169754 -33205 185548 304815 304394 78962 -1989 121955
10568 121955 215611 491552 501238 487391 363275 12044 -101800 34081 -100812 -25983
10558 -25983 240457 24704 86294 76429 264344 272526 -10560 45869 277845 -42871 218926
10547 218926 304019 274200 320925 535390 404490 404673 580011 467992 306918 210643 55090
10536 55090 121732 208159 285015 134450 -42374 -165341 -146888 177208 369146 448826 337410
10525 337410 346407 585323 552345 355621 455093 230853 -55345 -22690 244492 252097 121819
10514 121819 104095 345350 79803 -133632 -29949 48787 229503 270666 243832 101927
10504 101927 -39492 115368 429652 351468 162776 56745 -136016 62173 28256 70137
10494 70137 481935 558991 492649 289051 237894 161152 116782 247303 342717 530315 446052
10483 446052 127016 158704 270712 182492 313267 289118 402757 498749 412111 333287 378437
10472 378437 364243 283853 289836 367019 270065 453200 243243 84641 131202 197742 614540
10461 614540 494835 444931 459312 304682 424569 404050 389017 625018 581136 468352
10451 468352 288992 358370 480501 517487 394329 424426 303776 -134787 -37437 165492
10441 165492 214859 199492 183701 185752 444185 362428 360935 464437 381441 146683 234565
10430 234565 315478 275635 299536 230656 419767 118505 211985 507823 668162 521593
10420 521593 313404 406195 414609 276596 405623 457813 262515 520977 673725 653456
10410 653456 561891 481041 522163 564032 304914 321096 96370 22886 136110 197964 490108
10399 490108 544249 433419 295182 333658 289602 631987 497190 337108 502657 534571
10389 534571 741617 423847 317782 286991 389798 408936 596925 476640 347862 426639
10379 426639 424034 522041 648441 805850 574850 465646 664769 635667 537221 369927
10369 369927 417837 541439 533871 354172 303318 208929 487377 491219 367172 655626 716631
10358 716631 737645 730408 631595 509726 687428 481572 670689 883340 590931 563602
10348 563602 740110 493350 410921 523591 574086 718502 414451 587578 819594 795815
10338 795815 857460 700537 519433 391567 709730 609593 654355 759712 585983 492539
10328 492539 515745 273356 219553 218697 374444 266605 351813 682680 805018 662938 354567
10317 354567 319939 749585 832346 749565 827737 820681 679071 548872 579144 661409 600100
10306 600100 614233 472863 272282 290972 510177 610501 667182 534770 342831 454872
10296 454872 899857 963606 563737 655001 807839 923581 912375 644417 1041773 870643
10286 870643 509345 557784 409431 335595 653383 657404 410147 657881 666434 679164 859395
10275 859395 810379 845218 993324 429540 541776 724672 723132 957665 1031463 838214
10265 838214 627706 614968 847313 697890 579884 568887 657088 698820 801472 911739
10255 911739 894919 749532 715716 603402 592966 754400 672439 841787 1194541 1253974
10245 1253974 1230644 938553 812432 698400 944698 962915 931221 1248168 1243655 987017
10235 987017 899889 644935 681236 916386 1118107 1374367 1192552 1074955 900808 1095343
10225 1095343 1145985 1126380 1204284 1109456 1064483 1355340 1524585 1238617 985301 1091316
10215 1091316 1262341 874064 991318 931408 1196628 1187199 1124000 1255427 1041150 1226184
10205 1226184 1383265 1205667 1123521 1437720 1498864 1603948 1393905 1412839 1464167 1169713
10195 1169713 1256078 1353918 1376948 1391982 1280331 1418614 1442292 1598988 1818897 1984148
10185 1984148 1568570 1357662 1569632 1474518 1781341 1935444 1764877 1804658 1647566 1732184
10175 1732184 1577797 1696276 1631674 1463293 1440069 1478073 1486512 1562852 1803570 1921273
10165 1921273 1664386 1798240 1662368 1698487 1905822 2176454 2121349 1782446 1734310 1638300
10155 1638300 1793488 1760065 1920861 2149496 1959236 1753474 1971795 2191643 2271654 2205674
10145 2205674 2069578 1934748 1886880 2080617 2257266 2366644 2388770 2356510 2369897 2298320
10135 2298320 2365603 2453111 2622440 2478150 2453536 2404446 2705817 2735910 2660817 2476658
10125 2476658 2571718 2649104 2846171 2927139 3021544 3063765 3051860 3190467 3277116 3241360 3440494
10114 3440494 3402907 3256392 2994527 3075414 3359780 3412426 3728827 3585553 3429800 3617683
10104 3617683 4004186 3996961 4118798 4159653 4427428 4375918 3949476 4136922 4282584 4515102
10094 4515102 4809135 4730673 4894793 4999746 4941308 4913114 5177720 5272116 5283762 5497754
10084 5497754 5856032 6085329 6201989 6143727 6107316 6277012 6593672 6682389 6915082 7205668
10074 7205668 7364914 7425514 7679644 7891154 8061536 8295961 8379560 8853443 9216033 9515355
10064 9515355 9786079 9867980 10244398 10575788 11107902 11749710 12074971 11998567 11902181 11849850
10054 11849850 11794344 12281232 12318256 12315535 12278808 12126103 12217906 12281916 12287500 12156275 12055618
10043 12055618 11891564 11556268 11421899 11265581 11512788 11671813 11503866 11363453 11172236
10034 11172236 11198156 11721785 12006094 11955926 12004344 12183039 12135593 12093585 12805546 13101166
10024 13101166 13337471 13470944 13582213 13687031 14077631 14343145 14743213 15045731 15254584
10015 15254584 15724917 16050595 16453177 16854588 17492653 18135555 18327735 19092231 19413913
10006 19413913 19827222 20512291 20948423 21644188 22484963 23147953 23702307 24465872 24947756
9997 24947756 25705908 26116232 26501679 26560883 26764987 26904120 27474495 27903210 28036135 27881939
9987 27881939 27615523 27392476 27217405 26936704 26770820 26666891 26595885 25967949 25676309 25381173
9977 25381173 25444793 25414403 25124240 25332644 25454479 25423698 25475805 26001418 26393177 26760382
9967 26760382 26937516 27275490 27621622 28096101 28547212 29391578 29812972 30321855 31237299
9958 31237299 31779825 32578147 33687168 34277055 35052684 35806584 36345523 37115723 37926283
9949 37926283 38427346 38689509 38568494 38328165 37936937 37945834 37819423 37211001 36516421 35458308
9939 35458308 34127171 33055667 32174016 30835701 29621674 28253873 26826625 25632010
9931 25632010 24271745 23294638 22506569 21564362 20277924 19194485 18551954 17680234 16859372
9922 16859372 15957104 15269469 14592086 13951662 13470281 13067664 12746105 12039393 11722973
9913 11722973 11245412 10716161 10143506 9727905 9490659 9406250 9394679 9007721 8823866 8566031
9903 8566031 8055005 7945174 7681319 7548706 7546649 7081766 6854529 6496137 6364940 6260462
9893 6260462 6230915 6187078 6062182 5682251 5417281 5168152 5122034 5448496 5661125 5253411
9883 5253411 4647218 4652752 4863186 4728167 4738856 4763815 4858842 4639821 4176187 3939935
9873 3939935 3904588 3989685 3833986 3714654 3767043 3687864 3487465 3348787 3398071 3388790 3329799
9862 3329799 3064325 2702569 2760005 2732808 2845620 2805537 2706593 2435303 2432442 2261954 2229816
9851 2229816 2366685 2228537 2081131 2195973 2291013 2216395 2245692 1843440 1812060 2136335
9841 2136335 2424902 2337024 2010164 1630694 1668894 2038270 1843841 1779123 1705579 1520087
9831 1520087 1561998 1461654 1442329 1501230 1437954 1563255 1507065 1182785 1381289 1505614
9821 1505614 1616711 1910449 1522662 1355674 1383634 1352998 1385692 1365341 1541213 1583531
9811 1583531 1554492 1572754 1517108 1342928 1181487 1392015 1443834 1298447 1342150 1311627 1303297
9800 1303297 1370743 1487409 1616239 1720602 1514870 1359373 1233980 1182032 1113146 1391078
9790 1391078 1531633 1531103 1483334 1179016 975949 1096997 1417984 1602619 1497105 1438582
9780 1438582 1364743 1292818 1333168 1426130 1553273 1386405 1255974 1297334 1325407 1188172 1116553
9769 1116553 1082556 1116677 1183931 1099160 1123002 1194957 1148497 1055472 1138065 1014216 1168896
9758 1168896 1332917 1189745 1301066 1453968 1264560 1368725 1513800 1500785 1480575 1214461
9748 1214461 1287978 1212406 1486880 1311247 1447379 1520692 1580834 1684898 1840494 1617035
9738 1617035 1818469 1779153 1566838 1751779 1744088 1585201 1648717 1904753 1800863 1732918
9728 1732918 1465375 1711195 1825535 1660423 1614184 1759768 1901396 1556373 1599851 1793821
9718 1793821 2015879 2108607 2113101 2211724 1953189 1811832 1915001 1745497 1802617 2085776
9708 2085776 2030347 2002178 1970599 2110416 2207644 2193052 2097383 2300344 2101369 2174714 2022072
9697 2022072 2172987 2240942 2323840 2334512 2103607 1703293 1792634 2132266 2152985 2296230
9687 2296230 2089828 2018123 1751340 1766400 1938517 1898468 1791110 1887509 1808485 1719336 1904908
9676 1904908 1769976 1878709 1871299 1712565 1744794 1497240 1648581 1727995 1840925 1924544
9666 1924544 1696629 1820642 1768936 1744051 1679399 1834057 1709089 1506490 1608047 1639860
9656 1639860 1608082 1575197 1492713 1403231 1341444 1260606 1443757 1627091 1603905 1543545 1625022
9645 1625022 1526375 1402303 1470916 1491306 1368232 1309962 1057549 1140359 1485341 1433666 1219432
9634 1219432 1102590 1316809 1173678 1033646 1206261 1317041 1420729 1320795 1260915 1397119
9624 1397119 1461512 1212502 1157510 1183537 1081925 1205993 1469148 1188844 919301 891381
9614 891381 1001462 1011298 995067 927039 1048434 1428532 1565035 1336458 1263789 1149478 1106803
9603 1106803 1229738 1165136 1237326 1278688 1039023 931260 1048808 1304881 1375664 1172400
9593 1172400 1242022 861301 942201 1087255 1243717 1542990 1522883 1297471 1197924 1255400
9583 1255400 1377005 1295442 1363063 1579004 1488638 1178910 1008285 1388674 1612666 1654200
9573 1654200 1426284 1377249 1190447 1072873 1441962 1657194 1494584 1471341 1228906 1207355
9563 1207355 1299220 1415932 1735828 1640909 1344682 1322834 1514596 1542479 1707405 1879238
9553 1879238 1750358 1677996 1638384 1797322 1995983 1794317 1732262 1827352 1865966 1928077 1826532
9542 1826532 1757584 1844701 1951273 1831168 1864501 2083936 1997004 1823338 1833719 1844093 1655308
9531 1655308 1697028 1805626 2056192 2108856 2163860 2247900 2190757 2011474 2095442 2217435 2121053
9520 2121053 2277019 2139563 2029605 2065063 2092155 2181860 2270603 2175434 2181161 2260235 2301252
9509 2301252 2414133 2321798 1990727 2273455 2385792 2578589 2486953 2578272 2646193 2487013
9499 2487013 2487590 2324819 2373256 2580666 2859713 2985133 3126729 3107840 3415038 3526389
9489 3526389 3573342 3586722 3593765 3897773 3977275 3792368 3868326 4330586 4494087 4490697 4804978
9478 4804978 4895482 4720305 4859575 5123394 5240056 5577035 5760147 5970791 6291344 6493686
9468 6493686 6532745 6952403 7005220 6950066 7421024 7694069 7690831 7854750 7727438 7813302 7873033
9457 7873033 7750654 7762457 7444316 6993477 7047725 6989891 6670758 6246371 6098303 5838403
9447 5838403 5269039 4934275 4884975 4781631 4618398 4502091 4538518 4585289 4157822 4021476
9437 4021476 4059523 4099213 3963826 3957753 3918235 3749699 3638900 3533777 3574588 3760365 3925069
9426 3925069 3609441 3226278 3087584 3158780 3365939 3424245 3415587 3259942 3263400 3026907 2980080
9415 2980080 3328545 3303448 3117820 2862793 2803442 2776217 2978184 2972522 3021757 3044314 2734989
9404 2734989 2350474 2426917 2616975 2495990 2447248 2404906 2652380 2396574 2368377 2549625
9394 2549625 2643938 2895730 2745796 2628568 2738301 2553803 2688633 2685331 2704369 2684317
9384 2684317 2638771 2389023 2499650 2629015 2784067 2695567 2876039 2968575 2737886 2748081
9374 2748081 2942077 2871363 2714706 2877144 2934693 2828288 2728497 2728419 2778204 2623066 2682173
9363 2682173 2860320 2797680 2850877 2823252 2951525 2831510 3066135 3143763 3037146 3122677
9353 3122677 3252192 3259989 3291625 3058987 3152338 3292544 3167651 3093237 3104269 3504605 3458928
9342 3458928 3544790 3861490 3838725 3694886 3843874 4052619 4124409 4313883 4193752 4097056
9332 4097056 3989331 3867959 3893408 4253740 4288751 4217196 4166012 4223575 4156286 4196894 4599937
9321 4599937 4596537 4772234 5045963 4705721 4662858 4726257 4600733 4648716 4962439 5209469
9311 5209469 5277185 5359518 5293722 5148316 5425427 5529333 5680237 6066922 6164374 6047371
9301 6047371 5955296 6084374 6256912 6730665 6848662 6725639 6727867 6937218 7140257 7258877
9291 7258877 7797927 7786276 7729300 7618701 7603186 8091525 8515437 9036625 9276528 9520269
9281 9520269 9483355 9786441 10136181 10254118 10372630 10443224 10717792 10829971 11016958 11273610
9271 11273610 11626057 11842174 12057822 12430526 12465518 12374608 12542604 12928317 12943253 12971253
9261 12971253 13228318 13682963 13670140 13859330 14092329 14548281 14888927 15341957 15588152 16091023
9251 16091023 16670147 16900285 17357937 17758576 18220070 18536547 19182023 19976700 20482202
9242 20482202 21184123 22190114 22736689 23266972 23945222 24520869 25357901 25946407 26378758
9233 26378758 27046154 27557637 27799344 27935976 28081807 28061991 28398704 28617171 28609989 28842864
9223 28842864 28801672 28868278 29069998 28737494 28846326 28803499 28693169 28560996 28179363 27856786
9213 27856786 27531995 27310635 26936504 26574972 26115948 25332337 24765488 24202235 23284716
9204 23284716 22773326 22462849 21887665 21365462 20848050 20274011 19728406 19409029 18954197
9195 18954197 18500642 18180596 18016433 17376217 16981981 17091161 17287062 17191975 16996396 16584216
9185 16584216 16402399 16469933 16316486 16382577 16516374 16205403 16080800 16081233 15918067 15823103
9175 15823103 15976827 15872530 15702401 15763622 15795349 15996322 15813698 15703609 15601332 15697687
9165 15697687 15789176 15721634 15920789 15960051 15897962 16124675 16199437 16271843 16382147 16429400 16438767
9154 16438767 16366198 16550991 17194290 17185047 17256506 17349390 17328762 17230911 17309870 17672530 17751193
9143 17751193 17696958 17706322 17634903 17374465 17324068 17247259 17119004 16942200 16782027 16818538 16874889
9132 16874889 16606342 16535334 16554027 16499248 16274222 16284883 16258347 15970595 16006333 15908586 15475223
9121 15475223 15572006 15636597 15739330 16118101 16026111 15902405 15931978 16161664 16357379 16517817
9111 16517817 16632298 16728465 17099847 17427812 17481357 17972140 18225568 18065655 18431802 19002636
9101 19002636 19312945 19838037 20099259 20524707 20710585 20895567 21200358 21312646 22015820
9092 22015820 21938183 22077851 22036285 21883529 22111724 21969165 22160816 22382817 22387891 22127161
9082 22127161 22125008 22049615 22140945 22063769 22144036 22247361 22310266 22445295 22694304 23158682 23402775
9071 23402775 23673823 24140487 24478006 24986126 25369916 25738474 26399354 26898620 27305533
9062 27305533 28016784 28249581 28699518 29442180 29945818 30575409 31054120 31193301 31253389 31291588
9052 31291588 31484368 31518415 31697993 31467721 31105404 30794615 30122423 29359919 28749958 28256526
9042 28256526 27531710 26699170 25890285 25219420 24679530 24420061 24040915 23676719 23089627
9033 23089627 22595005 22107216 22195940 22105076 21900373 21952748 21765475 21236858 21275302 21350781
9023 21350781 21397262 21377419 21536906 21344260 21165266 21147263 21523400 21629923 21965874 22194886
9013 22194886 22320389 22604962 22902990 23373157 24034459 24416853 24865726 25275436 25722305
9004 25722305 26551423 27159226 27630988 28210363 29005981 29774643 30311293 30394575 30326885 30178656
8994 30178656 30389076 30210173 29954111 29381950 28428891 27531169 27078183 26532784 25617397
8985 25617397 24940577 23944363 22917792 22303935 21510747 20713843 20251037 19978031 19412979
8976 19412979 19161117 18441415 17979038 17793066 17703209 17553333 17202030 16987177 16708685 16415468
8966 16415468 16202721 16427266 16571193 16694793 16593257 16248761 16259926 16307344 16340696 16473664
8956 16473664 16424220 16153527 15680606 15575744 15170490 14818491 14358816 14050998 13650500 13010065
8946 13010065 12504163 11840665 11405188 11250926 10887060 10350099 9857859 9465564 8894191
8937 8894191 8373945 8293500 8190862 8145589 7552045 7227813 6922786 6754267 6647362 6650313
8927 6650313 6583787 6313275 6107625 5583073 5308652 5277016 5117589 5101282 5038885 4861134
8917 4861134 4632742 4755073 4693360 4373080 4309518 4176713 3927940 3793378 3969816 4045796
8907 4045796 3723863 3768551 4048977 3969323 3676257 3225810 3030118 3121739 3042409 3073003
8897 3073003 3297018 3399391 3282596 3332869 3173934 3124997 3225240 3119223 2884198 2608423
8887 2608423 2582972 2805152 2792976 2657330 2983414 3204455 2890612 2743098 2884565 2710110
8877 2710110 2599645 2697135 3019718 2981457 2879628 2659951 2556462 2429644 2385470 2705149
8867 2705149 2522815 2461013 2616545 2594557 2573836 2493723 2290932 2286339 2535011 2416291 2282979
8856 2282979 2603774 2718946 2627198 2541500 2656056 2672804 2610144 2680015 2727292 2593698 2686533
8845 2686533 2854265 2580429 2674954 2538909 2668233 2769403 2560305 2290434 2618134 2674732
8835 2674732 2632356 2489596 2225458 2199164 2450136 2400331 2153245 2296810 2019961 1926255
8825 1926255 1980736 2145546 2059633 2272074 2165295 2150073 1991279 1601091 1912589 2104150
8815 2104150 2096898 2112153 2177458 2006903 1837199 1977262 1550544 1566172 1790010 1736601 1608890
8804 1608890 1452700 1426596 1157914 1334747 1537766 1390516 1169044 1082489 791093 974680
8794 974680 1146781 983439 1225881 1006316 893433 868156 754505 822272 1027284 1068156
8784 1068156 1060610 1048735 1080926 1087370 991940 836693 636257 531565 637954 642596 851849
8773 851849 674164 629638 726856 873053 646041 680053 777404 465383 481061 549610 732842
8762 732842 878833 952782 454758 356561 380334 541116 756321 662902 276634 335878 162886
8751 162886 396332 610110 613509 545715 587244 585177 632064 436035 332249 285240 182591
8740 182591 510928 406389 369666 707121 555295 546309 278323 -50796 72565 199223
8730 199223 226149 297755 386489 525788 411417 115560 -46368 99299 -203705 -114378
8720 -114378 154301 163516 274277 196224 377768 522437 380099 183097 171367 70518
8710 70518 141251 229061 151011 -104593 -284969 -85608 302374 182816 281941 -16524 177393
8699 177393 148783 179101 125898 178887 146805 95719 -98454 -194862 94268 188349 167707
8688 167707 64307 -30682 209723 46144 -98856 -17967 46914 300861 211642 11523
8678 11523 157087 -70602 25019 397485 419027 529205 241487 -2249 -281033 -189926
8668 -189926 313346 261497 211634 245714 146369 113683 188417 308035 175841 101439 7910
8657 7910 -165642 -292246 -109977 291085 303279 133399 79540 -12413 -136450 -179064 61477
8646 61477 57483 -68324 -183094 -69481 130198 62543 226793 441338 175360 196594 106945
8635 106945 40064 69601 -13672 69497 -55475 26316 56036 -164522 -227870 -163021 336760
8624 336760 382085 197318 121584 58943 -200963 -173727 180616 -16676 -37180 80650 52283
8613 52283 -36189 -187191 -22367 94975 184392 153756 -311945 -288457 -300493 -102918 108980
8602 108980 -83410 -160564 -366327 -235349 -331055 -9680 198216 99042 -86552 -386751
8592 -386751 -293661 -139068 192542 142668 16094 -41059 -280210 -181004 85029 -118298
8582 -118298 -254428 -158867 -553801 -513568 -399153 -391576 -54337 -121389 -72952 -276057 -284189
8571 -284189 -201835 -216089 -129381 -170069 -336694 -123516 -65867 -382275 -504387 -326922 -126603
8560 -126603 -223303 133029 7147 113134 -215397 -442834 -401917 -252780 -161997 -123313
8550 -123313 -144535 -222277 -256633 -129285 -41299 -56371 -19416 128357 -662 -243438 -225371
8539 -225371 -310133 -290566 -333877 -176433 -190475 -46101 -348027 -425324 -376085 -382965 -169949
8528 -169949 127371 346367 9848 -7228 -284804 -202068 274256 181943 7879 -198662
8518 -198662 -176963 -270721 -221337 -33844 132919 -136425 -329964 -368136 -307074 -290155 53411
8507 53411 143394 -99870 -390454 -652371 -510198 -135479 21077 245964 -24802 -425349
8497 -425349 -337292 -351438 -339707 -92154 -94871 125700 -79080 -692693 -725942 -352971 -233107
8486 -233107 -221945 -459797 -627240 -545766 -513751 -405101 -362029 -127728 -168522 -189854 -106227
8475 -106227 -261443 -536974 -207297 64762 -55037 -415577 -672474 -597909 -337169 -225821
8465 -225821 -306880 -201707 -160713 -270526 -361931 10365 254540 25580 -142505 -177324
8455 -177324 -341814 -408232 -115555 -60120 88371 127777 73685 -131988 -182245 -293351 -85965
8444 -85965 -136773 -363341 -85567 -12726 -230426 -312139 -259247 -124251 -45006 -355057 -358637
8433 -358637 -376042 -527131 -375930 -394022 -243600 -356769 -394614 -115362 -174728 -380699
8423 -380699 -356644 -488470 -391987 -357035 -90352 -67066 -202571 -221147 -372129 -307895 -315834
8412 -315834 -55215 48852 -143057 -454490 -407145 -209255 89152 183856 26441 -49720
8402 -49720 -234255 -252231 -143022 -140888 -183291 -248239 -341313 -507101 -369851 -1802 249564
8391 249564 -134645 -153836 -201323 -344219 68475 -6878 -251213 -272864 -438003 -173974
8381 -173974 -87811 -225799 -161435 -9833 -249082 -431153 -253093 -114197 -70831 -130167
8371 -130167 -149784 -100424 -86225 -243454 -306930 -215723 -311556 -388222 -501610 -68945 244621
8360 244621 262292 -125184 -369107 -445242 -463986 12528 -196294 -265927 -168709 -246816 -317623
8349 -317623 -430082 -383182 -187668 33887 -140708 -406135 -279447 -342689 -406152 -466302
8339 -466302 -350496 -386355 -99948 -97121 -186306 -114283 -74474 -255789 -293243 -85119 213059
8328 213059 99038 -286548 -442124 -182901 -2851 76345 -111161 -664129 -607387 -601358
8318 -601358 -309074 -84024 -195294 -175940 30952 -85829 -304701 -345917 -37063 117554
8308 117554 307210 43714 -187892 -61184 -84013 -119524 -145104 -184414 -388254 -349766 -227291
8297 -227291 -466745 -371446 53324 152377 -28803 -209774 -206141 -103745 -232710 -362055
8287 -362055 -396373 -506689 -490159 -280187 -298926 -273764 -308379 -218348 -236742 -263226 21574
8276 21574 -179998 -25496 -56295 25266 -194515 -181935 -171115 -239236 -237616 -85608 -194186
8265 -194186 -162417 3303 -179548 -343863 -257315 -35669 -61249 -26602 56622 -41879 53180
8254 53180 -123725 -278122 -31232 -181320 28153 -71915 -14537 98232 2024 -11922
8244 -11922 -116842 -171288 -83241 -18890 31211 -50707 -175155 -429217 -717135 -459794 -230646
8233 -230646 1615 -223768 -559665 -450910 -389070 -316389 -187224 81206 -37310 -305070
8223 -305070 -405145 -387406 -325304 -36267 104301 187432 -226075 -268238 -63393 -189039
8213 -189039 -99644 136332 250413 -158445 -480587 -230326 4443 77288 85094 -148097
8203 -148097 -129859 -209455 124086 117528 166421 368533 157486 -110263 -248910 -69989 343216
8192 343216 561541 82240 79234 -89301 -186482 -396979 -344827 -204405 -68385 73042
8182 73042 262032 398356 -20679 -393180 -298562 -96458 -142194 31107 -357888 -487085
8172 -487085 -413046 -351073 -143787 211447 54404 -361125 -394696 -269862 -247939 -75335
8162 -75335 128910 -63863 -221354 -273184 -336846 -409856 -152284 168035 23970 34955 119907
8151 119907 -72785 29221 -211534 -64836 -94053 165610 265289 197554 134744 40121 -3386
8140 -3386 74015 285269 7073 -262746 -321400 -294586 -490459 -345344 -207513 78127 164663
8129 164663 191328 -136529 -199462 -202554 -8310 214115 -61802 -426701 -295180 -114666
8119 -114666 -117290 50395 267032 124496 -234116 -354545 -446994 -218221 34793 185767
8109 185767 158824 -24645 -284901 -265119 87096 201288 166630 340585 32315 -250912
8099 -250912 -375330 -279865 -132560 -34374 -9920 -58340 -258381 -119710 64793 144039 166218
8088 166218 1236 -166981 -354089 -27841 -156985 48043 151727 -221729 -276316 -315821
8078 -315821 -447003 -223871 -168095 -30853 -53162 3211 -47930 -191180 -76776 -73030 43811
8067 43811 24627 187709 20512 -67817 -76682 11011 -35195 -194228 -289603 -58660 11979
8056 11979 -149908 -178157 -222976 -165186 -121872 19794 -124827 -65793 -47045 -7003 -188552
8045 -188552 -197515 -116892 -59520 -6608 157466 65393 -101595 -243434 -301402 -220990 -400964
8034 -400964 -42400 -90486 -378412 -123164 -78795 -150986 -100166 -60795 -253399 -181338 -180525
8023 -180525 -254595 -150424 211525 189107 -262673 -369419 -451047 -511930 -271878 -47902
8013 -47902 -95478 15994 103426 206160 65885 290677 137843 31077 -195029 -315129
8003 -315129 -344365 -421132 -187321 -281082 -193617 -113678 -84540 -14766 41224 -214080 -335106
7992 -335106 -172833 -159841 -100575 -18740 -127912 -370498 -376524 -178085 127990 -173204 -606668
7981 -606668 -401827 -373459 -331278 37400 -64526 -184163 -264085 -281820 -103715 255159
7971 255159 270454 389135 163276 -60895 -137981 -202111 -51585 84822 35157 -77356
7961 -77356 -407379 -651178 -540767 -327669 -234486 -122153 -63172 -243383 -360043 -312210
7951 -312210 43145 117909 -93 -34384 -138831 -358616 -208896 -205128 -264660 -430234 -530532
7940 -530532 -523434 -241361 79529 80951 95031 6772 -23858 43799 -78951 -101829 176081
7929 176081 123385 -50391 38699 102647 -194630 -145126 -34584 -16234 -132047 -424419 -765626
7918 -765626 -631017 -217504 -262431 -182900 -203844 -30409 -170356 -172646 -240267 -14577 168881
7907 168881 107821 -336401 -229056 -345220 -256982 -183835 -221389 -162430 -202372 -277198 -445846
7896 -445846 -455911 -393495 -123545 23235 -99565 -98052 -9319 -50753 -63933 -244576 -241988
7885 -241988 -161560 -217294 -309513 -239666 -148229 64429 -130525 -120359 -160442 -66333 -199943
7874 -199943 -284982 -211937 -177256 -419867 -440983 -372139 -198033 -98166 116085 403984 262138
7863 262138 6047 -258271 -161657 -110226 -351692 -354556 -273340 -378073 -193019 -16894 127339
7852 127339 -242957 -285905 20063 -205383 -171495 56276 96363 40012 -226418 -257091 19392
7841 19392 196639 33602 130305 -45283 -235931 -249332 -186316 116126 -10505 182255
7831 182255 -2591 -64577 -124346 -357821 -308265 -140925 -8464 -36927 -52413 -263902 47762
7820 47762 349298 147753 -102940 -255435 -132457 -259814 -294253 56779 256168 169908
7810 169908 -103077 -83908 5742 -132142 144652 -79640 -510364 -82499 -227716 -223071
7800 -223071 57284 -51216 134613 -20985 -125250 -135202 -160242 40392 194767 212437
7790 212437 194061 -68407 -182102 -153903 -358885 -348371 -155420 184324 332720 256146
7780 256146 -11130 -98087 266229 257192 -26707 277645 210869 96321 -12234 17144 65163
7769 65163 26638 -89474 -360543 -610961 -326759 -69445 -153148 2341 27101 -195680
7759 -195680 -273721 -39951 101569 -37275 60177 70959 -98973 -98152 -111502 17823 -82556
7748 -82556 106508 -38627 -81941 -347182 -159165 -56383 -226034 -160249 -40918 110524
7738 110524 90058 100371 10521 64303 99192 73486 -104895 -33813 34313 -152218 -117080
7727 -117080 -175861 6759 107105 60488 223808 17608 -191765 -160093 -104905 -41772 5531
7716 5531 210466 312086 -46246 -132964 -7220 90909 234640 208157 -16719 -124142 -3574
7705 -3574 145719 -111960 -76475 -122786 -19021 543 -224490 -185814 14339 -27307 -44417
7694 -44417 26024 -134753 -327698 -117664 69747 33230 144696 44295 87684 288335
7684 288335 -22659 -124123 132008 127774 -30279 -371311 -428082 -397145 -345878 -295145 -370048
7673 -370048 -179455 -169708 -357988 -127878 1894 -65928 40296 120760 -35855 -84612 -251601
7662 -251601 -144553 -2206 325515 98028 -62101 -108669 -108276 -99158 72398 287614 119653
7651 119653 87004 -45890 -509094 -404383 139268 154523 -147940 -92257 207908 239708
7641 239708 95749 228138 330197 251707 153188 -104894 10778 199231 130556 101942
7631 101942 -18300 -285968 -121925 -155751 433 44539 168644 259583 286588 152542
7621 152542 74928 97256 -23676 -153226 -59543 15851 20609 -20825 -1223 -54256 -79287
7610 -79287 71732 265663 57785 104033 -120787 -42942 125014 121709 96842 -24402 -115817
7599 -115817 -263803 -265158 -229899 -15447 -88385 -39750 -135640 -108258 -14596 159529 230282
7588 230282 120236 136407 98927 178212 -38477 -337237 -139646 142482 55528 107768 52812
7577 52812 -97938 -107905 -163706 102544 3733 6306 63618 129886 -111542 -132674 -57148 47136
7565 47136 98174 -7919 -64228 -130612 -172514 -10506 199575 130335 204819 93224 -174663
7554 -174663 -286435 -133679 -53400 -30509 16556 -173992 -387468 -431446 -157054 77801
7544 77801 287050 282749 43897 -112327 -364500 -220144 -139908 56920 14298 -83814 -51256
7533 -51256 -51999 130680 234145 591960 437854 217661 228851 211981 -48196 124981 245542
7522 245542 147050 103765 130275 -56305 -196784 64973 318231 725779 605387 88952
7512 88952 45397 -242183 -53493 -200461 17229 329718 126959 180151 -76382 -37965
7502 -37965 93281 339944 326444 205365 -203310 -346130 -256385 2486 290413 315441
7492 315441 200378 -113883 -254645 -399445 -3827 173990 35458 -49966 -105190 -143578
7482 -143578 132680 284043 137430 217346 270867 73819 113191 154884 15897 282436
7472 282436 73300 123744 -51259 -26379 104591 -53938 -124946 43387 19520 230018
7462 230018 292536 244479 207945 283925 12394 30100 162927 154300 200961 302831 -1123
7451 -1123 -140836 158489 208333 455131 404930 21187 211500 103635 -3194 193824
7441 193824 170342 86451 58499 132334 105412 290863 450657 342446 330849 227830 54650
7430 54650 -31957 -148577 -4746 110997 118763 4466 -92037 -95313 178282 173031 -1110
7419 -1110 46964 387683 349972 422902 310252 239769 179376 344056 299593 186688 161226
7408 161226 62206 -192403 -180968 36295 31955 161099 44581 -79577 -163363 -119948 204025
7397 204025 403393 527530 437789 416942 105609 193788 204430 -53588 60684 113528 -141504
7386 -141504 -320571 88601 98697 145574 250342 212867 259401 -76260 8720 15207 -29106
7375 -29106 206066 321486 140029 125894 249895 260628 202197 -12234 18266 -27673 -14244
7364 -14244 169999 160668 49397 117539 159644 243323 209796 -133773 -203125 21983 147427
7353 147427 99657 178745 83235 171091 245044 116649 85350 205091 373430 311402 187533
7342 187533 -89555 41438 39031 38987 101786 84879 220561 18837 -55513 255280 135064
7331 135064 40003 63461 365133 430734 510406 440637 -9906 -1797 -90484 -167231 46391
7320 46391 -46603 39491 60358 104148 880 48084 152656 405410 252890 48786 -107979
7309 -107979 -54966 20854 247318 251013 333653 381961 -29773 45167 306132 527083 386199
7298 386199 8258 77873 -152949 -2907 95842 60449 144359 228508 411753 266256 283024
7287 283024 -18835 56474 276973 287740 451344 232117 -88158 -253673 -442022 -46699
7277 -46699 221622 221826 195692 -6850 -190549 -41754 211757 267047 306364 269984 116152
7266 116152 164677 64879 354769 619769 454146 232066 129168 -60622 -39749 123920
7256 123920 81621 204962 324062 49353 -211031 -264701 233178 434252 424239 218032
7246 218032 303727 397335 358202 456701 336447 347911 464397 171075 190965 47691 90930
7235 90930 125657 59687 72252 95023 -146694 -109534 -5349 -126594 -255463 41361 348323
7224 348323 194889 366924 408006 168933 287455 213518 291143 248412 80093 172691 217494
7213 217494 132637 150189 225552 105049 185813 -99104 25034 209531 328431 540719
7203 540719 421291 54367 138774 -343 101023 495977 474825 408530 326309 140344
7193 140344 33971 30128 358267 604656 751479 287303 100498 353623 265288 146149
7183 146149 187427 183299 71355 256342 492753 440231 237628 988 101984 447874
7173 447874 356216 209302 444800 266204 -66380 -6737 96569 101585 238667 352376
7163 352376 394000 240128 76999 204146 264092 278627 477549 346174 130595 185239
7153 185239 165241 284530 405561 309991 135527 125295 336852 354173 314408 257704 259514
7142 259514 169459 220663 76500 -25000 81489 289683 321325 479261 272185 163261
7132 163261 230269 255450 350264 402062 271893 178003 -35281 -88961 -80060 125619 57448
7121 57448 2406 -117267 -152878 113051 370687 468034 585834 525455 338097 551752 490877
7110 490877 692409 738194 811378 683546 405053 118071 337915 236882 278477 297138
7100 297138 457707 414093 367796 434953 427959 474423 634699 464433 396837 507610 259938
7089 259938 261794 126055 234908 440994 293794 277378 104601 140320 -176436 147858
7079 147858 464692 170602 231757 479063 512022 313903 451523 312972 347201 446782
7069 446782 312278 315602 281648 287898 431323 151935 5741 198903 329192 369960 397670
7058 397670 81725 235784 276461 79034 242783 505446 573267 515310 467170 410672 58145
7047 58145 140797 296907 189589 68606 -296579 -161232 -84821 224981 323364 554402
7037 554402 315708 -16629 -41138 163271 347611 615988 526475 405212 508490 180197
7027 180197 344734 520677 477123 381155 39910 83455 84339 194983 218621 532963 561399
7016 561399 397810 376000 171706 78448 297501 341606 424012 658737 634017 418283 -32399
7005 -32399 -86642 167167 348062 207394 284609 269450 222077 196036 456356 787876 957672
6994 957672 718876 450893 319534 64836 122175 435222 710530 408576 -30721 -127091
6984 -127091 12276 230696 322441 611915 670394 445952 129503 108599 545940 689255
6974 689255 604713 466375 203331 373445 531126 302109 189866 454825 483755 491788
6964 491788 372459 547063 472140 192832 337826 516032 479733 433164 528510 660306
6954 660306 542760 333959 235237 397259 339745 257913 313706 328737 391896 413464 387970
6943 387970 516572 295621 356085 255023 365429 310172 544171 744535 774903 711030
6933 711030 624580 550477 233130 342843 482934 517410 433222 372602 356321 582241 699856
6922 699856 592180 607794 524827 174721 128245 158128 381396 622012 642138 627245 697697
6911 697697 651387 608108 643539 726624 784254 710042 456497 468545 466795 545403 375769
6900 375769 803864 869829 711355 522885 317196 234625 376273 602438 710159 725200
6890 725200 723692 447669 87881 439159 645945 772283 875237 897218 492427 479417
6880 479417 575071 762538 821227 739445 590859 463473 643520 506051 458437 484990 546315
6869 546315 618462 549277 480931 533700 1040910 1110120 898558 999360 861556 737044 516311
6858 516311 509250 425504 695726 638658 611828 397565 479958 398357 762284 1097322 957097
6847 957097 815012 614163 639184 682122 766100 805628 993563 715397 668207 588377 558228
6836 558228 779762 649746 778649 824765 821838 706241 761917 793491 815844 986353 645433
6825 645433 585748 632602 453177 453472 867393 1004407 856069 676549 652513 651704 583757
6814 583757 517394 662827 787090 825512 936396 900470 873045 661874 673264 902350 808144
6803 808144 920098 832754 755814 655396 625026 806457 948893 607741 527866 759728
6793 759728 852927 856319 996302 1187184 897053 573000 669235 887229 829806 783595 957977
6782 957977 880675 798648 935971 1024722 906435 894212 799392 841804 810076 939307 952903
6771 952903 747254 766555 1072470 1169762 1091703 1263268 1300899 1207762 1258413 1033451 627612
6760 627612 748075 921004 1063292 1120312 1106928 797159 659240 882439 1104138 1161813
6750 1161813 1251878 1233173 1302242 1322844 1164042 1286118 1277100 775526 687210 798237 728090
6739 728090 681161 674098 842431 936814 847525 725007 691320 903692 926793 1095553 1305230
6728 1305230 1223347 1075578 1012493 1107580 1220991 1291527 1237361 1087014 802046 622554
6718 622554 517874 766869 984754 1169702 845589 766485 898809 1020153 904984 1050650
6708 1050650 1284562 1085569 818864 659992 655559 806711 1241583 1196972 952444 810936
6698 810936 655254 864967 1075220 1184650 1344370 1058753 1224382 1114982 1202212 1543103
6688 1543103 1387267 1585912 1242741 960268 1075039 1243565 1132658 898870 1012035 1051388
6678 1051388 1290646 1253102 1130485 1004296 987842 1411927 1363872 1185560 1156283 1179928
6668 1179928 1304906 1568887 1610470 1491652 1570786 1241508 1251182 1174576 1261253 1431985 1305597
6657 1305597 1232541 1346179 1343765 1423509 1454111 1387098 1331216 1507706 1431779 1421893 1637882
6646 1637882 1623833 1528627 1435063 1539904 1656728 1572903 1625942 1739099 1613611 1870096
6636 1870096 1920044 1745138 1597335 1741787 1907479 2207696 2141229 1688316 1634860 1792398
6626 1792398 2002004 1951647 1814143 1694699 1771425 2014457 1929260 1925905 2257400 2238821 2237930
6615 2237930 1996035 1987231 2041725 1820893 2050805 2281290 2200334 2240460 2208920 1988967 1868090
6604 1868090 2190811 2053039 2213645 2153198 2216675 2258353 2422842 2465945 2296556 2284299
6594 2284299 2158538 2293807 2406952 2384997 2269924 2671194 2618161 2558922 2600487 2455416
6584 2455416 2370125 2647244 2774139 2909608 2619841 2383424 2475630 2861682 3055824 3107545
6574 3107545 3075701 2954741 2810001 2900360 2884660 2717608 2919253 3143336 2918357 2621850
6564 2621850 2708032 2878449 3171140 3350198 3486664 3471585 3374528 3319985 3182744 3325157
6554 3325157 3509627 3520288 3183077 3142777 3249919 3465839 3451207 3460401 3364526 3373722 3627825
6543 3627825 3658019 3666380 3729257 3856262 3938380 3694413 3810899 4046719 4089109 4164357 4382088
6532 4382088 4392421 4411476 4342619 4260673 4464127 4511267 4670430 4530131 4744292 5087072
6522 5087072 5005498 4829193 4996537 5340074 5516552 5451040 5637518 5530993 5646679 5657651
6512 5657651 5891137 6171060 6401086 6292565 6146833 6494504 6900394 6731006 7069439 7612318
6502 7612318 7510014 7559186 7676693 7980468 8174751 8576602 8706685 8829179 9007498 9261674
6492 9261674 9330744 9547700 9878151 10018375 10062758 9853627 10278011 10551863 10471789 10786886
6482 10786886 11230156 11364462 11321762 11563389 11984875 12184005 11946916 12264403 12393792 12497459
6472 12497459 12536023 12634912 12962487 13224025 13471306 13398369 13578711 13965446 13907960 13463811
6462 13463811 13509020 13602062 13742281 13601623 13389067 13478503 13481460 13375226 13179017 12917411
6452 12917411 12848292 12794966 12691063 12774550 12852462 12660431 12570754 12437509 12245977 12326761
6442 12326761 12490331 12465283 12345343 11838628 11603409 11516862 11524741 11336817 11155969 11119288
6432 11119288 10943220 10822151 10829149 11010819 10910901 10643424 10228980 10291963 10341230 10070338
6422 10070338 9599908 9545792 9590304 9215150 9067002 8973243 9092225 9182615 9112381 9021136
6412 9021136 9053513 8827656 8881125 8714809 8961705 9393074 9240711 8762431 8568582 8726031
6402 8726031 8741491 8665335 8539435 8602218 8365190 8152441 8142424 8317358 8448332 8523073
6392 8523073 8193485 8421659 8596569 8617257 8843637 8802658 8829379 8824135 8626547 8780687
6382 8780687 8876500 8836035 8500205 8616567 8707221 8753380 8740329 8751146 8635211 8771221 8864887
6371 8864887 8621770 8966648 9276599 9397552 9413936 9319649 9505043 9565556 9696232 9809842
6361 9809842 9558256 9290820 9114038 9470387 9717861 9670493 9767188 9617419 9650894 9675291
6351 9675291 9723680 10083315 10474568 10589340 10296060 10357726 10542590 10683522 11012824 11021248
6341 11021248 11106732 11345991 11521418 11612180 11580714 12357020 12636334 12385208 12546446 12790447
6331 12790447 12989525 13230697 13486087 13797383 14093051 14503579 14619000 15028779 15251096
6322 15251096 15284985 15535615 16011686 16416612 17023158 17208600 17465365 17971609 18292734 18622832
6312 18622832 18737431 18926775 19294369 19689871 19978960 20274833 20394086 20751431 21130142
6303 21130142 21479555 21589246 21311875 21745299 22170063 22243139 22473974 22580393 22940119 23138938
6293 23138938 23204072 23465207 23503536 23803671 23979597 23926289 23960325 23767491 23750564 23676423
6283 23676423 23398583 23419132 23126493 22777254 22421653 21966132 21697693 21426180 21102938 20573386
6273 20573386 20328108 20315555 19932345 19487946 19412835 19109306 18723706 18187605 18103520 17757140
6263 17757140 17232263 16992290 16629163 16277242 15750283 15518891 15125813 14488262 14140927
6254 14140927 13910927 13456770 13054680 12829908 12253655 12082776 11934869 11515228 11404265
6245 11404265 10984818 10324489 9919349 9784521 9499666 9374182 9334597 9339398 9063059 8872424
6235 8872424 8615120 8295904 8148990 7769850 7930121 7762208 7564496 7290888 7332903 7249838
6225 7249838 7284971 7312320 7091558 6943099 6868314 7120629 6881429 6888053 6923955 6689034 6407273
6214 6407273 6458320 6605388 6543891 6481932 6314543 6398027 6432806 6214418 6103546 5810628
6204 5810628 5943759 6000821 6104185 5985798 5648920 5649300 5507966 5653370 5732329 5785879 5861625
6193 5861625 5569667 5550593 5698187 5453005 5646010 5478272 5432513 5063464 4947885 5154566
6183 5154566 5242307 5477096 5374747 5190180 5194310 5270705 5307304 5051143 5237990 5269121 5115591
6172 5115591 5368047 5328987 5413540 5387766 5159717 5050666 5111789 4955467 5256441 5319558
6162 5319558 5186517 5143847 5223054 5206218 5370363 5681271 5785864 5902270 5450361 5345068
6152 5345068 5511496 5479314 5549455 5719588 5701413 5604199 5665306 5769552 5812410 5764060 5831923
6141 5831923 6095565 6291900 6759546 7060739 6933010 7090754 7150023 7303393 7339833 7744890
6131 7744890 7982671 8141695 8370309 8518622 8578382 8853847 9023221 9176406 9377073 9549406
6121 9549406 9580029 9813517 10092898 10196621 10455058 10477537 10618317 10990276 10670404 10828076
6111 10828076 11096592 11151242 11519928 11559683 11669949 11890565 11712844 11684662 11749591 11808384
6101 11808384 12162435 12109943 11836030 11794108 11848387 11903000 12116834 11906353 11773897 11610910
6091 11610910 11326836 11120317 11176101 11332546 11242830 10914903 10740249 10653569 10539041 10495354
6081 10495354 10410261 10314998 10036177 9608612 9213092 9117962 9070714 8776047 8415945 8326702
6071 8326702 7743597 7587588 7541353 7352033 7412198 7010693 6966415 6791811 6457599 6108308
6061 6108308 6151275 6066579 5890740 5851480 5635929 5234001 4924198 4722769 4849349 4720645
6051 4720645 4644607 4751936 4554452 4521191 4646405 4726822 4753092 4482101 4457343 4303758
6041 4303758 4188287 4096067 4010709 4038639 4001335 4009751 4066069 4150734 3848937 3940135 4219977
6030 4219977 4150608 3922981 3798510 3597097 3759524 4068683 4018096 3862942 3923298 3716752
6020 3716752 3601655 3492589 3575699 3678037 3789516 3906191 3684663 3799518 3570662 3515721
6010 3515721 3422471 3440836 3334748 3271096 3303851 3414608 3607585 3500471 3432715 3619244
6000 3619244 3626303 3155711 3135970 3527604 3989728 3820780 3417869 3497869 3165793 3142647
5990 3142647 3554396 3556120 3581288 3707859 3713410 3384664 3386320 3638402 3655979 3585297 3363869
5979 3363869 2996175 3145671 3362282 3529960 3438264 3360475 3167621 2915001 3065305 3107144
5969 3107144 3268093 3139599 3105845 3009167 3039374 3200546 3405177 3624118 3453182 3214333
5959 3214333 3245048 3411963 3541412 3461780 3516409 3477247 3170409 3171070 3382922 3489609 3480322
5948 3480322 3598403 3324448 3196105 3237098 3263495 3333979 3256011 3117365 3371743 3480088
5938 3480088 3359889 3407675 3568196 3553910 3435813 3413699 3161613 3355124 3405723 3397210 3479231
5927 3479231 3620820 3714414 3724830 3755123 3554228 3433042 3477999 3403742 3455905 3673178 3613305
5916 3613305 3525674 3402861 3829436 3698986 3769121 3840380 3595013 3648545 3846561 3531008
5906 3531008 3689904 3978711 3716594 3603441 3679382 3678555 3839579 3848177 3833556 3911597 3827445
5895 3827445 3799260 3906201 4239358 4261614 4444879 4247268 4264328 4353770 4322633 4528999
5885 4528999 4328584 4270802 4234685 4083475 4094029 4350737 4406210 4553699 4755349 4604179
5875 4604179 4671094 4437904 4386621 4710516 4718693 4646641 4720812 4906331 4848490 5070482 5077396
5864 5077396 4872868 5204644 5150010 4996225 5000969 5188538 5259003 5303828 5301801 5471698 5519446
5853 5519446 5435650 5549896 5743583 5785053 6169137 6336171 6356258 5934320 5829274 6191458
5843 6191458 6426632 6486183 6421503 6584522 6499359 6562821 6773894 6844103 7132805 7493982
5833 7493982 7540836 7495454 7419728 7508973 7924880 8106400 7994126 7952553 8040382 8292608 8426369
5822 8426369 8367099 8500650 8661904 8639140 8712435 8861128 8988595 9337742 9678922 9752757
5812 9752757 9901218 10290102 10413018 10517306 10566828 10452767 10612568 11041590 11315715 11512821
5802 11512821 11852648 11897912 11779930 11981086 12587181 12683543 12568015 12793011 13151432 13287497
5792 13287497 13595919 13617810 13679359 14055616 13826976 13872840 14132140 14407900 14440981 14663687
5782 14663687 14696342 14401473 14403540 14791552 15045782 15398058 15587124 15628859 15837653 15756823
5772 15756823 16104795 16064856 16087671 16056349 16037090 15850777 15987506 15908085 15736186 15846333
5762 15846333 15618410 15577892 15580127 15535086 15346199 15362456 15199442 15090875 14981360 14946151
5752 14946151 14846144 14504254 14506337 14526940 14438991 14516171 14510196 14642680 14393808 14132948 14283079
5741 14283079 14320642 14348750 13814936 13642960 13414621 13104431 13081850 13233744 13486372 13187003
5731 13187003 13066754 13203445 13289586 13396796 13340481 13363554 13120595 12877630 12931402 13067494
5721 13067494 13352357 13573092 13471009 13077673 12883847 13103478 13165788 13199520 13311362 13219240
5711 13219240 13391526 13662265 13865318 13951414 14141828 14386868 14151384 14007968 14114487 14367741
5701 14367741 14520372 14705658 15117331 15172906 14853120 14742592 14972942 15548249 15669385 15771844
5691 15771844 16001699 15654765 15767708 15976862 16502331 16955470 16977292 17144700 17045147 17436787
5681 17436787 17643827 17998628 18195264 18553220 18738607 18712672 18965672 19189865 19714351 20099083
5671 20099083 20495930 20803404 20777975 21001469 21584945 21854826 22582279 23014171 23180456 23575843
5661 23575843 24001138 24200856 24725780 25434768 26024843 26370796 26789377 27229170 27363419
5652 27363419 27803040 28386788 29017100 29367280 29666065 29963602 30150242 30461270 31163238
5643 31163238 31837856 31772297 32132354 32558089 32980859 33105874 33491416 34097778 34247682 34443669
5633 34443669 34409863 34569545 34887324 34963563 35137157 35465496 35322362 35289172 35392344 35504095
5623 35504095 35575412 35526275 35489011 35348991 35144606 34965192 34587792 34046712 34061982 33816977
5613 33816977 33541791 33620495 33164673 32710936 32564755 32484344 32339406 32300163 32077654 31749794
5603 31749794 31737683 31492147 31187911 30820858 30884180 30681307 30497453 30525192 30676206 30429171
5593 30429171 30082660 29849454 29860140 29861479 29858711 29494396 29342461 29404555 29320294 29362185 29115188
5582 29115188 28994239 28660171 28668963 28496411 28567071 28476507 28617604 28356601 28085134 28236404
5572 28236404 28031402 27971829 27880985 27903684 28168977 27894564 27869367 27749553 27807176 27585442
5562 27585442 27455402 27456889 27515489 27377178 27226926 27254452 27176863 27308754 27010249 27094915
5552 27094915 26922611 26712497 26912804 26752716 26642872 26710345 26895477 26811448 26677165 26589479
5542 26589479 26428163 26211674 26267242 26232909 26033440 25910605 25596857 25731109 25809346 25868077
5532 25868077 25960594 25843200 25651983 25752515 25725679 25744798 25697457 25548314 25745314 26049803
5522 26049803 26093604 26172294 26089342 26290056 26364424 26898569 27279738 27327366 27228410 27428844
5512 27428844 27788335 28108473 28627127 28922701 28941551 28966868 29359464 29669227 30182247 30867834
5502 30867834 31337166 31387592 31466321 31768223 32005452 32613529 33212821 33941154 34496942 34762556
5492 34762556 34984403 35405496 35813679 36476462 37333177 37821603 38271200 38613785 39367389
5483 39367389 40152544 40615228 41176705 42370561 43272563 44174598 44716067 45630643 46518409
5474 46518409 47491898 48069274 49088517 50204891 50845696 51909738 53141925 54466607 55694616
5465 55694616 56759992 57952140 59092480 60111943 61425192 62547489 63838002 65155337
5457 65155337 66526923 67778258 69012723 70547703 71795956 73380608 75017059 76637504
5449 76637504 78077129 79865164 81649001 83502685 85322714 87432064 89713371 91671597
5441 91671597 94121916 96083537 98641286 101272095 103857202 106443327 109188460 112260708
5433 112260708 115374853 118578096 122170032 125903216 129658724 133699112 137875130 141911363
5425 141911363 146247551 150931055 155796728 161211251 166814158 172559882 178654885 184977823
5417 184977823 191733352 198888348 206536430 214842076 223463124 232996588 242845281 253359127
5409 253359127 264319695 275834912 288531224 302241383 316297606 330876744 346026616
5402 346026616 361467435 377580603 393533050 408876726 423148843 435485957 444806932
5395 444806932 451131588 453975136 453179376 448249369 439771755 427845683 413171000 396786665
5387 396786665 379460810 361364995 343460441 325774607 308321386 291657294 275571638
5380 275571638 260818265 247266433 234413723 222295040 211217215 200987764 191258428
5373 191258428 182241323 173867848 165815131 158716301 151909015 145258972 139162041 133569062
5365 133569062 127981095 122995071 118437480 113675659 109534497 105276777 101235277 97500171
5357 97500171 94072688 90570307 87075956 84029148 80876091 77928842 75127790 72614297
5349 72614297 70325177 68143994 66093334 63919965 62021650 60445005 58533275 57034206
5341 57034206 55587623 54169026 52820613 51393336 50060137 48926214 47844777 46334760
5333 46334760 45209306 43946155 42669086 41347300 40241974 39251806 38405675 37628121 36767967
5324 36767967 35725277 34762762 33776905 32896506 32371405 31574028 30946963 30566970 30040869
5315 30040869 29310897 28586801 27981881 27197942 26479184 26436290 25802964 24859064 24571699 24174339
5305 24174339 23709615 23031589 22518254 22128754 21806798 21241187 20881086 20519765 19968317
5296 19968317 19824169 19529012 19194607 18785795 18539584 18396225 18074521 17654404 17489688
5287 17489688 17132984 17012505 16760042 16483812 16089996 15860840 15631257 15659584 15590159 15314792
5277 15314792 15045220 14785495 14538170 14315850 14291652 14169647 14055974 13999125 13711326 13622020
5267 13622020 13342271 12921331 12705878 12925916 12754865 12390332 12194195 12117116 12026622 11977737
5257 11977737 12214851 12245935 11786308 11838536 11752995 11899868 12216909 11895484 11637516 11277356
5247 11277356 11149495 11143278 11267147 11284596 11373710 11357097 11188206 11168433 11217629 11049919 11149198
5236 11149198 11062747 11125058 11198288 10977434 10831863 10732465 10697397 10597257 10689580 10764526 10504308
5225 10504308 10121196 10003466 10496403 10637657 10446204 10048858 9870343 9968338 9876139 10044924
5215 10044924 10173067 9945290 9611534 9399458 8992416 8874255 9109379 9101482 8928793 8848361
5205 8848361 8720166 8481025 8413218 8313351 7893342 7750971 7759743 8049956 8035877 7702000
5195 7702000 7748178 7753033 8041727 8076499 8112673 8252805 8353338 8288569 8124644 8194162 8471569
5184 8471569 8492883 8385258 8381299 8375252 8045498 7937242 7885156 7749666 7773288 8075743 8082016
5173 8082016 7867304 7639530 7461894 7229505 7235746 6915951 6819247 6735814 6708277 6570820
5163 6570820 6467106 6369932 6256493 6269612 6244035 6190555 6074391 6069868 6254733 6224519 6041556
5152 6041556 6151367 6160923 6188323 6220667 6216819 6321018 6624776 6494552 6081745 6187594 6107676
5141 6107676 6191073 6396458 6423475 6361593 6126649 5911065 5849577 6033641 5941841 6268244
5131 6268244 6436935 6458727 6412507 6426137 6397804 6562766 6668230 6849384 6724689 6546948
5121 6546948 6452658 6521867 6663600 6751518 6625784 6675655 6745797 6734355 6601424 6607688 6648510
5110 6648510 6487310 6497229 6980791 7078291 6866259 6621149 6647506 7122215 7095809 7247143
5100 7247143 7275715 7227297 6981265 6650560 7131332 7346688 7415021 7340217 7447520 7423072
5090 7423072 7542681 7837061 7882337 8129997 8331436 8355090 8314263 8365668 8546432 8837967
5080 8837967 9382425 9549150 9624118 9872750 10098335 10244931 10366191 10936782 11151561 11354989
5070 11354989 11657770 12080080 12452188 12952246 13588979 14181214 14685024 15041526 15473327
5061 15473327 16156861 16725380 17768058 18638473 19187981 19819579 20081586 20563376 21137237
5052 21137237 21612716 21772786 21740419 21558374 20954279 20191363 19595684 19450157 18533115 17891985
5042 17891985 17245189 16065880 15272141 14746451 14219815 13788677 13218005 12555008 11767974
5033 11767974 10832654 10656789 10328242 10243549 9854529 9215554 8949449 8183441 7955833 7761188
5023 7761188 7429964 7395157 7041644 6815952 6283529 6007796 6065523 6075156 5787858 5482981
5013 5482981 5386139 5323088 5202978 4920268 4805202 4874617 4713623 4342436 4185495 3971574
5003 3971574 3873034 3642892 3588110 3717329 3667097 3651495 3408293 3457317 3293625 3050140
4993 3050140 3275355 3265435 2935536 2654118 2863840 3001772 2642428 2748220 2840269 2587788
4983 2587788 2569886 2467511 2393809 2477798 2534644 2413390 2314906 2463059 2401800 2396953 2149993
4972 2149993 2128660 2328360 2491245 2418648 2184103 2073204 2038684 1942440 1907637 2188286
4962 2188286 2393843 2377123 2176821 2020935 1739944 2011175 2067422 2284010 2486878 2508419
4952 2508419 2164539 2057741 2308936 2654531 2640374 2802422 2670676 2369153 2372542 2335256
4942 2335256 2758614 2989604 3003577 2871687 2661504 2511570 2449626 2652496 2691227 2757767
4932 2757767 2683068 2655875 2375941 2136646 2298355 2513932 2426121 2484014 2575635 2043606
4922 2043606 1866175 1999753 1888949 2047046 2245534 1933165 1726469 1645710 1761160 1850092
4912 1850092 1987056 2107076 1871932 1599834 1693071 1712255 1726450 1760002 1854242 1725854
4902 1725854 1706385 1512247 1439514 1369293 1446610 1704632 1609645 1571324 1582645 1509882 1506816
4891 1506816 1696241 1733742 1627136 1663094 1814764 1413443 1440069 1234651 1251485 1340404
4881 1340404 1422886 1423228 1344261 1165452 1140545 1633046 1628852 1622331 1455609 1572917 1313008
4870 1313008 1394283 1391711 1399444 1482859 1575541 1675401 1571052 1582008 1350611 1135496 1209726
4859 1209726 1349712 1513544 1309654 1368255 1091476 1022692 1187249 1444964 1603349 1643875
4849 1643875 1487280 1337248 1460510 1834578 1764846 1524415 1642131 1351045 982373 1079835
4839 1079835 1078787 1165523 1580450 1672334 1522158 1338627 1384704 1419588 1535846 1689473 1772428
4828 1772428 1762664 1909121 1626230 1448276 1666370 1568669 1664803 1650085 1521244 1259189
4818 1259189 1601586 1732935 1750649 1753513 1656801 2026910 1850022 1562742 1428808 1638256
4808 1638256 1746506 1899787 2013346 1904539 1717118 1846143 1983743 2009241 2347059 2458205
4798 2458205 2444140 2403457 2130393 2304405 2401520 2484750 2393503 2208072 2202586 2082118 1890097
4787 1890097 1917245 1683821 1880972 1887683 1706827 1536471 1703530 1613689 1347775 1544053
4777 1544053 1685072 1654383 1680624 1591470 1678603 1511852 1707225 1806333 1703507 1548229
4767 1548229 1105830 1328351 1555978 1707727 1724909 1614403 1453964 1455090 1416474 1404435
4757 1404435 1505609 1756705 1981031 1766782 1515627 1427024 1481946 1569963 1706910 1826499
4747 1826499 1786535 1593161 1397332 1420418 1696664 2062891 2220807 2229130 1985679 1861897
4737 1861897 1521409 1628033 2098731 2428586 2255781 1946662 1356793 1104478 1351490 1697200
4727 1697200 2044152 2084247 1891148 1623109 1677523 1962292 2038036 2180054 2336238 2130549
4717 2130549 2000723 2033911 2238370 2259577 2443421 2379102 2341203 2270987 2159867 2239959 2371118
4706 2371118 2555106 2502657 2463440 2746782 2755264 2741630 2814088 3061459 3128434 3229663 3420918
4695 3420918 3144397 2925584 2946297 2937113 3055394 3094334 3312560 3054089 3194476 3325984
4685 3325984 3520070 3424626 3604409 3964792 3841698 3962446 3914573 4260446 4400061 4698565
4675 4698565 4728915 4480536 4459296 4546440 4576235 4847350 4928391 5306654 5139977 5149259 5307095
4664 5307095 5679757 5939792 6049564 6058741 6235703 6193718 6346255 6619778 6625266 6761932
4654 6761932 7023533 7038936 7081781 7137519 7275824 7568630 7919853 8259455 8486354 8251800
4644 8251800 8441754 8806816 8946515 9488615 9778999 9943213 10135482 10132243 10719393 11277510
4634 11277510 11898723 12150890 12274245 12569414 13016410 13487749 13639544 14152824 14666616
4625 14666616 15238840 15656747 16213844 16742655 17292538 17954722 18795248 19321496 20028082
4616 20028082 20934907 21677597 22833142 24015632 24762575 25605939 26247477 27459834 28513935
4607 28513935 29467305 30484541 31573536 32389345 33370108 34313278 35225123 36083261 36597880
4598 36597880 37171492 37832535 38177678 38715967 39229983 39278404 39375637 39364431 39053687 38739767
4588 38739767 38271081 38003660 37258741 36386341 35712383 34979421 34175724 33376286 32516132
4579 32516132 31166362 29999167 28828041 27822991 26775905 25927804 24329493 22945185
4571 22945185 22085621 21102549 20100958 19142816 18472848 17763418 17126706 16202571 15180375
4562 15180375 14469431 14055269 13457413 12919269 12292771 11646477 11234654 10775122 10060604
4553 10060604 9533622 9254137 9126352 9009126 8780406 8275658 7597926 7602047 7594520 7471044
4543 7471044 7145290 6706546 6342083 6092130 5811435 5844219 5932890 5355152 4925755 4795346
4533 4795346 4685762 4273514 4312997 4588912 4587146 4327654 4260184 3946925 3783422 3870506
4523 3870506 3813674 3509987 3209269 3137195 3026201 3145296 3158168 3036186 2730493 2700311
4513 2700311 2777293 2848512 2724070 2611856 2797953 2867179 2547632 2532531 2366318 2293061
4503 2293061 2344252 2254516 2055862 2055302 2088865 2093483 2061941 1817869 1836997 2059272 1989514
4492 1989514 1909217 1841349 1394593 1565913 1636022 1481471 1230863 1415006 1444832 1386380
4482 1386380 1272459 1384283 1370056 1280739 1346945 1313860 1162192 1055432 1028166 1098949 1327415
4471 1327415 1238285 1289708 1236000 1410967 1375545 1201000 1136785 943261 1187218 1088168 1053111
4460 1053111 982992 868327 1107300 1137199 1535046 1290183 1247890 1053608 999859 1184318
4450 1184318 1112388 941093 1114288 1153697 1187222 1228586 1277748 1254578 832251 898693 956513
4439 956513 956620 923030 858419 1074904 951062 1148753 1119227 1194060 948664 1016996 1298438
4428 1298438 1275038 1362567 1695357 1785931 1755449 1590993 1355237 1342272 1379878 1465753 1311244
4417 1311244 1313978 1310087 1476886 1150381 1281750 1323321 1292703 1241266 1236196 1143133 1320727
4406 1320727 1353479 1051497 1181214 1086790 882440 770949 638617 450058 699753 734986
4396 734986 840131 784583 738644 785424 679434 720607 513390 684386 717849 652223 559031
4385 559031 546347 545230 535277 375627 442603 445229 352682 87373 152496 409998 705551
4374 705551 963539 1052690 742430 301445 -68440 -93624 245474 635100 343079 242943
4364 242943 250267 311104 500473 460021 638025 660925 720884 383602 126488 224949 380505
4353 380505 423693 334804 309365 364955 168329 146005 -18988 142988 388618 159693 294973
4342 294973 482837 87972 221049 377270 366042 334742 534558 542166 324700 332185 553609
4331 553609 559401 681062 499650 349434 232555 54555 349278 348213 328555 326380 569871
4320 569871 596326 252195 109973 375468 357197 613096 544479 253803 345160 91723
4310 91723 48420 179587 311968 129431 -214642 -105009 -76085 152695 308662 173938
4300 173938 124633 -51134 18944 -11459 183637 435209 378132 273223 457958 535849 463385
4289 463385 389493 72633 272168 332295 202002 21700 -55386 111631 416404 362396
4279 362396 543794 420848 434251 375867 281803 383458 395102 578785 565464 361148 78559
4268 78559 -30576 -40468 254583 381943 471226 627611 508624 272516 50646 250502
4258 250502 190406 232350 195811 361330 202494 -2920 150929 158514 419947 55795 40160
4247 40160 299673 284427 269183 -15275 174756 528197 299757 274664 317159 55922 22837
4236 22837 44543 -124611 341180 279780 -81305 -487 195572 212508 290700 293737 239828
4225 239828 230667 277783 197319 303183 205673 427347 595307 442926 529359 421078 273020
4214 273020 153716 67803 328600 464543 296977 440486 348872 375606 564868 434754
4204 434754 340340 270761 256031 151727 216700 9908 381442 247958 220118 308355 222929
4193 222929 213322 497672 362082 316835 390657 358867 471801 142038 -10040 -59060 36254
4182 36254 300183 395139 248015 247617 114507 289423 313512 379688 471508 457758 406064
4171 406064 167458 110435 304013 445879 338102 265308 221247 90265 18273 105358 221326
4160 221326 336008 413893 270545 289105 298013 560107 341588 483999 305149 282881 258719
4149 258719 180537 361497 603380 586966 509528 610538 674041 520838 637533 266332
4139 266332 68169 272769 437782 556116 498038 450614 490998 734495 525405 569367
4129 569367 809516 622133 604888 533586 335823 422149 648416 761213 762025 450424 427400
4118 427400 352839 478235 509192 463871 461827 378066 274838 412746 355802 248046 499085
4107 499085 369859 414843 292422 499357 524123 800489 689308 735149 607210 391717
4097 391717 364004 525925 682014 706962 503790 473033 564882 354483 291466 554752 801629
4086 801629 772039 912359 867013 533205 584976 488871 582579 762771 745364 575001 423081
4075 423081 409778 404035 407319 601792 654583 707422 450690 291181 466970 489517 646186
4064 646186 553724 370569 399227 617191 399823 428779 514605 773593 873996 481049
4054 481049 187070 426015 497177 710357 540143 537150 687158 568642 286037 273639
4044 273639 402468 594696 580438 494005 453874 494178 627218 674763 694699 669097 856869
4033 856869 858509 849937 641941 720667 564264 747031 882429 811468 698845 588796 573562
4022 573562 693451 658324 653064 865662 752309 736806 758345 659085 817042 1128450 968527
4011 968527 924262 949049 651304 393836 427905 713939 670649 453687 590521 775006
4001 775006 620988 663436 1023725 813701 662170 656565 520279 582334 738353 1011157
3991 1011157 1030409 1211017 1090527 770831 681050 842006 788195 867141 777052 875810 796065
3980 796065 680880 645840 854982 1261775 1325691 1274226 1039947 1004624 971158 977073 971480
3969 971480 1091440 1043168 804088 970683 1011452 987755 934412 797060 965897 943800 965714
3958 965714 1131555 1108575 1097791 1270595 1287573 1054785 1056217 1277200 1297639 1485565 1467586
3947 1467586 1338020 1149286 1051394 1185750 1187746 1172080 1336191 1281655 1291239 1115770 957950
3936 957950 1260900 1422217 1394380 1414808 1679847 1646455 1481984 1570370 1494659 1584022 1557496
3925 1557496 1602723 1557861 1643008 1446116 1390791 1465078 1646571 1699970 1647897 1619669 1625852
3914 1625852 1473275 1539868 1565160 1457682 1458488 1316139 1648884 1471735 1432583 1545212 1509275
3903 1509275 1400832 1509278 1465954 1466068 1601415 1617184 1692154 1755447 1825414 1888923 1722666
3892 1722666 1668549 1765898 1774494 1591483 1615649 1664143 1813322 1952665 2110748 2120112 2020352
3881 2020352 2012348 1989456 1932537 1894241 2013242 1944731 1883660 1838358 1822559 1784045 1917323
3870 1917323 2000742 1974356 1886891 1873158 1792833 1984040 2175443 2357832 2075349 1846840
3860 1846840 2031271 2139136 2251029 2351473 2371328 2178988 2098313 1955736 2130247 1982414
3850 1982414 1933292 2218633 2247348 2431068 2378907 2238520 2353561 2350502 2043982 2202493
3840 2202493 2370011 2354883 2480082 2531506 2234752 2360713 2437669 2225916 2117590 2215074
3830 2215074 2215734 2144092 2360479 2441450 2482239 2287562 2287867 2095113 2205774 2273339 2390819
3819 2390819 2570357 2390197 2193392 2117265 2104576 2200690 2159523 2378658 2483429 2219006
3809 2219006 2214631 2288270 2204630 2466024 2392100 2277193 1936296 1734129 1919123 2177003
3799 2177003 2434902 2390451 2379527 2180277 2404207 2335048 2436167 2632967 2505477 2504610 2624454
3788 2624454 2468729 2532229 2508640 2461716 2363869 2537263 2528152 2448117 2399889 2409586 2193984
3777 2193984 2148009 2367981 2594603 2658700 2903754 2555986 2586466 2699388 2446619 2653252
3767 2653252 2771652 2677247 2360812 2494902 2492434 2686212 2779625 2873887 2865851 2858594 2630504
3756 2630504 2744256 2779716 2799003 2999172 2876318 2765272 2679404 2601938 2910197 2939646
3746 2939646 2926015 2853112 2697912 2501820 2870381 2863281 2648829 2516565 2819685 2716526
3736 2716526 2872291 2932202 2636293 2655145 2617656 2982181 3087995 2970226 2919714 2842355
3726 2842355 2841969 2910684 3004788 2945464 2822246 2696317 2653557 2726553 2839467 3077626 3031596
3715 3031596 2893239 2571034 2795516 2905471 3045608 3077255 2994274 2869562 2865768 2783897
3705 2783897 2985533 3098273 2831131 2905898 2749117 2837405 2819499 2666469 2698558 2787080
3695 2787080 2721539 2964263 2655135 2928771 2914467 2926455 3142782 3180303 3247654 2897872
3685 2897872 3070176 2831202 2900734 2865557 3096334 3064829 2850246 2745898 2502815 2428363
3675 2428363 2794716 2991944 2902264 3148310 3192267 2911251 2880626 2776636 3035398 3158431
3665 3158431 3005436 2948245 2806256 2885265 3016941 2951670 3271885 3137302 2997018 2982803
3655 2982803 2980155 3183002 3219462 3098911 3120375 3187447 3275071 3067987 3045592 3167455 3340947
3644 3340947 3238084 2916174 2909446 2948108 2979690 2922367 2965891 3074386 2991262 2721593 3021359
3633 3021359 3151371 3112477 3192076 3240071 3265205 3087759 3093390 2798604 2897537 3084711 3052262
3622 3052262 3008774 3134716 2984152 2904086 3212656 3183148 3255382 3285587 3126909 3130282 3377687
3611 3377687 3349612 3055289 2960292 3068304 3242589 3301658 3090530 3112719 3383564 3294630
3601 3294630 3270360 3309951 3145474 3338448 3454961 3617162 3553401 3546283 3476176 3521616 3638909
3590 3638909 3786151 3699820 3388707 3135956 3470261 3639090 3563283 3322129 3134914 3212647
3580 3212647 3538060 3773917 3649203 3707991 3898866 3685231 3475829 3433501 3648740 3729133
3570 3729133 3727089 3907160 3704581 3738045 3851961 3902404 3848500 3856769 3874225 3894880 3779743
3559 3779743 3721360 4181078 4204952 4154687 4250683 4123161 3897193 4050082 3941982 4150514
3549 4150514 4275369 4229969 4033759 3848294 3995578 4317724 4243597 4214132 4473710 4617921
3539 4617921 4695564 4752886 4947782 4848945 4710568 4614065 4683025 4635582 4836354 4888969 4924231
3528 4924231 4919377 4714098 4852398 4858900 4846936 5055562 5139636 4951174 5070981 5486912 5510826
3517 5510826 5632734 5466940 5385452 5571366 5557024 5421185 5484202 5541313 5561787 5584141 5368743
3506 5368743 5442551 5661895 6001276 6177707 5911064 5925592 6024537 5956015 5968801 6211974
3496 6211974 6647542 6502142 6436404 6678213 6701082 6577637 6340743 6486814 6525358 6644935
3486 6644935 6771027 6809160 6621519 6855030 7150189 7362534 7454141 7278023 7202108 7410437
3476 7410437 7512345 7661011 7857454 7692358 7887849 7786706 7802250 7997094 7796010 8010898
3466 8010898 8320841 8449285 8402992 8476523 8596021 8513306 8700355 8800429 8668677 8680978
3456 8680978 8877720 8986319 8997949 9023891 9104345 9114676 9178503 9453787 9675097 9994800
3446 9994800 9952161 10009266 10127498 9955837 10014621 10340240 10584986 10981435 11100081 11171825
3436 11171825 11138353 11055180 10944282 11090776 11296125 11657437 11722442 11766179 11872605 12056993
3426 12056993 12278081 12178731 12415409 12500134 12672407 12764097 13010259 13345983 13335528 13389384
3416 13389384 13684547 13919142 13991864 14167643 14387362 14463315 14704793 14558510 14661295 14819439
3406 14819439 14793152 14941538 14982043 15086087 15091874 15294345 15542609 15399782 15379050 15570344
3396 15570344 15602195 15496462 15505553 15640880 15663536 15535916 15636227 15653687 15668901 15350910
3386 15350910 15420481 15540833 15341504 15167544 15081393 14766764 14611821 14799339 14508904 14298222
3376 14298222 14284810 14293296 14097882 13798218 13716953 13675172 13625611 13605283 13440777 13155419 13202450
3365 13202450 13121449 12982153 12547568 12244689 11898529 11892166 12091847 11757918 11718033 11673818
3355 11673818 11489785 11374173 10912033 10955713 11073681 11112275 11210911 11006794 10970004 10663468
3345 10663468 10712106 10599010 10455888 10126910 9859404 9799820 9455562 9261407 9327059 9303839
3335 9303839 9123497 9019810 8807488 8710200 8824700 8770869 8788414 8644026 8388431 8302693
3325 8302693 8339137 8283893 8193681 8218944 8079756 7701090 7468791 7310647 7365129 7396556 7316535
3314 7316535 7317826 7267367 7413829 7219958 7477621 7610542 7532074 7395190 7186166 7141987
3304 7141987 7067098 7005356 7175070 6967478 6774869 6820599 6670386 6458623 6386897 6433119
3294 6433119 6607407 6799667 6569533 6584379 6572637 6465710 6638731 6598654 6548135 6531583
3284 6531583 6245468 6071810 5825049 5829509 5979259 6066650 5807084 5665202 5476561 5575493
3274 5575493 5656165 5768933 5923260 5648238 5831477 5682351 5572214 5565858 5541008 5560809
3264 5560809 5655640 5720482 5464554 5200113 5156448 5278711 5383838 5419459 5076641 4955524
3254 4955524 5052137 5231022 5424465 5521516 5373699 5292616 5236865 4925918 5166823 5261523
3244 5261523 5232847 4970396 4947802 5089448 4853844 4570556 4664148 4819046 4955106 4818272
3234 4818272 4779095 5002588 4837965 4898571 4936313 5018776 4914352 4914232 5093925 5028256 4762848
3223 4762848 4623432 4482238 4820520 4692832 4484406 4652937 4840854 4686539 4466477 4297803
3213 4297803 4649249 4593106 4659507 4798044 4581752 4665650 4818924 4963191 4860891 4575755
3203 4575755 4476033 4410600 4380844 4320552 4379154 4469513 4209102 4250084 4129893 4003072 4289529
3192 4289529 4444788 4527735 4542697 4461865 4330954 4080510 4024845 4253631 4137197 3973835
3182 3973835 4080668 3851647 3843991 4049515 4229294 4272358 4374969 4362564 4337150 4049840
3172 4049840 3981715 3901869 4211933 4522438 4535071 4325713 3982128 3843554 3828691 4245483
3162 4245483 4164712 4137570 4150025 4070280 4114342 4366728 4668646 4383958 4446689 4510716 4433829
3151 4433829 4577061 4592686 4543809 4536678 4250311 4252919 4201583 3913630 4328119 4685440 4688333
3140 4688333 4487507 4077367 4135326 4129766 4371222 4926834 5031621 4941246 4663632 4540859
3130 4540859 4672949 4705093 4963257 4887397 4826655 4944480 4889947 4938045 4988015 4956151 5106034
3119 5106034 5098156 4957415 4865091 5008802 5184095 5120643 5303850 5379362 5376263 5218909 4968654
3108 4968654 5124032 5302519 5555746 5473652 5456786 5671849 5627702 5618794 5682315 5923534 5891385
3097 5891385 6014302 6183365 6056011 6062050 6364204 6666531 6492842 6257922 6136318 6403220
3087 6403220 6248345 6370207 6531990 6710581 6743794 6422894 6613099 6663100 6764499 7024900
3077 7024900 6999952 7228080 7290584 7228715 7191908 7314425 7099386 6932453 7007294 6916756 7004383
3066 7004383 7123796 7271207 7607859 7777458 7608248 7634929 7707788 7697027 7937738 8140410
3056 8140410 8289567 8109661 8014107 8147747 8054827 8365188 8107292 8264316 8216512 8347789
3046 8347789 8292235 8198659 8310257 8386780 8350891 8512235 8409024 8638322 8746513 8575819
3036 8575819 8633793 8693239 8831918 8860313 8511444 8453058 8639184 8832584 8895625 8659877
3026 8659877 8487316 8564433 8569960 8735617 8638494 8424001 8421499 8503873 8489941 8293720 8203998
3015 8203998 8261223 8277895 8047707 7869613 7906508 8143941 8081777 7783220 7614071 7522175
3005 7522175 7740426 7627299 7540976 7793094 7756904 7800642 7377592 7293366 7236579 7126786
2995 7126786 6961190 7025566 6842576 6763009 6628567 6529836 6619423 6581454 6615849 6348328 6424611
2984 6424611 6232989 6233478 6005029 5929808 6126056 5928544 5777115 5367979 5252591 5502466
2974 5502466 5361971 5281998 5037556 4756497 4768981 4687386 4893686 5167711 5035504 4665475
2964 4665475 4338720 4288350 4279205 4102671 4265056 4161940 4080074 3898044 3884241 3762334
2954 3762334 3635234 3692528 3824575 3871517 3854928 3688590 3795837 3848417 3569197 3349463
2944 3349463 3599322 3554305 3661734 3594926 3421872 3204013 3146349 3230029 3278288 3273386 2961420
2933 2961420 2937224 3004883 3129358 3047213 3014796 2994318 2756030 2814806 3012848 2845640 2842609
2922 2842609 2792280 2616535 2602990 2445716 2360917 2368618 2530476 2620715 2401748 2122531 2337974
2911 2337974 2468915 2427802 2303652 2232310 2215157 2167825 2354519 2456344 2571576 2752775
2901 2752775 2455663 2425664 2464979 2219159 2208487 2263492 2269497 2248761 2168260 2133554 2118780
2890 2118780 1983438 2112177 1812886 1945117 1851971 1750425 1773691 1795965 1807175 1688779
2880 1688779 1651772 1728223 1557631 1624596 1840941 1734749 1807934 1974241 1769962 1539368
2870 1539368 1586315 1573080 1504769 1521492 1723339 1855987 1712586 1490266 1435021 1759031
2860 1759031 1727570 1468657 1468878 1630480 1439516 1498823 1486009 1572946 1440962 1263378 1475477
2849 1475477 1227870 1225210 1516504 1409588 1352151 1117561 1015684 1332473 1461243 1407060
2839 1407060 1395477 1426545 1274066 993728 1222064 1334773 1625451 1712447 1526183 1274022
2829 1274022 870069 842046 867761 913010 931639 1072745 1133162 873175 930593 1238454 1295375
2818 1295375 1480703 1361274 1411492 1258277 1300270 1355305 1187062 1387148 1465984 1306363
2808 1306363 949118 742470 788438 757477 886230 1155103 1172400 1213939 1295441 1056324
2798 1056324 933411 832486 972467 950614 934343 754911 861547 944752 747935 820276
2788 820276 874570 872633 913244 840816 1061658 1055618 1193344 1184263 882751 676021 449052
2777 449052 609046 808449 787820 716443 1152482 900303 756905 1069538 1001444 906009
2767 906009 894796 1030033 749326 667713 775720 465478 769470 945693 904687 954924
2757 954924 728606 734833 924593 1002050 961957 990698 1028013 701749 418827 578541 512302
2746 512302 730676 877370 838037 531081 510167 394823 427968 681694 682496 828576 889582
2735 889582 687229 576186 561611 598054 747157 938058 632457 514993 625964 566859
2725 566859 644210 705417 661032 506868 331251 422434 446058 703427 582089 486417 666366
2714 666366 608171 484995 404741 399058 637464 597118 165968 589839 591064 637283 523716
2703 523716 570320 638543 841048 741380 651440 794434 657873 703163 922935 764023 708180
2692 708180 434435 451233 409269 210184 220524 735105 729688 408119 190113 117107 408405
2681 408405 595075 646519 594143 434714 433960 410043 435642 815566 958187 816448 711099
2670 711099 344734 340971 625675 779232 534152 536907 728582 626347 596866 368335 527806
2659 527806 668938 661704 493449 357911 358316 595727 548977 518952 546861 427762 146716
2648 146716 318588 552943 333938 317858 645488 735925 554004 362878 499529 276911
2638 276911 198796 597382 657014 541975 147717 61755 67838 307087 352813 499017 552751
2627 552751 287917 249098 333981 613549 934683 822441 613435 601709 563822 592240 413842
2616 413842 635245 828900 540677 259388 151444 162087 239782 57220 178280 343263
2606 343263 463314 333175 494905 360326 396882 187785 -42449 234417 358551 464215
2596 464215 445421 81278 -30133 218305 284333 174725 313469 458167 434983 351255
2586 351255 282511 373087 302951 337150 154336 247847 303698 309833 447976 477042 544488
2575 544488 638310 537918 377635 312482 335787 405494 343680 184005 319259 221000 2059
2564 2059 76663 -20876 -25881 -67951 25585 1147 144828 108547 73633 -43555 128192 235570
2552 235570 231411 298802 167131 221339 208420 113972 195524 456328 326954 58576 90128
2541 90128 208675 652665 546383 167802 152246 32027 165330 326507 551031 369777
2531 369777 459239 211693 -98292 28498 430886 452908 325998 252017 163478 144238 355304
2520 355304 436864 445298 319327 97561 -106644 -231470 -107076 -16962 67248 227280 172949
2509 172949 303247 243112 205719 313094 84074 -35529 82148 195068 304544 297886
2499 297886 -107116 -65137 106548 257603 -8424 26581 -41408 -39604 5068 77483 239141
2488 239141 64518 145316 355637 414361 394647 384852 300464 445784 -3877 -17147 -99310
2477 -99310 134773 393505 261207 45819 33252 87845 142385 343588 516972 559638 192299
2466 192299 -129280 -136548 21434 385497 421947 110613 -162665 -251892 -33732 -75251 90842
2455 90842 398169 252843 225201 69952 162266 252873 382344 531002 237924 254598 159120
2444 159120 -18594 145561 -40951 -128648 105153 207453 -9327 -84158 98676 -3209
2434 -3209 88289 188730 145521 214226 340580 -13800 23556 173509 291399 298222 314011
2423 314011 58865 -16970 -182621 -177340 128055 223248 118005 68538 81276 -63499 -13326
2412 -13326 198495 199911 55723 -49522 166888 408686 386928 322522 380698 31170 -104706
2401 -104706 -168161 547 128052 210755 298943 205431 -11950 47815 106840 73340 -120919
2390 -120919 -418316 -333445 -44053 94667 281054 396926 159533 87582 2064 -146839
2380 -146839 25517 197818 -70198 1999 73551 198188 243713 299312 478890 267091
2370 267091 57840 6666 44164 96570 183995 235458 57271 -104770 -46942 -143201 6742
2359 6742 -1589 -34710 -93660 -272046 -137281 186688 417031 229786 69981 125968 -13802
2348 -13802 -300625 -14300 9863 -49070 205488 325545 -141952 -206142 -343742 -107957
2338 -107957 56572 37474 93384 -18650 -210391 -367883 -89873 155336 327208 259568
2328 259568 -160901 -380300 -312201 -123662 102682 2053 -34197 176779 119140 -83847
2318 -83847 -156329 162281 410736 323114 -20193 -161104 -155678 -35731 -29054 -72907 -85569
2307 -85569 -31523 -105836 -256531 -64844 34836 -201727 -140451 -79947 -118858 45461 206677
2296 206677 323952 272555 13548 -97361 -25027 -3413 -11955 -24731 130268 -38957 13902
2285 13902 54565 74864 -47040 -284826 -344146 -160603 -75463 -144551 -255331 -85149 -256740
2274 -256740 47318 333878 173779 136136 -57234 -130926 -353919 -125593 236873 365755
2264 365755 189555 178068 17652 33916 -146252 67584 157786 366435 437130 168348
2254 168348 32671 -284506 -90036 3654 128622 97594 6999 -88297 -141058 185348 239127
2243 239127 156903 205710 29290 -36795 75647 151079 -22075 7029 186428 207309 142266
2232 142266 -94552 -73969 -157323 -174065 110610 90732 -73466 -443645 -495441 -68208 290162
2221 290162 431620 285830 -115831 -169169 -37196 -62984 156717 448373 294430 -78333
2211 -78333 -196178 -333431 -187652 -35887 -125008 -278067 -187371 -133950 -294851 -123382
2201 -123382 274056 284058 -148570 -250400 -208900 -13315 6639 59396 46654 -214685 -400975
2190 -400975 -272800 -259136 16191 201499 279628 229513 43862 -89635 67404 310675
2180 310675 166014 -55712 -145679 -352269 -87382 265758 219511 130332 -71347 -262281
2170 -262281 -130566 15703 -65453 -148520 -143128 -282039 -237611 -208478 59144 223134 288464
2159 288464 199533 211589 214284 222897 126209 4253 294158 287214 103082 -362530 -146941
2148 -146941 128191 -76767 -149153 -87039 -183054 -244110 -144214 -62906 -40991 69836 51355
2137 51355 -106437 -214862 -232564 -283043 -164045 124218 -108664 -143818 -35237 30656 -214054
2126 -214054 -241904 140026 166580 -21580 -102630 -71893 -156912 25535 46355 114303 -85304
2115 -85304 -36204 3650 -77207 21990 1532 -123955 -315893 -589978 -219080 28693 235844
2104 235844 389994 314298 -158034 -140105 -107948 57680 187445 299028 262509 131679
2094 131679 -58900 -384353 -388041 44579 205888 -160801 -172914 -320537 -573607 -248650
2084 -248650 77685 137220 14310 45051 74301 -266011 -7519 378583 286703 242702 82629
2073 82629 -276845 -443541 -256954 103318 470374 514735 79076 -280979 -164650 -97397
2063 -97397 10766 241207 147544 94083 -165223 -352751 -414939 -54391 210518 90693
2053 90693 -187365 -206605 -442095 -234273 -259192 5980 167891 184928 52425 -360664
2043 -360664 -486900 -69348 84023 -95750 -250578 -188047 -275129 -318112 -85191 20921
2033 20921 -36743 -240823 -148436 -231584 -224948 -35893 140184 -26461 84330 20393 -286874
2022 -286874 -24732 176213 182644 203648 251634 15578 2722 146671 -64102 -151469 -144110
2011 -144110 -111535 -167834 93587 9718 83143 -14669 24919 -99279 -98855 33505 169805
2000 169805 -24257 -74449 236236 49842 -97659 -66790 16883 -283852 -217155 -102398
1990 -102398 -108858 -174829 -64323 -149026 -218655 -111242 -166943 -110682 73002 54800 -12297
1979 -12297 -32178 33332 -193264 -74150 -6379 -106940 -127627 -232673 69943 -98857 -261061
1968 -261061 -325819 -396890 -119867 31156 26197 200962 83174 218036 155637 169938 250185
1957 250185 -136111 -71747 -319386 -192511 -176165 -177047 -79678 -171827 -173545 65883 202401
1946 202401 90622 -256675 -176076 -120262 -248919 -147906 24177 -49290 -170799 -51872
1936 -51872 -26505 -179398 -161034 70704 13502 64540 74793 227570 -92837 -250812 -39024
1925 -39024 43179 -291802 -258627 -258708 -286165 -142932 -181212 -301477 -234273 9418 75817 -126483
1913 -126483 -163858 -243757 -150081 231323 262281 325759 136974 123908 185153 -132004 -278312
1902 -278312 58358 280445 84937 26048 41031 -262782 -268269 18420 167691 -18359
1892 -18359 225181 200458 152627 46404 -230890 -151236 -116001 142577 88023 -252356 -348311
1881 -348311 -108806 -17447 -37752 -308 -181025 -102130 -34146 -178135 -20067 47620 90674
1870 90674 15019 64185 23359 -145794 -101785 165134 33281 -208699 -416568 -401722 -321880
1859 -321880 114854 330094 195245 -180358 -285242 -260471 -240113 -376056 -320902 -235301
1849 -235301 -140333 -138379 -351193 -207709 -91279 -42910 -93605 -193503 -527434 -470600 -279676
1838 -279676 17881 20084 -12726 42212 -171588 -112514 -18524 1308 75279 44248 101674
1827 101674 59010 -104009 -49380 -48003 -203702 -148751 -233809 -202039 -174105 -26880 115618
1816 115618 217203 6279 -84567 -4941 -93915 -188693 19824 110904 207226 98067 -153879
1805 -153879 -159447 -58991 183493 50277 -150056 -286038 -320228 -330771 -308098 -183985 99810
1794 99810 61781 55701 5748 -109428 138810 -27785 27571 -130758 65835 -19620 -594541
1783 -594541 -152287 31627 100649 95104 -150660 -228712 -142353 -83171 31566 336561 400962
1772 400962 -5011 -232771 -18322 -10481 184474 100283 73849 -200225 -155269 -219992 -80406
1761 -80406 28211 -219530 -365863 -379945 -287181 -188903 33539 134167 83618 84200 84078 -181456
1749 -181456 -162633 -152712 -203541 -157034 -20825 -133270 -23830 -146239 -153133 -27991 -141077
1738 -141077 50599 208439 -60041 -143810 -165425 30697 -141895 72410 231404 119329
1728 119329 -135969 -219431 -159997 -118106 -19366 41681 86384 13020 -74676 -39744 6411
1717 6411 144769 -54141 -195344 -83734 -89304 -54539 -163475 -53936 92494 -63462 -84602
1706 -84602 -124948 -235226 -20268 -175524 -231695 -191808 91711 54652 -116658 32874 -146928
1695 -146928 -316173 -167789 -148810 -63787 64883 101207 -50365 -298701 -214898 -41745
1685 -41745 -19200 -182460 -415882 -287994 131615 344778 268727 235214 174861 -20021 -388567
1674 -388567 -285583 1181 78351 -81510 -274134 -325339 -409491 -289616 66403 275673
1664 275673 92652 -68043 -469165 -430780 -151377 176399 227704 -47656 -121321 -233558
1654 -233558 -295520 -213355 -403144 -248854 -75752 -29111 -8549 -57080 37764 -122723 -135327
1643 -135327 -200857 -161896 -70142 -356417 -515124 -232252 -286885 -244335 -56048 159821 -45498
1632 -45498 -25606 -11091 -369495 -420408 -107584 -128267 45726 70850 -19411 -219010 -235943
1621 -235943 -1049 -232092 -426973 -615656 -497365 -375387 -230327 84119 -56616 -118024
1611 -118024 -107323 -223522 -115149 -105128 -206423 -294086 -63788 -184725 -222933 -145275 -155052
1600 -155052 -109191 -149235 -81806 -218688 -83767 40379 -329902 -319253 -373509 -302944 -179703
1589 -179703 99415 -2696 123816 230939 67521 242590 188546 122019 84262 -721
1579 -721 -139236 -133591 -185104 -27424 -4029 -83574 27937 51306 -137471 -122707 271117
1568 271117 110152 -200082 -138000 23544 42807 -166490 -174451 -53412 138016 6235
1558 6235 -346184 -258259 -160677 -102642 -216120 -217600 -84611 -49520 240443 252601 -145759
1547 -145759 -181823 -483199 -226969 -10732 39906 51934 -32277 -69196 -60236 104335 -28830
1536 -28830 -132138 -286077 -376774 -296496 -196750 -350349 -248805 -463057 -564945 -393081
1526 -393081 71851 316883 165857 98329 -87638 -16271 51793 217300 235241 -34340
1516 -34340 -364131 -166798 -97429 -299555 10130 -259 -228290 -543773 -457034 -210627
1506 -210627 -83093 5508 215934 137587 57904 126963 683 -66108 62401 -71696 28781
1495 28781 365738 252595 -105894 -161542 -366796 -390931 -213861 -190983 -121984 -62445 39317
1484 39317 -156664 -148323 -161928 14366 191741 77120 -154992 -178620 102396 10512 72598
1473 72598 177415 111068 -51954 32489 40027 7679 15895 15929 117369 -52918 -81089 67915
1461 67915 98453 321157 93953 -210017 -194627 -122997 -167199 -176147 -123369 -139570 93077
1450 93077 368290 175528 -73057 124225 -44805 -119229 -22135 51008 -108859 -120374 -63578
1439 -63578 -154912 -275089 -272470 -178051 -7015 -169386 -173923 -346986 -364667 -109759 149925
1428 149925 -59216 -191591 -188541 -343346 -171277 25266 -99747 -110437 -416979 -453946
1418 -453946 -194814 -158995 95441 100797 120511 -115403 -233494 -166252 -139191 94779 96329
1407 96329 -174457 -342054 -256776 -176913 -35768 -63505 -72344 5617 -57766 91445 -94116
1396 -94116 -124781 111213 31099 -29536 -37959 31461 205619 220806 -17519 -22377 118097
1385 118097 139753 208740 -112560 -284660 -396583 -363872 -339732 -110759 -473547 -419689 -206693
1374 -206693 -201868 -72388 -52046 19124 39876 87124 -8543 65359 -144968 -80229 152800
1363 152800 120420 62181 162831 182314 126348 112661 -106279 -228532 -108775 -48356 -112740
1352 -112740 -128193 -112355 -67862 -135032 288528 243807 77182 -73435 1287 155527 156081
1341 156081 210670 246678 171284 -13716 19165 -116528 61558 219884 189712 -116324 -148213
1330 -148213 -71859 -101564 -106084 59752 82099 -44423 -47381 -263215 -9643 198542 151481
1319 151481 203166 -31501 -37127 -71901 -7465 -60476 232477 56308 -17052 -65890 182212
1308 182212 134266 71278 117633 34634 35331 -90128 -8043 -42643 -139463 -214775 -56499 -164532
1296 -164532 -53276 102142 -27010 -262315 -215528 -175349 -229746 -260149 -238176 -188103 -108594
1285 -108594 -149661 -348794 -144860 7731 -64127 -244494 -284329 95990 93639 -99122 -22284
1274 -22284 -73710 47455 42973 1266 86952 -69382 -142944 -173271 -111638 -41782 17065 -43577
1262 -43577 58241 -46733 -13118 31499 30216 94033 209875 157947 -14064 -268507 -150538
1251 -150538 46777 -42616 -202411 -244549 -322356 -314012 -171017 190476 318323 140755 8507
1240 8507 -143768 72841 165835 -119936 -84702 21700 -12848 -157588 106593 368992 51097
1229 51097 -229675 -162734 -68194 54063 186872 -61045 -174693 158460 256216 276906 308530
1218 308530 290070 273312 267777 123335 -101213 154680 331462 -3521 -234003 -252927 -45835
1207 -45835 49358 -1180 26435 -112630 -111379 -42967 203630 147055 236282 -24518 -125372
1196 -125372 126713 246616 111106 147058 37775 -22164 -402213 -504579 -248760 -385296
1186 -385296 -272226 -137549 -268386 -134077 -280467 -292385 -6662 245282 38995 151483
1176 151483 136742 103065 345653 218735 201461 121799 94445 141538 234807 60199 -199092
1165 -199092 -124659 110391 61398 121115 87514 90856 155900 126302 216621 80913 70734
1154 70734 54266 201544 65679 -272447 -246021 -324770 109640 122445 -25445 -316595 -326461
1143 -326461 -304048 -184553 29905 71244 -18785 -40971 -36978 52384 -183315 -402100 76232
1132 76232 154189 -205024 110124 87211 -82431 -179275 -30197 -106555 -298678 -551551 -534150
1121 -534150 -393597 -211570 -65013 -195180 -301456 -355466 -165531 -22921 -72506 -7701
1111 -7701 -78236 -73735 -202801 -552666 -335067 -154732 -46126 -310801 -91754 -33383 -95144
1100 -95144 -400518 -219657 -54918 -193902 -129769 6997 -206267 -555563 -418562 -273643
1090 -273643 -74694 254835 175067 -141662 -256252 -154367 -171087 -160963 -16218 114890
1080 114890 -84271 -70960 -247969 -235147 38408 39809 -60704 -81698 73087 7429 -269610
1069 -269610 -477023 -233625 -69541 5932 16489 -243418 -303028 -117336 -208021 -149273 -71023
1058 -71023 -107523 19982 -35393 -263229 -178913 186271 22973 -67624 -133244 -112076 -119020
1047 -119020 -177088 -43287 242668 301030 27339 -43284 -67941 -113914 43851 200071 73151
1036 73151 103861 -7051 -112599 -257269 96863 6754 -117854 -204658 -22936 162441
1026 162441 -18757 -15724 184810 113155 -125087 -66940 151079 215046 88386 210918 157976
1015 157976 43296 -35131 -92681 -166031 30452 139508 166985 119678 -87556 -232369 -120455
1004 -120455 -17058 27214 -69555 -28136 -155201 -174336 -446355 -442467 -297336 -323378 -273723
993 -273723 -525760 -340210 -107533 252649 74977 31694 113570 80355 -139529 -278397
983 -278397 -72874 -110986 -36877 -85877 -129257 -93991 49836 16964 -78056 162129 -628
972 -628 84053 -145511 -266226 -95525 -41176 -100880 167376 394708 197643 20992 -44530
961 -44530 82124 296780 244429 88373 130127 208505 -108619 -45741 204919 130359 47374
950 47374 -77656 60415 56685 -74284 -81652 -274372 -259731 -192756 -331280 -246831 -221747
939 -221747 48255 29456 167870 108167 177776 302963 70397 -193018 44177 -12393 129242
928 129242 61620 -78412 261678 60770 -39700 90370 133194 9350 29616 -45339 54320
917 54320 171297 230326 202672 257264 21720 -89687 -91795 -112608 151409 -31029 93371
906 93371 -143077 -330769 -290743 -193410 -53570 -73339 -35028 -43915 66016 58803 -187000
895 -187000 -210214 293151 307647 241465 87133 -125208 -185507 147954 172368 60141 188444
884 188444 -62904 -99966 202457 139818 21755 86617 149380 102878 -173652 -105205 -35057
873 -35057 188929 87820 -12054 -105008 -282672 -328028 -171141 6712 197216 169213 -39096
862 -39096 -147806 -40433 185828 131693 108572 180034 51598 -97118 -146731 -60926 138089
851 138089 287468 72370 217447 221490 -32703 123073 332634 239312 -94317 13940
841 13940 246634 224122 79728 138765 420702 192040 94229 118360 -21808 -157443 -99404
830 -99404 65280 -51945 154395 196168 -26898 17720 -135680 -83377 -40623 139680 102649
819 102649 -298300 -162428 30196 201414 25639 -101444 -20816 -262643 -525444 -360343
809 -360343 -268592 -414135 -440936 120202 85765 100842 275942 160114 177653 227858 139017
798 139017 232660 187653 -73184 -235347 -227706 -99463 -49796 -70955 -246986 -90790 18456
787 18456 -109182 -57957 123777 37027 -75382 31005 -96560 -150933 -322760 -187018 -38307
776 -38307 86802 -57296 -116903 -134952 -32955 270763 234640 -43787 31855 25166 -65951
765 -65951 -69254 29348 41225 -29954 -86302 61089 70982 190860 -31113 -286105 -47174
754 -47174 181070 -12027 -253281 -73756 -135912 -174498 108802 263806 313089 392785 99382
743 99382 138155 -27884 -264787 -136074 80474 132145 146850 42468 -208308 -596503 -130677
732 -130677 -85169 -86630 262641 23223 26331 106660 126897 47354 112915 185619 17043 -231152
720 -231152 -285189 -316314 -91803 126607 -150562 -323410 -379801 -202817 -31052 32208 -285916
709 -285916 -168193 -284818 -127017 -177428 -135727 234859 338812 151596 328814 319867 222562
698 222562 235752 60611 -19270 230152 338398 -147149 180789 141095 -159685 20328
688 20328 -18083 83330 209353 208093 -175625 -200911 -27528 117357 95784 -110375 -271272
677 -271272 -122436 -132776 -201788 71557 269422 104339 100837 161530 230731 430648 467417
666 467417 500520 452987 131947 23764 15452 -30057 101140 6148 253014 262431 29502
655 29502 -370180 -20829 -2710 173461 257204 -17972 -62021 -10821 -238761 -371085 -207679
644 -207679 238922 -11221 -196570 -58935 -192696 -152075 -203155 6116 143845 33208
634 33208 93157 77443 123182 262947 519145 378692 533374 199734 -48974 -103853 -148995
623 -148995 71617 -31067 -108933 -139735 -14878 -158947 -258361 -227613 187775 60563 203886
612 203886 -46601 266331 232956 -31963 34914 124269 215737 222205 -37495 152741 320208
601 320208 167299 100275 101386 84222 -57768 153413 84132 79959 -146129 -3279 192704
590 192704 433435 359001 312301 174208 139702 118962 192473 120178 21227 -60337 -103298
579 -103298 -243652 11971 293950 440065 201280 -137573 -293847 75086 261278 137719
569 137719 -62705 -75633 -53652 -5066 42849 -103405 239184 312976 324636 219629 -158396
558 -158396 -337919 -55095 -36632 278413 187544 -252730 -276337 -40390 69409 191527
548 191527 206667 322695 215226 24086 -33827 -132871 -209517 -86483 -109387 91647 194289
537 194289 347271 489035 329330 519244 425557 185945 145406 190491 155862 161814 158029
526 158029 208381 311498 349142 184964 -22118 -69927 17248 82247 365259 461090 51595
515 51595 66031 -16071 164055 228129 143308 174754 162243 116213 217028 38361 -28637
504 -28637 27090 -3835 -18051 -18112 2336 -16086 44796 -180573 9667 86522 47786 414537
492 414537 201142 182112 297026 251583 333975 188688 140816 -120887 80110 184376 255231
481 255231 488035 410914 -21281 -170868 -178351 -161786 166363 359270 60811 -193051 -179823
470 -179823 -121437 -39458 289637 549459 65740 -180081 -75274 240200 274907 35879
460 35879 96139 50985 28750 185726 299307 190343 301044 103356 -38472 98509 -97061
449 -97061 -196375 -20435 123866 256094 276376 109323 155657 -31459 -158365 -12345 128765
438 128765 9248 111971 147451 130311 180131 99201 -121085 -231534 67609 -30126 -303367
427 -303367 -366542 -401165 59566 155634 105875 249307 198088 120316 -227214 -44165 263988
416 263988 334644 233337 171844 283172 214485 218661 222751 281669 291924 106885 1159
405 1159 -13568 -86487 208522 327618 -34880 161300 149841 116876 141777 -63662 84046
394 84046 93684 197357 247292 -5569 -41855 -187941 -336117 -265441 34797 7334 30236
383 30236 37332 -115042 -46426 107767 259089 211106 446602 255141 -162447 -119760 -125213
372 -125213 67419 95940 36753 16400 -4420 40091 27286 199703 240874 282744 281742 27877
360 27877 -206836 11956 416814 373741 431161 318723 185685 -34386 -152543 42275
350 42275 -61325 139303 255868 52060 -11864 -57469 -25704 81089 -5847 117399 380470
339 380470 122179 -20627 433 -53674 107383 436158 227776 345065 199440 -202597
329 -202597 -258754 3685 118352 43623 283125 85248 76525 297639 404800 363931 420221
318 420221 281183 192148 267130 142980 157072 105578 -94141 111872 218872 61020 289209
307 289209 4713 -158423 161492 21249 5022 113483 260040 274349 152950 261660
297 261660 228535 63619 146333 146793 276089 293825 315689 115952 -20380 -50671 42717
286 42717 -74744 28921 -16031 160804 284860 117338 -18157 -172374 41933 23552
276 23552 196482 381154 316987 344541 297264 44666 -80831 55649 59481 87165 82042
265 82042 55033 -61219 150616 439987 223404 138859 49344 -65199 54491 43945 -115212
254 -115212 -53171 -210141 25503 -11269 -331115 -166203 -139422 -5876 125075 11599
244 11599 183679 163001 112161 290514 660034 614611 333258 116888 153803 309913 -81599
233 -81599 823 173706 91260 24003 102715 183790 322798 204656 35156 92562 202343
222 202343 562200 433884 262167 68656 -67886 20755 -49548 -26148 348755 209329
212 209329 69833 212744 144979 61143 180877 174559 114408 373840 262342 187643 149777
201 149777 133155 301733 333782 178299 118810 90711 122963 139480 213179 505328 220268
190 220268 193281 20527 29999 162133 154953 44007 -12417 21190 96060 18931 34744 250834
178 250834 341858 173708 -72426 -87590 6209 102347 164891 283285 11797 187729 269851
167 269851 177251 185064 146424 42302 143421 31704 -12312 98197 57446 178366 236149
156 236149 278243 216296 290737 253979 -16521 75950 262729 379550 211005 157571 189288
145 189288 151885 345943 312487 244871 299760 204312 171917 6739 -5932 23798 278001
134 278001 352431 170467 91649 163471 349388 369667 323446 268582 322513 355517 315675
123 315675 103780 257240 353716 158079 112548 129809 172051 228543 195230 203091 136812
112 136812 193772 189089 370903 413552 244623 234191 153291 231008 168231 158065 219667 97027
100 97027 23748 301750 342037 387612 241345 82899 -6549 41543 4487 -240913 -139933
89 -139933 81980 169679 58509 126899 49551 -21075 165905 230547 257117 280204 292710
78 292710 213837 269890 190674 210274 366660 330870 151734 -30813 132512 345282 277147
67 277147 261397 400773 339956 176059 77308 181942 107461 239181 54369 -168352 -20413
56 -20413 163212 236354 220060 253931 354903 117165 -127909 -21270 142095 199580 229814
45 229814 246552 303727 46848 25171 163557 154022 305500 168768 161973 146367 93866 259528
33 259528 427081 403187 262165 193891 312934 331716 135258 303301 230984 206778 307038
$$ [...]
##END NTUPLES=NMR SPECTRUM
##END=
