##TITLE=1H_CG-1192
 CDCl3
 8 sc, 
 13.2.2024
##JCAMPDX= 6.0         $$ Bruker NMR JCAMP-DX V2.0
##DATA TYPE= NMR SPECTRUM
##DATA CLASS= NTUPLES
##ORIGIN= UXNMR, Bruker Analytische Messtechnik GmbH
##OWNER= root
$$ XWIN-NMR		Version 3.5
$$ Tue Feb 13 14:44:46 2024 Russian Standard Time (UT+4h)  she@DPX200
##.OBSERVE FREQUENCY= 200.1313
##.OBSERVE NUCLEUS= ^1H
##.ACQUISITION MODE= SIMULTANEOUS
##.ACQUISITION SCHEME= undefined
##.AVERAGES= 8
##.DIGITISER RES= 18
##SPECTROMETER/DATA SYSTEM= spect
##.PULSE SEQUENCE= zg30
##.SOLVENT NAME= CDCl3
##.SHIFT REFERENCE= (INTERNAL, CDCl3, 0, 15.4505)
##AUDIT TRAIL= $$ (NUMBER, WHEN, WHO, WHERE, WHAT)
$$ ##TITLE= Audit trail, XWIN-NMR		Version 3.5
$$ ##JCAMPDX= 5.01
$$ ##ORIGIN= Bruker BioSpin GmbH
$$ ##OWNER= she
$$ F:/spectra/data/she/nmr/H-F/1/pdata/1/auditp.txt
$$ ##AUDIT TRAIL=  $$ (NUMBER, WHEN, WHO, WHERE, WHAT)
(   1,<2024-02-13 14:43:29.73 +0400>,<she>,<DPX200>,
      <created by zg, POWCHK disabled, PULCHK disabled
       configuration hash MD5:
       00 E9 B6 7A A2 85 ED C7 34 08 36 98 17 FE 4E 26
       data hash MD5: 16K
       BD A7 BC D7 56 0D 11 B4 5B A3 1A 54 C7 72 A0 31>)
(   2,<2024-02-13 14:43:32.14 +0400>,<she>,<DPX200>,
      <Start of raw data processing
       efp BC_mod = 2 LB = 0.24 FT_mod = 6 PKNL = 1 PHC0 = -24943.69 PHC1 = 4.8527 SI = 16K 
       data hash MD5: 16K
       6C 1D 8F 3B 90 5A 6F B2 DA 9B 15 A9 6C 15 47 36>)
(   3,<2024-02-13 14:43:52.93 +0400>,<she>,<DPX200>,
      <pk PHC0 = -0.77789 PHC1 = 2.2 
       data hash MD5: 16K
       7F 82 E5 43 93 9B 0D 3C A5 F6 40 54 17 C4 9E 01>)
(   4,<2024-02-13 14:43:56.28 +0400>,<she>,<DPX200>,
      <abs ABSG = 5 
       data hash MD5: 16K
       2E 9B A9 13 0D 46 42 AD 78 6A 3D 79 9A E4 26 60>)
$$ ##END=
$$ 
$$ hash MD5
$$ 42 BD D0 6C 1A 8D 12 18 D1 F7 00 F8 60 16 39 21
##$RELAX= 
##$RELAX= 
##$RELAX= 
##$RELAX= 
##$RELAX= 
##$RELAX= 
$$ Bruker specific parameters
$$ --------------------------
##$DU= <F:/spectra>
##$EXPNO= 1
##$NAME= <H-F>
##$PROCNO= 1
##$TYPE= <nmr>
##$USER= <she>
##$AMP= (0..31)
100 100 100 100 100 100 100 100 100 100 100 100 100 100 100 100 100 100 
100 100 100 100 100 100 100 100 100 100 100 100 100 100 
##$AQSEQ= 0
##$AQ_mod= 1
##$AUNM= <au_zg>
##$AUTOPOS= <>
##$BF1= 200.13
##$BF2= 200.13
##$BF3= 200.13
##$BF4= 200.13
##$BF5= 200.13
##$BF6= 200.13
##$BF7= 200.13
##$BF8= 200.13
##$BYTORDA= 1
##$CFDGTYP= 0
##$CFRGTYP= 5
##$CHEMSTR= <none>
##$CNST= (0..31)
1 1 145 1 1 1 1 1 1 1 1 1 1 1 1 1 1 1 1 1 1 1 1 1 1 1 1 1 1 1 1 1 
##$CPDPRG= <>
##$CPDPRG1= <>
##$CPDPRG2= <>
##$CPDPRG3= <>
##$CPDPRG4= <mlev>
##$CPDPRG5= <mlev>
##$CPDPRG6= <mlev>
##$CPDPRG7= <mlev>
##$CPDPRG8= <mlev>
##$CPDPRGB= <>
##$CPDPRGT= <>
##$D= (0..31)
0 1.2 0 0 0 0 0 0 0 0.06 0 0.03 0 0 0 0 0.0002 0 0 0 0 0 0 0 0 0 0 0 0 
0 0 0 
##$DATE= 1707821009
##$DBL= (0..7)
120 120 120 120 120 120 120 120 
##$DBP= (0..7)
150 150 150 150 150 150 150 150 
##$DBP07= 0
##$DBPNAM0= <>
##$DBPNAM1= <>
##$DBPNAM2= <>
##$DBPNAM3= <>
##$DBPNAM4= <>
##$DBPNAM5= <>
$$ [...]
##$SUBNAM3= <"">
##$SUBNAM4= <"">
##$SUBNAM5= <"">
##$SUBNAM6= <"">
##$SUBNAM7= <"">
##$SUBNAM8= <"">
##$SUBNAM9= <"">
##$SW= 18.0517328524113
##$SWIBOX= (0..15)
0 0 2 0 0 0 0 0 0 0 0 0 0 0 0 0 
##$SW_h= 3612.71676300578
##$TD= 16384
##$TD0= 1
##$TE= 0
##$TE2= 300
##$TE3= 300
##$TEG= 300
##$TL= (0..7)
0 120 120 120 120 120 120 120 
##$TP= (0..7)
150 150 150 150 150 150 150 150 
##$TP07= 0
##$TPNAME0= <>
##$TPNAME1= <>
##$TPNAME2= <>
##$TPNAME3= <>
##$TPNAME4= <>
##$TPNAME5= <>
##$TPNAME6= <>
##$TPNAME7= <>
##$TPOAL= (0..7)
0.5 0.5 0.5 0.5 0.5 0.5 0.5 0.5 
##$TPOFFS= (0..7)
0 0 0 0 0 0 0 0 
##$TUNHIN= 0
##$TUNHOUT= 0
##$TUNXOUT= 0
##$USERA1= <user>
##$USERA2= <user>
##$USERA3= <user>
##$USERA4= <user>
##$USERA5= <user>
##$V9= 5
##$VALIST= <valist>
##$VCLIST= <CCCCCCCCCCCCCCC>
##$VD= 0
##$VDLIST= <DDDDDDDDDDDDDDD>
##$VPLIST= <PPPPPPPPPPPPPPP>
##$VTLIST= <TTTTTTTTTTTTTTT>
##$WBST= 1024
##$WBSW= 4
##$XGAIN= (0..3)
0 0 0 0 
##$XL= 0
##$YL= 0
##$YMAX_a= 782148
##$YMIN_a= -891082
##$ZGOPTNS= <>
##$ZL1= 120
##$ZL2= 120
##$ZL3= 120
##$ZL4= 120
##$ABSF1= 15.46483
##$ABSF2= -2.587019
##$ABSG= 5
##$ABSL= 3
##$ALPHA= 0
##$AQORDER= 0
##$ASSFAC= 0
##$ASSFACI= 0
##$ASSFACX= 0
##$ASSWID= 0
##$AUNMP= <proc_1d>
##$AZFE= 0.1
##$AZFW= 0.1
##$BCFW= 0
##$BC_mod= 2
##$BYTORDP= 0
##$COROFFS= 0
##$CY= -3
##$DATMOD= 1
##$DC= 0
##$DFILT= <>
##$DTYPP= 0
##$F1P= 0
##$F2P= 0
##$FCOR= 1
##$FTSIZE= 16384
##$FT_mod= 6
##$GAMMA= 0
##$GB= 0
##$INTBC= 1
##$INTSCL= 3.70164e-10
##$ISEN= 128
##$LB= 0.24
##$LEV0= 0
##$LPBIN= 0
##$MAXI= 10000
##$MC2= 0
##$MEAN= 0
##$ME_mod= 0
##$MI= 1.114404
##$NCOEF= 0
##$NC_proc= -5
##$NLEV= 6
##$NOISF1= 3.799351
##$NOISF2= 2.8
##$NSP= 0
##$NTH_PI= 0
##$NZP= 0
##$OFFSET= 15.45051
##$PC= 1
##$PHC0= -24944.47
##$PHC1= 7.0527
##$PH_mod= 1
##$PKNL= yes
##$PPARMOD= 0
##$PSCAL= 0
##$PSIGN= 0
##$REVERSE= no
##$SF= 200.130014249289
##$SI= 16384
##$SIGF1= 3
##$SIGF2= 2
##$SINO= 5.538805
##$SIOLD= 16384
##$SREGLST= <1H.CDCl3>
##$SSB= 0
##$STSI= 16384
##$STSR= 0
##$SW_p= 3612.71676300578
##$SYMM= 0
##$S_DEV= 0
##$TDeff= 16384
##$TDoff= 0
##$TI= <>
##$TILT= no
##$TM1= 0
##$TM2= 0
##$TOPLEV= 0
##$USERP1= <user>
##$USERP2= <user>
##$USERP3= <user>
##$USERP4= <user>
##$USERP5= <user>
##$WDW= 1
##$XDIM= 16384
##$YMAX_p= 322092635
##$YMIN_p= -99275
$$ End of Bruker specific parameters
$$ ---------------------------------
##NTUPLES= NMR SPECTRUM
##VAR_NAME=  FREQUENCY,     SPECTRUM/REAL,   SPECTRUM/IMAG
##SYMBOL=    X,             R,               I
##VAR_TYPE=  INDEPENDENT,   DEPENDENT,       DEPENDENT
##VAR_FORM=  AFFN,          ASDF,            ASDF
##VAR_DIM=   16384,         16384,           16384
##UNITS=     HZ,            ARBITRARY UNITS, ARBITRARY UNITS
##FACTOR=    0.220516191357247, 1,           1
##FIRST=     3092.11079146692, 0,            0
##LAST=      -520.605971538862, 0,           0
##MIN=       -520.605971538862, -99275,      0
##MAX=       3092.11079146692, 322092635,    0
$$ Real data points
##PAGE= N=1
##DATA TABLE= (X++(R..R)), XYDATA
$$ [...]
6492A061068Q2479N0109p0502q1158j58410p0587m4958l8451n8624o8934l3674
6481E68358r943l1924l4603l4004J4015N7858k2355J8425m157O4230K5258L0353
6469F41511O6819M6629j7216p390k9899j00087k1813l0777m0425m5954n1223j8830
6457C91345j9935m2663k0670J9668O982L5727l7349k1086K6691l8051j9317j288
6445B80054J7011O283q45j3982q931k961J1935m056k896j4043k7781K7622R066
6432B76476k2572J5616J9839k2002O509K1645k2578P708L4417p473o399j181k2468
6419B77537N247k7645N967J9556o087O680k0997J658j8565k4747m712j4400n804
6406A93688K3891l0031L2578r066l476M9039J8236q227l4312J3890J8282M7858
$$ plain form
6492 1061068 1143547 1193656 1123154 1041996 883586 812999 768041 729590 670966 602032 568358
6481 568358 558415 526491 491888 457884 471899 529757 507402 525827 521670 585900 611158 641511
6469 641511 708330 754959 737743 730353 700454 600367 578554 547777 507352 461398 410175 391345
6457 391345 371410 328747 308077 327745 334727 370454 333105 312019 338710 300659 281342 280054
6445 280054 297065 303348 302503 288521 279590 276629 288564 284508 281612 267569 239788 267410 276476
6432 276476 253904 269520 289359 267357 273866 295511 272933 280641 315058 307585 301186 300005 277537
6419 277537 282784 255139 261106 280662 274575 281255 260258 261916 243351 218604 213892 199492 193688
6406 193688 217579 187548 220126 211060 207584 256623 274859 266632 232320 246210 264492 312350
6394C12350j4085J1981K8849p157k7488K9962p279k3758P296R6j4696j8603p179
6381B70289j5931L3759l1931k0639K9106k0881p989j5869q00N046J0274J5915
6369B50349m972K6092m3923R9M453K4955j3941j0946J2046K1161J0644M225m255
6356B75987K530L8036R544j8437n1096J2071L6536n009J0052K7973m5998Q081
6344C00270L6606M022K3062j9829q111K2404k0324r092L7045L4915m066N5322
6332D52224K393j5726j7957O1103M6229m1551n998k4934L381j1660Q260M486M785
6319D65035J8212Q324l559j5557K2877q171K6918L7984q646k1834L6916K8547
6307E87046L3377J155K6166J9615K0220R3766p193L0385m4540P050P1672L2529
$$ plain form
6394 312350 298265 310246 339095 331938 304450 334412 327133 303375 310671 310767 296071 277468 270289
6381 270289 254358 288117 256186 235547 264653 243772 235783 219914 219114 224160 234434 250349
6369 250349 245377 271469 227546 227645 232098 257053 243112 232166 244212 265373 276017 280242 275987
6356 275987 278517 316553 326097 307660 256564 268635 305171 300162 310214 338187 292189 300270
6344 300270 336876 340898 363960 344131 336020 358424 338100 329008 366053 400968 396902 452224
6332 452224 454617 438891 420934 482037 528266 486715 480717 455783 459164 447504 455764 460250 465035
6319 465035 483247 491571 488012 472455 495332 487161 514079 552063 543417 521583 558499 587046
6307 587046 620423 621578 647744 667359 687579 781345 774152 804537 759997 767047 838719 871248
6295H71248j3882o1124l024l0772m3019n4052J3605k6394j6269k9750L0668M9556
6283F86791m285j9480l1022K1676L4670K0840J5295j6981P997N8346j0316M1203
6271H04734j545Q4691J12718Q2739P2543K1325j6200m9898n1434p6978o2717l6856
6259H83122l9623M0200p827m3749K7839N893l2126j9010l8002k5646J4976K370
6247G68417M9517N1813K731j242M4032J7283R419K7190m823M4142P9129P0296
6235A157904L707k2312n8719m2732l5408K4570m7469N014K2666K4084J3547L3497
6223A078349j4051j6773N2772L488M231K8269N6826J1782K6030K1408L4447R56
6211A287734J0004l31l0774k0069j5711J9772K8190m0268N4334k506M6552K1340
$$ plain form
6295 871248 857366 796242 793218 762446 719427 665375 678980 652586 636317 606567 637235 686791
6283 686791 682506 663026 632004 653680 688350 709190 724485 707504 715501 773847 763531 804734
6271 804734 803189 887880 1000598 1083337 1155880 1177205 1161005 1111107 1059673 982695 919978 883122
6259 883122 843499 883699 875872 832123 859962 865855 833729 814719 776717 751071 766047 768417
6247 768417 817934 869747 872478 871236 915268 932551 941970 969160 964337 1008479 1087608 1157904
6235 1157904 1161611 1139299 1080580 1037848 1002440 1027010 979541 984555 1007221 1031305 1044852 1078349
6223 1078349 1064298 1047525 1100297 1103785 1108016 1136285 1193111 1204893 1230923 1252331 1286778 1287734
6211 1287734 1297738 1297407 1266633 1246564 1230853 1250625 1278815 1238547 1292881 1290375 1336927 1358267
6199A358267N1574J7712N776M8516J2567N7605J3514N9295N3739O9896M0327o581
6187A782207O2384M1523P6483O3927Q8547O4714R7608J42434J77831J75562K22277
6176B995497K02823J84347K72075K15357J88062J22511n5192j86288j78390k14575
6166C546227j59461j18370q7333o4498o7651N5525P2336N6952Q1459J06374J22466
6155C544026J42516K27801K90046K82413L06475L39258M01230M82238N73029O07607
6145G196639N78018L59380K036m04826n77387o09758n47755l93417k92055k53038
6135E057837k31755j31068j36264q9509o5893n3972L5250P0780R8661J25342J45718
6124D825127J55316J63764K61288K80302M25396L88696K88289J57182r1927j97255
$$ plain form
6199 1358267 1409841 1427553 1433329 1481845 1494412 1552017 1565531 1624826 1678565 1748461 1788788 1782207
6187 1782207 1844591 1886114 1962597 2026524 2115071 2179785 2277393 2419827 2597658 2773220 2995497
6176 2995497 3198320 3382667 3654742 3870099 4058161 4180672 4125480 3939192 3760802 3546227
6166 3546227 3386766 3268396 3181063 3116565 3048914 3104439 3176775 3233727 3315186 3421560 3544026
6155 3544026 3686542 3914343 4204389 4486802 4793277 5132535 5533765 6016003 6589032 7196639
6145 7196639 7774657 8134037 8136073 7731247 7153860 6544102 5996347 5602930 5310875 5057837
6135 5057837 4826082 4695014 4558750 4469241 4403348 4349376 4384626 4455406 4554067 4679409 4825127
6124 4825127 4980443 5144207 5405495 5685797 6111193 6499889 6788178 6945360 6853433 6656178
6114F656178k80488k74145k00962k12291j99904k22284k22234k42885j70542j94037
6104D436406j29662r1571n3417l4838n5842P8295J7354O6468J29969J05059Q0410
6093D548631Q1002J28771J12394L7780M4932Q0970P1112L4710l9295K864q4550
6082E019321r1305j35029n7793k6184j4876j8453N0002O4118O9962J33881J00415
6071E094059J41917J45243K26306K30674K36950K95784L47343L14804L01047L15559
6061G649686J29262K4821r789j4191k1263N1443K44488K50128L73713M58336O13655
6050I750289P24886Q02782P50682N19886J60223j90597m33158o09699n95765m66022
6040A0413507l52251k57125r0960O8373J34509J21041J36867K45357K22260K52969
$$ plain form
6114 6656178 6375690 6101545 5900583 5688292 5488388 5266104 5043870 4800985 4630443 4436406
6104 4436406 4306744 4215173 4161756 4126918 4071076 4149371 4166725 4233193 4363162 4468221 4548631
6093 4548631 4629633 4758404 4870798 4908578 4953510 5034480 5105592 5140302 5101007 5103871 5019321
6082 5019321 4928016 4792987 4735194 4709010 4694134 4675681 4725683 4789801 4859763 4993644 5094059
6071 5094059 5235976 5381219 5607525 5838199 6075149 6370933 6718276 7033080 7334127 7649686
6061 7649686 7778948 7803769 7793980 7779789 7758526 7809969 8054457 8304585 8678298 9136634 9750289
6050 9750289 10475175 11277957 12028639 12548525 12708748 12518151 12084993 11475294 10879529 10413507
6040 10413507 10061256 9804131 9713171 9781544 9916053 10037094 10173961 10419318 10641578 10894547
6030A0894547K76525M19299N54361O55528Q95185J206928J407432J604157J687404
6021A9601366J436662Q01535l18043j356199k009274k117731j851761j457871
6013A2728684j088362q63610o40938n32714l69000k59625q3604n9009K606Q2283
6003H916711J29705K88504M18196M81651N26508N94929N75213O44187N34512K48876
5993A3358992k36938p20970r93736j166341j060010q95060p68446n97058m64459
5984F455974l78929k77238j81092k09390j53858j36587j80724k15528k45544l23066
5974D154018k02926k19332j29629q5307j01062r9413j10254m6325r7176r7333
5964B965261p1285o3625k8235m6982O340K60K7681n4613m9081m111o6687p6820
$$ plain form
6030 10894547 11171072 11590371 12144732 12800260 13695445 14902373 16309805 17913962 19601366
6021 19601366 21038028 21839563 21521520 20165321 18156047 16038316 14186555 12728684
6013 12728684 11640322 10776712 10135774 9603060 9234060 8974435 8890831 8831822 8834428 8916711
6003 8916711 9046416 9334920 9753116 10234767 10761275 11356204 11931417 12575604 13110116 13358992
5993 13358992 13122054 12401084 11407348 10241007 9180997 8285937 7517491 6920433 6455974
5984 6455974 6077045 5799807 5618715 5409325 5255467 5118880 4938156 4722628 4477084 4154018
5974 4154018 3951092 3731760 3602131 3516824 3415762 3316349 3206095 3159770 3062594 2965261
5964 2965261 2893976 2830351 2802116 2755134 2761474 2761734 2789415 2734802 2685721 2681610 2614923 2538103
5952B538103o1793p1806j05422j00540j12930r2880q9546j07389o6636P778m2690
5941A694249l3468o3399n5265j5189L6433j5302j3724Q470J7139p060m4766L6071
5929A544189l0105m7664Q011r3401K272J5392J3426q106J1954n4847j1001k5639
5917A324481k1718K5144j7177k5317k4249m8601l3060N7039R930L9608J8881L3611
5905A338572N1529j8163L4257J5068K3102L4794L4042l661K0578K3227k0013l4207
5893A499125m0052k0750m1539k396J446p1047l7826q455J9748K2260j0805J5666
5881A325375J5164K3296K6669P943L9073L5042n841Q131j6687j2100K527J2558
5869A461150l6898j7486o1809j5069m4349K1593p1425m6348m3073J4067j590j5261
$$ plain form
5952 2538103 2476310 2404504 2299082 2198542 2085612 1992732 1903186 1795797 1729161 1736939 1694249
5941 1694249 1660781 1597382 1542117 1526928 1563361 1548059 1534335 1542805 1559944 1552884 1508118 1544189
5929 1544189 1514084 1466420 1474431 1381030 1383302 1398694 1412120 1404014 1415968 1361121 1350120 1324481
5917 1324481 1302763 1327907 1310730 1285413 1261164 1212563 1179503 1236542 1246472 1286080 1304961 1338572
5905 1338572 1390101 1371938 1406195 1421263 1444365 1479159 1513201 1509540 1530118 1553345 1533332 1499125
5893 1499125 1459073 1438323 1396784 1394388 1395834 1324787 1286961 1278506 1298254 1320514 1309709 1325375
5881 1325375 1340539 1363835 1390504 1398447 1437520 1472562 1466721 1474852 1458165 1446065 1448592 1461150
5869 1461150 1424252 1406766 1344957 1329888 1285539 1307132 1235707 1189359 1146286 1160353 1158763 1143502
5857A143502j3681j1643J5920N0852O301N626m0560J7567j551j3467k9837l5806
5845A093223J4132l5291k3455j6885J4051p737k2935m6719J6995N950K9699J376
5833A022404J0177k9189k049M0229k3788r033k3604K6208M5049k0812j5232j239
5821A019121j4647l591j6373L6420L6784l8438L4587j0086O575q111O726K7622
5809A076589L2774K7943K7314N1347M4135l0311M6554K3634O236j904k1221n146
5797A277944N187k0929O663j5642K8268K4183L2237m2238J9352O66P40P986N3117
5784A377534M2391j5049J7992J9898O2955j1237K7542J3031J5302L014J8029N1404
5772A622806J0846J0879M7446J7511L9739K261N3903K0035J3996J8536N7025M5859
$$ plain form
5857 1143502 1129821 1118178 1134098 1184950 1191251 1196877 1156317 1173884 1172333 1158866 1129029 1093223
5845 1093223 1107355 1072064 1048609 1031724 1045775 1038038 1015103 968384 985379 991329 1021028 1022404
5833 1022404 1032581 1003392 1001343 1041572 1017784 1008751 985147 1011355 1056404 1035592 1020360 1019121
5821 1019121 1004474 1000883 984510 1020930 1057714 1019276 1053863 1043777 1050352 1042241 1048967 1076589
5809 1076589 1109363 1137306 1164620 1215967 1260102 1229791 1276345 1299979 1306215 1304311 1283090 1277944
5797 1277944 1283131 1262202 1268865 1253223 1281491 1305674 1337911 1295673 1315025 1315691 1316431 1324417 1377534
5784 1377534 1419925 1404876 1422868 1442766 1505721 1494484 1522026 1535057 1550359 1553373 1571402 1622806
5772 1622806 1633652 1644531 1691977 1709488 1749227 1751488 1805391 1825426 1839422 1857958 1914983 1960842
5760A960842M8584K8743Q2844M0983L0813Q3900N4376R5125O4325J03791J28890
5749B723216J77302R1004J12880J83524J85822K52917K82189L64581M26326L36199
5739E135960K14917m6004k20581k56271k73837k77373j50904j29839r4306j8055
5729C883707l6489N791K6908L4585J02035J68055K28731J89599J45921J84660
5719D933503K24402K91193L77480M85106N98196O96266O85030L15669j36839n79832
5709G890174p40687o42146n70026l94116l12818j98547j85943l4993K6113O595
5699D843606O7523J25094J18377J21688Q4027r573o5667l0784p7790j5016J04611
5688E266096J61961J08665J71626J91079l6297j88397k76366l21960k86087k88383
$$ plain form
5760 1960842 2009426 2038169 2121013 2161996 2192809 2276709 2331085 2426210 2490535 2594326 2723216
5749 2723216 2900518 2991522 3104402 3287926 3473748 3726665 4008854 4373435 4799761 5135960
5739 5135960 5350877 5304873 5084292 4828021 4554184 4276811 4125907 3996068 3901762 3883707
5729 3883707 3847218 3853009 3879917 3914502 4016537 4184592 4413323 4602922 4748843 4933503
5719 4933503 5157905 5449098 5826578 6311684 6909880 7606146 8291176 8606845 8470006 7890174
5709 7890174 7149487 6507341 5937315 5543199 5230381 5031834 4845891 4810898 4837011 4843606
5699 4843606 4911129 5036223 5154600 5276288 5360315 5350742 5285075 5254291 5176501 5161485 5266096
5688 5266096 5428057 5536722 5708348 5899427 5863130 5674733 5398367 5076407 4790320 4501937
5678D501937k56143j14348j05861j3519M7128L6196O0708O5006J25812O0255P6574
5667D483745N9130r95j15225j44198k12385j75571p0126j24207q6578l5489n7805
5656C520296J0373L9626K3380J4460j4556l2036N008L7912K9310Q433L2976N4108
5644C729290J00298J02874N9861J13776Q9448P3398R2198oo4399q8970n4177J0445
5632D164036j6544O619K491O5105Q4282R5422P6645O0680J09753J65390J34349
5621D948228J87797J64507K00263K59915J95306J16855J85552J13613J16467J05957
5611F594460J7100m8846j35190j28147q2395p161K0467J7993J05318J20162J29124
5600F602885J88015K29872K39745K91262L53756M10264M61109N30552N64287O65611
$$ plain form
5678 4501937 4245794 4131446 4025585 4012066 4059194 4095390 4156098 4221104 4346916 4407171 4483745
5667 4483745 4542875 4541880 4426655 4282457 4070072 3894501 3824375 3700168 3613590 3578101 3520296
5656 3520296 3530669 3570295 3593675 3608135 3593579 3561543 3566551 3604463 3633773 3642206 3675182 3729290
5644 3729290 3829588 3932462 3992323 4106099 4195547 4268945 4361143 4361137 4296738 4207768 4153591 4164036
5632 4164036 4147492 4154111 4156602 4221707 4305989 4401411 4478056 4538736 4648489 4813879 4948228
5621 4948228 5136025 5300532 5500795 5760710 5956016 6072871 6258423 6372036 6488503 6594460
5611 6594460 6611560 6562714 6427524 6299377 6216982 6209821 6230288 6248281 6353599 6473761 6602885
5600 6602885 6790900 7020772 7260517 7551779 7905535 8315799 8776908 9307460 9871747 10537358
5590A0537358P60335O80034O06392N78650O37797O64524O72944P77267P22428
5581A6637729M36218n8637n74067r97406j084935r32330p62866n40898l40638
5572A1782170j51977l2580O8107K12826L20221L99694M69338N16608O28037P96465
5562A5008909R26084R34228R27859J128672J425951J778181J911062J373529J21542
5553B5536017j235098k036442k320382k101518j702402j339029j069436p87245
5545A2944465o06738m57465l03114j74927q6896k3116L8073J42482K05599L24578
5535A2002941L94189M95229M00800L80241M29154N10989N03432K88341j25708
5526A5279608m31200o73994o14791l96863k40111j7706J71096N06896Q44611J313231
$$ plain form
5590 10537358 11297693 11977727 12584119 13162769 13800566 14465090 15138034 15915301 16637729
5581 16637729 17073947 17015310 16441243 15443837 14358902 13426572 12663706 12122808 11782170
5572 11782170 11630193 11597613 11665720 11878546 12198767 12598461 13067799 13584407 14212444 15008909
5562 15008909 15934993 16869221 17797080 18925752 20351703 22129884 24040946 25414475 25536017
5553 25536017 24300919 22264477 19944095 17842577 16140175 14801146 13731710 12944465
5545 12944465 12337727 11880262 11577148 11402221 11315325 11292209 11330282 11472764 11678363 12002941
5535 12002941 12397130 12892359 13293159 13673400 14102554 14613543 15116975 15405316 15279608
5526 15279608 14848408 14174414 13559623 13162760 12922649 12904943 13076039 13582935 14427546 15740777
5516A5740777J786722K336115L088963L862486L276134m4323l302547m426326
5508B2318001m029432k872325k085936j624092j273268j004287p78927o35198
5500H014536n12191l67043l80353l07166k96500k46565k49521j59063j25143j27095
5490E243896j59740j50575q3366r1959j08008l6913j8157p3827o5192l3061R512
5479D432610k244L579L2890M6097J57838J87327K30161K51870L25035L44697L10070
5468F319930L30838J66684l4246k11287m02397m05784m41012m63738l57297l11929
5458D189762k66117k03475k10252j88434j16605n1947n5428r2669p9092l3554
5448B892189l8743q6007o6341j00895l7525l9890l1163o0446N257N1876Q9965
$$ plain form
5516 15740777 17527499 19863614 22952577 26815063 30091197 30046874 26744327 22318001
5508 22318001 18288569 15416244 13330308 11706216 10432948 9428661 8649734 8014536
5500 8014536 7502345 7135302 6754949 6447783 6151283 5904718 5655197 5496134 5370991 5243896
5490 5243896 5084156 4933581 4850215 4758256 4650248 4613335 4595178 4521351 4456159 4423098 4432610
5479 4432610 4430366 4433945 4466835 4512932 4670770 4858097 5088258 5340128 5665163 6009860 6319930
5468 6319930 6650768 6817452 6783206 6571919 6169522 5763738 5322726 4858988 4501691 4189762
5458 4189762 3923645 3720170 3509918 3321484 3204879 3152932 3097504 3004835 2925743 2892189
5448 2892189 2853446 2767439 2701098 2600203 2562678 2522788 2491625 2431179 2436436 2488312 2578277
5437B578277k6611j1003M0188P8692Q4929J35053J68123J37866K60892J89843
5427C636249J3141j52247l01975k75923j74164j26941j06609j53698p5036j0051
5417B272746m1951k014k22p9790k5245N342K7396r840m697K686l6522j4171j5850
5404B077868N2217J7733J6455o778j3839K8124K7504J6847J0806K6644K7470J3405
5392B294456L0187K8639L1190M0143N2414Q7751J09313J20008O9373J02337K12121
5381C177932J65924K08776K65064L34044M33911N45407N79454N15505K99776M7373
5371F573166k66614m61027m72151m44960l36150l07220j97685j36746o9071r5606
5361C785936j9151j6654r527L5934Q3069J25012P8252J62905K17938K85455L35298
$$ plain form
5437 2578277 2551666 2540663 2580851 2659543 2744472 2879525 3047648 3185514 3446406 3636249
5427 3636249 3649390 3497143 3195168 2919245 2745081 2618140 2511531 2357833 2282797 2272746
5417 2272746 2230795 2228781 2228559 2148769 2123524 2128866 2156262 2146422 2141725 2144411 2107889 2093718 2077868
5404 2077868 2130085 2147818 2164273 2157495 2143656 2171780 2199284 2216131 2226937 2253581 2281051 2294456
5392 2294456 2324643 2353282 2384472 2424615 2477029 2564780 2674093 2794101 2863474 2965811 3177932
5381 3177932 3343856 3552632 3817696 4151740 4585651 5131058 5710512 6226017 6525793 6573166
5371 6573166 6306552 5845525 5373374 4928414 4592264 4285044 4087359 3950613 3881542 3785936
5361 3785936 3766785 3750131 3740604 3776538 3859607 3984619 4062871 4225776 4443714 4729169 5064467
5350E064467L93475N06459N65674O94590R02341J147278J352269J737041J897269
5341A4260863J476508L78904q66992j575361j727300j571813j298285j043282
5333H033242q44484o36181m62133l86986k76370k12597j40300p8187p0042k1138
5323D904824K8856M9962J30515J70012K36198K92821L80452N11834O43637P68599
5313H117710J001413J271741J590473J956494J724681P31170o06845j459322j756048
5304A2571467j685231j494206j221786r59758p53666n69945m56578l58304k92369
5295D779624k58868k25927j40154j12454p6277l9617k9828n5546k3343N7209J02235
5284C977054R8209J52249J91697K99039M14695M65789N83537N37374K60317o1247
$$ plain form
5350 5064467 5457942 5964401 6530075 7224665 8127006 9274284 10626553 12363594 14260863
5341 14260863 15737371 16116275 15249283 13673922 11946622 10374809 9076524 8033242
5333 8033242 7188758 6552577 6090444 5703458 5427088 5214491 5074191 4996004 4925962 4904824
5323 4904824 4933680 4983642 5114157 5284169 5520367 5813188 6193640 6705474 7349111 8117710
5313 8117710 9119123 10390864 11981337 13937831 15662512 16393682 15786837 14327515 12571467
5304 12571467 10886236 9392030 8170244 7210486 6456820 5886875 5430297 5071993 4779624
5295 4779624 4520756 4294829 4154675 4042221 3965944 3926327 3896499 3840953 3817610 3874819 3977054
5284 3977054 4075263 4227512 4419209 4718248 5132943 5598732 6182269 6719643 6979960 6918713
5274F918713k86591m82372n61203n07679l46048k77894j61141o2877m832j4224
5264D213852j3523n0762j05899k08926k28969j28764j17309j31599j13415o9069
5254C045617p2200o6757l9114k3359o17J532M4918O7244N5083M6396K8321Q4607
5242C171671R6735M5859R2565J30463J65785J56803J20012J68170J98077J30909
5232D477049J30754Q8283l290p3761j89147j99633j83172j33440q3178j22647
5222C707818j16934o0805N231L1434M4784n907k531L4804M8809J5253N0421P8676
5210C831053P4136j0793l6430J4418n8389l8900m4798m9172m1246L165j466N2285
5198C693863J09054J02961J07760Q462j26702j25311k32026k37858j53640r8848
$$ plain form
5274 6918713 6632122 6149750 5588547 5080868 4734820 4456926 4295785 4232908 4228076 4213852
5264 4213852 4200329 4149567 4043668 3834742 3605773 3477009 3359700 3228101 3114686 3045617
5254 3045617 2973417 2906660 2867546 2844187 2843570 2845102 2890020 2957264 3012347 3058743 3087064 3171671
5242 3171671 3268406 3314265 3406830 3537293 3703078 3859881 3979893 4148063 4346140 4477049
5232 4477049 4607803 4696086 4692796 4619035 4429888 4230255 4047083 3913643 3830465 3707818
5222 3707818 3590884 3530079 3535310 3566744 3611528 3605621 3603090 3637894 3686703 3701956 3752377 3831053
5210 3831053 3905189 3894396 3857966 3872384 3813995 3775095 3730297 3681125 3639879 3643044 3641578 3693863
5198 3693863 3802917 3905878 4013638 4022100 3895398 3770087 3538061 3300203 3146563 3047715
5188C047715j31586p6107m9272l7797m9656r0723l1611m6690n103l795m846r835
5176B510694q5228m0118p6076q6381n0227q8757q0800l7301j1743j9921l1244
5165A902898K2548P2346M0794M3451m8892j05073j23820j31485j11280P01o1950
5154A500238r3565l0343L0481J5745m6211n391j7154m0801l0108O496R711j930
5142A297168k8258p098k7431M415j383j3343L6034j0109J7230N8506M7928K5085
5130A398744K1983m657l1677m1381l1100j9322l0186J1532l2252J7336L5041j0654
5118A283407L0039L0472J9860l7887L69M7714J1457r145l1167j426q706M8161
5106A383148J6837j4687O677j0760J5012K8049L0311L3308J553P011M8489L3637
$$ plain form
5188 3047715 2916129 2840022 2790750 2752953 2703297 2612574 2580963 2534273 2529170 2525375 2520529 2510694
5176 2510694 2425466 2385348 2309272 2222891 2172664 2083907 2003107 1965806 1954063 1934142 1902898
5165 1902898 1925446 1997792 2038586 2082037 2033145 1928072 1804252 1672767 1561487 1562188 1500238
5154 1500238 1406673 1376330 1406811 1422556 1376345 1370954 1353800 1312999 1282891 1289387 1299098 1297168
5142 1297168 1268910 1261812 1234381 1238796 1237413 1224070 1260104 1249995 1267225 1325731 1373659 1398744
5130 1398744 1420727 1416070 1384393 1343012 1311912 1292590 1262404 1273936 1241684 1259020 1294061 1283407
5118 1283407 1313446 1343918 1363778 1325891 1326260 1373974 1385431 1376286 1345119 1343693 1334987 1383148
5106 1383148 1399985 1385298 1391975 1381215 1396227 1424276 1454587 1487895 1489448 1496459 1544948 1578585
5094A578585L3069j5420l316k3067l772J3146j4025L7008L1243L0573O4050L8562
5082A766636j0505M3902L7542O929L6039M574N2221O5875K645L2457J6185L6913
5070B091413P3586J14852K9495Q7991M3726J02163Q6355j3178J12296P8650J01246
5059B908595J11511M9463R8141J04922P7262Q2874J15969J30052Q2890J38646
5049C900325J23469R0430J01977J65155J69572J39625J31782J76883K48805K90153
5039E538176L06804L24173M17180M96113N26904O19686P67492J015139J286601
5030A1298268J543655K087506K702820K779380Q11363j973668k902274k650910
5022A3696140j956262j304136r33578p22409n14569m16013k90387k42766p3913
$$ plain form
5094 1578585 1611654 1596234 1592918 1569851 1566079 1579225 1565200 1602208 1633451 1664024 1728074 1766636
5082 1766636 1756131 1800033 1837575 1844504 1880543 1885117 1937338 2003213 2005858 2038315 2054500 2091413
5070 2091413 2164999 2279851 2309346 2397337 2441063 2543226 2629581 2616403 2728699 2807349 2908595
5059 2908595 3020106 3069569 3167710 3272632 3349894 3432768 3548737 3678789 3761679 3900325
5049 3900325 4023794 4114224 4216201 4381356 4550928 4690553 4822335 4999218 5248023 5538176
5039 5538176 5844980 6169153 6586333 7082446 7609350 8229036 8996528 10011667 11298268
5030 11298268 12841923 14929429 17632249 20411629 21222992 19249324 16347050 13696140
5022 13696140 11739878 10435742 9502164 8779755 8265186 7849173 7558786 7316020 7242107
5013G242107o1933q6443o6526r6476j75843k06522j91397j39269j22544j28189
5003E966965n9710q3433q9044j28825j68479j20288p2212r9423j02652p9929r7724
4992D865246r1598l7219n5803p0000r412j8786k6362J1708m9816l7340q9419q6199
4980D305000q5826j04217o4858j7737L775q640n6113m1518m8389r9510j08123
4969C673844l1530m6451o261l7295l2648o83j2095L0631J7976k146M6483L2791
4957C632616J0138N9320O4960R4748N8036R5824M2364P3416Q7077J04187R7736
4946D420422N1672P7989P1443M8293J24370J21356J27580J02126J20368J95910
4936E461529J66523J77752J90923K42051L36596K23828O5560M9934O1466J63873
$$ plain form
5013 7242107 7180174 7093731 7027205 6930729 6754886 6548364 6356967 6217698 6095154 5966965
5003 5966965 5907255 5823822 5734778 5605953 5437474 5317186 5244974 5145551 5042899 4962970 4865246
4992 4865246 4773648 4736429 4680626 4610626 4601214 4582428 4556066 4567774 4517958 4480618 4391199 4305000
4980 4305000 4219174 4114957 4050099 4032362 4036137 4027497 3971384 3929866 3881477 3781967 3673844
4969 3673844 3642314 3595863 3589602 3552307 3519659 3518976 3506881 3537512 3555488 3553342 3599825 3632616
4957 3632616 3642754 3702074 3767034 3861782 3919818 4015642 4058006 4131422 4218499 4322686 4420422
4946 4420422 4472094 4550083 4621526 4669819 4794189 4915545 5043125 5145251 5265619 5461529
4936 5461529 5628052 5805804 5996727 6238778 6575374 6799202 6864762 6914696 6976162 7140035
4926G140035K68333L75107M55386O27715P66775Q26341N47662L62249M57445P73555
4916A2600603J032940J499907K008719K626752L429814M692577O453117O481842
4908D0826271J228569l597107n534968o344015n102767l902338k745188j914120
4900A2914337j434793j110669q60262o32620m61521m15213l69541k95769k48785
4891G085164k47269k06051k06787j53549j52671r6556p4349n8429o3436o9311
4881E756756n2371m1632n4114l6064n4625l7315K2991P4036R7179P1874J06360
4870E853075J71652J34658K02856J53489J34157L8839L6370P5624P5912R8757
4860F975389Q5135R7373O3856L9186K8420O1274M4264L6515M7954L4340J8489
$$ plain form
4926 7140035 7408368 7783475 8238861 8866576 9633351 10459692 11007354 11369603 11827048 12600603
4916 12600603 13633543 15133450 17142169 19768921 23198735 27891312 34344429 40826271
4908 40826271 42054840 38457733 32922765 26578750 21475983 17573645 14828457 12914337
4900 12914337 11479544 10368875 9508613 8875993 8414472 7999259 7629718 7333949 7085164
4891 7085164 6837895 6631844 6425057 6271508 6118837 6022281 5947932 5889503 5826067 5756756
4881 5756756 5704385 5662753 5608639 5572575 5517950 5480635 5503626 5577662 5674841 5746715 5853075
4870 5853075 6024727 6159385 6362241 6515730 6649887 6688726 6725096 6800720 6876632 6975389
4860 6975389 7060524 7157897 7221753 7260939 7289359 7350633 7394897 7431412 7479366 7513706 7532195
4849G532195M3574P0690Q3909J48571J50416J52488J83177K23758K33535K53920
4839I076233K94761K75978L17649L04936K68080K43647J87622J19428O7465P0735
4829A1226534L4022L2982l9753n2795q0799n6675o7370j02703l8266n588M93J482
4817A0851564K3006M0840J08164K06046J96889K08890K63028K32398L08107L05804
4807A2744736L47088L87233L74820L69531L77608L36019L10009K37997J74742
4798A5659783R2533J0374k6256k8231j00635o5473q8631n2196J839L2722O6920
4787A5502749J96671K64479L40597M00878M70103N11391M88522N72488N29262
4778A9277140N51552O57113O29312O23656M98326M39903L67377J73621Q2285p997
$$ plain form
4849 7532195 7575769 7646459 7730368 7878939 8029355 8181843 8365020 8588778 8822313 9076233
4839 9076233 9370994 9646972 9964621 10269557 10537637 10781284 10968906 11088334 11155799 11226534
4829 11226534 11260556 11293538 11253785 11200990 11120191 11063516 10996146 10893443 10855177 10849589 10850082 10851564
4817 10851564 10874570 10915410 11023574 11229620 11426509 11635399 11898427 12130825 12438932 12744736
4807 12744736 13091824 13479057 13853877 14223408 14601016 14937035 15247044 15485041 15659783
4798 15659783 15752316 15762690 15736434 15708203 15607568 15542095 15453464 15401268 15403107 15435829 15502749
4787 15502749 15699420 15963899 16304496 16705374 17175477 17686868 18175390 18747878 19277140
4778 19277140 19828692 20485805 21115117 21738773 22237099 22677002 23044379 23218000 23300285 23292288
4768B3292288J8919j3045n9839p0777n062K220J3578M4430J64827K95007L96936
4757B4079482M34551N69908O11590O75507O90710N48659N57574N37350M92185
4748B9197516L71327K06861m0061j89801k97174m41173m41322m46113m65591n15259
4738B6939210n44888n28528n29451m72342l34470k38105j90105j23531m6082R637
4728B3941345P0446R0352R8488J48122P7577N7213M7328M1363j01979k29402j71864
4717B4068989k08156k52507k57692k51660k69969l41405m10651m51148m73479
4708B1152322m40931m05033l05975k23541j77561j85934n8104j0323N9530J36704
4698A9541154J57368J87937K62325K62667K35538J97821J29745O2676K5923o4403
$$ plain form
4768 23292288 23311207 23298162 23238323 23167546 23162484 23164704 23178282 23222712 23387539 23682546 24079482
4757 24079482 24514033 25083941 25695531 26371038 27061748 27610407 28167981 28705331 29197516
4748 29197516 29568843 29775704 29735643 29545842 29248668 28807495 28366173 27920060 27454469 26939210
4738 26939210 26394322 25865794 25336343 24864001 24529531 24291426 24101321 23977790 23931708 23941345
4728 23941345 24011791 24102143 24200631 24348753 24426330 24483543 24530871 24572234 24470255 24240853 24068989
4717 24068989 23860833 23608326 23350634 23098974 22829005 22487600 22076949 21625801 21152322
4708 21152322 20711391 20306358 20000383 19776842 19599281 19413347 19355243 19344920 19404450 19541154
4698 19541154 19698522 19886459 20148784 20411451 20646989 20844810 20974555 21037231 21063154 20998751
4688B0998751k96245m17103n16322o08720o70592o75846o75483o88809o36707
4679A5812924n98314n44933m21052l60078k86003j84894j14133q6276o4178r1867
4669A3061196k7351o0196j46698o5550j20876k21593j84479k74358l57136l93249
4659A1209710m30475m32709l85429m12298l69881l88702l96634l93072l80439
4650G620071l30273l05922k66472j94142j75749j43247j81789j78980r6519q2288
4640E664690r3707j26960j07381j45229j19735j44586j59838j64375j61261j63421
4630D278197j18110j12033j26661r6150j21843j03940j09297m8036o1775o8796
4620C311556n7907l8082k7338l8451m9835m4377n6489m3926l4481n5344o871q0750
$$ plain form
4688 20998751 20702506 20285403 19769081 19160361 18489769 17813923 17138440 16449631 15812924
4679 15812924 15214610 14669677 14248625 13888547 13602544 13417650 13303517 13217241 13153063 13061196
4669 13061196 13033845 12973649 12826951 12761401 12640525 12418932 12234453 11960095 11602959 11209710
4659 11209710 10779235 10346526 9961097 9548799 9178918 8790216 8393582 8000510 7620071
4650 7620071 7289798 6983876 6717404 6523262 6347513 6204266 6022477 5843497 5746978 5664690
4640 5664690 5570983 5444023 5336642 5191413 5071678 4927092 4767254 4602879 4441618 4278197
4630 4278197 4160087 4048054 3921393 3825243 3703400 3599460 3490163 3442127 3380352 3311556
4620 3311556 3253649 3215567 3188229 3149778 3099943 3055566 2999077 2955151 2920670 2865326 2858455 2777705
4608B777705r7889n0960o9710r3671l8836n8048j8125o9246m9362K7367N3585
4597B312810m7343n6610l3757n6088m6165p9354l0538m0366n0227j8901n3822
4586A799639k2887j8000J3968n5372n1360l7173n8107M234J3339p99k6455J307
4574A562334n2593m2674o952j9983J7476j1133k6125j1607j1923m302j6429O157
4562A382246q837k9222k4928j0938N2831q247p4034K3353o725j5137k4002O452
4550A262812l4948k58K9401J1217p03l8889j1604L464J9618k1381j8031j6395
4538A184303K633q334k479O874k7721K7767j3872J8755O1760l2783k9320o08k0976
4525A165999Q943K176J8059l0336J6282J8114k0111j895K3525l1303Q093K9273
$$ plain form
4608 2777705 2679816 2628856 2559146 2465475 2426639 2368591 2350466 2281220 2231858 2259225 2312810
4597 2312810 2265467 2208857 2175100 2119012 2072847 1993493 1962955 1922589 1872362 1853461 1799639
4586 1799639 1776752 1758752 1772720 1717348 1665988 1628815 1570708 1574942 1588281 1587482 1561027 1562334
4574 1562334 1509741 1467067 1460115 1440132 1457608 1446475 1420350 1408743 1396820 1392518 1376089 1382246
4562 1382246 1373409 1344187 1319259 1308321 1361152 1352905 1278871 1302224 1295499 1280362 1256360 1262812
4550 1262812 1227864 1227606 1257007 1268224 1267521 1228632 1217028 1220492 1240110 1218729 1200698 1184303
4538 1184303 1186936 1178602 1176123 1182997 1155276 1183043 1169171 1187926 1249686 1216903 1187583 1186975 1165999
4525 1165999 1174942 1177118 1195177 1164841 1181123 1199237 1179126 1177231 1200756 1169453 1177546 1206819
4513A206819j9368L7676j3231M1348K6144j2329J0499J6180k8207k7165q598j5461
4501A214307O693l8368n477j4328j1742M6673K3615j792J3731L3086j1850L5408
4489A289956k0014Q353L9900m629K3236N1845J6405L0078M3373J9828J3231J1692
4477A523254m155l5080j4556l4601O473n763j8098M5019k1551j5459L8622j734
4465A462371n2326L764J9928L8917K9600k15O3600J5217N331Q362K3262M018J3323
4452A635152o327N4007J02439N1435q380j4763J9844k8561k3618k9486L1350N007
4440A788099j7921l8803r609L8379q101L5656k5634J1008L1998N2632j7029j6455
4428A824220L0904L6218P0813n529M9472O2129J6572N00N1925K3223J1344K0760
$$ plain form
4513 1206819 1187451 1225127 1211896 1253244 1279388 1267059 1277558 1293738 1265531 1238366 1229768 1214307
4501 1214307 1221000 1182632 1177155 1162827 1151085 1197758 1221373 1219581 1233312 1266398 1254548 1289956
4489 1289956 1269942 1278295 1318195 1313566 1336802 1388647 1405052 1435130 1478503 1498331 1511562 1523254
4477 1523254 1519099 1484019 1469463 1434862 1441335 1435572 1417474 1462493 1440942 1425483 1464105 1462371
4465 1462371 1410045 1413809 1433737 1472654 1502254 1502039 1565639 1580856 1586187 1594549 1617811 1621829 1635152
4452 1635152 1628825 1682832 1785271 1836706 1828326 1813563 1833407 1804846 1781228 1751742 1783092 1788099
4440 1788099 1770178 1731375 1721766 1760145 1752044 1787700 1762066 1773074 1805072 1857704 1840675 1824220
4428 1824220 1855124 1891342 1962155 1956626 2006098 2068227 2084799 2085299 2137224 2160447 2171791 2192551
4416B192551M1840R1500M990j8737J6419P0603J20317J03788J10457J62387Q6496
4405B982611o4474j58582j64827p8102o9435m6787k9387j3797j2853K2330j1429
4394B355268k4642j4129K4937o573L842K435J8257K2319k0571J6433j0910K2903
4382B389569L2186R2443N1549J14808R7757O0605L041q0827k6449Q588K5192l743
4370B764719m7968l7567m8757m7572p721p209j6359k9334p216j4639J0989L2488
4358B543854k0982n903N2207K3859M388j3446J7236L2839L9657L1023K6603N3044
4346B784379O6238J5630k7424N4331J790k9524M5964J2953L3494J52K9355L9542
4334C026880N6311O7477M372M412r833o0877m9959p3709n5736M6701J1890M8386
$$ plain form
4416 2192551 2234391 2325891 2330881 2312144 2328563 2399166 2519483 2623271 2733728 2896115 2982611
4405 2982611 2918137 2759555 2594728 2516626 2447191 2400404 2371017 2357220 2344367 2366697 2355268
4394 2355268 2330626 2316497 2341434 2334861 2338703 2341138 2359395 2381714 2361143 2377576 2366666 2389569
4382 2389569 2421755 2514198 2565747 2680555 2778312 2838917 2841958 2761131 2734682 2743270 2768462 2764719
4370 2764719 2716751 2679184 2630427 2582855 2575134 2567925 2551566 2522232 2515016 2500377 2511366 2543854
4358 2543854 2522872 2516969 2569176 2593035 2597423 2583977 2601213 2634052 2673709 2704732 2731335 2784379
4346 2784379 2850617 2866247 2838823 2893154 2894944 2865420 2911384 2924337 2957831 2957983 2987338 3026880
4334 3026880 3083191 3150668 3155040 3159452 3149619 3088742 3038783 2965074 2909338 2956039 2967929 3016315
4322C016315M806q00K6252J6378k4540q830l674j1868M0568L2092j6831n2217
4310C017651j9421J5600l8561j0392o264k0034J2415M9243P5455J3032L9224K5354
4298C153302j8578J7028j171J0867K7090k2721M0959K4674L388L5051L9584l092
4286C306381J6629l0666R880L0727k2233J1892l1075K835J6491N0558j250O131
4274C366300K7802m5513P5798N4671m3200K2149L3712j945J0647J4317J6132P279
4262C538149j0045N8487k283l896J0112L3269L7585n239N072k3215M5580L3811
4250C717387Q836J292J5664Q405M8442M3171K8293O9281J09944O6336m9444R0558
4238D158165N3414L2206K3543Q8751M0918P7041R0127K4504O2798N5446m414l077
$$ plain form
4322 3016315 3021121 3020321 3046573 3062951 3038411 3029581 3025907 3014039 3054607 3086699 3069868 3017651
4310 3017651 2998230 3013830 2975269 2964877 2958613 2938579 2950994 3000237 3075692 3088724 3127948 3153302
4298 3153302 3134724 3151752 3150581 3161448 3188538 3165817 3206776 3231450 3234838 3269889 3309473 3306381
4286 3306381 3323010 3292344 3302224 3332951 3310718 3322610 3291535 3294370 3310861 3361419 3360169 3366300
4274 3366300 3394102 3348589 3424387 3479058 3435858 3458007 3491719 3489774 3500421 3514738 3530870 3538149
4262 3538149 3528104 3586591 3584308 3580412 3590524 3623793 3661378 3656139 3661211 3637996 3683576 3717387
4250 3717387 3726223 3727515 3743179 3751584 3800026 3843197 3871490 3940771 4050715 4117051 4067607 4158165
4238 4158165 4211579 4243785 4267328 4356079 4396997 4474038 4564165 4588669 4651467 4706913 4702499 4699422
4226D699422N5851M5728M209M6004M9488j1257k039j7136M0270k5772L2300O4161
4214D981229J01004N6401J0819O1873Q1220N8569O6087M7069P3238K2649K9898
4203E590056Q1581Q2970O5539P8891O3200M0425N0683Q1737P3542R8227J11470
4192F418321R5901Q2487J16027J05476L1975L2217R5473P0278L7729R3945Q7460
4181G267289O4448P4900P0684N5249L8522L9106R4011K3237O7015L3535l77j5487
4169G812132K0277M7557L1520O7660L8756M3507K6679K1457M5779J34699J11112
4158H401135O0518J11930P0849J33731Q3434J24981J30817J07843J10241J02114
4148I437593R4286J19607J04916R5505J33837J74286J67603J75936J26369J05858
$$ plain form
4226 4699422 4755273 4801001 4805210 4851214 4900702 4889445 4887406 4870270 4910540 4884768 4917068 4981229
4214 4981229 5082233 5138634 5149453 5211326 5292546 5351115 5417202 5464271 5537509 5560158 5590056
4203 5590056 5671637 5754607 5820146 5899037 5962237 6002662 6053345 6135082 6208624 6306851 6418321
4192 6418321 6514222 6596709 6712736 6818212 6850187 6882404 6977877 7048155 7085884 7179829 7267289
4181 7267289 7331737 7406637 7477321 7532570 7571092 7610198 7704209 7727446 7794461 7827996 7827619 7812132
4169 7812132 7832409 7879966 7911486 7979146 8017902 8061409 8088088 8109545 8155324 8290023 8401135
4158 8401135 8461653 8573583 8644432 8778163 8861597 8986578 9117395 9225238 9335479 9437593
4148 9437593 9531879 9651486 9756402 9851907 9985744 10160030 10327633 10503569 10629938 10735796
4138A0735796J70577J00795J96408K15418K52159K60491K63755K40882K95044
4129A2731325K72264K02039K05789J78814J68854K11940J87039J49636J31631
4120A4439331J35678J57180J83927J77996K39486K73268L17546K41592J80859
4111A6346863K09330J26109J66471J64974K59447J97393K40667K51963K57098
4102A8220315J84071J94771K04827J57447K38494K55285L10482K59407K54666
4093B0279765J70971J17883J24426J85388K56085K20625K69153K84361K64940
4084B2173597K75114K56043K61015K81448L25444M03033M14345M74748M37702
4075B5302489M22438M31723M42238M56366M47897L87037L72786M11972L83724
$$ plain form
4138 10735796 10906373 11007168 11203576 11418994 11671153 11931644 12195399 12436281 12731325
4129 12731325 13003589 13205628 13411417 13590231 13759085 13971025 14158064 14307700 14439331
4120 14439331 14575009 14732189 14916116 15094112 15333598 15606866 15924412 16166004 16346863
4111 16346863 16556193 16682302 16848773 17013747 17273194 17470587 17711254 17963217 18220315
4102 18220315 18404386 18599157 18803984 18961431 19199925 19455210 19765692 20025099 20279765
4093 20279765 20450736 20568619 20693045 20878433 21134518 21355143 21624296 21908657 22173597
4084 22173597 22448711 22704754 22965769 23247217 23572661 23975694 24390039 24864787 25302489
4075 25302489 25724927 26156650 26598888 27055254 27503151 27890188 28262974 28674946 29058670
4066B9058670L51414K82669J46694J20461J04895Q6432P7011R5812J35436M4652
4056C0504146J06577J32424J91441J29834J48977J24116K16515K54206L34331
4047C2142567L44194L43584M64840M61710N44244N35525N46084N40954N44814
4038C6468516M26379K82451J90618K7595o2871j86584k92972k86755l87638m62506
4028C5716233m22263l35454k87984k20323j18762j18901j24419j58161j90834
4019C3739132j81937j79778j37618n5015N9386Q8501R8266J10989P4968j3627
4009C3603267j28583k11322l38188m85390n88180p58630q79703r37843r32018
4000B8343410q46906o95607n94259n18071m34885l65222l50267l82229l64884
$$ plain form
4066 29058670 29410084 29692753 29839447 29959908 30064803 30151235 30228246 30324058 30459494 30504146
4056 30504146 30610723 30743147 30934588 31064422 31213399 31337515 31554030 31808236 32142567
4047 32142567 32486761 32830345 33295185 33756895 34301139 34836664 35382748 35923702 36468516
4038 36468516 36894895 37177346 37367964 37395559 37332688 37146104 36853132 36566377 36178739 35716233
4028 35716233 35293970 34958516 34670532 34450209 34331447 34212546 34088127 33929966 33739132
4019 33739132 33557195 33377417 33239799 33184784 33244170 33332671 33430937 33541926 33616894 33603267
4009 33603267 33474684 33263362 32925174 32439784 31851604 31092974 30213271 29275428 28343410
4000 28343410 27496504 26800897 26206638 25688567 25253682 24888460 24538193 24155964 23791080
3991B3791080l41167l08556l30948k71842k45966k81058k77063k52104k82574
3982B1199802k78820k19107k47721k15890k01196j89020l25394l63463l61758
3973A8797433m07262l39543k49722k99046k28543j94981j70342j89851k51533
3964A6466610k13877k17950j86259k09062j37445j27575p1432p9651j18492j08455
3954A4996412n2182n6890r460k2743n6836n6628j40028j50409j17713j43364q7561
3943A4102598m7863k4802m1318L2565k2722o0152m6227l9053l0806k6394l7929
3932A3757897p6898k0441k1831r3444n2907k6709j9652j4824m7337l7039m3412
3921A3303403R962l1744n592J2539L5883J7550P6874K3981M0508L0166N104K0424
$$ plain form
3991 23791080 23449913 23141357 22810409 22538567 22292601 22011543 21734480 21482376 21199802
3982 21199802 20920982 20701875 20454154 20238264 20037068 19848048 19522654 19159191 18797433
3973 18797433 18390171 18050628 17800906 17501860 17273317 17078336 16907994 16718143 16466610
3964 16466610 16252733 16034783 15848524 15639462 15502017 15374442 15303010 15223359 15104867 14996412
3954 14996412 14944230 14887340 14877880 14855137 14798301 14741673 14601645 14451236 14333523 14190159 14102598
3943 14102598 14054735 14029933 13988615 14021180 13998458 13938306 13892079 13853026 13822220 13795826 13757897
3932 13757897 13680999 13660558 13638727 13545283 13492376 13465667 13446015 13431191 13383854 13346815 13303403
3921 13303403 13313365 13281621 13276029 13288568 13324451 13342001 13418875 13442856 13483364 13513530 13518634 13539058
3909A3539058L2811K8527R991k5451n4490K5405l8792J0424K7421N6389P8188
3898A3689481L8733M7972O8267M8942j731j279j1075L6350J8827K2570M8042P3107
3886A4078206K8711j1096L3084N3652P7931P0882Q7442N4358P092k6466k0966
3875A4432830L2406k088K2075L6190O3316K6677L9387j7553K67M6176M9742m0987
3863A4688438k2197o781o7408m623k2721L6863J4440M3269n9480p5853n6685m1096
3851A4426166m3943p8200q167p2769l4606m6792p0102p5261n3947j11862j17760
3840A3712757r0087m1167n8719n0121j0087l0552o704j9450N1202j7791K5274
3829A3464555Q2809L7398N9249Q4305L2179J2423K8237P779J3477N8662M91L0943
$$ plain form
3909 13539058 13571869 13600396 13610387 13584936 13530446 13555851 13517059 13527483 13554904 13611293 13689481
3898 13689481 13728214 13776186 13844453 13893395 13891664 13890385 13879310 13915660 13934487 13957057 14005099 14078206
3886 14078206 14106917 14095821 14128905 14182557 14260488 14331370 14418812 14473170 14480262 14453796 14432830
3875 14432830 14465236 14463148 14485223 14521413 14584729 14611406 14650793 14633240 14633507 14679683 14729425 14688438
3863 14688438 14666241 14659460 14592052 14587429 14564708 14601571 14616011 14659280 14599800 14523947 14467262 14426166
3851 14426166 14382223 14304023 14295856 14223087 14188481 14141689 14071587 13996326 13942379 13830517 13712757
3840 13712757 13622670 13581503 13522784 13472663 13462576 13432024 13425320 13405870 13457072 13439281 13464555
3829 13464555 13547364 13584762 13644011 13728316 13760495 13772918 13801155 13808934 13822411 13881073 13881564 13912507
3817A3912507N3583R6565J17445O5575M8608R3419O4322j3518m4855j6296r588
3806A4367767N7778N0228L6312Q8761O6864Q4453J08908J04008R9487J12508J03813
3795A5280887Q4638J12066M1943K6924O2289N4539O2968j4291J5900J8214L9169
3784A5785246k2281l0707n0770j0982O1159N3834O7207O4970O5002M0841L089
3773A6026608L6313O9586L0107M3239J7124N2788O4547Q3005M5459P1487M5608
3762A6585871P7299N0961L0879L2098O6628K5822Q296M5883P6045O1689j078Q376
3750A7068769L7767J183R3361O7931j7427O7342L9629K6157N1012O5246P801J5982
3738A7524753Q795M1996l9645p0315k3354m6080j7029N353m7029N756M4775L0699
$$ plain form
3817 13912507 13966090 14062655 14180100 14245675 14294283 14387702 14452024 14438506 14393651 14377355 14367767
3806 14367767 14425545 14475773 14512085 14600846 14667710 14752163 14861071 14965079 15064566 15177074 15280887
3795 15280887 15365525 15477591 15519534 15546458 15608747 15663286 15726254 15711963 15727863 15746077 15785246
3784 15785246 15762965 15732258 15681488 15670506 15731665 15785499 15852706 15917676 15982678 16023519 16026608
3773 16026608 16062921 16132507 16162614 16205853 16222977 16275765 16340312 16423317 16468776 16540263 16585871
3762 16585871 16663170 16714131 16745010 16777108 16843736 16869558 16877854 16923737 16999782 17061471 17060393 17068769
3750 17068769 17106536 17107719 17201080 17269011 17251584 17318926 17358555 17384712 17435724 17500970 17508771 17524753
3738 17524753 17533548 17575544 17535899 17465584 17442230 17396150 17379121 17384474 17337445 17343201 17387976 17418675
3726A7418675M5983Q8092Q7236R1748J23757J72164J41992J61794J79165J79083
3716A8689689J47154J92830J78761K34742J98838J59779J94558J70562J27568
3707B0294481Q5550Q5144J9896j2580K5659J5383l160L0057P7229L4550L559r414
3695B0646354l0213n0010m7454n0926q8030j10190o1048o4659o5188m6238n9199
3684A9973199n4442o245K3436j0564j3878K6321N4877O676j8785k0758L0810M90
3672A9991137P644M3284N3544O5412P0693O0161O6255Q1527J33810J45784J51066
3661B0870317J48601J77930J41427J26934J76920J54655J60896J39118J73049
3652B2269847J81860J97124J93609J61392J68946J64027K02077K14773J52084
$$ plain form
3726 17418675 17464658 17552750 17639986 17731734 17855491 18027655 18169647 18331441 18510606 18689689
3716 18689689 18836843 19029673 19208434 19443176 19642014 19801793 19996351 20166913 20294481
3707 20294481 20380031 20465175 20485071 20472491 20498150 20513533 20510373 20540430 20617659 20652209 20655768 20646354
3695 20646354 20616141 20566131 20518677 20467751 20379721 20269531 20208483 20143824 20078636 20032398 19973199
3684 19973199 19918757 19912512 19935948 19925384 19911506 19937827 19992704 19999380 19980595 19959837 19990647 19991137
3672 19991137 19998781 20042065 20095609 20161021 20231714 20291875 20358130 20439657 20573467 20719251 20870317
3661 20870317 21018918 21196848 21338275 21465209 21642129 21796784 21957680 22096798 22269847
3652 22269847 22451707 22648831 22842440 23003832 23172778 23336805 23538882 23753655 23905739
3643B3905739J99708K16780K35066J77685K08231K46222K27974K63305K03793
3634B5884503K48059K60401K64871K77643L44868L52489L47352K89455K78580
3625B8548221K59415K62231K40635K25217K67353L08067L41558L42885L19974
3616C1115556L76653L79459L63241L41838L81212L75470M21316M16902M39458
3607C4611105M69152M35388M59051M56614M71965M54360N06273N39487M50985
3598C8854380N04838M76900N07854N25774N11321M97008N10671M95057M84257
3589D3368060M95399M64728N04598N20141N78552N19047N39409N37236N68480
3580D8095650N82010O15098O80520P20953P72833Q01503P58482P80259P97861
$$ plain form
3643 23905739 24105447 24322227 24557293 24734978 24943209 25189431 25417405 25680710 25884503
3634 25884503 26132562 26392963 26657834 26935477 27280345 27632834 27980186 28269641 28548221
3625 28548221 28807636 29069867 29310502 29535719 29803072 30111139 30452697 30795582 31115556
3616 31115556 31492209 31871668 32234909 32576747 32957959 33333429 33754745 34171647 34611105
3607 34611105 35080257 35515645 35974696 36431310 36903275 37357635 37863908 38403395 38854380
3598 38854380 39359218 39836118 40343972 40869746 41381067 41878075 42388746 42883803 43368060
3589 43368060 43863459 44328187 44832785 45352926 45931478 46450525 46989934 47527170 48095650
3580 48095650 48677660 49292758 49973278 50694231 51467064 52268567 53027049 53807308 54605169
3571E4605169Q64291Q83517R25512R19737R47620R19697Q76339R40559R88681
3562F2871122J007226J132616J168264J149212J234405J275665J300335J308228
3554G2447073J293375J327761J381181J370446J358707J415887J443889J493893
3546H3532212J532954J521648J559857J635916J686473J670382J762553J822636
3538I6724631J933724J966709K114046K203914K051952J900832J940681K069473
3530A12905962K228778K471159K668158K869513K990428L196365L382083L668359
3522A36380805M023314M528552N072747N616780O316064O964123P703115Q472313
3514A85077813R333867J0173611J1060842J1911250J2657198J3361388J3733567
$$ plain form
3571 54605169 55469460 56352977 57278489 58198226 59145846 60065543 60941882 61882441 62871122
3562 62871122 63878348 65010964 66179228 67328440 68562845 69838510 71138845 72447073
3554 72447073 73740448 75068209 76449390 77819836 79178543 80594430 82038319 83532212
3546 83532212 85065166 86586814 88146671 89782587 91469060 93139442 94901995 96724631
3538 96724631 98658355 100625064 102739110 104943024 106994976 108895808 110836489 112905962
3530 112905962 115134740 117605899 120274057 123143570 126133998 129330363 132712446 136380805
3522 136380805 140404119 144932671 150005418 155622198 161938262 168902385 176605500 185077813
3514 185077813 194411680 204585291 215646133 227557383 240214581 253575969 267309536
3507B67309536J3751081J3202046J1779019R234787N694037J122129m126262r014764
3499C08951609j2671838j4564545j4788680j3797573j2352625j0875649r668914
3492B20231785q578706p441263o324799n243877m308922l441968k674342k597814
3484A79620094l372889m275611m637829m515830m255736l831871l586883l429302
3476A47714143l257283l018051k825821k591890k494457k472399k470656k476049
3468A26107537k444154k407581k350534k251686k118045j961099j800846j681392
3460A09092200j475848j177062p89374k86771L90521J279392K154519K290015
3452A11477592J57764k644513m088961m526418m513023m398530m093514l531321
$$ plain form
3507 267309536 281060617 294262663 306041682 315276469 320970506 322092635 317966373 308951609
3499 308951609 296279771 281715226 266926546 253128973 240776348 229900699 220231785
3492 220231785 211653079 204211816 197887017 192643140 188334218 184892250 182217908 179620094
3484 179620094 176247205 171971594 167333765 162817935 158562199 154730328 151143445 147714143
3476 147714143 144456860 141438809 138612988 136021098 133526641 131054242 128583586 126107537
3468 126107537 123663383 121255802 118905268 116653582 114535537 112574438 110773592 109092200
3460 109092200 107616352 106439290 105649916 105363145 105753666 107033058 109187577 111477592
3452 111477592 111635356 108990843 104901882 100375464 95862441 91463911 87370397 83839076
3444H3839076k912952k395648k029669j804242j586754j470635j306342j232339
3436F9100495j109162j056803r09010q92926p26769o28512n02045l83648k91564
3427F2600056k49156q7253J70918M11870P82838J159688J262857O92459n98359
3418F6145918j575901j959406k085537j935295j701008j352841j004035p08886
3410E3823009m70276k74586j50194j9071P0371J40583L99981Q81614J286846J861336
3400E7549613K645068K649301L94345k420191l731199l727284k846352k039415
3392D8473886j462361j184494r92314p57472o49920m96266m40688l45932j75090
3383D1969349n4876R857J31025K05470K31396K37552L97659O27212J017544J558704
$$ plain form
3444 83839076 80926124 78530476 76500807 74696565 73109811 71639176 70332834 69100495
3436 69100495 67991333 66934530 66025520 65132594 64405825 63777313 63275268 62891620 62600056
3427 62600056 62350900 62263647 62434565 62846435 63629273 64788961 66051818 66744277 66145918
3418 66145918 64570017 62610611 60525074 58589779 56888771 55535930 54531895 53823009
3410 53823009 53352733 53078147 52927953 52908882 52979253 53119836 53519817 54401431 55688277 57549613
3400 57549613 60194681 62843982 63238327 60818136 57086937 53359653 50513301 48473886
3392 48473886 47011525 45827031 44834717 44077245 43427325 42931059 42490371 42144439 41969349
3383 41969349 41914473 41924330 42055355 42260825 42492221 42729773 43127432 43754644 44772188 46330892
3373D6330892K130379K813845K307756k61305k682960l656608l417024k438363
3365D1126612j745017j301720j034420p70491o07557o11298m63319m06241l98528
3356C3788021l34902l04352k42285k32781j73193j93770k52484k63330k38387
3347C1552537k52418j87181j91900k10597j86412j66025j46316j60176j48778
3338B9902734j78147j97770k29316k30614k42441j82132k41461k75354k41184
3329B7884315j99246k06816k16979k43899k48253k35377k06608k09494k22022
3320B5895621j67604j66675j48302j25355j13685j16367j50022p5695j13969j17166
3310B4600781j07958r1511r4494j31982j60650j13525j34157j84759j88195k22761
$$ plain form
3373 46330892 48461271 51275116 53582872 53321567 50638607 46981999 43564975 41126612
3365 41126612 39381595 38079875 37045455 36274964 35667407 35056109 34592790 34186549 33788021
3356 33788021 33453119 33148767 32906482 32673701 32500508 32306738 32054254 31790924 31552537
3347 31552537 31300119 31112938 30921038 30710441 30524029 30358004 30211688 30051512 29902734
3338 29902734 29724587 29526817 29297501 29066887 28824446 28642314 28400853 28125499 27884315
3329 27884315 27685069 27478253 27261274 27017375 26769122 26533745 26327137 26117643 25895621
3320 25895621 25728017 25561342 25413040 25287685 25174000 25057633 24907611 24831916 24717947 24600781
3310 24600781 24492823 24401312 24306818 24174836 24014186 23900661 23766504 23581745 23393550 23170789
3300B3170789j83917k22351j96034j99088k17908j62269j59330j47250j52501
3291B1530141j13243j05983m6113l7711j04539o5432o7635l1905p511m7920l1071
3280B0871078J6996K4564O8797J6334L1503M9372L2521O4673Q5223N9654M8929
3269B1369644K8659Q4547N7954P2224N4652M6077P6998Q6182O7519Q6143R7358
3258B2127957J19766J55541K25000K45908K09120K27568K45292K77917L03845
3249B4137914L45725L66929M46542M23640M15915L08223K07725J17029N5971K8150
3239B6853763Q5191K47242L10234L85976M36352M12447M27170L10341J63030N208
3229B9636954o7191r511K6998J63092K28315K89340L30564L71810L70885M13300
$$ plain form
3300 23170789 22986872 22764521 22568487 22369399 22151491 21989222 21829892 21682642 21530141
3291 21530141 21416898 21310915 21264802 21227091 21122552 21057120 20989485 20957580 20950069 20902149 20871078
3280 20871078 20888074 20912638 20981435 20997769 21029272 21078644 21111165 21175838 21261061 21320715 21369644
3269 21369644 21398303 21482850 21540804 21613028 21667680 21713757 21790755 21876937 21944456 22030599 22127957
3258 22127957 22247723 22403264 22628264 22874172 23083292 23310860 23556152 23834069 24137914
3249 24137914 24483639 24850568 25297110 25720750 26136665 26444888 26652613 26769642 26825613 26853763
3239 26853763 26938954 27186196 27496430 27882406 28318758 28731205 29158375 29468716 29631746 29636954
3229 29636954 29569763 29560252 29587250 29750342 29978657 30267997 30598561 30970371 31341256 31754556
3219C1754556L96189M94291O08592P12211Q23462R38431J018260R05180O82699
3210C8333871M79437L72752K69785L64335N70443P39568Q72195J075136J205518
3201D4283040J296348J250500J099769J002381R01495R83700J099482J192731
3193E3109446J209995J220203J163881J094703J019763Q29006P03756N55626N55917
3184F1462296N42909N82934O54902P33451Q29818Q71462Q84451J030612J214241
3175F8807076J407668J680080J916910K215646K475201K752622L053389L231489
3167H7540081L423453L616122L746654L706685L510945K839440J862354N33873
3159A10779607r12855k257175l338940l766403l684455l161068k390521j605513
$$ plain form
3219 31754556 32150745 32645036 33253628 33965839 34789301 35727732 36745992 37651172 38333871
3210 38333871 38813308 39186060 39455845 39820180 40390623 41130191 42002386 43077522 44283040
3201 44283040 45579388 46829888 47929657 48932038 49833533 50817233 51916715 53109446
3193 53109446 54319441 55539644 56703525 57798228 58817991 59646997 60350753 60906379 61462296
3184 61462296 62005205 62588139 63243041 63976492 64806310 65677772 66562223 67592835 68807076
3175 68807076 70214744 71894824 73811734 76027380 78502581 81255203 84308592 87540081
3167 87540081 90963534 94579656 98326310 102032995 105543940 108383380 110245734 110779607
3159 110779607 109866752 107609577 104270637 100504234 96819779 93658711 91268190 89662677
3151H9662677r16653l10794K08618P30314J027710J434436J794072K049857K263723
3142I7943960K389993K461726K458573K432444K356898K210038J786719J125434
3134A15165785K69854o74215j504348k116123k560470k994469l421539l854880
3126I8309595m033107l807226l280939k648864k079821j599137j121346o94368
3118G9044787l19626L4632K16196L42025L27001J41711p2127l98811p01760j082676
3108G7531352j388568j791671k197664k613040l014342l248636l260186l055995
3100E6961250k767370k472135k235990k011902j908358j716796j607654j434343
3092D0806702j266499j206875j072334r40719q22614p87945p35833p02568o03794
$$ plain form
3151 89662677 88746024 88435230 88643848 89374162 90401872 91836308 93630380 95680237 97943960
3142 97943960 100333953 102795679 105254252 107686696 110043594 112253632 114040351 115165785
3134 115165785 115435639 114761424 113257076 111140953 108580483 105586014 102164475 98309595
3126 98309595 94276488 90469262 87188323 84539459 82459638 80860501 79739155 79044787
3118 79044787 78725161 78759793 78975989 79318014 79645015 79786726 79714599 79315788 78614028 77531352
3108 77531352 76142784 74351113 72153449 69540409 66526067 63277431 60017245 56961250
3100 56961250 54193880 51721745 49485755 47473853 45565495 43848699 42241045 40806702
3092 40806702 39540203 38333328 37260994 36320275 35497661 34709716 33973883 33271315 32667521
3083C2667521o64637p44940p89037q09550q36132r57396q64571q75625q14686
3074B5310947q19595p60810o34785o27974o40113n56878m71271m98945n06221
3065A9794355m73882m87110m67951m61561m66881l87637l71978l69876k89510
3056A6017969k52354k81870k25173j67849k42956j94283j63619j66461j59020
3047A4164384j83017j58203j83092k14656k57910k58746k20538k28535k58509
3038A2201178k39617k68750l02750k63900k41846k17201k39839k71735j95372
3029I960168j88377j73446j41020j82521j34481q6240j08754p7921q7101j12907
3019H667400q4592r4355j11807j32333j13266j39987j19188j48801j35474j63227
$$ plain form
3083 32667521 32002884 31257944 30468907 29659357 28823225 27865829 27001258 26125633 25310947
3074 25310947 24491352 23730542 23095757 22467783 21827670 21270792 20799521 20300576 19794355
3065 19794355 19320473 18833363 18365412 17903851 17436970 17049333 16677355 16307479 16017969
3056 16017969 15765615 15483745 15258572 15090723 14847767 14653484 14489865 14323404 14164384
3047 14164384 13981367 13823164 13640072 13425416 13167506 12908760 12688222 12459687 12201178
3038 12201178 11961561 11692811 11390061 11126161 10884315 10667114 10427275 10155540 9960168
3029 9960168 9771791 9598345 9457325 9274804 9140323 9054083 8945329 8867408 8780307 8667400
3019 8667400 8582808 8488453 8376646 8244313 8131047 7991060 7871872 7723071 7587597 7424370
3009G424370j81698j29141j27923j22724j60357j12708j02165j18177j61844j21801
2999F085832r4262j24701j56750j30072p4484q5385p3861n0839r0253p1671r3275
2988E040279r4357o9525o3842n4669m4807k9772p1799j04252q3600p6522n2442
2977D294692q5526n2638j5035k6340l3431r5989n6398k8257l3943o3892o7938
2966C735305q236l7927M746l6420l8393k8899k7228l7164j8516j5409k3819m9163
2954C418877j5286r373n2077n388n9411N169j4437n2154l3496R890n9297n4225
2942C078792m3091j7191J9766k8378n2932J4535k0369l8722m7377K546j837k4017
2930B841725p249k900m395n0992j6347k1682k0821j3055m2436k3685K164O905
$$ plain form
3009 7424370 7242672 7113531 6985608 6862884 6702527 6589819 6487654 6369477 6207633 6085832
2999 6085832 5991570 5866869 5710119 5580047 5505563 5420178 5346317 5295478 5205225 5133554 5040279
2988 5040279 4945922 4876397 4812555 4757886 4713079 4683307 4611508 4507256 4423656 4347134 4294692
2977 4294692 4209166 4156528 4141493 4115153 4081722 3985733 3929335 3901078 3867135 3803243 3735305
2966 3735305 3727069 3689142 3693888 3657468 3619075 3590176 3562948 3525784 3507268 3491859 3468040 3418877
2954 3418877 3403591 3394218 3342141 3336753 3277342 3282511 3268074 3215920 3182424 3192314 3133017 3078792
2942 3078792 3035701 3018510 3038276 3009898 2956966 2971501 2951132 2912410 2865033 2867579 2865742 2841725
2930 2841725 2834476 2831576 2827181 2776189 2759842 2738160 2717339 2704284 2661848 2638163 2640327 2647232
2918B647232l0348o941M3573l1745K11J1626R571m7551n9104n25m0742l773j802
2905B489682K91R117J042k2499j7605j0732k9715j1990k4866P596O418j3492k7977
2892B355270j9516r588J5641J1273L8342J287k3270J5826M7748j8036J5162j8253
2880B411886J0323K8219K008J8395k4206m8564l8688m1312l0117p580l2398n6349
2868B191617j7960M4717j7029l4211k3823K8295l080M0420K1955j6973n855r271
2856B198802L3819L4363k4957l1483K619M990k1490k4315j8158l4618o404l2851
2844B080317m4438l7990r893J7527m2853k5435l2722l2980J7947J0819L0477j54
2832A930622r4730m12L2891l2844J4268j9129m6970j5798p483m0888m6436j2017
$$ plain form
2918 2647232 2616884 2609943 2653516 2621771 2621982 2633608 2643179 2595628 2536524 2535999 2495257 2491484 2489682
2905 2489682 2489973 2499090 2500132 2477633 2460028 2449296 2419581 2407591 2382725 2390321 2396739 2383247 2355270
2892 2355270 2335754 2326166 2341807 2353080 2391422 2392709 2369439 2385265 2433013 2414977 2430139 2411886
2880 2411886 2422209 2450428 2452436 2470831 2446625 2398061 2359373 2318061 2287944 2280364 2247966 2191617
2868 2191617 2173657 2218374 2201345 2167134 2143311 2171606 2168526 2208946 2230901 2213928 2208073 2198802
2856 2198802 2232621 2266984 2242027 2210544 2213163 2218153 2196663 2172348 2154190 2119572 2113168 2080317
2844 2080317 2035879 1997889 1987996 2005523 1962670 1937235 1904513 1871533 1889480 1900299 1930776 1930622
2832 1930622 1835892 1835480 1868371 1835527 1849795 1830666 1783696 1767898 1760415 1719527 1673091 1661074
2820A661074j8156k7657l7455Q228k3589n4140j1386k2028J8020j0819j1419k1499
2808A449174K3735m9427l0941m7680j88N3112j7711m653K6408j4569m4855k871
2796A339534p012J435j0970J8994j8111j3421J467k6469k0799J6569O347O113
2784A293677N621J0159p0372j6510l9484M639l0833R831L239q958j1032k5763
2772A124214j9302N909J2670j2629j7482k218J4303r603j5059k5172j1398n1691
2760I92542q096q710L667k0071j1483L8802m3572n0451o760j330L4294K0947L819
2747I43598m1586L2175q861m6111k3573M2109R848l4191l018k1880J4640j0245
2735H52905j2687p956L4473K3577q630j3452J986p535l7911m2108j3786K2385
$$ plain form
2820 1661074 1642918 1615261 1577806 1586034 1562445 1508305 1496919 1474891 1492911 1482092 1470673 1449174
2808 1449174 1472909 1423482 1392541 1344861 1344673 1397785 1380074 1375421 1401829 1387260 1342405 1339534
2796 1339534 1332522 1333957 1322987 1341981 1323870 1310449 1311916 1285447 1264648 1281217 1287564 1293677
2784 1293677 1299298 1309457 1239085 1222575 1183091 1187730 1156897 1166728 1169967 1161009 1149977 1124214
2772 1124214 1104912 1110821 1123491 1110862 1093380 1091162 1105465 1095862 1080803 1055631 1044233 992542
2760 992542 984446 975736 979403 959332 947849 986651 943079 892628 885868 884538 918832 939779 943598
2747 943598 902012 934187 925326 879215 855642 897751 907599 873408 870390 848510 863150 852905
2735 852905 840218 832262 866735 890312 881682 868230 870216 862681 824770 782662 768876 791261
2723G91261m6109k5884M2345q218j646M3037q548k4060l9020j4414R033J2880
2711G30657l4364j2501K2917L311p7256k7434J3652j4769j0574m412J3441O219
2699F08887m7146j5643J1773K2529m0014r298k536j5289n795J2944j4856j5967
2687D89589K9010j9296k5655k1028j3469L5985r059p319K8781j6347J9489m838
2675D85843l1067m3377l2863j2713k7643J5767R740K2958J562k7289j3157j7093
2663C30668K2561J209L24M5710l3403l3236L307n52K3857l5452n46k8245J1219
2650C07421p06J9392m1133K2711O483j7973l643j4655j3813q953M623q247k0847
2637B30660L2820L9564l5384k2126J0969J5896k2246L4379L479n639k899K1669
$$ plain form
2723 791261 745152 719268 761613 753395 751749 794786 786238 762178 723158 708744 717777 730657
2711 730657 696293 683792 706709 710020 632764 605330 618982 604213 593639 589227 602668 608887
2699 608887 561741 546098 557871 580400 540386 531088 528552 513263 507468 520412 505556 489589
2687 489589 518599 499303 473648 452620 439151 475136 466077 458758 487539 471192 490681 485843
2675 485843 454776 411399 378536 365823 338180 353947 363687 386645 388207 360918 347761 330668
2663 330668 353229 354438 354762 400472 367069 333833 337140 336588 360445 324993 324447 296202 307421
2650 307421 306715 326107 284974 307685 314168 296195 292552 277897 264084 255131 259754 251507 230660
2637 230660 263480 303044 267660 245534 256503 272399 250153 284532 288011 282372 279473 301142
2625C01142L6278n8143l5026m7593j9734J72J7577K8300k3730o716j3067J1254
2613A90714j3551n6996J7949M3951J8842j149l94m2600K7308Q908K002l3054k0145
2600A41785K235M1726R57m6409Q077k0882K9783l2016J9031O018o014k4157L722
2587A23856M62k0425p248J1023J4801O867J8204k7619k0354M687j0290J6416P936
2574A18316L8561l6005r221j422l8909M0758K0275p472j2699J9474m1037R440
2562A00059k590j2657r900J6893L1415J2927l1001k7426K076P969J2806j6465
2550H4106K4837j6178N396j5085j53M92J1008l582j4011j5440L7485N8884P83
2537A58542k3589j364l2424j8039k2890m428R846K0089N728r739J5332m881K5473
$$ plain form
2625 301142 337420 279277 244251 196658 176924 177096 194673 222973 199243 192527 179460 190714
2613 190714 177163 120167 138116 182067 200909 199760 199366 156766 184074 192982 194984 161930 141785
2600 141785 144020 185746 186703 140294 148371 127489 157272 125256 144287 150305 144291 120134 123856
2587 123856 124318 103893 96645 107668 122469 129336 147540 119921 99567 104254 93964 110380 118316
2574 118316 156877 120872 111651 110229 71320 112078 132353 124881 112182 131656 90619 100059
2562 100059 97469 84812 74912 91805 123220 136147 105146 77720 79796 87765 100571 84106
2550 84106 108943 92765 98161 83076 82923 83415 94423 90841 76830 61390 98875 157759 158542
2537 158542 134953 133589 101165 83126 60236 55808 65654 85743 91471 81732 97064 92183 117656
2524A17656l797m993J8171k466l3581K2520k6270j1868J1765m8681L1364J1641
2512H1461J0979j4014M30J55J718L129j4702j4931L0424J5734k5278L677K7725
2499A06507J7510l594j0536p636l5439l0468P5802j4724K409R487n4072n8395
2487c149M5810N8541j6922N534k4904K1535J2949j8080M5938J1222R449l4824
2475A13099l5430j2223j5704L1526J4049j9554j0079M1212o198K0649J4974K3757
2463A60078M38n1947L893k3426M1550j5443K7109Q124L756n632R901k8700M454
2450A34155k647O902L8884N721K2623J3752q595l589j9721k7517K6634j2445L4680
2437B08837q508M109J1431j0863N4501p124m5576L463j7969J3118K0215j5910
$$ plain form
2524 117656 113859 108866 127037 124571 90990 113510 87240 75372 87137 38456 69820 81461
2512 81461 92440 78426 78856 79011 80729 83858 69156 54225 84649 100383 75105 78782 106507
2499 106507 124017 120423 109887 102251 66812 36344 112146 97422 99831 109318 55246 -3149
2487 -3149 42661 101202 84280 89814 64910 86445 99394 81314 127252 138474 147923 113099
2475 113099 77669 65446 49742 81268 95317 75763 65684 106896 100698 121347 136321 160078
2463 160078 160516 108569 112462 89036 130586 115143 142252 150376 154132 148500 158401 129701 134155
2450 134155 131508 138410 177294 183015 205638 219390 210795 207206 187485 159968 186602 174157 208837
2437 208837 200329 204438 215869 205006 259507 252383 206807 210270 192301 205419 225634 209724
2425B09724M0458m1484l3264M5771J4291J0760R906o519K836J4388j803J8947
2413B84011j6399M1312J2895N096j0158K4579k1249q687J1857K9258M8244N008
2401D05767P74O5666J616j5321J0905J9550l116K1608J5440j3862N6323K859K5329
2388E93538p156M4136M7091P999O9021k9784K4496N5639P3715Q2141M1754M0273
2376A042863O5537N5216J53909J69840J24585J55014K08351L45455L50259N03372
2366C174401O47099Q18143J104013J517230J049735j15857j088001j475501j372507
2357D258755r29697n74296m12454l75509k82025j77985j32625r9687n7861j1756
2347A204860q7579m2020j08621n4258r1053p1184j06119q4194j5229Q07k8830
$$ plain form
2425 209724 250182 208698 175434 221205 235496 246256 256162 249643 252479 266867 265064 284011
2413 284011 267612 308924 321819 326915 316757 341336 320087 311400 323257 352515 400759 405767
2401 405767 406541 472207 473823 458502 469407 488957 485841 507449 522889 509027 565350 568209 593538
2388 593538 586382 630518 677609 685608 754629 724845 749341 804980 878695 960836 1002590 1042863
2376 1042863 1108400 1163616 1317525 1487365 1611950 1766964 1975315 2320770 2671029 3174401
2366 3174401 3821500 4639643 5743656 7260886 8310621 8194764 7106763 5631262 4258755
2357 4258755 3329058 2754762 2342308 1966799 1684774 1506789 1374164 1274477 1216616 1204860
2347 1204860 1117281 1075261 966640 912382 821329 750145 644026 559832 544603 545410 516580
2336E16580l6175j673p1153j7953o337l6008m2753L2497M959m8994l6034L375
2324B60331k8203j347l8552l4453K0420N578J3469K5231j3942m0709Q198k6887
2312A49134r666L9787k8394j6844k0029o22P794k5048j6174K5108l355k5327K7530
2299A03894k6665M407m3625l3556J4760J3474O069J1304j934m900r017n578Q109
2286C6742k2971j4395l49M6979J2190j801p992l8478J2338j0682J4686J173k9583
2273b143L2693L5296k6615n689K331l6784M992j8943n868K2563K7214j0903K0106
2260C8250K7228N41K0331p0898J5442j0230l475l0630j3665l8261J0803K6752
2248b7812K5871O052k0727n431J758k1367j7070K9625K0046k320K545q879K956
$$ plain form
2336 516580 480405 478732 407579 389626 383289 347281 304528 337025 341984 292990 256956 260331
2324 260331 232128 230781 192229 157776 178196 183774 197243 222474 208532 167823 176021 149134
2312 149134 139468 179255 150861 134017 113988 113366 121160 96112 79938 105046 101691 76364 103894
2299 103894 77229 81636 38011 4455 19215 32689 38758 50062 48128 43228 34211 28633 36742
2286 36742 13771 -624 -973 46006 58196 56395 48403 9925 22263 11581 26267 27440 -2143
2273 -2143 30550 65846 39231 33542 35873 -911 4081 -14862 -20730 1833 29047 18144 38250
2260 38250 65478 66019 86350 15452 30894 20664 17189 -13441 -27106 -65367 -54564 -27812
2248 -27812 -1941 4111 -16616 -22047 -20289 -41656 -58726 -29101 -9055 -11375 -8830 -17709 -14753
2235a4753N579J929J1352j8237j3633O095J1800n000K2276m8291L2853k2083k4324
2222e4437J2355K5311O408Q832k9409K5487n790J1042N027r932n178k3133j982
2209c5399j1985n649K1915j1296q702K5837k1397k9799J5557K8757J1347j047
2197b1861O199j5389N948j8531R199J0979j3076K417l370K0205p020l7678J652
2184f0326J1764K7775J8103k3459j0884n2285K0401N2055l1793r544M8151J7612
2172G570J1034n5769j1246M4115N3675m2011m894O698K047o744n941J597J3123
2159A3254p8694J455M8247o733k2369K043r753r096M7524j6969R367l514k6976
2146e2214k6067P396K3193k993J5356J5922l0018M6255j2151r408K4990N0856
$$ plain form
2235 -14753 -9174 -7245 4107 -14130 -27763 -21668 -9868 -14868 7408 -40883 -8030 -30113 -54437
2222 -54437 -42082 -16771 -10363 -1531 -30940 -5453 -11243 -201 4826 -5106 -10284 -33417 -35399
2209 -35399 -47384 -53033 -31118 -42414 -51116 -25279 -46676 -76475 -60918 -32161 -20814 -21861
2197 -21861 -15662 -31051 -25103 -43634 -34435 -23456 -36532 -34115 -37485 -17280 -24300 -61978 -60326
2184 -60326 -48562 -20787 -2684 -26143 -37027 -89312 -68911 -16856 -48649 -58193 -10042 7570
2172 7570 18604 -37165 -48411 -4296 49379 7368 2474 9172 11219 4475 -1466 131 13254
2159 13254 -65440 -63985 -15738 -22471 -44840 -42797 -52550 -61646 -14122 -31091 -21724 -25238 -52214
2146 -52214 -78281 -70885 -47692 -50685 -35329 -19407 -49425 -3170 -15321 -24729 261 51117
2134E1117k029n7250L8493j4179l1350p582n251O073J728o609L3880l9346k4978
2121e7283J285j8691K7711J2369o651l8080J6213L5717j6486j089J9143L780J5931
2108f131j2249j4416k0202L6176K145K5124p115n0096k3752L0462L3206K1175
2096A4327K2863k2162K7220J434k2596k0895k1043j8574k607J7034j405k6196
2084e2600K8844J7613J6748Q302k257m3713j5904n67K400O541k6969M6633N390
2071i539l1572m868O598J9086j2346l7518r351K659L5151k507p798J9967k9951
2058f1989J0963K609J4237J505k1714O6846k3350j9717L5755K3322j4318M666
2046A8815q9420k1411R981j0358j74L5337M8757j7J4111n811k9379m833J6642
$$ plain form
2134 51117 49088 -8162 30331 16152 -15198 -22780 -28031 -21958 -20230 -26839 7041 -32305 -57283
2121 -57283 -55998 -74689 -46978 -34609 -41260 -79340 -63127 -27410 -43896 -44985 -25842 -22062 -6131
2108 -6131 -18380 -32796 -52998 -16822 -14677 10447 3332 -46764 -70516 -40054 -6848 14327
2096 14327 37190 15028 42248 43682 21086 191 -20852 -39426 -42033 -24999 -26404 -52600
2084 -52600 -23756 -6143 10605 18907 16650 -27063 -42967 -43534 -41134 -34593 -61562 -14929 -9539
2071 -9539 -41111 -45979 -39381 -20295 -32641 -70159 -79510 -76851 -41700 -44207 -52005 -32038 -61989
2058 -61989 -51026 -48417 -34180 -32675 -54389 12457 -10893 -30610 5145 28467 14149 18815
2046 18815 -70605 -92016 -82035 -92393 -92567 -57230 -8473 -8490 5621 -190 -29569 -34402 -17760
2033a7760K0481J9087J7386m6409j5506j1090l1746N3431O4486q938j5963K1682
2021D9141m4873J8265n5011R280K253L0695j0310o891J2844j4586j3068K554l449
2008b3156O646j1916Q50m3783J4264M1574n0077j6539L0212L1143J4389k5474
1996c1867j7910j8053q259J5750O424r546M7131L7183l1947j0123J9088l4744
1984c6873m6917K0654J5626N475l7541J6348K7462O469j4821j5254j5639J7256
1972e7755M4441Q471n140m0769r108K7384K0337l1722j8741J2324j5048K4805
1960d0521l2382J4031L8584J4632j8094j2278K3624k0789k579L5832j7295k8775
1948d6010l588N3962k3417q66J8767K831k9998L731L04p438l691J8971K4040R166
$$ plain form
2033 -17760 2721 21808 39194 -7215 -22721 -33811 -65557 -12126 52360 43422 27459 49141
2021 49141 4268 22533 -32478 -23198 -20945 9750 -560 -7451 5393 -9193 -22261 -19707 -23156
2008 -23156 -16510 -28426 -27576 -71359 -57095 -15521 -65598 -82137 -51925 -20782 -6393 -31867
1996 -31867 -49777 -67830 -76089 -60339 -53915 -63461 -16330 20853 -11094 -21217 -2129 -36873
1984 -36873 -83790 -63136 -47510 -42035 -79576 -63228 -35766 -29297 -44118 -59372 -75011 -57755
1972 -57755 -13314 -4843 -9983 -50752 -59860 -32476 -12139 -43861 -62602 -50278 -65326 -40521
1960 -40521 -72903 -58872 -20288 -5656 -23750 -36028 -12404 -33193 -35772 60 -17235 -46010
1948 -46010 -49598 4364 -19053 -19919 -1152 1679 -28319 -24588 -24284 -31722 -35413 -16442 7598 16764
1934A6764J1223m4179l8471j8743K4121P613O702k3701o335L8419j1957j5504
1922e4048m203J8693L1109L1492m3215l4806n371K8234M041j7939P914K042J440
1909c4617j9313Q184K4860J5268p882k8066j7260L835M4637j8562L824L8007l1545
1896a8630K2514j2334j6104j029J2326p795l9890J267M553q596O943l8051J2102
1883h2724L2104Q945l5362K739L8259k0359m492K9718P980m2865K6460K4112J6936
1870A451J6694m4155m660l312j7861k0727Q690J9174j5226J915K1426Q625m81
1857b8447p510O027L892L2551k331j4560j8803K4685l251L1689l2184n2773J4460
1844d6555N299o616L3512J6771n3455Q845J0319j6171J8038K8868l5687p733l9758
$$ plain form
1934 16764 27987 -16192 -54663 -73406 -49285 -41672 -34970 -58671 -65006 -26587 -38544 -54048
1922 -54048 -58251 -39558 -8449 23043 -20172 -54978 -60349 -32115 -28074 -46013 -38099 -36057 -34617
1909 -34617 -53930 -45746 -20886 -5618 -13500 -41566 -58826 -54991 -10354 -28916 -25092 12915 -18630
1896 -18630 3884 -8450 -24554 -25583 -13257 -21052 -60942 -59675 -55122 -63718 -56775 -94826 -82724
1883 -82724 -50620 -41675 -77037 -74298 -36039 -56398 -60890 -31172 -23192 -66057 -39597 -15485 1451
1870 1451 18145 -26010 -30670 -33982 -51843 -72570 -63880 -44706 -59932 -58017 -36591 -27966 -28447
1857 -28447 -35957 -29930 -26038 6513 4182 -10378 -29181 -4496 -7747 23942 -8242 -61015 -46555
1844 -46555 -41256 -47872 -14360 2411 -51044 -42199 -31880 -48051 -30013 -1145 -36832 -44565 -84323
1831h4323K1907K6647p443J2144j5838j5870m113J7153k0910L5922K5887j3068
1819b1905k8645K458M9252n347l4494N8358k724m4344J6674k3100l1123M9525
1807a5415o761k7307q502L142J0968J5736l5j4254q812j5217j7316M0797K0343
1794b2633r768L644j8676M0876l2198L0263J775o592J1625m535j9032l301J2601
1781a5951k3452J938J7830l802L1714K4956k3414k7178J3189o236o34r367M887
1768a5520k4744K187O672q775p539k1096M5187N4336K7823j0611n1909j9840m393
1755b8222l0064J0931P30O63N3419k8773j0965J717J3931o312m972J0399P008
1742a0510k4799J2632l01k3063J0270m0856L0202K2005j8911O917j9126N1795
$$ plain form
1831 -84323 -62416 -35769 -43212 -31068 -46906 -62776 -66889 -49736 -70646 -34724 -8837 -21905
1819 -21905 -50550 -48092 1160 -4187 -38681 19677 16953 -27391 -10717 -33817 -64940 -15415
1807 -15415 -22176 -49483 -57985 -54843 -43875 -28139 -28174 -42428 -51240 -66457 -83773 -42976 -22633
1794 -22633 -32401 -28757 -47433 -6557 -38755 -8492 -6717 -13309 -1684 -6219 -25251 -28552 -15951
1781 -15951 -39403 -37465 -19635 -23437 8277 33233 9819 -17359 -4170 -10406 -11040 -20407 -15520
1768 -15520 -40264 -38077 -31405 -40180 -47719 -68815 -23628 30708 58531 47920 -3989 -23829 -28222
1755 -28222 -58286 -47355 -46625 -45962 7457 -21316 -32281 -30564 -16633 -22945 -27917 -17518 -10510
1742 -10510 -35309 -22677 -22978 -46041 -35771 -76627 -46425 -24420 -43331 -36414 -55540 -3745
1730c745K6211m3449r593k154l2135j5676K8104Q902K9307P751J4161k6819J6557
1717b578L4723L963l3911k8654P733m5674j0186L1689K2502J343k84K0529K1216
1704B2411k4728j7502J0414k9186j8849J9055K6743q128l1567m515L2903m6534
1692f9483k377L2432K0221L4902L2672Q91m6895P723O761k9856k4591L625q723
1679d2698K4962R0603q045r161l0940k969J5448o559l2232j8793j7796P604J5014
1666a5562R396j739J8564l2375j4092K1006j1533J3005j1933j4117j3371L703
1654d9048J3311N700L2773l2164P670K6136m6412J0329K5354k1420k7531j7351
1642g2653L2141M698K4423J4106m0919K3939k563J8591k1839J6974k6308m6080
$$ plain form
1730 -3745 22466 -20983 -30576 -32730 -64865 -80541 -52437 -43535 -14228 -6477 7684 -19135 -2578
1717 -2578 32145 36108 2197 -26457 -18724 -64398 -74584 -42895 -20393 -19050 -19334 1195 22411
1704 22411 -2317 -19819 -9405 -38591 -57440 -38385 -11642 -19770 -51337 -55852 -22949 -69483
1692 -69483 -71860 -39428 -19207 15695 48367 49258 2363 10086 16847 -13009 -37600 -33975 -42698
1679 -42698 -17736 72867 64822 55661 24721 21752 37200 30641 -1591 -20384 -38180 -30576 -15562
1666 -15562 -6166 -7905 10659 -21716 -35808 -14802 -26335 -13330 -25263 -39380 -52751 -49048
1654 -49048 -35737 -30037 2736 -29428 -21758 4378 -42034 -31705 -6351 -27771 -55302 -72653
1642 -72653 -40512 -35814 -11391 2715 -38204 -14265 -16828 1763 -20076 -3102 -29410 -75490
1630g5490L2160o007K3424l9291l4071K2640j4806K4803K4086O7650k9664n271
1618i837r17j3919K6824j4103k5038J4925L4635j3801N685k3299j3200M3833j5901
1605d113j3340j9052k516J4536l88O19R483j2188L751k4697k816N2232l0086O41
1591b7934M7357l1093l2554M9661k6705K4673k2675P219j9001l5701L3947m322
1579c7128M9808J202o028n7933L427k1974L9479N53M659N2191n2835m504K5029
1566d054R022n811k8775k4156L6088r538O837P584k9663j3909L4537j3695k0283
1553e5816O523l128J8552J1310L030J1137r340j218J015K0918R938k541j462Q538
1539A7456r199l0494N4600J4717j5868m4137p684k066J6573j7181l165j8513N5108
$$ plain form
1630 -75490 -43330 -49337 -25913 -65204 -99275 -76635 -91441 -66638 -42552 25098 -4566 -9837
1618 -9837 -10754 -24673 2151 -11952 -36990 -22065 12570 -1231 4454 -18845 -32045 11788 -4113
1605 -4113 -17453 -36505 -39021 -24485 -24873 -24254 -14771 -26959 -23208 -47905 -50721 1511 -28575 -27934
1591 -27934 19423 -11670 -44224 5437 -21268 3405 -19270 -12051 -31052 -66753 -32806 -37128
1579 -37128 12680 13882 7854 -50079 -46652 -68626 -29147 -28594 -23935 28256 -24579 -29083 -4054
1566 -4054 4968 -843 -29618 -53774 -17686 -27224 -20387 -12803 -42466 -56375 -21838 -35533 -55816
1553 -55816 -49293 -52421 -33869 -22559 -19529 -8392 -17732 -18950 -17935 2983 12921 10380 8918 17456
1539 17456 8257 -22237 32363 47080 31212 -12925 -20609 -22675 -6102 -23283 -26448 -44961 10147
1526A0147k2712j6626J8401N662K8248q328o865m4951N4940k2746J3926m232k2709
1513a7845K5122k0488O721k9182r777r407L7086O325j9048k247j6876N7021k2524
1500a5119J0541k007J2192J6897k3107k1643L3703j8999j1723J4268R928l8337
1488c3406J2352K7574k4063M755J6869M3094j0522j4407m4278J5620M3041m3428
1476f799j6321K010r7P415j9979J070K7247j0764k7671J5584J2700j4338j4340
1463d4283j6897M7818L5696m109n803O661n5040L5064o642l974P886j0072K0206
1450F511J4676O472n577l7910k7112K8596N4551j4002l2290Q233J0439k3963Q172
1437c204L5418o2014j6574J5672k157J0409L5450k3156L0257R232k8513l9579
$$ plain form
1526 10147 -12565 -29191 -10790 -5128 23120 14792 7927 -37024 17916 -4830 9096 4864 -17845
1513 -17845 7277 -13211 -6490 -35672 -45449 -54856 -17770 -11445 -30493 -32740 -49616 7405 -15119
1500 -15119 -4578 -6585 5607 22504 -603 -22246 11457 -7542 -19265 -4997 4931 -33406
1488 -33406 -21054 6520 -17543 -12788 4081 47175 36653 22246 -22032 -6412 36629 -6799
1476 -6799 -23120 -21110 -21207 -13792 -33771 -32701 -5454 -16218 -43889 -28305 -15605 -29943 -44283
1463 -44283 -61180 -13362 22334 18225 12422 19083 -35957 -893 -7535 -11509 -3623 -13695 6511
1450 6511 21187 27659 22082 -15828 -42940 -14344 40207 26205 -6085 2148 12587 -11376 -3204
1437 -3204 32214 -29800 -46374 -30702 -32859 -22450 13000 -10156 20101 29333 820 -38759
1425c8759j6703k8087L426R341L2396J3034J5883P099k0248n784K8772M0372k8443
1412A2299k0474K5081k2950K576J8106O782k4519k2324j8138K6966k7782K6298
1400a8079p351K6367L0939n1374l804J5660J8201m8758K3529P690Q755k3222J1087
1387a0360L1188l9261O132N487l8459q490k92M701J1748L1886K3591K444o894
1374A3421l7915k2149j9519Q044N1302j0522j5371J6539K6844p179k9629J7492
1362h642j494o761j0521j5523K3153R676l2883K7054K6791j2658J1378M585k2196
1349h041j7567K9506k8866j5345J9756J4541K4685M866M380j1451J40l2072o945
1336b2413l218J5868k669j610L0722Q337k1948j0165L8349n302P146l2601k8592
$$ plain form
1425 -38759 -55462 -83549 -80123 -70782 -38386 -25352 -9469 -2370 -22618 -28402 370 40742 12299
1412 12299 -8175 16906 -6044 -3468 14638 21420 -3099 -25423 -43561 -16595 -44377 -18079
1400 -18079 -25430 937 31876 -19498 -23302 -7642 10559 -38199 -14670 -6980 1775 -21447 -10360
1387 -10360 20828 -18433 -12301 -6814 -45273 -53763 -54055 -49354 -37606 -5720 17871 20315 13421
1374 13421 -24494 -46643 -66162 -58118 -6816 -17338 -32709 -16170 10674 3495 -26134 -8642
1362 -8642 -10136 -16897 -27418 -42941 -19788 -10112 -42995 -15941 10850 -1808 9570 14155 -8041
1349 -8041 -25608 3898 -24968 -40313 -20557 -6016 18669 23535 27915 16464 16604 -15468 -22413
1336 -22413 -25631 -9763 -12432 -14042 16680 25017 3069 -7096 31253 25951 33097 496 -28096
1323b8096L5145k5843k1168j2373K0754N837l6872L5495N6640J3825o0834M5926
1311B8436r8m0064L2045j2088m0433K7484M325m23J1448K1136n0952j5616J1535
1298b3265j9284N206p897K1567J0138J1638j2777l0196M0364Q824L649l1454J4115
1285i372K4286k110j6391j240O249J1112q171l148j847m3728M9313k8014K249
1272b0812J9134Q371j989n423J9865j1393J3310K5044l0570k0299q113J6560k7654
1259b3969M5752L3446j6621l7921P615J0411k3046K3209j5589M118J9197L116
1247B9718q867l2127m042k192o245J1418J8160J8893j7313j7946l623J61j3546
1234b7551j0443J7122K844Q013l671J5182k115o133M1965n7556k3739q059R30
$$ plain form
1323 -28096 7049 -18794 -39962 -52335 -31581 -25744 -62616 -27121 29519 43344 -17490 28436
1311 28436 28338 -11726 20319 8231 -32202 -4718 -393 -816 10632 31768 -19184 -34800 -23265
1298 -23265 -42549 -37343 -45240 -23673 -13535 -1897 -14674 -44870 -4506 4318 7967 -23487 -9372
1285 -9372 14914 12804 -3587 -4827 1422 12534 4363 1215 -632 -44360 4953 -23061 -20812
1272 -20812 -1678 6693 4704 -719 19146 7753 21063 46107 15537 -4762 -12875 3685 -23969
1259 -23969 21783 55229 38608 687 8302 18713 -4333 18876 3287 7405 26602 29718
1247 29718 20851 -11276 -15318 -17510 -23755 -12337 5823 24716 7403 -10543 -14166 -14005 -27551
1234 -27551 -37994 -20872 -18028 -10015 -13686 1496 -619 -6752 35213 -22343 -46082 -54141 -53211
1221e3211k5389N7360P4319m5169k711p202p806Q940J1466k1976J9649j7896m258
1208a3884N274j3307L6503j6232Q055j5699m988k5494P752m0287K4945J8085j8249
1195d7526K0805l845J110J0117r607m786k459k2104L0024l1120J8770M4523K1662
1182B5564M795K9346j3510R183j6065q969k786m2635r130K6166J644j3820J7946
1169G729k5446p743L7835k4286K228L4070j9736l3381j6174J027J6134q39N261
1156b3321m05K8681J4011l3147Q867M0722n9676k2596L9405M7994o115M2571K850
1143G9841j3372j9313q427N929m9238r28L738J575k4395M6588j9504j3298J6512
1130E708j6318k2246J2761R041K9036k7607J6875j846j7656O113K9488k201k2451
$$ plain form
1221 -53211 -78600 -21240 53079 7910 5199 -2003 -9809 -869 10597 -11379 8270 -9626 -13884
1208 -13884 -8610 -21917 14586 -1646 6409 -9290 -14278 -39772 -32020 -72307 -47362 -29277 -47526
1195 -47526 -26721 -30566 -29456 -19339 -28946 -33732 -36191 -58295 -28271 -59391 -40621 3902 25564
1182 25564 30359 59705 46195 55378 39313 30344 27558 -15077 -24207 1959 3603 -10217 7729
1169 7729 -17717 -25460 12375 -11911 -9683 24387 4651 -28730 -44904 -43877 -27743 -28582 -23321
1156 -23321 -23726 4955 18966 -14181 -5314 35408 -24268 -46864 -7459 40535 34420 76991 79841
1143 79841 66469 47156 38729 44658 -4580 -5508 -1770 -195 -24590 21998 2494 -10804 5708
1130 5708 -10610 -32856 -20095 -11054 17982 -9625 7250 5404 -12252 -6139 23349 21148 -1303
1117a303K046J8445j7424M427n2186R735P1670o875l895p111N005l4913J8170
1104E791j0088k1574k5776L9018J1002M99L402m0836L3748J2323j2016r437j1825
1091b5769K1658k702q937j1562M1013L7702k4944j7019L5886l1821j4057n694
1079f246j150j816J3692Q986l679k9816l0997J8543O398J3202m153K9850k3121
1066a0307k5497j5103M1434Q812K867L557R581R5L1519j9169j0036j7553K8288
1053B8488P317p401j9772l0070M491K5393j1684k7187P349o285L375p426j8401
1040e1813J4725J0074R717L2413J1308J8134l5587n684k6599N248J9065K4580
1028B5581j2345m1678J8319o169m3717N892L7496L9330m1139Q191M1969j8759
$$ plain form
1117 -1303 743 19188 1764 6191 -45995 -36260 35410 28535 24640 17529 22534 -12379 5791
1104 5791 -4297 -25871 -51647 -12629 -1627 -1128 2274 -38562 -4814 7509 -4507 -13944 -25769
1091 -25769 -4111 -6813 -15750 -27312 13701 51403 26459 9440 45326 13505 -552 -6246
1079 -6246 -7396 -9212 4480 13466 9787 -20029 -51026 -32483 -26085 -12883 -17036 12814 -10307
1066 -10307 -35804 -50907 -9473 -661 2206 5763 15344 15439 46958 27789 17753 200 28488
1053 28488 35805 28404 8632 -21438 -16947 8446 -3238 -30425 -23076 -29361 -25986 -33412 -51813
1040 -51813 -37088 -27014 -17297 15116 26424 44558 8971 3287 -23312 -18064 1001 25581
1028 25581 13236 -28442 -10123 -16292 -60009 -54117 -16621 22709 -18430 -10239 31730 12971
1016A2971m9123M62L4188Q737K0273R451m4785J3475j0851j2292n046J5465L405
1003c670j3910l0136L4000L8956j2030l267k4411j5673M501J5019L2769q291l2290
990a8433J4126L9863K0904j1419lk5793K4321n302k2665J0037m6530k9015m525
977e4434k883K4663J6815P328j5890J0399J5985r317j861r579J3104O9096k1884
964D1542j1975K2021j6913Q275q032J8198o615m1674O587K1049p953K1517r717
951C6310m1528K4489K2652j4627j2297L456j5268L0556n507j3711L7491j7893
939C4123o2046K5540K9626j0160L680k4606J6659L1368n6193l5312J4915K0152
927a2254n915j6375L632j270J5421J6450L2740k1246k4165K2269k3813M5474k8120
$$ plain form
1016 12971 -36152 -35690 -1502 7235 27508 36959 -7826 5649 -5202 -17494 -22540 -7075 -3670
1003 -3670 -17580 -47716 -13716 25240 13210 9943 -14468 -30141 -25640 -10621 22148 13857 -18433
990 -18433 -4307 35556 56460 45041 45038 19245 43566 38264 15599 25636 -20894 -49909 -54434
977 -54434 -57317 -32654 -15839 -8511 -24401 -14002 1983 -7334 -9195 -18774 -5670 63426 41542
964 41542 29567 51588 34675 42950 34918 53116 46501 4827 11414 32463 24510 46027 36310
951 36310 -5218 19271 41923 27296 14999 18455 3187 33743 28236 14525 52016 34123
939 34123 -27923 -2383 27243 17083 20763 -3843 12816 44184 -12009 -47321 -32406 -12254
927 -12254 -18169 -34544 -30912 -32182 -16761 -311 32429 11183 -12982 9287 -14526 30948 2828
914B828l3492J1997j507J8048L6320K7453k7589J2901l7492o0967m213O6168k7629
901a7174r733r675K297J8205J0995J4965j5720R384j6258l206J9122K6549n2319
888b2568J1197m840p3N073J2236K0975l6666J7268N137J0100k410m23J0978l3792
874g808K0025K5709j6020l417J7872Q039q181q633l8770J3604l4647L910L1142
861B825l50l058K548L1014J4757q9753j0089L8518j0553N9442J921k2153J003
848A6072K930n772K0124m8778K3971K126L6732K867n3653j6663J3833K0283K3957
835C8029K250j5072K3410j0112N831J4935j9927J1852j5189j3019j3886k0134
823a1032M4256k8648j5677L966l446o796K3710R912k305r258J3592n961j0571
$$ plain form
914 2828 -30664 -18667 -20174 -2126 34194 61647 34058 46959 9467 -51500 -55713 10455 -17174
901 -17174 -26907 -36582 -34285 -16080 -5085 9880 -5840 3544 -12714 -15920 3202 29751 -22568
888 -22568 -11371 -16211 -16284 -11211 1025 22000 -14666 2602 7739 17839 15429 15006 25984 -7808
874 -7808 12217 37926 21906 18489 36361 44400 36219 27586 -11184 2420 -32227 -28317 2825
861 2825 2475 -583 1965 32979 47736 -42017 -52106 -13588 -24141 35301 37222 15069 16072
848 16072 19002 13230 33354 -15424 8547 10673 47405 50272 -3381 -20044 -6211 14072 38029
835 38029 40279 25207 48617 38505 44336 59271 39344 51196 36007 22988 9102 -11032
823 -11032 33224 4576 -11101 -7135 -10581 -17377 6333 16245 13940 4682 18274 12313 1742
810A742J2832L2622m1253p167O218m2123L4919J7529j2685r1j4206J4885j5029
797a1807n56J4782J5395j5152j1577J0882p310n804O591K9021k390J7587r115
784C0547j8151k9958M1604K4871k1596r342r111L157M0986K8621o5045j0268N814
771A2129N3963q078m8151l8640N6761L5839k0346j4888J6400N142j0242k458p281
758C0150J225o737q270j2964L1912l4661N034K2821K6411J1737k5349O427l4041
745A3695l8885K0596p079L0681j1378K1058k2391k4393L5361J3872j0974P947
733B8110M9826o506j3529J9148k3533j0675k8708K7050l4411j1953L5487J0080
721D0386m2244j8912J6809K6363L0178l4n968q21N682k1819M009r152j8589k3600
$$ plain form
810 1742 14574 47196 5943 -1224 4994 -37129 -2210 15319 2634 2543 -11663 3222 -11807
797 -11807 -12363 2419 17814 2662 -8915 1967 -5343 -11147 -4556 24465 22075 39662 30547
784 30547 12396 -17562 24042 48913 27317 17975 8864 12021 53007 81628 16583 6315 12129
771 12129 66092 58014 9863 -28777 27984 63823 43477 28589 44989 50131 39889 37431 30150
758 30150 31375 24638 16368 3404 35316 655 5689 28510 54921 66658 41309 47736 13695
745 13695 -25190 -4594 -11673 19008 7630 28688 6297 -18096 17265 31137 20163 28110
733 28110 77936 71430 57901 77049 53516 42841 14133 41183 6772 -5181 30306 40386
721 40386 -1858 -20770 -3961 22402 52580 52546 46578 45757 51439 29620 33629 24477 5888 -17712
707a7712L4460k8655k1389J5197J482q46J8161j1691R592j5798K8829o892j2112
694g374K8618k6295n689K197K2575J0329j7152m255L1483L4234N980l6303l2385
681E963P75j8906L3511k0522K9925J1631J2656L444m202m897J124q900k9063k6678
667a4139j052K9507l1962K4080k6745r084M6534k9409j2056L1179K7192K735K5162
654F1942J1216j9978K2428n1860l5129K2561K0072J343r022k8881K0041J1007
642B5740j5165j6673J9933l3489N510j3789J6396L0295m2129k3341K0645j6723
630d2790J3493J5837l619L2347q56L0502P028j1756J7838n777k8212l5615l280
617a4860R227j448M2608j1033k2823O1673l473n5712r587N3454K110P810J4350
$$ plain form
707 -17712 16748 -11907 -33296 -18099 -16617 -17463 698 -10993 -1401 -17199 11630 4738 -7374
694 -7374 21244 -5051 -10740 -8543 14032 24361 7209 2954 34437 68671 74651 38348 5963
681 5963 6738 -12168 21343 821 30746 42377 55033 58477 54275 49378 50502 41602 12539 -14139
667 -14139 -15191 14316 -17646 6434 -20311 -29395 17139 -12270 -24326 6853 34045 36780 61942
654 61942 73158 53180 75608 23748 -11381 11180 31252 32595 23573 -5308 14733 25740
642 25740 10575 -6098 13835 -19654 -14144 -27933 -11537 18758 -23371 -46712 -26067 -42790
630 -42790 -29297 -13460 -17079 15268 14412 44914 51942 40186 58024 52247 24035 -11580 -14860
617 -14860 -5633 -7081 35527 24494 1671 63344 59871 4159 -5428 48026 50136 57946 72296
604G2296l3964K5729k7190k3837N536j0445j3114p896O454N563n440o59L0105
591B3138J8781N242l745m286m4710J2921R275j039K1592j3181J298l6172J1958
578A072j2767M750O965k8385O799K8675J7416k2230k2260M1937q974n936J4481
565B1543L3243n426l0929M546L7625j8323L600m1856J2998Q468j681L293J7662
552D4763j204l0341J172j9088P983J1559O791K079k4781J6478Q671O699j187j9662
538I932M911J7744K7376j9008K2182l2178j6962L436l6060k1473L2756l158j0234
525b0736l165J9443Q469P042L7593l4557j0913Q9910k9332K2340m5655K757P443
512E0639j2746Q431j7946j9533k7595j3689K313J1790J5818J4226l5479L5532
$$ plain form
604 72296 38332 64061 36871 13034 18570 8125 -4989 -12885 -6431 -868 -6308 -6967 23138
591 23138 41919 47161 43416 39130 -5580 7341 16616 15577 37169 23988 25286 -10886 1072
578 1072 -11695 -6945 20 -28365 -21566 7109 24525 2295 -19965 21972 12998 7062 21543
565 21543 54786 49360 18431 22977 60602 42279 45879 4023 17021 25489 23808 27101 44763
552 44763 43559 13218 14390 -4698 3285 14844 21635 23714 -1067 15411 24082 30781 29594 9932
538 9932 14843 32587 59963 40955 63137 30959 13997 17433 -18627 -40100 -7344 -10502 -20736
525 -20736 -23901 -4458 4011 11053 48646 14089 3176 93086 63754 86094 40439 43196 50639
512 50639 37893 46324 28378 8845 -18750 -32439 -30126 -18336 -2518 11708 -23771 11761
500A1761L9091m2251l6782M5280M06O197j981j6708O759j0208o516L9381J5439
487D9868k1659l5412K6968m480k0183n792l511J1703J4195l176k418L4490j8480
474B2113j7727J7151K7451K3834l0943Q107K1937l8752m2161k6031J0231Q897
462a5893J5478k519J1284o702o799j9629q651m035J9129K8271J869k1244Q54L3450
448B4863o779j3J976L44k3492j8775q41N0303j0524J4415j3810j2028P29l921
434B447K3859J0395L978k3094J6867m2782M0473p854m4012N331J9104J2968k1408
421c728K5960K5509M648J7220l3333J1301k5156P910j9390j237L6824m116P782
408E0194k6893m1189p768L0399J4988O657O641J9153m9297p717J263K6873m066
$$ plain form
500 11761 50852 8601 -28181 17099 17505 23702 21721 5013 11772 1564 -4952 34429 49868
487 49868 28209 -7203 19765 15285 -4898 -10690 -14201 -2498 11697 8521 6103 40593 22113
474 22113 4386 21537 48988 72822 41879 49986 71923 33171 -8990 -35021 -24790 -15893
462 -15893 -415 -2934 8350 1648 -5151 -24780 -33431 -37466 -18337 9934 11803 -9441 -8587 24863
448 24863 18084 18071 20047 20391 -3101 -21876 -22717 27586 17062 31477 17667 5639 6368 2447
434 2447 26306 36701 40679 17585 34452 -8330 32143 24289 -19723 -14392 4712 17680 -3728
421 -3728 22232 47741 52389 69609 36276 47577 22421 30331 10941 9704 46528 42412 50194
408 50194 23301 -17888 -25656 4743 19731 26388 33029 52182 2885 -4832 -3569 23304 19238
395A9238K3384l3437q62L785K5722K0074l1949j8747J2923k3781L4282M932j8883
382A6681j0920K0137J4744k2410P059P959n543Q32q245n2542P4833J3505m3862
369A2228m787k5925q448N3285J5329j3029K2596k0342l3199J6763J7947O896m9256
356i942p634N5562m2464j6656M5898n1934K8158J3753j1528q076J8331j5940J7333
343A4861K6347j1659j4259m1769K0428L0231o469L596J7821j2250j1963Q880k5808
330b013K2214J8779J7348k0874n395j3354Q64L9828N171J1943l137k7485j2959
317C0930K0884n050m320n5455J5508M2743l1476J1141R417k5149L4025j4101K5910
304E5007J070j0109o41j2627O892j0690r135J0682l0080k048m440k0059k582J958
$$ plain form
395 19238 42622 9185 8323 12108 37830 57904 25955 7208 20131 -3650 30632 35564 16681
382 16681 5761 25898 40642 18232 25291 33250 27707 28539 20294 -32248 42585 56090 12228
369 12228 7441 -18484 -26932 26353 41682 28653 51249 30907 -2292 14471 32418 39314 -9942
356 -9942 -17576 37986 -4478 -21134 24764 -27170 988 14741 3213 -4863 13468 -2472 14861
343 14861 41208 29549 15290 -26479 -6051 24180 17711 21307 39128 26878 14915 23795 -2013
330 -2013 20201 38980 56328 35454 30059 16705 17569 57397 62568 74511 71374 43889 30930
317 30930 51814 46764 42444 -13011 2497 45240 13764 24905 34322 9173 43198 29097 55007
304 55007 56077 45968 45327 32700 39592 28902 19767 30449 369 -1679 -6119 -26178 -28760 -26802
290b6802L1781Q116R724q808j4759L1638j5202r820r337j1141K5412J6128k4509
277B421O815Q092M494J6171l0809K6206J3617m6459k8201K5679k7608l446L0792
264b236K0657l0049k852K655L7867q971q466L9901n494r679n2392J8139k636j8534
250b2090J1951K9704L1220k9462r607K0435r194k6959J8683J7753j0792j5710
238E932j5550L3649O990l5048j6903L8970kl173K5945j3799J4864k2736K1120
225D0259L1122J1694O104J4809l6992k3405j787Q107K6174j4918l3218m1869N7282
212D3362K739m1457k57k5222J4834L2679j3168n829P568J0058k5897l0806Q5188
199E3792j0844n8840K2608p480n103K0865K972n1492P841K1228K1584n531q096
$$ plain form
290 -26802 4979 13095 22819 14011 -748 30890 15688 5868 -3469 -14610 10802 26930 2421
277 2421 9236 17328 21822 37993 7184 33390 47007 548 -27653 -1974 -29582 -33028 -2236
264 -2236 18421 -11628 -14480 -11825 26042 17071 8605 48506 43012 33333 -19059 -920 -3556 -22090
250 -22090 -10139 19565 50785 21323 11716 32151 22957 -4002 14681 32434 21642 5932
238 5932 -9618 24031 31021 -4027 -20930 18040 18038 14865 40810 27011 41875 19139 40259
225 40259 71381 83075 89179 103988 66996 43591 41804 49911 76085 61167 27949 -13920 43362
212 43362 46101 4644 4387 -20835 -6001 26678 13510 7681 15249 25307 -590 -31396 53792
199 53792 42948 -15892 6716 -764 -5867 14998 17970 -33522 -25681 -4453 17131 11600 3504
186C504j8190p715M3200l850k3228L6454J5789k0355j2358L213K334L7862j5831
173D0829k0954q878Q301j618K5200j7319p693J3788k3786J8443J245R457l8874
160a859M2511J3733J2690N536k8579j1473r448K2528R102j9079j2702Q346n550
147B5756j694j7951N582J7273J346r222j1436M274K2021n21j1732J6752j8475
$$ plain form
186 3504 -14686 -22401 20799 16949 -6279 30175 45964 25609 13251 16464 18798 56660 40829
173 40829 19875 10997 19298 17680 42880 25561 17868 31656 7870 26313 27558 37015 -1859
160 -1859 40652 54385 67075 72611 44032 32559 23111 45639 54741 35662 22960 31306 25756
147 25756 24062 6111 11693 28966 30312 21090 9654 13928 35949 35428 23696 40448 21973
$$ [...]
##END NTUPLES=NMR SPECTRUM
##END=
