##TITLE=1H_CG-1192-p1
 CDCl3
 8 sc, 
 12.2.2024
##JCAMPDX= 6.0         $$ Bruker NMR JCAMP-DX V2.0
##DATA TYPE= NMR SPECTRUM
##DATA CLASS= NTUPLES
##ORIGIN= UXNMR, Bruker Analytische Messtechnik GmbH
##OWNER= root
$$ XWIN-NMR		Version 3.5
$$ Mon Feb 12 15:50:29 2024 Russian Standard Time (UT+4h)  she@DPX200
##.OBSERVE FREQUENCY= 200.1313
##.OBSERVE NUCLEUS= ^1H
##.ACQUISITION MODE= SIMULTANEOUS
##.ACQUISITION SCHEME= undefined
##.AVERAGES= 8
##.DIGITISER RES= 18
##SPECTROMETER/DATA SYSTEM= spect
##.PULSE SEQUENCE= zg30
##.SOLVENT NAME= CDCl3
##.SHIFT REFERENCE= (INTERNAL, CDCl3, 0, 15.5948)
##AUDIT TRAIL= $$ (NUMBER, WHEN, WHO, WHERE, WHAT)
$$ ##TITLE= Audit trail, XWIN-NMR		Version 3.5
$$ ##JCAMPDX= 5.01
$$ ##ORIGIN= Bruker BioSpin GmbH
$$ ##OWNER= she
$$ F:/spectra/data/she/nmr/H-F/1/pdata/1/auditp.txt
$$ ##AUDIT TRAIL=  $$ (NUMBER, WHEN, WHO, WHERE, WHAT)
(   1,<2024-02-12 15:48:42.89 +0400>,<she>,<DPX200>,
      <created by zg, POWCHK disabled, PULCHK disabled
       configuration hash MD5:
       00 E9 B6 7A A2 85 ED C7 34 08 36 98 17 FE 4E 26
       data hash MD5: 16K
       DD 60 F3 9A ED 00 2E E9 D0 04 B2 1A 34 48 1B DE>)
(   2,<2024-02-12 15:48:45.84 +0400>,<she>,<DPX200>,
      <Start of raw data processing
       efp BC_mod = 2 LB = 0.24 FT_mod = 6 PKNL = 1 PHC0 = -24942.41 PHC1 = 4.252696 SI = 16K 
       data hash MD5: 16K
       14 96 44 E2 07 37 42 91 E5 91 ED 01 CE 4E CF D9>)
(   3,<2024-02-12 15:49:14.48 +0400>,<she>,<DPX200>,
      <pk PHC0 = -159.8739 PHC1 = 3.6 
       data hash MD5: 16K
       2A 8D 41 4A F7 23 18 F2 66 15 6A 9A 32 E5 64 7F>)
(   4,<2024-02-12 15:49:18.23 +0400>,<she>,<DPX200>,
      <abs ABSG = 5 
       data hash MD5: 16K
       C8 36 B9 8C 5D 64 34 25 7F F1 D4 2B E9 8A EE A9>)
$$ ##END=
$$ 
$$ hash MD5
$$ 89 6B 7B 9F 8B B2 3F 8F ED C4 E8 EC D9 B9 D1 48
##$RELAX= 
##$RELAX= 
##$RELAX= 
##$RELAX= 
##$RELAX= 
##$RELAX= 
$$ Bruker specific parameters
$$ --------------------------
##$DU= <F:/spectra>
##$EXPNO= 1
##$NAME= <H-F>
##$PROCNO= 1
##$TYPE= <nmr>
##$USER= <she>
##$AMP= (0..31)
100 100 100 100 100 100 100 100 100 100 100 100 100 100 100 100 100 100 
100 100 100 100 100 100 100 100 100 100 100 100 100 100 
##$AQSEQ= 0
##$AQ_mod= 1
##$AUNM= <au_zg>
##$AUTOPOS= <>
##$BF1= 200.13
##$BF2= 200.13
##$BF3= 200.13
##$BF4= 200.13
##$BF5= 200.13
##$BF6= 200.13
##$BF7= 200.13
##$BF8= 200.13
##$BYTORDA= 1
##$CFDGTYP= 0
##$CFRGTYP= 5
##$CHEMSTR= <none>
##$CNST= (0..31)
1 1 145 1 1 1 1 1 1 1 1 1 1 1 1 1 1 1 1 1 1 1 1 1 1 1 1 1 1 1 1 1 
##$CPDPRG= <>
##$CPDPRG1= <>
##$CPDPRG2= <>
##$CPDPRG3= <>
##$CPDPRG4= <mlev>
##$CPDPRG5= <mlev>
##$CPDPRG6= <mlev>
##$CPDPRG7= <mlev>
##$CPDPRG8= <mlev>
##$CPDPRGB= <>
##$CPDPRGT= <>
##$D= (0..31)
0 1.2 0 0 0 0 0 0 0 0.06 0 0.03 0 0 0 0 0.0002 0 0 0 0 0 0 0 0 0 0 0 0 
0 0 0 
##$DATE= 1707738522
##$DBL= (0..7)
120 120 120 120 120 120 120 120 
##$DBP= (0..7)
150 150 150 150 150 150 150 150 
##$DBP07= 0
##$DBPNAM0= <>
##$DBPNAM1= <>
##$DBPNAM2= <>
##$DBPNAM3= <>
##$DBPNAM4= <>
$$ [...]
##$SUBNAM3= <"">
##$SUBNAM4= <"">
##$SUBNAM5= <"">
##$SUBNAM6= <"">
##$SUBNAM7= <"">
##$SUBNAM8= <"">
##$SUBNAM9= <"">
##$SW= 18.0517328524113
##$SWIBOX= (0..15)
0 0 2 0 0 0 0 0 0 0 0 0 0 0 0 0 
##$SW_h= 3612.71676300578
##$TD= 16384
##$TD0= 1
##$TE= 0
##$TE2= 300
##$TE3= 300
##$TEG= 300
##$TL= (0..7)
0 120 120 120 120 120 120 120 
##$TP= (0..7)
150 150 150 150 150 150 150 150 
##$TP07= 0
##$TPNAME0= <>
##$TPNAME1= <>
##$TPNAME2= <>
##$TPNAME3= <>
##$TPNAME4= <>
##$TPNAME5= <>
##$TPNAME6= <>
##$TPNAME7= <>
##$TPOAL= (0..7)
0.5 0.5 0.5 0.5 0.5 0.5 0.5 0.5 
##$TPOFFS= (0..7)
0 0 0 0 0 0 0 0 
##$TUNHIN= 0
##$TUNHOUT= 0
##$TUNXOUT= 0
##$USERA1= <user>
##$USERA2= <user>
##$USERA3= <user>
##$USERA4= <user>
##$USERA5= <user>
##$V9= 5
##$VALIST= <valist>
##$VCLIST= <CCCCCCCCCCCCCCC>
##$VD= 0
##$VDLIST= <DDDDDDDDDDDDDDD>
##$VPLIST= <PPPPPPPPPPPPPPP>
##$VTLIST= <TTTTTTTTTTTTTTT>
##$WBST= 1024
##$WBSW= 4
##$XGAIN= (0..3)
0 0 0 0 
##$XL= 0
##$YL= 0
##$YMAX_a= 554209
##$YMIN_a= -612813
##$ZGOPTNS= <>
##$ZL1= 120
##$ZL2= 120
##$ZL3= 120
##$ZL4= 120
##$ABSF1= 15.48577
##$ABSF2= -2.566079
##$ABSG= 5
##$ABSL= 3
##$ALPHA= 0
##$AQORDER= 0
##$ASSFAC= 0
##$ASSFACI= 0
##$ASSFACX= 0
##$ASSWID= 0
##$AUNMP= <proc_1d>
##$AZFE= 0.1
##$AZFW= 0.1
##$BCFW= 0
##$BC_mod= 2
##$BYTORDP= 0
##$COROFFS= 0
##$CY= -3
##$DATMOD= 1
##$DC= 0
##$DFILT= <>
##$DTYPP= 0
##$F1P= 0
##$F2P= 0
##$FCOR= 1
##$FTSIZE= 16384
##$FT_mod= 6
##$GAMMA= 0
##$GB= 0
##$INTBC= 1
##$INTSCL= 3.70164e-10
##$ISEN= 128
##$LB= 0.24
##$LEV0= 0
##$LPBIN= 0
##$MAXI= 10000
##$MC2= 0
##$MEAN= 0
##$ME_mod= 0
##$MI= 1.114404
##$NCOEF= 0
##$NC_proc= -5
##$NLEV= 6
##$NOISF1= 3.799351
##$NOISF2= 2.8
##$NSP= 0
##$NTH_PI= 0
##$NZP= 0
##$OFFSET= 15.59484
##$PC= 1
##$PHC0= -25102.28
##$PHC1= 7.852696
##$PH_mod= 1
##$PKNL= yes
##$PPARMOD= 0
##$PSCAL= 0
##$PSIGN= 0
##$REVERSE= no
##$SF= 200.129985363088
##$SI= 16384
##$SIGF1= 3
##$SIGF2= 2
##$SINO= 5.538805
##$SIOLD= 16384
##$SREGLST= <1H.CDCl3>
##$SSB= 0
##$STSI= 16384
##$STSR= 0
##$SW_p= 3612.71676300578
##$SYMM= 0
##$S_DEV= 0
##$TDeff= 16384
##$TDoff= 0
##$TI= <>
##$TILT= no
##$TM1= 0
##$TM2= 0
##$TOPLEV= 0
##$USERP1= <user>
##$USERP2= <user>
##$USERP3= <user>
##$USERP4= <user>
##$USERP5= <user>
##$WDW= 1
##$XDIM= 16384
##$YMAX_p= 320148223
##$YMIN_p= -150705
$$ End of Bruker specific parameters
$$ ---------------------------------
##NTUPLES= NMR SPECTRUM
##VAR_NAME=  FREQUENCY,     SPECTRUM/REAL,   SPECTRUM/IMAG
##SYMBOL=    X,             R,               I
##VAR_TYPE=  INDEPENDENT,   DEPENDENT,       DEPENDENT
##VAR_FORM=  AFFN,          ASDF,            ASDF
##VAR_DIM=   16384,         16384,           16384
##UNITS=     HZ,            ARBITRARY UNITS, ARBITRARY UNITS
##FACTOR=    0.220516191357247, 1,           1
##FIRST=     3120.9951108949, 0,             0
##LAST=      -491.721652110884, 0,           0
##MIN=       -491.721652110884, -150705,     0
##MAX=       3120.9951108949, 320148223,     0
$$ Real data points
##PAGE= N=1
##DATA TABLE= (X++(R..R)), XYDATA
$$ [...]
7077a7273n980L14k294J2817k03j3186l022M840K095O355J0078k187p995k346
7063a7987N893Q241M908p314J014j089q519Q042l819j1634J7500o405J1041j3903
7049a4031q620P118k93j1162q562J6598J2495J7569j3471j5383j810N292R802
7036d458q332J0938j4381r217K8560j4075p586O53j4357J3314J9180j8948J8545
7023a64N25L709k611k599P966j6057j4679R198j2464J3395r63P254m526r035P995
7008a3056j151J668J4329p444k9j3932q113P823p573o72J4628p062n427J6150
6994i861j993J2528j5702J3329k346j3213J5143O89j2543r438P380j5697J6412
6981a5312l399J1840k721q263J9721k5941J4374q271J9079l042q829j42J216j765
$$ plain form
7077 -17273 -23253 -22939 -25233 -12416 -12619 -25805 -28827 -23987 -21892 -15537 -5459 -7646 -15641 -17987
7063 -17987 -12094 -3853 1055 -6259 -5245 -6334 -14853 -6811 -10630 -22264 -4764 -11169 -128 -14031
7049 -14031 -22651 -15533 -15826 -26988 -35550 -18952 -6457 11112 -2359 -17742 -19552 -14260 -4458
7036 -4458 -12790 -1852 -16233 -25450 3110 -10965 -18551 -17898 -32255 -18941 239 -18709 -164
7023 -164 361 4070 1459 -1140 6826 -9231 -23910 -14712 -27176 -13781 -14744 -7490 -12016 -21051 -13056
7008 -13056 -14207 -12539 1790 -5654 -5683 -19615 -27728 -19905 -27478 -28150 -13522 -20584 -26011 -9861
6994 -9861 -11854 674 -15028 -1699 -4045 -17258 -2115 -1426 -13969 -23407 -16027 -31724 -15312
6981 -15312 -18711 -6871 -9592 -17855 1866 -24075 -9701 -17972 1107 -1935 -10764 -10906 -9690 -11455
6967a1455R326k81j2232r928M414J6105n304r057m92j3156K9765K410m940j030
6953e855R115N891j756j5382m659Q235n093J8078k5936j912J3576o171P977O777
6939B885j6922j7737J7684J0664Q47p356L395P00j5568K7705j2539K3817j7064
6926E11q374O415j1163K1861r607P68k5255J0813K0770J7564J396L654K798l0252
6912A899J7419N152M37j1160j2318j4557m784K1194j7554j0149n303N491O868
6899a7365j0026K1897p142K1789j5855Q923o908j3389J1057j3280J7330r456l82
6886a2807j518l598J2703j1593K3889j4374J6828k2244J8285Q061j3552J3506
6874A3586k7618L5803l4754l20m870l823J1853j6947L1417j8937P114j3928K4736
$$ plain form
6967 -11455 -2129 -2410 -14642 -24570 -20156 -4051 -9355 -18412 -18904 -32060 -2295 115 -4825 -5855
6953 -5855 3260 9151 7395 -7987 -12646 -4411 -9504 8574 -17362 -19274 -5698 -11869 -3892 2885
6939 2885 -14037 -31774 -14090 -3426 -2579 -9935 -6540 -5840 -21408 6297 -6242 17575 511
6926 511 -7863 -1448 -12611 9250 -357 411 -24844 -14031 6739 24303 25699 29353 32151 1899
6912 1899 19318 24470 24907 13747 1429 -13128 -17912 3282 -14272 -24421 -29724 -24233 -17365
6899 -17365 -27391 -5494 -12636 9153 -6702 2221 -4687 -18076 -7019 -20299 -2969 -12425 -12807
6886 -12807 -14325 -17923 -5220 -16813 7076 -7298 9530 -12714 5571 13632 80 13586
6874 13586 -14032 21771 -12983 -13303 -18173 -21996 -10143 -27090 4327 -14610 -7496 -21424 3312
6861C312J917j0231J3764k4079J3699l0865L0647k6221k785K5593j5141M704j1999
6848b7685J3669r961J9032l826l831M754l219K4411k6091J0986j2429Q321r53
6835f822j066J4587r637N209Q147k2846J5441j1686K386P48k088O387M754j1416
6821g902k866n121j1264P042k7276J0317P075O441J1489r953K5212m531Q419L339
6807A0421N59J612j7198P096j0773J5483k0914r874L892N350j851j0538L1888
6794E153j9071P232O863j7748p555N871J9852n769k862j4169J4254o779R277M814
6780f37j9016p16q568K4125n942k4293J2262J6581O845N363r071P978L009j2244
6766d324k133O166J4505j0467o429J0762j9792k922P981j6582R181k203J477J1355
$$ plain form
6861 3312 5229 -5002 8762 -15317 -1618 -32483 -1836 -28057 -30842 -5249 -20390 -15686 -27685
6848 -27685 -14016 -23977 -4945 -8771 -12602 -7848 -11067 13344 -12747 -1761 -14190 -5869 -6822
6835 -6822 -7888 6699 -2938 2271 10418 -12428 3013 -8673 -6287 -5539 -7627 -1240 3514 -7902
6821 -7902 -10768 -15889 -27153 -20111 -47387 -37070 -29995 -23554 -12065 -22018 3194 -1337 7082 10421
6807 10421 10980 12592 -4606 2490 -8283 7200 -13714 -23588 -19696 -14346 -16197 -26735 5153
6794 5153 -13918 -6686 177 -17571 -25126 -19255 597 -5172 -8034 -22203 -7949 -14728 -5451 -637
6780 -637 -19653 -20369 -28937 -4812 -10754 -35047 -22785 -6204 641 6004 -3067 4911 7920 -4324
6766 -4324 -6457 -291 14214 3747 -2682 8080 -11712 -14634 -6653 -23235 -14054 -16257 -14780 -3425
6752c425n65J4962j0832m492n018k752J7047j3165N201m850K221p511L068J1929
6738A818J4298M266r855p393K281J0985j8716r177j0564M425m397K2J0548j8504
6724b9963K5906j2332O054N752K04P881r616J9408O918j8666J498j1574k504n882
6710a6916J4904r591J5036o200p265j4050J3864J038J370L2297k7189N724J2327
6697A5349j9964k066j1713J8650n857j9372J4872p612J7839l968m818K4632q974
6684F998k3835K1205l1505K6419p705j748J5629j4025K7904j7670j1521J1579
6672A725N93N74k1891K8353j6035N845J1386k5821K6522L278l1179R52K4909j7828
6658h617K0227J246n653m352k0290R553j3829K6261n369m222K2630k842O407p078
$$ plain form
6752 -3425 -3990 10972 140 -4352 -9370 -12122 4925 -8240 -3039 -7889 -5668 -13179 -10111 1818
6738 1818 16116 20382 10527 3134 5415 16400 -2316 -11493 -22057 -17632 -22029 -22007 -11459 -29963
6724 -29963 -4057 -16389 -10335 -4583 -4379 3502 -6114 13294 20212 1546 3044 -8530 -11034 -16916
6710 -16916 -2012 -11603 3433 -2767 -10032 -24082 -10218 -9180 -7810 24487 -2702 3022 15349
6697 15349 -4615 -6681 -18394 256 -5601 -24973 -10101 -17713 126 -3842 -8660 15972 6998
6684 6998 -16837 4368 -27137 -718 -8423 -10171 5458 -8567 19337 1667 -9854 1725
6672 1725 2318 2892 -18999 9354 -6681 -836 10550 -15271 11251 14529 -16650 -15698 9211 -8617
6658 -8617 11610 12856 7203 2851 -17439 -7886 -21715 4546 -823 -5045 17585 14743 21150 14072
6644A4072P873l9177m071K9864k5227L674j388j641K162J8541k9446J8921K145
6631c698j772Q373j7256L5187j3395J1181k960r296K3831r611J175j6824P769
6618A2704p597K435n19J438J188j1366J4685j3199Q535O40j1661j0525O138K730
6604d374j9144K4305m906N960J5583j0911p617j0227K3874r387J8935j6592k7608
6591b2109K6831J3850J733l283l141q492L219j7589L934r058R966K0880m893K7044
6577C8892l2329p249N549l572J1355r570k762j9768K2497L53k723j635k348L640
6563C30j026J483l3315K3883J3316R079o257K76o456j9656K1209j0067J3109R937
6549A5845l440j8998J1457o195k0288K8423R424l47k2687K5052j9507J1413r128
$$ plain form
6644 14072 21945 -17232 -21303 8561 -16666 -12992 -14380 -16021 -13859 4682 -24764 -5843 -3698
6631 -3698 -5470 2903 -14353 20834 7439 18620 15660 6364 30195 20584 21759 4935 12704
6618 12704 5107 7542 7023 8461 9649 -1717 12968 -231 8304 8944 -2717 -13242 -7104 -4374
6604 -4374 -23518 787 -4119 1841 17424 6513 -1104 -11331 12543 3156 22091 5499 -22109
6591 -22109 4722 18572 20305 17022 13881 5389 8608 -8981 -5047 -14105 -4139 16741 11848 38892
6577 38892 6563 -686 4863 1291 12646 3076 314 -19454 3043 3396 673 -962 -3310 330
6563 330 -696 787 -32528 -8645 4671 13750 7493 7769 1313 -18343 2866 -7201 5908 15845
6549 15845 12405 -6593 4864 -1331 -21619 6804 16228 15881 -6806 18246 -1261 10152 1024
6536A024p906P855j709L354j6328K757k502P190J5909K068N635l336J683M225
6522A9919K595L788j7672j1645J7416m236k7392J9448n281j77j1763O971K647
6509e382p874J9260q048J5768J0168j4187j581K03m253Q145J0638j6849m206J3651
6495A5453M362q424Q77J2988k2304J292J5770j920M97n24K319J6387J744k9513
6481I004l238p163O514J0510K17J9471r385j420o154k550K4921p663J8199k8k1355
6466B9880J202j7904K6813k6296j0430l263q382K3442J5333j1846n614j0338p509
6453d912J5944R33K3387j4667J1832j5696j1142J3319l481p349k160J9499q91
6440B4616l3179J1268R287j0065K9691Q288l7278R313M570K75j272P809L545N326
$$ plain form
6536 1024 -6882 973 -736 2618 -13710 -10953 -13455 -6265 9644 11712 17347 14011 15694 19919
6522 19919 22514 26302 8630 -3015 14401 10165 -17227 2221 -3060 -3237 -15000 -8029 -5382
6509 -5382 -13256 6004 -2044 13724 23892 9705 8124 8327 4074 12219 22857 6008 1802 15453
6495 15453 19815 11391 12268 25256 2952 4244 20014 18094 18591 18067 20386 36773 38517 9004
6481 9004 5766 -1397 5117 15627 15844 35315 25930 24510 18356 15806 40727 33064 51263 51235 29880
6466 29880 31082 13178 39991 13695 3265 2 -8380 15062 30395 18549 12935 2597 -4912
6453 -4912 11032 11965 35352 20685 32517 16821 5679 18998 15517 8168 6008 25507 24616
6440 24616 -8563 2705 11992 1927 31618 39906 2628 11941 16511 16786 15514 23323 26868 32194
6426C2194J0352j9737J3757j2466k7765J0720O421m870j7338J3599J2636m595
6414A2908j6164J9211j0370p275P009N846M004J1302p705k1440L7204r899j4891
6401I740J2826j0679k415Q410m479R371J7401J519j6953j9280J1124K97P330Q176
6387C2388k4536K550J0179K1206l2288m528Q000k046k042J1470J2416l747n85
6374B8437L301M01j0382k547m662N158J2835j557K5113k9742o274J3111q476J7031
6360D1747L454o255j59p1J7224j7537l971J3195k4027q524n381K1254J7041j6373
6346C1617l611J0775O215j665k0556p504J8415M940M872m340n892j888k1298J3380
6332B3460k0410P322Q961K1140J3032k2868J3703p891M443R501j8667M079j3185
$$ plain form
6426 32194 42546 22809 36566 24100 -3665 7055 13476 8606 -8732 4867 17503 12908
6414 12908 -3256 15955 5585 -1690 5319 11165 15169 26471 18766 -2674 34530 24631 9740
6401 9740 22566 11887 9472 17882 13403 22774 40175 41694 24741 5461 16585 16882 24212 32388
6387 32388 7852 10402 20581 41787 9499 4971 12971 10925 8883 20353 32769 29022 28437
6374 28437 31738 32139 21757 19210 14548 19706 32541 30984 56097 26355 20081 33192 24716 41747
6360 41747 45201 38946 38787 38716 55940 38403 34432 47627 23600 15076 9695 30949 47990 31617
6346 31617 28006 38781 44996 43331 22775 15271 33686 38626 43498 39158 33266 31378 10080 23460
6332 23460 3050 10372 19333 40473 53505 30637 44340 36449 40892 50393 31726 35805 22620
6319B2620J1708j1795j050K516P860o665K571o212J1887J3444m389K7043j7961
6306E1577P504j2773N708K107p795K563n41J0487j2745L975n985J4932j730Q798
6292F6082O533k7860K4062j1132J5034j9779k648K3347p068k930j2450J4120j8025
6279D7286n403k141N606Q865j7181J3262l070J014P285q411j8822J6439N341M853
6265E4923j277j602J1922j7215j6597M190K699J2255n677J7614J843n547M895
6252F2426K0o171j9190P221Q527R972j1575J1967m44m433j5199k7618J3192J7243
6238D5938Q671J3321k0848P297l312O633j3816K187N915p404J306K331m682j0409
6224C3128J3193m634J4705j2750J449K2472Q981k1671J5357J3043j2643r946L268
$$ plain form
6319 22620 34328 22533 21483 23999 31859 25194 27765 21553 33440 46884 42495 69538 51577
6306 51577 59081 46308 52016 54123 46328 48891 48350 58837 46092 50067 44082 59014 57284 66082
6292 66082 72615 44755 68817 57685 72719 52940 50292 73639 66571 63641 51191 65311 47286
6279 47286 41883 39742 45348 54213 37032 50294 47224 48238 55523 47112 28290 44729 50070 54923
6265 54923 53646 52044 63966 46751 30154 34344 37043 49298 43621 61235 63078 57531 62426
6252 62426 62446 56275 37085 44306 52833 62805 51230 63197 62753 58320 43121 15503 28695 45938
6238 45938 54609 67930 47082 54379 51067 57700 43884 46071 51986 44582 45888 48219 43537 33128
6224 33128 46321 41687 56392 43642 45091 67563 76544 54873 70230 83273 70630 60684 63952
6211F3952j1467J0395P847j2035j0889k175J8131M462P191r355j1702Q193N482
6198F8030J4383Q838j7413j2536O632j3834J9300mj798j0425j3687K9269q525
6185F8230K235j594M703n13j2476J5988J3708K484r312J160j3848r53J4095J1246
6171I5153M929k3472K5480j0490J2371k6790PK1238k3269K9348n996R507p881
6158A00135p356J2938q770j5763Q339J5151r218L5211k3097L86m465J5407N166
6145A24064p146J2953p951Q066j426N171o886m960M273Q791J2825j7385q898K2497
6131A43988O220j1190R044K1412o686n727K634J6967j8496K238J4527r941p773
6118A57217j878K2738p381J1646K498o820K0267J651O282K4836j9250J4597j1306
$$ plain form
6211 63952 52485 62880 70727 58692 47803 45628 63759 68221 75412 66057 54355 62548 68030
6198 68030 82413 91251 73838 61302 67934 54100 73400 73396 71598 61173 47486 76755 68230
6185 68230 70465 68871 73574 73061 60585 76573 90281 92765 83453 84613 70765 69812 83907 95153
6171 95153 100082 76610 102090 91600 103971 77181 77188 98426 75157 104505 98509 108016 100135
6158 100135 92779 105717 96947 81184 89523 104674 95456 130667 107570 107956 103491 118898 124064
6145 124064 116918 129871 121920 129986 128560 133731 126845 121885 126158 134949 147774 130389 121491 143988
6131 143988 150208 139018 148062 169474 162788 157061 159695 176662 158166 160404 174931 164990 157217
6118 157217 155339 178077 170696 182342 184840 178020 198287 199938 206220 231056 211806 226403 215097
6105B15097o805L1141p778J1991P420J076K940n694J926R721Q648P111P609l328
6091B81075K3551n74K8036j0676R33L0681m0035K3074J775o063M693J1930K2379
6078C70779L5683m83m23J559M457L2679J2248J5521J0612J8316m208q339L0273
6065E18674P063L2320j2352K6935K0680K5439K0096J7123M6909J0496K0717L0789
6053G64889L1232J1200N4041J7805L3948M9404N2663P0859K5521Q6582L8174Q6640
6041A322958N9639P9882P7582O1179O1494P6118R4004M2364R3699K2749M7735
6030B039403K3060L8718N3714r404N6354L2787N6113K7497M6647P3476N5955R1125
6018B585445O8399J00937Q0911J03537N2474R5073J07777J08691J25131O0566
$$ plain form
6105 215097 208292 239433 231655 243646 251066 252142 255082 249388 251314 261035 269683 276794 284403 281075
6091 281075 304626 304052 332088 321412 322345 353026 312991 336065 337840 331777 336470 348400 370779
6078 370779 406462 405979 405556 407115 411572 444251 456499 472020 482632 500948 496740 488401 518674
6065 518674 525737 558057 545705 572640 593320 618759 638855 655978 702887 713383 734100 764889
6053 764889 796121 807321 861362 879167 913115 962519 1015182 1086041 1111562 1198144 1236318 1322958
6041 1322958 1382597 1462479 1540061 1601240 1662734 1738852 1832856 1875220 1968919 1991668 2039403
6030 2039403 2062463 2101181 2154895 2145491 2201845 2234632 2290745 2318242 2364889 2438365 2494320 2585445
6018 2585445 2653844 2754781 2835692 2939229 2991703 3086776 3194553 3303244 3428375 3488941
6008C488941Q2323O020k3670k5927j3004m6486j5437l1278o4165n4277r5104m9641
5996C158295n7171m0076m2342m926j2033k6215j3058j7789J1526N59N798J9161
5984B981729K3447l6248k8971m2254q0472n6423p9807p1280j02350j11814r4330
5973B301227r9723q9655r0194o4618o9367o1254n8879m3877n6425o0674l5536
5962A571025l8152l0647o8568J072p1723l8465k6918k8123k1197m9394j2257m9071
5950A137582o606k4890k8330r578k3088L7775j9767J470l536k067L5887J3100
5938A107952K4416L3800M8209Q342M6018K5574K7806L4554K8640R7952N1387Q6100
5926A620750K2263r061o2712o1106J5863l271J8563n3532m1439n7868n0318l0989
$$ plain form
6008 3488941 3571264 3577284 3553614 3527687 3514683 3468197 3452760 3421482 3357317 3303040 3207936 3158295
5996 3158295 3101124 3061048 3018706 3013780 3001747 2975532 2962474 2944685 2956211 2956770 2962568 2981729
5984 2981729 3005176 2968928 2939957 2897703 2817231 2760808 2681001 2609721 2507371 2395557 2301227
5973 2301227 2201504 2111849 2021655 1957037 1887670 1826416 1767537 1723660 1667235 1606561 1571025
5962 1571025 1532873 1502226 1433658 1434730 1363007 1324542 1297624 1269501 1248304 1198910 1186653 1137582
5950 1137582 1130976 1106086 1077756 1068178 1045090 1082865 1063098 1064568 1061032 1058965 1094852 1107952
5938 1107952 1132368 1166168 1214377 1222719 1268737 1294311 1322117 1356671 1385311 1483263 1534650 1620750
5926 1620750 1643013 1633952 1571240 1510134 1525997 1522726 1541289 1487757 1446318 1388450 1338132 1307143
5914A307143l7232J8804r997J5185l0836P45j8681j0349K102k7512K4472j8595
5902A215249J111k6966O432l967l2251n649m2235k0274m5970k8709j9977m2780
5890I54014j9000l0369j0084m2049l257k3041k8463r176o755k762j1298L62j3630
5877G54492j2636j3250o728J7871l4149r619k3128j6155j0013l7009j064k0674
5865E87938p124K976l4006k3083k1266r33k4075O638j1295k08k0832l676j5217
5852D35837k1721K481l2324K0487k4767j82k665j2459k360k5787L2117l5850J0662
5839C43469L779j9475p035O412J2086k7327L448j9939J1594j9895j305K09j926
5826B84095m31l1733M3143l0089n585p902J0185K71m0104L4626k030n62k4539
$$ plain form
5914 1307143 1269911 1288715 1278718 1293903 1263067 1263812 1245131 1234782 1236884 1209372 1233844 1215249
5902 1215249 1216360 1189394 1195826 1191859 1159608 1153959 1111724 1091450 1045480 1016771 996794 954014
5890 954014 935014 904645 894561 852512 849255 826214 797751 788575 781820 779058 767760 768122 754492
5877 754492 741856 728606 721878 739749 705600 695981 672853 656698 646685 609676 608612 587938
5865 587938 580814 583790 549784 526701 505435 504502 480427 487065 475770 475562 454730 451054 435837
5852 435837 414116 416597 384273 404760 379993 379811 377146 364687 362327 336540 368657 332807 343469
5839 343469 347248 327773 320738 327150 339236 311909 315357 295418 307012 287117 285812 286021 284095
5826 284095 283664 251931 295074 264985 259400 251498 261683 261954 221850 256476 254446 253884 229345
5813B29345P696j1090J9154O08J0755k8375J3779j3726j6045L8387k0191J3275
5801B43572j8890n991j0172L220k358m380q586L919j2894k907L161j9534J9824
5788A87984j8138J2188J5549j2198K3605k5093R809M487j1990Q92N590k5308k079
5775A65298K1299j7131K6363j1457J1310k9965K6033m513j3291K4506j2316K4027
5763B10163l2633J4440p826j1175Q856j9136K9855j0831N287j995K4996q724j0776
5750A90501M003j3965j031K059J0809k5070K3444j2887j806K7137j6116K2478
5738B09556J577K5672j4278j2977J2477r973K3286J7748j0549Q799R210p388J6907
5725B70067K6726j0547j7684N970J6951q973J5752m322J323L0136L325J7244Q936
$$ plain form
5813 229345 237041 225951 245105 245713 256468 228093 241872 228146 212101 250488 230297 243572
5801 243572 224682 218691 208519 211739 209381 205001 196415 200334 187440 184533 187694 168160 187984
5788 187984 169846 182034 197583 185385 208990 183897 193706 198193 186203 187095 192685 167377 165298
5775 165298 186597 169466 195829 184372 195682 165717 191750 187237 173946 198452 186136 210163
5763 210163 177530 191970 184144 172969 181825 162689 192544 181713 187000 185005 210001 201277 190501
5750 190501 194504 180539 179508 181567 192376 167306 190750 177863 176057 203194 187078 209556
5738 209556 211133 236805 222527 209550 222027 212054 235340 253088 242539 251338 260548 253160 270067
5725 270067 296793 286246 268562 274532 291483 282510 298262 293940 295263 325399 328724 345968 354904
5712C54904P714j0351J260K7125k3140J6456K8264n475K448P600L5462k873K4183
5699D63577j172K4174L0965J9260J0965J6717L1603M984M9196K6166L1925L0194
5687G38554P8570N4793M7288Q4265M9011P8257K2611L3164M0456P9044J18887
5676A424900J23414J29543K6876k9755o5133n2371m4766q624N9572j2248l1118
5665A520290q3203n4791q6660l8954k9428k5128J2304j4642k4701n9934k6510
5654A088643j4839K34J986j7826J0912q779q125k1146l467O653j0211l6751m1834
5641I45450j2658k2898j0618k4192j9488j2295k6524l569k2050N751k4502N153
5629G77560m477o951K4414k5795J8443j4230N617K3482J8309Q438k430n479J2752
$$ plain form
5712 354904 362618 352267 353527 380652 357512 373968 402232 396757 399205 406805 442267 439394 463577
5699 463577 462405 486579 517544 536804 547769 564486 596089 601073 650269 676435 708360 738554
5687 738554 817124 871917 919205 1003470 1052481 1130738 1153349 1186513 1226969 1306013 1424900
5676 1424900 1548314 1677857 1704733 1674978 1609845 1557474 1512708 1504084 1563656 1551408 1520290
5665 1520290 1437087 1382296 1295636 1256682 1227254 1202126 1214430 1199788 1175087 1115153 1088643
5654 1088643 1073804 1074038 1076024 1058198 1069110 1060331 1052206 1031060 1027593 1034246 1024035 987284 945450
5641 945450 932792 909894 899276 875084 855596 843301 816777 813208 791158 796909 772407 777560
5629 777560 773083 766132 790546 764751 783194 768964 774581 798063 816372 824810 822380 816901 829653
5616H29653J1363J7333L6613j1563J1331K7680k926L9260q830M3940K2284L0981
5604A047119J3847K516J5118L953J9583J3892K0931J8724K4286K4517J6190J1349
5592A232025M4809L7264K9308L1736J6307N3071N2903N0626N2072M4038P1601
5581A715760N6459R2166N7214Q2600Q5956N9180O5231R2834R3905R0100R3914
5570B585319P1541O7271K0635M6197K9617K9187L5636O594M7931N76P439L6438
5558B984381L8125O1672N7317Q6830Q9988P7637Q4025O7451R5497J33358J02206
5547C878487J20905J14425P1442P0092M781j1064k6950m7813k0647o5087q4071
5536D004500j02522j15211p2336r7220q1314o2492n8687k2106n1034k7225k8095
$$ plain form
5616 829653 841016 858349 894962 883399 894730 922410 919484 958744 949914 993854 1016138 1047119
5604 1047119 1060966 1063482 1078600 1082553 1102136 1116028 1136959 1155683 1179969 1204486 1220676 1232025
5592 1232025 1276834 1314098 1343406 1375142 1391449 1444520 1497423 1548049 1600121 1644159 1715760
5581 1715760 1772219 1864385 1921599 2004199 2090155 2149335 2214566 2307400 2401305 2491405 2585319
5570 2585319 2656860 2724131 2744766 2790963 2820580 2849767 2885403 2891997 2939928 2940504 2947943 2984381
5558 2984381 3022506 3084178 3141495 3228325 3318313 3395950 3479975 3547426 3642923 3776281 3878487
5547 3878487 3999392 4113817 4185259 4255351 4260132 4249068 4222118 4174305 4153658 4088571 4004500
5536 4004500 3901978 3786767 3714431 3617211 3535897 3473405 3414718 3392612 3341578 3314353 3286258
5525C286258n1630k807J9406O083K9279k5271m3678n3888n4307l7284j04122n7452
5513B910587p0306p4588o0740q6305n9466j27703p6980j13862q2395o1368m4741
5502B052133k7315o9924n4363o0849m5670p1777l7764m0099l9734l0879l9183
5491A534576l6107o2746j7031o2887r157k9526k7120j4754k6949J5059l5934o742
5479A220682l1356j1016k750m761j8880k6086o517k6836R062J707J6095j8307
5467A101037j842k891k6824K6199q607J1523p163J2665J316L483N89j3287K850
5454A099048J6484J903j7439J8841p44P585J8413p681K7114j1428K8359j091K8687
5441A208051J0362R723J2927m094K8428J6016M9882K1102K6203J3907J393L1687
$$ plain form
5525 3286258 3234628 3231821 3251227 3257310 3286589 3261318 3217640 3163752 3109445 3072161 2968039 2910587
5513 2910587 2840281 2765693 2704953 2618648 2559182 2431479 2354499 2240637 2158242 2096874 2052133
5502 2052133 2024818 1954894 1900531 1839682 1794012 1722235 1684471 1644372 1604638 1573759 1534576
5491 1534576 1498469 1435723 1418692 1355805 1346648 1317122 1290002 1275248 1248299 1263358 1227424 1220682
5479 1220682 1189326 1178310 1175560 1170799 1151919 1125833 1119316 1092480 1101542 1103249 1119344 1101037
5467 1101037 1099195 1096304 1069480 1095679 1087072 1098595 1091432 1104097 1105413 1108896 1109485 1096198 1099048
5454 1099048 1115532 1117435 1099996 1118837 1118093 1125678 1144091 1136410 1163524 1152096 1180455 1179364 1208051
5441 1208051 1218413 1228136 1241063 1236969 1265397 1281413 1331295 1352397 1378600 1392507 1393900 1425587
5429A425587L1157K2515J5709L6799j1103J3061K9051K5973O1341K9511P5924
5418A755525O1893N8945O2806N4070P3028N2327R4876O7223R5490R1891O9105
5407B537179O4735M3884M3270J8033N6818K4346M7815L6727K1859N6081K4280
5396B975027M6610L7658O8349M6273P0929P0679P9036Q5765P0396J05519O2881
5385C719122Q7334M0007M830K6077J6834K1013j5250k1286o7168p5096m5446n3718
5373C637253l3728m5865n3296m6413q521l2867r456j8365l7152J1040P732J6560
5361C386922P867j5956j9890p4239l2302q5140q8626j06112r7657q4639j04386
5350B685842j05277j16383r8880j08258r0734p4520p5433o8786o3985k9337p0333
$$ plain form
5429 1425587 1456744 1479259 1494968 1531767 1520664 1533725 1562776 1588749 1650090 1679601 1755525
5418 1755525 1817418 1876363 1939169 1993239 2066267 2118594 2213470 2280693 2376183 2468074 2537179
5407 2537179 2601914 2645798 2689068 2707101 2763919 2788265 2836080 2872807 2894666 2950747 2975027
5396 2975027 3021637 3059295 3127644 3173917 3244846 3315525 3394561 3480326 3550722 3656241 3719122
5385 3719122 3806456 3846463 3851293 3877370 3894204 3915217 3899967 3878681 3811513 3736417 3690971 3637253
5373 3637253 3603525 3557660 3504364 3457951 3449430 3416563 3407107 3388742 3351590 3362630 3370362 3386922
5361 3386922 3394789 3378833 3358943 3284704 3252402 3167262 3078636 2972524 2874867 2790228 2685842
5350 2685842 2580565 2464182 2365302 2257044 2166310 2091790 2016357 1947571 1883586 1854249 1783916
5339A783916o7318n8810n5181m8153o1696k2384p6026k8288p2884n5994m4320
5328A192862o2406j9473o9851j7452o8219j9003k2297k5297l4213m0481m387l9008
5316G70775j9555k7503j7394l3986J1092l0982m4602J3732j9802J599k1520n626
5304E76228j2962l769o09l9458N947M829k5335k2578l060P59J7668Q66j0998R920
5290D97448K1832J3767k108l078o818K44M315L1225K0975k017j0952k2297r193
5277E33343j9034k0899j4453K4202j280j81k9035R344j0731j2090k6257k8124
5265D04805L1548l0249j8242j4990M546k1295L612J1265k7730k03j1445J2976
5253C44598j719J3001j5193P938L693j2699r124j8509j6224j3845j901q965j7755
$$ plain form
5339 1783916 1716598 1657788 1602607 1554454 1492758 1470374 1394348 1366060 1293176 1237182 1192862
5328 1192862 1130456 1110983 1041132 1023680 955461 936458 914161 888864 854651 814170 809783 770775
5316 770775 751220 723717 706323 672337 683429 652447 607845 621577 601775 603374 581854 576228
5304 576228 563266 559497 558888 519430 525377 530206 504871 482293 479233 479992 497660 498526 487528 497448
5290 497448 519280 533047 530939 527861 521043 521287 525602 556827 577802 575785 564833 542536 533343
5277 533343 514309 493410 478957 503159 501879 501698 472663 482007 471276 459186 432929 404805
5265 404805 436353 406104 387862 372872 377418 356123 359735 371000 343270 343067 331622 344598
5253 344598 342879 355880 340687 348625 352318 339619 330495 311986 295762 281917 280016 271051 253296
5240B53296K0960k3197l697O93K2529j0362j026K77j358P531L398l146k3959J2948
5226B54887l7005K1252l864m557K0167p384Q329k487J2163j4834R330J2184o646
5213B61535J9237k2905L814j0867p883J927N964j1773k747r412j5482N424M966
5200B21798L2310j2398k4734L2961k1031M979n03J2465J4034j2813j2994O094
5188B40168o060j3414j5726Q72K3226J0292J071j5766R716J9532k5158P567r214
5175B27106j9976n129p345k146j5350J7029j9294p185J9937j6081m88J2650O73
5162A84401L994J416p431J1829J4421l253o41k0182p971j2508J4756q016j3645
5149A57170J6210r35P271q766J1765k446M529J3060l1629L746O010k52l0449P844
$$ plain form
5240 253296 274256 251059 247362 248055 270584 260222 259196 259473 258115 265646 269044 265898 241939 254887
5226 254887 217882 239134 235270 230713 250880 243496 251825 249338 261501 246667 255997 268181 261535
5213 261535 280772 257867 261681 250814 242931 244858 250822 239049 236302 226890 211408 216832 221798
5200 221798 254108 241710 216976 249937 228906 233885 233382 245847 259881 247068 234074 240168
5188 240168 234108 220694 204968 205840 229066 239358 240429 224663 234379 253911 228753 236320 227106
5175 227106 207130 202001 194656 192510 177160 194189 174895 167710 187647 171566 171078 183728 184401
5162 184401 188395 189811 182380 194209 208630 205377 204736 184554 176583 164075 178831 170815 157170
5149 157170 173380 172445 179716 170950 182715 180269 184798 197858 166229 169975 175985 175733 145284 153128
5135A53128Q111o427r478J0752j8517n267K8397j1545J8368J1337k4331P17R972
5122A65217k649j558P696P724j2456N051j6763j4926o469J0663J0729O480J3886
5109A72625m300P594j2815J0743o86J5837K548j3529P921k8202o982j1247Q094
5096A47601L914J9194M938r045O492j4644O014l122O747R140k73K9201j7814P29
5082A89072m980j1576K556r968M295R213m962K562P494J5835l890k2236K0997
5069A94412N89p803J5935J3744k4430j9277n993k788J0940j1396J1785m052N191
5056A76857J8801K860O35n995L889k3070J3889q372L320p226j1025K181p341K8187
5042A87590j7038J6531j8839K924M745O787j1211j247K0726j5789L1123k1021
$$ plain form
5135 153128 161239 154812 145334 156086 137569 132302 160699 149154 167522 178859 154528 155245 165217
5122 165217 162568 161010 168706 176430 163974 169025 152262 137336 130867 141530 152259 158739 172625
5109 172625 168325 175919 163104 173847 173161 188998 191546 178017 185938 157736 150754 139507 147601
5096 147601 151515 170709 175647 166602 173094 158450 164464 161342 168089 177229 176956 206157 188343 189072
5082 189072 184092 172516 175072 165104 169399 178612 173650 176212 183706 199541 195651 173415 194412
5069 194412 195001 187198 203133 216877 192447 173170 167177 164389 175329 163933 175718 171666 176857
5056 176857 195658 198518 199153 193158 197047 173977 187866 179494 182814 175588 164563 166744 159403 187590
5042 187590 170552 187083 168244 171168 175913 182700 171489 170242 190968 175179 206302 185281
5030A85281R316k5964l589N97j4986J5814j7644K5155k0231P59Q041n502K2947
5017A79994j2992M552L490m636J306J0821k804N8l629M173P99p900O26n496K7498
5002A95860n425j1303J4195j7730o992K9672O401L751o186k59j8991K248P434
4989A92675l6949K8403j5335K4248j7j8474K8729q806J5323j1460J5182l265Q604
4976B18858j8129j5668N996k1729L0616k7209J9929k2767K8921J6463k4933L5863
4964B26211k4657J7123j3679J9827o224M887O231n4J6226l0338Q168j4597L4025
4951B43149k4064j611K6783j8927M2879j3265J3746r594J7471j5270p933J0556
4939B63920j2474L4263k3500K1081k1742K1819j937o598J4881j7465J4561J8556
$$ plain form
5030 185281 194597 168633 165044 165641 150655 166469 148825 173980 153749 154508 162549 157047 179994
5017 179994 167002 171554 175044 170408 171714 182535 179731 179789 176160 180333 181132 173232 173858 168362 195860
5002 195860 190435 179132 193327 175597 168605 198277 204678 208429 202243 201984 182993 185241 192675
4989 192675 155726 184129 168794 193042 193025 174551 203280 194474 209797 198337 213519 210254 218858
4976 218858 200729 185061 191057 169328 199944 172735 192664 169897 198818 215281 190348 226211
4964 226211 201554 218677 204998 224825 218601 223488 229719 229665 245891 215553 223721 209124 243149
4951 243149 219085 217474 244257 225330 268209 254944 268690 259096 276567 261297 253364 263920
4939 263920 251446 285709 262209 283290 261548 283367 281430 274832 289713 272248 286809 305365
4927C05365K0368j1825N976J0410n18o959l240K9038j4615J7980m441P642N709
4914C60890n54K1307k4705J0868J0010O334q771q029n373K359J4110l348N399
4901C80497o012L583j8806j0996K6811l0841J9750J674J6465P732k3665J2834
4889C79026R32m089p876J4772j1621J369L841j0273J4524p712O762k4633K4048
4876C79070N259O320J0851k2128j2155L7186N250j6464Q166j7577j56J2336j9481
4863C76477J1137j7277R111j4574j27J5802j852m204r4J8471K644J565j3497l675
4849C79907q476L1763j5692P322J2658j8886J9744J2631r726j56J2244P220J0640
4836D41193P139N71k118o387N012j1274J8321m746J2936J0980J5593K390L778
$$ plain form
4927 305365 325733 313908 319884 330294 329776 322817 319577 348615 334000 351980 347539 355181 360890
4914 360890 360336 381643 356938 367806 377816 384150 375379 367350 361977 364336 378446 375098 380497
4901 380497 374485 378068 359262 348266 375077 344236 363986 365660 382125 389857 366192 379026
4889 379026 379958 375869 367993 382765 371144 372513 376354 366081 380605 372893 379655 355022 379070
4876 379070 384329 390649 401500 379372 367217 404403 409653 393189 401355 383778 383622 395958 376477
4863 376477 387614 370337 379448 364874 364747 380549 378697 374493 374399 392870 395514 397079 383582 379907
4849 379907 371431 403194 387502 394824 407482 388596 408340 420971 411245 411089 423333 430553 441193
4836 441193 448332 448903 446785 440398 445410 434136 452457 447711 460647 471627 487220 489610 493388
4823D93388J4076J0557M252K41K6624N554J1355J1657o97J0967k191P610K436
4810E95829K0011p015J6707J1495L016J1994M474K9973k550J8555J3372L020J8806
4797G37687K6053P755K8085J6140K61L4909J3884N3580N129M1595R642K9619M2100
4784A046439M706L3015J305K3117J4590K7735K6549L4223J2486K4771K4055K3318
4772A296309M3226j253L7058N3002O4332N6261K2859Q713k0204O068j8154L2560
4760A580777J4540j1786k4385j7555j5907k6668K3379j3864j2105r581K2112j7799
4748A491158j0638K9699o495K9580q237L3059J8726L5734K1648J3816L1326K6992
4736A706368N1822L2378N4386M1951K2214O7421N0361M3726N8543O8139M1442
$$ plain form
4823 493388 507464 518021 522273 522514 549138 554692 566047 577704 577007 587974 585783 593393 595829
4810 595829 615840 608825 625532 637027 640043 652037 656511 686484 683934 702489 715861 718881 737687
4797 737687 763740 771495 799580 815720 815981 850890 864774 918354 923483 965078 974720 1004339 1046439
4784 1046439 1051145 1084160 1085465 1108582 1123172 1150907 1177456 1211679 1224165 1248936 1272991 1296309
4772 1296309 1339535 1338282 1375340 1428342 1492674 1548935 1571794 1580507 1560303 1566371 1548217 1580777
4760 1580777 1595317 1583531 1559146 1541591 1525684 1499016 1522395 1508531 1496426 1486845 1508957 1491158
4748 1491158 1480520 1510219 1503724 1533304 1525067 1558126 1576852 1612586 1634234 1648050 1679376 1706368
4736 1706368 1758190 1790568 1844954 1886905 1909119 1976540 2026901 2070627 2129170 2197309 2238751
4725B238751P9515N4655M0450Q2120M5420P6154N3727O0028M5508O1124N8765
4714B896217K2719P0355N7894P0742N7439O0035O6120N3373Q4440O6454R5205
4703C600993P2890P9702O0508Q0428O3224N8237R0453N5616O1929K5245L1072
4692D280297K5941J8729K2510k5148P86l2178N155l7733P24J6916j6293K0189
4680D279895j4941J5643J7580M6358R489L0560L5608N3796N3014L9307O7624J4644
4668D648577O6640J8571J6204L0869n78M8385O362J4789k4653Q75j0857k3208
4656D791976o956n016r619p967L4676N533J8576L3026L0952N2348N0319O9561
4644E057409O5517O6666O2574Q1187Q1552O7554O6771O1201O0107O1096M9419
$$ plain form
4725 2238751 2318266 2372921 2413371 2495491 2540911 2617065 2670792 2730820 2776328 2837452 2896217
4714 2896217 2918936 2989291 3047185 3117927 3175366 3235401 3301521 3354894 3439334 3505788 3600993
4703 3600993 3673883 3753585 3814093 3894521 3957745 4015982 4106435 4162051 4223980 4249225 4280297
4692 4280297 4306238 4324967 4347477 4322329 4323115 4290937 4296092 4258359 4259083 4275999 4259706 4279895
4680 4279895 4264954 4280597 4298177 4344535 4354024 4384584 4420192 4473988 4527002 4566309 4633933 4648577
4668 4648577 4715217 4733788 4749992 4780861 4780283 4828668 4835030 4849819 4825166 4826041 4815184 4791976
4656 4791976 4785020 4780004 4770385 4762418 4797094 4802627 4821203 4854229 4885181 4937529 4987848 5057409
4644 5057409 5122926 5189592 5252166 5333353 5414905 5482459 5549230 5610431 5670538 5731634 5781053
4633E781053L8649M4136L5011L0048L3883M0018J4279L7126M0227K3089N2200
4622F169719M2906L8735M1891N7993P6985O3604N8197O0390J1620J8191k057K101
4610F640275L3567k1153K348N667l7792p727n5629l5249k5225M718j2155m2687
4598F448958r542k8889n485j9799j6989k3310J5729l0902k4753n5985q2452r6971
4586F069610j08884q9676j05522q7811j23203j36882q9196r3333j01095r3039
4576E040969q2144p7545n0917o4677n5389n6769k7719n4686n7607o3664r8925
4565D350927j08841j03064q0287j24492j14387j25999j39067j10749j35610j23100
4555C185331r6855r3501q8100q9742o6624r2313q5469m2965p9979q3946m0932
$$ plain form
4633 5781053 5819702 5863838 5898849 5928897 5962780 6002798 6017077 6054203 6094430 6117519 6169719
4622 6169719 6212625 6251360 6293251 6351244 6428229 6491833 6550030 6610420 6622040 6640231 6638174 6640275
4610 6640275 6673842 6652689 6655037 6660704 6622912 6615185 6559556 6524307 6499082 6503800 6491645 6448958
4598 6448958 6439416 6410527 6405042 6385243 6368254 6344944 6360673 6329771 6305018 6249033 6166581 6069610
4586 6069610 5960726 5871050 5765528 5677717 5554514 5417632 5328436 5235103 5134008 5040969
4576 5040969 4958825 4881280 4830363 4765686 4710297 4653528 4625809 4571123 4513516 4449852 4350927
4565 4350927 4242086 4139022 4058735 3934243 3819856 3693857 3554790 3444041 3308431 3185331
4555 3185331 3088476 2994975 2906875 2817133 2750509 2658196 2572727 2529762 2449783 2365837 2324905
4544B324905p1007n4133n3733n7258o0834q1413k9797p1473n7031m2489m7286
4533A698451k5223l7651m8483o6089l5142m8752l1984m8506j8856m9334k4418
4522A264013p749n1884k0635k2254j6764o932k4877j8901j5791m516l4342k7709
4510A011659j9178l8484k1275j5578k605j7966l125j8006k5438k277L033j0167
4498H40593M737j9874l0441l176j4085l105k3217j6035N582j7421k707j0687p280
4485G02884K5026k4660K45j4k2354K612O127J9581j5562j3494Q189m121k3635
4472F60824K0559m993n585j5416j6620J5200q184P352j3027O238P717k4934P441
4459F36572J5366P005N066r95k4246o985N942K537p293o304J2766J849J6023j607
$$ plain form
4544 2324905 2253898 2199765 2146032 2088774 2027940 1946527 1916730 1845257 1788226 1745737 1698451
4533 1698451 1673228 1635577 1587094 1521005 1485863 1437111 1405127 1356621 1337765 1288431 1264013
4522 1264013 1256264 1204380 1183745 1161491 1144727 1137795 1112918 1094017 1078226 1073710 1039368 1011659
4510 1011659 992481 953997 932722 917144 914539 896573 893448 875442 850004 847727 850760 840593
4498 840593 845330 825456 795015 791839 777754 774649 751432 735397 740979 723558 720851 710164 702884
4485 702884 727910 703250 703495 703481 681127 683739 689866 709447 693885 680391 688580 684459 660824
4472 660824 681383 676390 670805 655389 638769 653969 645785 653137 640110 646348 654065 629131 636572
4459 636572 651938 658943 664009 663014 638768 631783 637725 640262 632969 626665 639431 641280 657303 655696
4445F55696r018Q022J8278j608K802j6644J5211J1802p122Q27j3737j4525L513
4432F53497J5554J7177R832J9467N817n887L535K7748J494J0768J4339J338L916
4419G78595j7836M5527N440q349J4500L69J14J1339K8392o99K2583J8163K9260
4406I27398O313K2200J3336p436L3792P97K826j3815K4671J0155n60J1557J8022
4393A049256L0897P639K3258J3668M3662k172k1497L1854k2082R311j4175J5052
4381A164671J300L606K0431j7170R788p285O060q932J5535k689p369J1076l1367
4368A157655K9882l2158k146k1778L02R604j9442J150k9625J6442k0122P371j9567
4355A077568L722n844j1819J4943l2379P078j6607p587j1780n523J4765j6669
$$ plain form
4445 655696 646678 654700 672978 671370 674172 657528 672739 684541 677419 678246 664509 649984 653497
4432 653497 669051 686228 696060 715527 721344 715457 718992 746740 748234 759002 773341 774679 778595
4419 778595 760759 806286 811726 803377 817877 818246 818360 829699 858091 857392 879975 898138 927398
4406 927398 933711 955911 969247 961811 995603 996400 999226 985411 1010082 1020237 1019677 1031234 1049256
4393 1049256 1080153 1087792 1111050 1124718 1168380 1166208 1144711 1176565 1154483 1163794 1149619 1164671
4381 1164671 1165971 1169577 1190008 1172838 1182626 1175341 1181401 1172469 1188004 1185315 1177946 1189022 1157655
4368 1157655 1187537 1155379 1153233 1131455 1131757 1141361 1121919 1123069 1093444 1109886 1089764 1097135 1077568
4355 1077568 1081290 1075446 1063627 1078570 1046191 1053269 1036662 1029075 1017295 1011772 1026537 1009868
4343A009868q479j5004K3920o094K499j4121P42J5080j6000N374k6169O419q941
4330I69094M335n158j9107K1103j3861r974o196J7023k966J4044R766N123K3462
4317A006688k0451K0158k1777l742M566j7238J5351P19p188m05j4822J8351J9932
4304A000142j8171N356Q816K7499m413J1357J7221P551n144J0077J2864j1165
4292A061990K861L039J2872J451K2228L6994q454O343j1462K4755P956J9476K2957
4279A203006Q765N072p162L0067k0430L8489K487J7394o018J4808M6940j0316
4267A323102L1164P511J4636N000N8124J1638J1661K0673k742L2522j0002L5584
4255A538871j8204K1444M5197R326M9339M815J5703J0779M4676K1881J7191K7557
$$ plain form
4343 1009868 1001389 986385 1010305 1004211 1006710 992589 993331 1008411 992411 997785 971616 978035 969094
4330 969094 973429 968271 949164 970267 956406 946432 940236 957259 954293 968337 978103 983226 1006688
4317 1006688 986237 1006395 984618 980876 985442 968204 983555 984274 977086 976681 961859 980210 1000142
4304 1000142 981971 987327 996143 1023642 1019229 1030586 1047807 1055358 1050214 1060291 1073155 1061990
4292 1061990 1064851 1067890 1080762 1082213 1104441 1141435 1132981 1139324 1127862 1152617 1160573 1180049 1203006
4279 1203006 1211771 1216843 1209681 1239748 1219318 1257807 1260294 1277688 1271670 1286478 1333418 1323102
4267 1323102 1354266 1361777 1376413 1381413 1439537 1451175 1462836 1483509 1480767 1513289 1503287 1538871
4255 1538871 1520667 1542111 1587308 1596634 1645973 1650788 1666491 1677270 1721946 1743827 1761018 1788575
4243A788575K1810L8226J3459L8462j6992M7367r74J7521L5014J5325K5571M108
4231B027472O5616K1085L8334J6852K2130P243J9173K4997J0884M9612J4125M3643
4219B361166K8679J3587M4462J2327L6955L2940L1279L6406N1154K6061L4549
4208B709565N1340K2439M0249L1342M6400L3142J8627M2172N5210N5412M7595
4197C153493M3690P3755M8079N2568P4407N7082R0081P8684P1060P1175Q8251
4186C902325P2375R1322Q7382Q3837Q9295R3779J22154R4343J25233R8641R0205
4175D950891P7927P3526J17767R4265J00972Q5761J31525P0581Q1471J16756J06178
4164F007620J56963J34530J57876J51973J57421J64619J84150J92549J97108K28547
$$ plain form
4243 1788575 1810385 1848611 1862070 1900532 1883540 1930907 1929933 1947454 1982468 1997793 2023364 2027472
4231 2027472 2093088 2114173 2152507 2169359 2191489 2198732 2217905 2242902 2253786 2303398 2317523 2361166
4219 2361166 2389845 2403432 2447894 2460221 2497176 2530116 2561395 2597801 2648955 2675016 2709565
4208 2709565 2760905 2783344 2823593 2854935 2901335 2934477 2953104 2995276 3050486 3105898 3153493
4197 3153493 3197183 3270938 3319017 3371585 3445992 3503074 3593155 3671839 3742899 3814074 3902325
4186 3902325 3974700 4066022 4153404 4237241 4326536 4420315 4542469 4636812 4762045 4860686 4950891
4175 4950891 5028818 5102344 5220111 5314376 5415348 5501109 5632634 5703215 5784686 5901442 6007620
4164 6007620 6164583 6299113 6456989 6608962 6766383 6931002 7115152 7307701 7504809 7733356
4154G733356K22801K31067K51750K46675K57574K60910K83691L01297L25364L09949
4144A0424434L60216L66585L92472M06366M26289M85152M47712N18629N37778
4135A4365633N52305O25287O19726O49389O92270P63835P65506Q11076Q65782
4126B0710809Q99002R65057J001828J079247J100759J173414J209782J256028
4118B9395926J296405J332335J417465J423013J465495J492107J557248J597365
4110D0977359J623278J641669J624649J703214J695361J729456J712282J672514
4102E4379782J714082J656364J637702J612907J546671J494883J453998J375088
4094F6871477J282337J244906J185689J122034J031013R61961Q39803P11145O21826
$$ plain form
4154 7733356 7956157 8187224 8438974 8685649 8943223 9204133 9487824 9789121 10114485 10424434
4144 10424434 10784650 11151235 11543707 11950073 12376362 12861514 13309226 13827855 14365633
4135 14365633 14917938 15543225 16162951 16812340 17504610 18268445 19033951 19845027 20710809
4126 20710809 21609811 22574868 23576696 24655943 25756702 26930116 28139898 29395926
4118 29395926 30692331 32024666 33442131 34865144 36330639 37822746 39379994 40977359
4110 40977359 42600637 44242306 45866955 47570169 49265530 50994986 52707268 54379782
4102 54379782 56093864 57750228 59387930 61000837 62547508 64042391 65496389 66871477
4094 66871477 68153814 69398720 70584409 71706443 72737456 73699417 74539220 75250365 75872191
4085G5872191M82345M11380K91858J87996O6298o3286j51668k77853l54887m44614
4075G6019760n48259o52853p33990q39492r10730r73384j077241j143852j199999
4066F7939960j246500j315536j338872j381468j419842j422800j456928j467244
4058E6890770j473951j487935j508375j498499j450857j483488j448269j430924
4050D5108472j399819j378299j359271j329521j294550j252798j250392j212958
4042C4630864j168859j132955j134465j054941j013778r92307r55088r08080q75126
4033B5395265q57316p98941p80015p71519p00333p18139o83791o24536n97957
4024A8862718n62105n45634n51769n28550m86892m55361m47118m13319l79555
$$ plain form
4085 75872191 76354536 76765916 77057774 77245770 77312068 77248782 77097114 76819261 76464374 76019760
4075 76019760 75471501 74818648 74084658 73245166 72334436 71361052 70283811 69139959 67939960
4066 67939960 66693460 65377924 64039052 62657584 61237742 59814942 58358014 56890770
4058 56890770 55416819 53928884 52420509 50922010 49471153 47987665 46539396 45108472
4050 45108472 43708653 42330354 40971083 39641562 38347012 37094214 35843822 34630864
4042 34630864 33462005 32329050 31194585 30139644 29125866 28133559 27178471 26270391 25395265
4033 25395265 24537949 23739008 22958993 22187474 21487141 20769002 20085211 19460675 18862718
4024 18862718 18300613 17754979 17203210 16674660 16187768 15732407 15285289 14871970 14492415
4015A4492415l83570l63115l17355l24074l14557k89496k79942k49726k30736
4006A1739844k35819k13604k08054j89657j89896j63188j62769j42326j18633
3997A0115898j40054j24169j01253q5884j14693q2084o8977n1770q0661o8533
3987I197820m9923p1269l1677m9566o1534l3656l0000j2518j1243j7765k7891
3976H800778p437o042J9623J2954O222Q866L230L2679m057M042L7838K0368K6311
3963H955375K0362K1842L1633K8075L3131J1528j314L3542k563R492J8258q797
3951I150564o004J4137q111j2198r542l7776k5257r543j9272m2360j2574p467
3939H974597k3114l5944k3567l5972j4256o113m4592j5526j2178j0385k6516N267
$$ plain form
4015 14492415 14108845 13745730 13428375 13104301 12789744 12500248 12220306 11970580 11739844
4006 11739844 11504025 11290421 11082367 10892710 10702814 10539626 10376857 10234531 10115898
3997 10115898 9975844 9851675 9750422 9664538 9549845 9467761 9398784 9347014 9266353 9197820
3987 9197820 9147897 9076628 9044951 8995385 8933851 8900195 8870195 8857677 8846434 8828669 8800778
3976 8800778 8793341 8787299 8806922 8819876 8826098 8834964 8838194 8870873 8866816 8870858 8908696 8929064 8955375
3963 8955375 8975737 8997579 9029212 9057287 9090418 9101946 9100632 9134174 9131611 9141103 9159361 9150564
3951 9150564 9144560 9158697 9150586 9138388 9128846 9091070 9065813 9056270 9036998 8994638 8982064 8974597
3939 8974597 8951483 8915539 8891972 8856000 8841744 8835631 8791039 8775513 8763335 8752950 8726434 8731701
3927H731701j3748j6065K2860k9754j8625j0237L3k2275j8070j2806k9838l190
3915H579986m8516k0416k8039j7755n5442n4614j0385n7251l1775q328k8443m3035
3903H175987r393k3501j6187j0731q635k7232k6234J6799l2330Q280J218j3058
3891H034983j6044j7311m243k3503K2535j0107Q307q069n930j8074k7701j1679
3879G923164k8668n715j5543l0856k2106k1913j7845M148j1989j9476k491p593
3867G743117J2448j0916L7336m979j3046L8761K6327K0068K9684M0904J4671N9288
3855G993663L8898L9221M6210N6808M5765N1406J06900J3943P5460P8373P4391
3844H621038Q1126O5987Q9334N3948P6263P2356J04194Q8103Q8144J02729J13296
$$ plain form
3927 8731701 8717953 8701888 8724748 8694994 8676369 8666132 8666165 8643890 8625820 8613014 8583176 8579986
3915 8579986 8531470 8511054 8483015 8465260 8409818 8355204 8344819 8287568 8255793 8247465 8219022 8175987
3903 8175987 8166594 8143093 8126906 8116175 8107540 8080308 8054074 8070873 8038543 8046823 8048041 8034983
3891 8034983 8018939 8001628 7997385 7973882 7996417 7986310 7994617 7986548 7980618 7962544 7934843 7923164
3879 7923164 7894496 7888781 7873238 7842382 7820276 7798363 7780518 7784666 7772677 7753201 7750710 7743117
3867 7743117 7755565 7744649 7781985 7777006 7763960 7802721 7829048 7849116 7878800 7919704 7934375 7993663
3855 7993663 8032561 8071782 8117992 8174800 8220565 8271971 8378871 8392814 8468274 8546647 8621038
3844 8621038 8702164 8768151 8857485 8911433 8987696 9060052 9164246 9252349 9340493 9443222 9556518
3833I556518J20536Q1207J17904J25619J07276J19977J40643J32105J06282J49896
3823A0757963J36803J54476J65550J67495J62404J99127J90718J89032K04845
3814A2328413K02871K29247K11998K33221K42041K34550K58594K57065K33540
3805A4431540K69864K76534K84379L15911L29566L40721L69766L75453L89644
3796A7383378M30717M28921M53000M44070N13377N18213N30809N97712O15969
3787B1916166O23533O61936O94131O88930P56875P94257Q00920Q58543Q97674
3778B8692965R09611R18544R79418R70588J000152J040995J042551J064808J073090
3769C7692722J102016J082173J124965J113028J119298J125193J118744J109737
$$ plain form
3833 9556518 9677054 9758261 9876165 10001784 10109060 10229037 10369680 10501785 10608067 10757963
3823 10757963 10894766 11049242 11214792 11382287 11544691 11743818 11934536 12123568 12328413
3814 12328413 12531284 12760531 12972529 13205750 13447791 13682341 13940935 14198000 14431540
3805 14431540 14701404 14977938 15262317 15578228 15907794 16248515 16618281 16993734 17383378
3796 17383378 17814095 18243016 18696016 19140086 19653463 20171676 20702485 21300197 21916166
3787 21916166 22539699 23201635 23895766 24584696 25341571 26135828 26936748 27795291 28692965
3778 28692965 29602576 30521120 31500538 32471126 33471278 34512273 35554824 36619632 37692722
3769 37692722 38794738 39876911 41001876 42114904 43234202 44359395 45478139 46587876
3761D6587876J111506J112023J089416J098249J106845J087973J132294J142236
3753E5468418J158213J224974J279198J344810J390923J490634J574447J642198
3745F6573815J773021J881864J993741K142579K304686K475077K648544K899208
3737H4692535L136514L417078L763848M101419M479583M932511N415688N883090
3729A19822266O447432O979851P520935Q070954Q522652Q869020Q933426Q665837
3721A83832373P901622O670227N025627L137023J346086o9956r43444j270296
3713B05629262j176494r42176n54672j14073K44675O17591R70865J355488J641182
3704B07671648J942050K198452K390104K671846K898653L126899L353043L614290
$$ plain form
3761 46587876 47699382 48811405 49900821 50999070 52105915 53193888 54326182 55468418
3753 55468418 56626631 57851605 59130803 60475613 61866536 63357170 64931617 66573815
3745 66573815 68346836 70228700 72222441 74365020 76669706 79144783 81793327 84692535
3737 84692535 87829049 91246127 95009975 99111394 103590977 108523488 113939176 119822266
3729 119822266 126269698 133249549 140770484 148841438 157364090 166233110 175166536 183832373
3721 183832373 191733995 198404222 203429849 206566872 207912958 207843002 206899558 205629262
3713 205629262 204452768 203510592 202955920 202841847 203086522 203704113 204674978 206030466 207671648
3704 207671648 209613698 211812150 214202254 216874100 219772753 222899652 226252695 229866985
3696B29866985L887335M215508M530706M765023M953074N086791N286120N406180
3688B67997722N549606N667472N631059N550087N346862N119982M699765M221424
3680C09783979L587965K823962J994565J269468O52358L5926n95531j347069j969256
3671C16236367k598842l000488l247488l689906m311031n093641n849130o506250
3663B81939591o921028p313738p764196q169786q525201q697695q827376q715970
3655B17004601q608044q421766q117477p829050p455084p109515o683104o343689
3647A56436872n975426n660053n422846n162236m958607m759931m667949m516240
3639A15313584m443324m355443m180138m030608l797907l630864l380955l237955
$$ plain form
3696 229866985 233754320 237969828 242500534 247265557 252218631 257305422 262591542 267997722
3688 267997722 273547328 279214800 284845859 290395946 295742808 300862790 305562555 309783979
3680 309783979 313371944 316195906 318190471 319459939 320112297 320148223 319552692 318205623 316236367
3671 316236367 313637525 310637037 307389549 303699643 299388612 294294971 288445841 281939591
3663 281939591 275018563 267704825 259940629 251770843 243245642 234547947 225720571 217004601
3655 217004601 208396557 199974791 191857314 184028264 176573180 169463665 162780561 156436872
3647 156436872 150461446 144801393 139378547 134216311 129257704 124497773 119829824 115313584
3639 115313584 110870260 106514817 102334679 98304071 94506164 90875300 87494345 84256390
3631H4256390k999561k783569k652342k423001k332110k229766k166240k049395
3623F4620406k015825j934676j828798j820797j750438j698804j610290j580403
3615E0380375j486263j459965j444441j343670j357228j243509j226413j175613
3607C9643273j197428j147315j093062j076125j013790j024711r37843r36426
3599C1216573q77209r00607q47632p72021q06565p42445p24555o70714o98422
3590B4176403o40982o16597o05581n60802n72567n65335n43192m77110n13061
3581A9081176m69296m34869m48980m29629m28522m04958l95270l42729l31739
3572A5395184l50196l39547k88044l11767k86369k38361k86537k43099k30858
$$ plain form
3631 84256390 81256829 78473260 75820918 73397917 71065807 68836041 66669801 64620406
3623 64620406 62604581 60669905 58841107 57020310 55269872 53571068 51960778 50380375
3615 50380375 48894112 47434147 45989706 44646036 43288808 42045299 40818886 39643273
3607 39643273 38445845 37298530 36205468 35129343 34115553 33090842 32152999 31216573
3599 31216573 30339364 29438757 28591125 27819104 27012539 26270094 25545539 24874825 24176403
3590 24176403 23535421 22918824 22313243 21752441 21179874 20614539 20071347 19594237 19081176
3581 19081176 18611880 18177011 17728031 17298402 16869880 16464922 16069652 15726923 15395184
3572 15395184 15044988 14705441 14417397 14105630 13819261 13580900 13294363 13051264 12820406
3563A2820406k12625k30039j84314j87832j85123j71401j62504j57669j33328
3554A1195571j12372j37711p0781n9237m5518l1214m3853J241J9802P7807O9504
3543A0863239J05544J27958J68815J79167K17691K53182K45289L08881K81145
3534A2750911L38369L34223L65891L69121L89768M29101L51980L63533L35574
3525A6028471L28960K62901K48219J93580J47735J57555P3541M9967K3256J1917
3515A7526102n5552p5815r5634j46113j77716k45249k68651k94413l06445l41423
3505A5519091l58563l65078l98538l69751m10503l64775l87418l76261l73603
3496A2114601l74505l13494l32284l08015l02083k74845k90207k70925k61714
$$ plain form
3563 12820406 12607781 12377742 12193428 12005596 11820473 11649072 11486568 11328899 11195571
3554 11195571 11083199 10945488 10874707 10815470 10769952 10738738 10694885 10696126 10715928 10793735 10863239
3543 10863239 10968783 11096741 11265556 11444723 11662414 11915596 12160885 12469766 12750911
3534 12750911 13089280 13423503 13789394 14158515 14548283 14977384 15329364 15692897 16028471
3525 16028471 16357431 16620332 16868551 17062131 17209866 17367421 17440962 17490929 17514185 17526102
3515 17526102 17470550 17394735 17299101 17152988 16975272 16730023 16461372 16166959 15860514 15519091
3505 15519091 15160528 14795450 14396912 14027161 13616658 13251883 12864465 12488204 12114601
3496 12114601 11740096 11426602 11094318 10786303 10484220 10209375 9919168 9648243 9386529
3487I386529k55504k36089k53280k35973k57830k02857k02987k31541j89317k12051
3477G109100j85567j72948j49860j82579j30601j46895j51603j00263j36607j08741
3467E643436j16413o8267j13935q5490o0592r7465p2834o6946o6248r4865l7863
3456D762518n6483n7066l4779m9405l5821m3505j3922p1441l8384k1104n3532
3445D287076k2002j2912l044l3406j1466j7348j9746M254q772j2897M661J1928
3433D166326r130J9321r639l231L5353K169K6389O012M2764L1032L2356M1539
3421D381261J1933M5269R631L4781K6537M7172L1350L8302N8802O717L3449M0786
3409D765990O2066K8116N3056O8605M2952O7295N5204O1271M6766J20367P1654
$$ plain form
3487 9386529 9131025 8894936 8641656 8405683 8147853 7944996 7742009 7510468 7321151 7109100
3477 7109100 6923533 6750585 6600725 6418146 6287545 6140650 5989047 5888784 5752177 5643436
3467 5643436 5527023 5458756 5344821 5259331 5198739 5101274 5028440 4961494 4895246 4800381 4762518
3456 4762518 4706035 4648969 4614190 4564785 4528964 4485459 4471537 4400096 4361712 4340608 4287076
3445 4287076 4265074 4252162 4249118 4215712 4204246 4186898 4167152 4171406 4162634 4149737 4154398 4166326
3433 4166326 4157196 4176517 4166878 4163647 4199000 4201169 4227558 4233570 4276334 4307366 4339722 4381261
3421 4381261 4393194 4438463 4448094 4482875 4509412 4556584 4587934 4626236 4685038 4691755 4725204 4765990
3409 4765990 4828056 4856172 4909228 4977833 5020785 5088080 5143284 5204555 5251321 5371688 5443342
3398E443342M5498J04017N9194Q0783Q2861J08297Q9285Q3969J15840R4425J11004
3387F418515J12510J35314R8641J42405J47911J49224J39926J49947J82781J36690
3377G813864J77066J31653J69703J40716J01159J42821P3941J08000M6502L4487
3367H939912p772m2139l8506q7442q0985q4636r0981j43325j17962j54002j26337
3356G965825j27185j53930j13109j00460q1590r0275p5652j07027j06894j18915
3346F890788j22630j00909j05948n0024j09025j27852j19310j19399j08821q0184
3336E846686r9567p9949p3693o7341p0377p6635l2064o5430n2966k177m4782m7461
3324E134244n2023n5700k7860j8594p805J1264K5511p2531j02323n2394m1496
$$ plain form
3398 5443342 5488840 5592857 5652051 5732834 5815695 5923992 6013277 6097246 6213086 6307511 6418515
3387 6418515 6531025 6666339 6764980 6907385 7055296 7204520 7344446 7494393 7677174 7813864
3377 7813864 7990930 8122583 8292286 8433002 8534161 8676982 8750923 8858923 8905425 8939912
3367 8939912 8932140 8890001 8851495 8764053 8683068 8598432 8507451 8364126 8246164 8092162 7965825
3356 7965825 7838640 7684710 7571601 7471141 7389551 7299276 7223624 7116597 7009703 6890788
3346 6890788 6768158 6667249 6561301 6511277 6402252 6274400 6155090 6035691 5926870 5846686
3336 5846686 5747119 5667170 5593477 5526136 5455759 5379124 5347060 5281630 5228664 5226487 5181705 5134244
3324 5134244 5082221 5026521 4998661 4980067 4972262 4983526 5009037 4936506 4834183 4781789 4740293
3313D740293n3088M7062j7709q5243j11530j20146p5427p7173l1227n5751p5735
3302D084326n5660o3390p4219o8896n4947l0482J6237J664k0485k5138k2542m4816
3290C641652m4829j116j7340J4513Q523r133r636o2363q2379q1595m1537m7756
3278C267004o1963k7220p3974o2947q9404m6933q9448o4037m1466n5670k6749
3267B627193m7427l9429o4636k2076m7409k5819k5778l6362k693m2844l1907p8917
3255B161896j6984k5202n1130j8146q3271j6809l8083k7833m4237l3408l8363
3244A768430l1895j8331k0755J5127l0683M462m8282j2702q351l6798n164l6948
3232A538110J2178l6450j4557j8983j2729q521k7846J4466j8511j4609m4197o4
$$ plain form
3313 4740293 4687205 4734267 4716558 4631315 4519785 4399639 4324212 4247039 4215812 4160061 4084326
3302 4084326 4028666 3965276 3891057 3822161 3767214 3736732 3752969 3754633 3734148 3709010 3686468 3641652
3290 3641652 3596823 3595707 3578367 3592880 3601403 3592270 3582634 3520271 3437892 3356297 3314760 3267004
3278 3267004 3205041 3177821 3103847 3040900 2951496 2904563 2815115 2751078 2709612 2653942 2627193
3267 2627193 2579766 2540337 2475701 2453625 2406216 2380397 2354619 2318257 2315564 2272720 2240813 2161896
3255 2161896 2144912 2119710 2068580 2050434 1967163 1950354 1912271 1884438 1840201 1806793 1768430
3244 1768430 1736535 1718204 1697449 1712576 1681893 1686355 1638073 1625371 1617020 1580222 1575058 1538110
3232 1538110 1550288 1513838 1499281 1480298 1467569 1459048 1431202 1445668 1427157 1412548 1368351 1368287
3220A368287j5485k7873k464l9060j227k5791L631m3770q906K60j4439j9862k9777
3207A143524J8667k1277R014k7057j8225j0782k1023J2881j9475p844k2193r352
3195A026858q645m787j0733j4334K147J967M082l7096N175O546j8033r66j0937
3182I41244J2705k0349n469N287k4504k0934k742n857r193J9333k3754j0104j1459
3169H44204Q170r834j2106J4084k2639p19q866j1985j1939J767k2505j3523J073
3156G55182p544R765j3567J3805j4878m759m325k2287R091j7060j154m131o332
3143F91806n550J147r247j9967J8096J1923O904k4135N302k920n323J0540p579
3130F70997K342P946O482J279J7291j3966j816M236J345p752l699R649j6117J544
$$ plain form
3220 1368287 1352802 1324929 1322465 1283405 1282178 1256387 1260018 1216248 1207342 1207602 1193163 1173301 1143524
3207 1143524 1162191 1140914 1149928 1122871 1104646 1093864 1072841 1085722 1066247 1058403 1036210 1026858
3195 1026858 1018213 1013426 1002693 988359 990506 992473 996555 959459 964634 971180 953147 952181 941244
3182 941244 953949 933600 928131 933418 908914 887980 885238 879381 870188 889521 865767 855663 844204
3169 844204 852374 842540 830434 844518 821879 821160 812294 800309 788370 790137 767632 754109 755182
3156 755182 747638 757403 743836 757641 742763 738004 733679 711392 720483 703423 702269 698138 691806
3143 691806 686256 687403 678156 658189 676285 688208 695112 670977 676279 673359 668036 678576 670997
3130 670997 673339 681285 687767 689046 706337 692371 690555 694791 696136 688384 684685 694334 678217 679761
3116F79761J4081J0072p538j002k110J9349L994r188J0862J848J9021o436P10
3103G33424k009p476J1134J9926O966J428K5035l5706J5616k56P219K1352j7561
3090G79092K8823j5084K0144Q667J879L9465L385K3348K341Q817K0317K289J2011
3077I35494L2035J98L4402L983O458M2743j1090K5858L3846K0788J3022K0451
3065A158188N3518J3594K5612L4796J0970M9855K9985J9514L1361L4591K0843
3054A482827L682J6703M1154M0633K6015J2860L3359L7612J7659M1489L0554M2823
3042A827370K7428M0185N9997K4935N4627O0837M5432M6873M9738O6780L9157
3031B343359L6810N9806J4330O6905L1168R920K5052K5898n303J1779j8400P975
$$ plain form
3116 679761 693842 703914 696376 695374 693264 712613 716607 707419 718281 720129 739150 732714 733424
3103 733424 731415 723939 735073 754999 761965 763393 788428 752722 768338 768082 775301 796653 779092
3090 779092 807915 792831 812975 821642 823521 862986 866371 889719 892060 900877 921194 923483 935494
3077 935494 967529 967727 1002129 1006112 1012570 1055313 1044223 1070081 1103927 1124715 1137737 1158188
3065 1158188 1211706 1225300 1250912 1285708 1296678 1346533 1376518 1396032 1427393 1461984 1482827
3054 1482827 1486509 1503212 1544366 1584999 1611014 1623874 1657233 1694845 1712504 1753993 1784547 1827370
3042 1827370 1854798 1894983 1954980 1979915 2034542 2095379 2140811 2187684 2237422 2304202 2343359
3031 2343359 2380169 2439975 2454305 2521210 2552378 2562298 2587350 2613248 2607945 2619724 2601324 2609299
3019B609299j21j1361J7203j3636L5652p449J0217L3799K4000M0864J2570L9392
3007B790429L2175K4954K3959L1548L9434P282j3709j0281O413j9188J2560l3932
2995B891644k2178k6391k9301l0571m8283k2998k3785k3819l6250k2189l7934
2984B567945j7661j5914k4547k4064j2114j7579l6424j4091l5060l8265k8911
2973B303315k8516l8692m1379l3258p6071l8167o2701o5474l6784o1647n6841
2962A763785m8048m4091l3262m5429o3842k0629n2610k2378m6879j9074j8432
2951A349111n0607k0075m9645l3824l6751l3245l3882l4971l8929k4489k5812
2940I66881k9107j3371k7769j0789l1157l2245k0819r851k1152k1702j5790l5934
$$ plain form
3019 2609299 2609178 2597817 2615020 2601384 2637036 2629587 2639804 2673603 2697603 2738467 2751037 2790429
3007 2790429 2822604 2847558 2871517 2903065 2942499 2949781 2936072 2925791 2932204 2913016 2925576 2891644
2995 2891644 2869466 2843075 2813774 2783203 2734920 2711922 2688137 2664318 2628068 2605879 2567945
2984 2567945 2550284 2534370 2509823 2485759 2473645 2456066 2419642 2405551 2370491 2332226 2303315
2973 2303315 2274799 2236107 2194728 2161470 2085399 2047232 1984531 1919057 1882273 1820626 1763785
2962 1763785 1715737 1671646 1638384 1592955 1529113 1508484 1455874 1433496 1386617 1367543 1349111
2951 1349111 1298504 1278429 1228784 1194960 1158209 1124964 1091082 1056111 1017182 992693 966881
2940 966881 937774 924403 896634 885845 854688 822443 801624 791773 770621 748919 733129 697195
2928F97195j4449j9257j0164j6311j2756j7490j2928P753j0082k9568j7790j4779
2916E29374l1087J4836j94k6914J3522j8139j0591k2181j2053O297k1681r011
2904D12178l738j4057m53j0373j4796p464J966q062l4857J2007R132J974p171
2891C36286r578j4112q648q879j9068l317L480K199k7927Q412K351m371J2098
2878B68926k0740Q714j7808J2869j9445q26q876j3736J1221j0424P269l3673J7090
2865B00561q763q584K0547r29j2437o511Q526o209Q297j6353o108l793j9194O968
2851A56018M242K683k5226n37J821r230J4203P415J4842k1614P38J6600j5973
2838A45982J328j7392l781j3535K127J3524r516m777Q244M104o537J0815p585
$$ plain form
2928 697195 682746 663489 653325 637014 624258 606768 593840 601593 591511 561943 544153 529374
2916 529374 498287 513123 512929 486015 499537 481398 470807 448626 436573 442870 421189 412178
2904 412178 408440 394383 393930 383557 368761 361297 363263 355201 320344 332351 341483 343457 336286
2891 336286 326708 312596 303948 295069 276001 272684 276164 278363 250436 258848 261199 256828 268926
2878 268926 248186 256900 239092 251961 232516 231690 222814 209078 220299 209875 217144 183471 200561
2865 200561 191798 183214 203761 202832 190395 183884 192410 186201 194498 178145 172037 168244 149050 156018
2851 156018 160260 162943 137717 137180 139001 129771 143974 151389 166231 144617 145355 161955 145982
2838 145982 147310 129918 126137 112602 114729 128253 118737 113960 122204 126308 119771 130586 123001
2825A23001l072N978j337j1354l41r233l098J5780k0526Q39J0691j5289J1647
2812A03686K631n87m294N105J0270L47Q064k5670j3149Q774q289M315K5147q745
2798A07605j6012r381l585Q203J436J1378j4508J314J5171j2848J6398j1663R727
2785A03235k3181k244M029o705R582q626J2809m583j2295j9290J4608m312J9643
2772H2670k733r64l081j4531K5172j1005L957M344j0489k338p390K316M564k0856
2758D9636Q077L5308k154J1053k4302l184q767M164K2234k0289J6780j1845M057
2745H0768k958o781M211o553l044Q534M853N123M450j2074j1039P072J722m671
2731F9613j8761R207r748J658Q986j4122N330Q26J3613j4417M209K2375j4882
$$ plain form
2825 123001 119929 125907 124570 113216 112875 103642 100544 116324 95798 96637 107328 92039 103686
2812 103686 106317 105730 101436 106541 116811 117158 125222 99552 86403 95177 86888 91203 116350 107605
2798 107605 91593 82212 78627 86830 88266 99644 85136 86450 101621 88773 105171 93508 103235
2785 103235 80054 77810 81839 75134 84716 76090 88899 84316 72021 52731 67339 63027 82670
2772 82670 79937 78973 75892 61361 86533 75528 79485 83829 73340 71002 63612 65928 70492 49636
2758 49636 57713 93021 90867 101920 77618 74434 65667 69831 92065 71776 88556 76711 80768
2745 80768 77810 71029 75240 68687 65643 74177 79030 84153 88603 76529 65490 72562 74284 69613
2731 69613 50852 60059 50311 51969 60955 46833 52163 52989 66602 52185 56394 78769 63887
2718F3887J2369j0149l880M127j4377K1076p295j2207k492r721J460J0185k307
2705E0676O874o597K252P73k9177K755J9420R906k913j2376J0304k1602N559P069
2691D2923M282m459q241J1551n58J7770j4195r940N757J0092p513m247J2103m236
2677E1089m014k2955K4628j5508r946P374j2915K662j0265J8604K378J522N287
2664C7941j2375l199J2440J0340j9758J999n495P380j5046k0098M80Q984J0983
2651A4576k596K40j8655J8553Q044p600K1630p825j3941l46L361J8994j0608l780
2637B0047r958m694N819J517r327Q396q81j1767M483O048K234J5905p256l440
2623A7126k1450O829m452p62L68n104O577j6057J2709J3190Q318j6107R167N586
$$ plain form
2718 63887 76256 66107 62227 66354 51977 73053 65758 53551 51059 41338 42798 52983 50676
2705 50676 57550 50953 53205 53978 24801 27556 46976 56882 53969 41593 51897 30295 35854 42923
2691 42923 47205 42746 34505 46056 45498 63268 49073 39133 44890 54982 47469 43222 55325 51089
2677 51089 47075 24120 48748 33240 23294 30668 17753 20415 10150 28754 31132 32654 37941
2664 37941 25566 22367 34807 45147 25389 27388 21893 29273 14227 -5871 -5391 3593 14576
2651 14576 11980 12220 -6435 12118 20162 12562 34192 26367 12426 12080 15441 34435 23827 20047
2637 20047 10089 5395 11214 12731 3404 11800 10919 -848 3635 9683 11917 27822 20566 17126
2623 17126 -4324 2505 -1947 -2709 -2341 -7445 -868 -16925 -4216 8974 17292 1185 10352 15938
2609A5938R862J319j4434M773j0909L125k4942j373n472j486K4456p255J068j4301
2595a9631J7773l234J2673k0110n469P239j4026K3250j412Q305n908k708j0064
2582a3322N725j627k250K2200j6178J907k0628J2395K0834P74P585o378m892j8844
2568a2699J7461O719Q206m264j3698R472k5032L5571j6728l626N816r767K2067
2555A9498n588Q89j700q642j11o733j7694J5903j3781J1227J0038j6027K1620
2542H899j6005q803M508K9K6355k3938o953q894k874K0070R13r66N814q4j2837
2527a4766k8121J6442R633M068K6524j4316m357k426n948M009j0308P453K466
2514i647K219J402j8856n090J2166P619j63Q126o077R52p43M742o140J7573Q191
$$ plain form
2609 15938 25800 27119 12685 17458 6549 9674 -15268 -16641 -22113 -23599 857 -6398 -5330 -19631
2595 -19631 -1858 -5092 7581 -12529 -17998 -10759 -24785 -1535 -2947 5358 -550 -3258 -13322
2582 -13322 -7597 -9224 -11474 10726 -5452 -3545 -24173 -11778 9056 9830 17415 11037 6145 -12699
2568 -12699 4762 11481 19687 15423 1725 11197 -13835 21736 5008 1382 7198 -2569 19498
2555 19498 13910 14799 13099 4457 4346 -2387 -20081 -4178 -17959 -6732 3306 -12721 8899
2542 8899 -7106 -15909 -11401 -11372 14983 -8955 -15908 -24802 -27676 -7606 -6693 -7659 -1845 -1929 -14766
2527 -14766 -42887 -26445 -16812 -12744 13780 -536 -4893 -7319 -13267 -9258 -19566 -12113 -9647
2514 -9647 -7428 -6026 -24882 -29972 -17806 -10187 -10350 -2224 -8301 -7349 -8092 -3350 -9490 8083 16274
2499A6274r493J2346k9010K179q128N957j6295j3997K7409q691J4441m51n697
2486a3156J1167M079k098j0753R712R164J8547k8703M699k1089Q689J1386l0410
2473b8766K8664k4335J5756o481N102Q177k5659J3903k7605J4938K39J0208o955
2460b2814J2660J960K207K9421l1317l723j8788K4539j9807J6325J3330k4433
2448b0440O584K495O157j745J708M265k0368J1698n428j5715q128p393K1435J7024
2434g851K475K751p999J2702o313j5853j799p578J384J1897O82p15p277j5544
2420c9038J931M649K1042j7948J9184K249p264K9406l3255J847p571K3811n28
2407a485l150K713k7351J2165P736o976j7227K4185K179N859j4703j8319J7160
$$ plain form
2499 16274 6781 19127 -9883 -7704 -15832 -9875 -26170 -40167 -12758 -21449 -7008 -7459 -13156
2486 -13156 -1989 2090 -8 -10761 -1049 8115 26662 -2041 2658 -18431 -9742 1644 -28766
2473 -28766 -102 -24437 -8681 -15162 -10060 -1883 -27542 -13639 -41244 -26306 -26067 -15859 -22814
2460 -22814 -10154 -8194 -5987 23434 -7883 -11606 -30394 -5855 -25662 -9337 3993 -20440
2448 -20440 -13856 -11361 -5204 -6949 -5241 -976 -21344 -9646 -15074 -30789 -38917 -46310 -24875 -7851
2434 -7851 -5376 -2625 -10624 2078 -4235 -20088 -21887 -29465 -28081 -16184 -15502 -16217 -23494 -39038
2420 -39038 -37107 -32458 -11416 -29364 -10180 -7931 -15195 14211 -19044 -17197 -24768 -957 -1485
2407 -1485 -4635 -1922 -29273 -17108 -9372 -16348 -33575 -9390 -7211 -1352 -16055 -34374 -17214
2394a7214j2938J1087k5823J1026K2385j8078Q464j0669K3430j1821Q317l604
2382a5438l769J4320j2841L398n752J709j7294K5143r316q27K555M350K137j6646
2368b8271L3016k0103R320o254j9276R403J5041R97p525K332l669n317K946J1954
2354e406K497J4215P15j6807M280j2312L183k3021K8108n146j5216L1957l0796
2341b3749l22J1199J388k063L380j9651m719L2007k865n370o24K6328k5163J5064
2327D840n798o409J0120j6133J6989j4568R816j3773o211J2591j346J4740J351
2314F209J9080j0260O220j6726R036J2796r226n46j2436K1555k2113J7755N96
2301B1940O75m009N557Q717r105O514j1882N378J7241J957n826k482L4958k8834
$$ plain form
2394 -17214 -30152 -19065 -44888 -33862 -11477 -29555 -21091 -31760 -8330 -20151 -11834 -15438
2382 -15438 -19207 -4887 -17728 -14330 -20082 -18373 -35667 -10524 -19840 -20667 -18112 -13762 -11625 -28271
2368 -28271 4745 -15358 -6038 -12292 -31568 -22165 -7124 -6127 -13652 -11320 -14989 -20306 -17360 -5406
2354 -5406 -2909 11306 12021 -4786 -506 -12818 -9635 -32656 -4548 -9694 -24910 7047 -23749
2341 -23749 -24071 -12872 -11484 -13547 -10167 -29818 -34537 -2530 -5395 -10765 -11389 14939 -10224 4840
2327 4840 -958 -7367 2753 -13380 3609 -10959 -1143 -14916 -21127 -8536 -9882 4858 6209
2314 6209 25289 15029 21249 4523 13559 26355 17129 16583 4147 25702 3589 21344 21940
2301 21940 22615 18606 24163 32880 23775 30289 18407 23785 41026 42983 37157 34675 69633 40799
2287D0799M209Q574M211j7436J5957q804L822M5982j9873J5410j1848K3158p22
2274A03439M718J1069q869P101M658r311k4349L0562Q31J3417J1013k856k731
2261A38692j046J723k364L8304R266K4545J1966L421l525J3184L6894m774J7027
2248B83313J9681J5126K8849M1353K0549L4533N1857L9437N6252O2604R9229O9033
2236H21816P4914K2846J7022O1950Q5527J13915J58126L6682j11790m5434m6787
2225A188787l0123N0157M8685j00468j34254p7578q3565o5873k0822k4422m0827
2214G09697m3257m1630m7107j5471j9939k4993k0682o294k0453l3938r096k6263
2202D00574j9225j4986l9811k6675l5041l2970o708j1337n072k1661o029p435
$$ plain form
2287 40799 45008 53582 57793 40357 56314 47510 51332 97314 77441 92851 81003 104161 103439
2274 103439 108157 119226 110357 117458 122116 112805 88456 119018 119849 133266 144279 141423 138692
2261 138692 137646 139369 137005 175309 184575 209120 221086 224507 220982 234166 271060 266286 283313
2248 283313 302994 318120 346969 388322 408871 443404 495261 534698 590950 653554 752783 821816
2236 821816 896730 919576 936598 998548 1084075 1197990 1356116 1392798 1281008 1235574 1188787
2225 1188787 1158664 1208821 1257506 1157038 1022784 945206 861641 795768 774946 750524 709697
2214 709697 666440 624810 577703 562232 542293 517300 496618 490324 469871 435933 426837 400574
2202 400574 381349 366363 326552 299877 264836 231866 225158 213821 208749 187088 181059 173624
2190A73624j6680k546j2218L799r17n692o508j714j2878k0233k2331J3026J1051
2177I9783k9349K2862l0941Q83J6659j0652k459j4484J2650j2552j4661P292r733
2164C5298J0287N795p512l744J5384j9405j6963r951J5730o891J0049R445k1399
2151A6123O706j1867k464K4623r203K682k4629J7610j7460n441K1754m1179J7010
2138e735J0704R430j6982J6082j323p341K302J5040k1061o381L4383j1300Q864
2125B6682P30k3216n771j5590J5814j1346J412J4339P035J152o959l666J4808
2112A5424O74k1805j024O072j0223k071J3213j407q88K5650k7995k692M391J1849
2098I168k2742j2301p556R599K5094K192J1346j6549J3994k0786Q822j8654Q796
$$ plain form
2190 173624 156944 154398 142180 145979 145062 139370 132862 131148 118270 98037 75706 88732 99783
2177 99783 70434 93296 62355 63238 79897 69245 66786 52302 64952 52400 37739 45031 35298
2164 35298 45585 51380 43868 40124 55508 36103 19140 9189 24919 18028 28077 37522 16123
2151 16123 22829 10962 8498 33121 23918 26600 1971 19581 2121 -3320 18434 -22745 -5735
2138 -5735 4969 14399 -2583 13499 12176 4835 7137 22177 1116 -5265 29118 17818 26682
2125 26682 27412 4196 -1575 -17165 -1351 -12697 -11285 3054 10089 11241 4282 616 15424
2112 15424 16098 -5707 -6731 -659 -10882 -12953 260 -1147 -2035 23615 -4380 -7072 -2681 9168
2098 9168 -13574 -25875 -33431 -23832 1262 3454 14800 -1749 12245 -8541 281 -18373 -9577
2085i577K1629L100n462j4885J9993k5736P913J2023q794P801j670o212j4626
2072a4503J6552l055L490m767N806L711j3895l936j3093J9314p784k442J3501
2059a101J5202N99k2170J4106k0341o810k3407J2852n398J3857j152r875J2275
2046b1363m276K2011Q040n175J3J4125O650k3381j8956O554O195r74M993j1698
2032a7242p251J0733J7108j7292j5556K3734k3252J1957n483L300K1753P012k1637
2019a2116Q256P009q921l991j7761J8595j6336L725K594o679J0602k0060R217
2006b5866R760N475j3306K085J5368r839N393J6870k261j8694J7116k3568P193
1993a4274J3725j0161L197L740K8150k7443J9285j656j3430q948j407P255n872
$$ plain form
2085 -9577 12052 15152 9690 -5195 14798 -10938 -3025 8998 204 8005 6335 123 -14503
2072 -14503 2049 -1006 2484 -2283 3523 7234 -6661 -10597 -23690 -4376 -12160 -14602 -1101
2059 -1101 14101 14700 -7470 6636 -13705 -20515 -43922 -31070 -36468 -22611 -23763 -33638 -21363
2046 -21363 -25639 -3628 4412 -763 -750 13375 20025 -3356 -22312 -15758 -9563 -10537 -5544 -17242
2032 -17242 -24493 -13760 3348 -13944 -29500 -5766 -29018 -17061 -22544 -19244 2509 9521 -12116
2019 -12116 -3860 3149 -5772 -9763 -27524 -8929 -25265 -21540 -18946 -25625 -15023 -35083 -25866
2006 -25866 -16106 -10631 -23937 -21852 -6484 -16323 -10930 5940 3679 -15015 2101 -21467 -14274
1993 -14274 -549 -10710 -7513 -3773 24377 -3066 16219 14563 1133 -7815 -9222 -1967 -7839
1980g839K449k1499J6045N441N979j3021N34K012q290K6447j6320J8358j2458
1967b162p697P384m76K2588l1913J5137r973o261J5404j3319P353j0727J4522
1954a40j446O579l230K324M511K983J1538l5118P302r177N718q901k402J1351
1940h108l194P676k5339p386J8824L795j731P393l666k146N056k740p650P502
1926a1714k256j9076P280J9105j9173J0599M813j345j0964J4420J675j3749L6249
1913A5864q677q783J0469o1k2438k3313M059L341p085K1877j508L743K4762k1478
1899i228M753J1923j1578j4760O608K702m845j5187o816J6320P729j259k6084
1886c9722J6369R95J1807o795J533J4448j5710K6472j5878P00M879j6456J0904
$$ plain form
1980 -7839 -5390 -26889 -10844 -5403 576 -12445 -11911 -9899 -18189 8258 -8062 10296 -2162
1967 -2162 -9859 -2475 -2951 19637 -12276 2861 -7112 -13373 2031 -11288 -3935 -14662 -140
1954 -140 -1586 4993 1763 4087 8598 11581 23119 -11999 -4697 -13874 -8156 -17057 -19459 -8108
1940 -8108 -11302 -3626 -28965 -36351 -17527 -13732 -15463 -8070 -11736 -13882 -8826 -11566 -19216 -11714
1926 -11714 -13970 -33046 -25766 -6661 -25834 -15235 -10422 -11767 -22731 -8311 -6636 -20385 15864
1913 15864 7187 -1596 8873 8812 -13626 -36939 -32880 -29539 -36624 -14747 -16255 -12512 12250 -9228
1899 -9228 -4475 7448 -4130 -18890 -12282 -9580 -14425 -29612 -36428 -20108 -12379 -13638 -39722
1886 -39722 -23353 -22358 -10551 -17346 -15813 -1365 -17075 9397 -6481 -5781 -902 -17358 -6454
1873f454j6742L450j3217J3133k930K129n993K000j3769N371K6058k571J7397
1860G862j448J5290r581o178k5723n835J4880l0272J4336j858o301N406J0036
1847a9386J6110k6547R589J6998N667p572K1258j9208Q472k2745j0856K414p257
1834c3063L3935j8922J3472l577m976K196n211o038j686K5972N79N430q640l487
1820d016j0998j3608j7046R709K7389l5970K6625j3277M36J0306N094r773l992
1807b9121L2758q521J9674j4590l136j4126P885j466L191o939o386J0134k2354
1794c2997K3926n456j1577K1665M332O320P597K907j6858J57J5380j8501j1237
1781a4342O7l481l617n345L061j0660M372Q877O578R100R893k4364J0656k800
$$ plain form
1873 -6454 -23196 -19746 -32963 -19830 -22760 -20631 -26624 -24624 -38393 -33022 -6964 -9535 7862
1860 7862 6414 21704 12123 5945 -19778 -25613 -10733 -41005 -26669 -28527 -34828 -29422 -19386
1847 -19386 -3276 -29823 -20234 -3236 2431 -5141 16117 -3091 5381 -17364 -28220 -25806 -33063
1834 -33063 872 -18050 -4578 -8155 -13131 -10935 -16146 -22184 -23870 2102 2681 8111 -529 -4016
1820 -4016 -15014 -28622 -45668 -35959 -8570 -44540 -17915 -31192 -30756 -20450 -15356 -25129 -29121
1807 -29121 3637 -4884 14790 200 -2936 -17062 -9177 -10643 -7452 -14391 -20777 -10643 -32997
1794 -32997 -9071 -14527 -26104 -4439 -107 6213 13810 16717 -141 16 15396 -3105 -14342
1781 -14342 -14275 -17756 -21373 -26718 -23657 -34317 -29945 -21068 -14490 -5390 4503 -19861 -9205 -12005
1767a2005j6611J3895k9492J3091J0315Q947j1724m332J2398j0498J5336l989
1755a4669k794K2202J819j8072n278K8793j6203O43Q494j3388j2734m510J3588
1742a2109j2256J5020J593N366j2218M465O052r490J9180M004O990j6412R108
1729I293j8574L227j1578k2186R540K0482p833J0311J603p0L624O926k2973j941
1715b0149J2535q945J7468j1890n483j0454KM824p214J4472L970m204k0615K5284
1701a0399O506k9812M4481k8502J4321N633J2529k4890j4574K3316l4264K8751
1689f904p149L719L894p73q357j4374L0452j4867K1554n951K2470j1501R413j9785
1675A841l0148J9659k3388K1846k1977K4587j3061P225L9614j9416j2769r950
$$ plain form
1767 -12005 -28616 -14721 -44213 -31122 -20807 -11860 -23584 -27916 -15518 -26016 -10680 -14669
1755 -14669 -17463 4739 6558 -11514 -16792 12001 -4202 -3559 4935 -8453 -21187 -25697 -12109
1742 -12109 -24365 -9345 -7752 -2386 -14604 -10139 -4087 -13577 5603 9607 16597 185 9293
1729 9293 -9281 -6054 -17632 -39818 -30278 -9796 -17629 -7318 -5715 -5785 -2161 4765 -18208 -20149
1715 -20149 -7614 -16559 909 -10981 -16464 -26918 -26916 -22092 -29306 -14834 -10864 -15068 -35683 -10399
1701 -10399 -3893 -33705 10776 -17726 -3405 2228 14757 -10133 -24707 -1391 -35655 -6904
1689 -6904 -14053 -10334 -6440 -7213 -15570 -29944 508 -14359 7195 1244 23714 12213 21626 1841
1675 1841 -28307 -8648 -32036 -10190 -32167 -7580 -20641 -13416 26198 6782 -5987 -15937
1663a5937K3245j6824J2102O561q029k8171n835J6325P149R279l4331J4682J0497
1650i287K940J886o004J9175n793K322L899o774J666j9658J497J3096j7713k085
1636b0833J434n328J5209r347k313l082N477Q778J386K2067l322m451N543Q761
1622A9979k1218l307p403l50j8084R926O902j2473K8769j5592j514r161K1049
1609b477J5445l6404M105J8218l542N679j7154l310k098P222k1136N921L195R587
1595a6749J1486L2233k5056k0160K0299k8490K9164j016Q255r493q134J3515l8999
1582c3145K3442k2552K870J2375K0R988j4394J9711n117L2320j2064r867K756
1569F343o866j6103j5827L7522l6056K1583J340j3096K788k3317M3277l3989K1950
$$ plain form
1663 -15937 7308 -9516 2586 9147 1118 -27053 -32888 -16563 -9414 -135 -34466 -19784 -9287
1650 -9287 -6347 -4461 -10465 8710 2917 5239 9138 2364 4030 -15628 -14131 -1035 -18748 -20833
1636 -20833 -19399 -24727 -9518 -18865 -21178 -24260 -18783 -10005 -8619 13448 10126 5675 11218 19979
1622 19979 -1239 -4546 -11949 -12299 -30383 -20457 -13555 -26028 2741 -12851 -14365 -23526 -2477
1609 -2477 12968 -23436 -19331 -1113 -4655 1024 -16130 -19440 -21538 -14316 -35452 -29531 -26336 -16749
1595 -16749 -5263 26970 1914 -18246 2053 -26437 2727 1711 9966 473 -7661 5854 -33145
1582 -33145 -9703 -32255 -29385 -17010 -16990 -7002 -21396 -1685 -6802 25518 13454 3587 6343
1569 6343 -523 -16626 -32453 5069 -30987 -9404 -8064 -21160 -18372 -41689 1588 -32401 -10451
1556a0451m154J6829K906m798m682j1957K7380l2201P280j3039J4052k3207L3105
1543b937J1999k1916K3558l2299J3830J1469p551k180J0074p70j9096K6256r813
1530F24r316J5881o26j1575o328J0197J217Q775j8885P67n055K4720O272j0111
1516F557L381q209r604R491j1497q273M105J1849k1667l385J0241o818J0872K4324
1502A1367j8763p608M780J0194R952k534j0336q421O300J537j540J076k277j2048
1488a8321J1978o616n464J1168J6555k485M91r309j0320j4636J4874mL337p405
1474a6157k5548J2373J941J1855P280N055J6947r619m507q89l71j3800K5398k0920
1460a0962P7J5476L953j4948j0655J320k742J3202P524r021p719j26J0662o580
$$ plain form
1556 -10451 -14605 2224 5130 332 -4350 -16307 11073 -21128 -13848 -26887 -12835 -36042 -2937
1543 -2937 9062 -12854 10704 -21595 -7765 3704 -3847 -6027 4047 3277 -15819 10437 624
1530 624 -8692 7189 6563 -5012 -11340 -1143 74 8849 -10036 -9269 -14324 10396 16668 6557
1516 6557 9938 1729 -7875 1616 -9881 -18154 -14049 -2200 -23867 -27252 -17011 -23829 -12957 11367
1502 11367 -7396 -15004 -10224 -30 9922 7388 -2948 -11369 -5069 -3532 -5072 -3996 -6273 -18321
1488 -18321 -6343 -12959 -18423 -7255 9300 6815 7306 -2003 -12323 -26959 -12085 -12089 -8752 -16157
1474 -16157 -41705 -29332 -27391 -15536 -8256 -3201 13746 4127 -380 -1269 -1640 -15440 9958 -10962
1460 -10962 -10885 4591 8544 -6404 -17059 -15739 -18481 -5279 2245 -6776 -14495 -14621 -3959 -10539
1446a0539P838J294l612O473q904J1326j1844J7820j8017J5400j1905o940J1188
1433d22p712j920o564K5242k4687L407R566r2j204j8352L2672j3296r000q414
1419b0776j302Q447M42n834n374K0306j3193J9337J5999j2883K840k323M817j7973
1405g470P586j2096j2822K6119j1617m005n172J8437K538l569O450k0430P121
1392h930O655K165j2017P751J547l166P33p043J2322j3176J230j5816K2273J3381
1378G909j4147K1290o694M630q340Q117o356O06J2253r275n943j4397p374N164
1364a2557J5298P17Q759k900N183j1972j156J337j1587J6460n390j8522J3641
1351b689J5005j4355q576R603o102R967O773j4568q559P204j3385J9721J0465
$$ plain form
1446 -10539 -2701 -1407 -5019 1454 -7450 3876 -7968 9852 -8165 7235 -4670 -11610 -422
1433 -422 -8134 -10054 -16618 8624 -16063 -12656 -3090 -3182 -4386 -22738 9934 -3362 -12362 -20776
1419 -20776 -22078 -13631 -13189 -19023 -24397 -4091 -17284 2053 18052 5169 8009 5686 10503 -7470
1405 -7470 116 -11980 -24802 1317 -10300 -14305 -19477 -1040 1498 -2071 4379 -16051 -8930
1392 -8930 -2275 -110 -12127 -4376 -2829 -5995 -5262 -12305 17 -13159 -11929 -27745 -5472 7909
1378 7909 -6238 15052 8358 12988 4648 12765 6409 7015 19268 9993 4050 -10347 -17721 -12557
1364 -12557 2741 3458 12217 9317 14500 2528 1372 2709 -8878 7582 2192 -16330 -2689
1351 -2689 12316 -2039 -10615 -1012 -7114 2853 9626 -4942 -13501 -6297 -19682 39 10504
1338A0504r070n931J0717K2759k3505m79o409L983l939o417O921j9455K0728p022
1324f615L85K6556r276j7651J4687L986l653J7697l0199J8658j4077m681j0451
1311a4634J3562J8634k4025R535p692P554j640j317r855O152J2027k370J6989
1298B2920j8478M042J5618J1609k8341l1654K7121j2636o652Q837J4701k494r026
1285d433K3217l0970k739K2779n76p262J450r252l242P742k4049j42N98M588m701
1270b6992O776J8427k6394K5672R473l695J9743m297j9601j3304J8881j7422K3778
1257A1045K804q17R412j2354n932k2J748j0881J518m251J4142O374l993o95j4732
1242f634J9846j2278o486m629K940J3120j1224J4365j1713J1042P274J16J1882
$$ plain form
1338 10504 1434 -4497 6220 28979 5474 4995 -1414 2569 -1370 -7787 -866 -20321 407 -6615
1324 -6615 -6230 20326 11050 -6601 8086 12072 8419 26116 -4083 14575 498 -4183 -14634
1311 -14634 -1072 17562 -6463 3072 -4620 2934 1294 -23 -9878 -3726 8301 5931 22920
1298 22920 4442 8484 24102 35711 7370 -24284 2837 -9799 -16451 -7614 7087 4593 -4433
1285 -4433 18784 -12186 -14925 7854 7278 16 1466 -7786 -11028 -3286 -27335 -27477 -26879 -22291 -26992
1270 -26992 -20216 -1789 -28183 -2511 6962 3267 23010 18713 -888 -14192 4689 -12733 11045
1257 11045 13849 13032 22444 10090 4158 4136 5884 -4997 -3479 -7730 6412 12786 8793 8098 -6634
1242 -6634 13212 934 -5552 -10181 -7241 5879 -5345 9020 -2693 8349 15623 15739 27621
1229B7621j1639j2039m433Q58j311j758j5500J9192n960n49J5488j4030P617q707
1215e150J2838j1748Q613K490O038Q576J517o023k3399Q619j5323K8114L013r360
1201H815j3473m698n667n258K5373p990l394J6077q534k0992K4393n90j2136J6089
1187H015p623j8416O110J1425k9387J4621K5267m506K53R527O732R4R075l1064
1173A23l416K1614J607k2561K2027K0709l6234N523j1724m694j763K111k652N733
1159c597L2836k0444r433J2690j5821j5313J7838j8989p507J9040O250j2518K3446
1146H478J8805k1479n171J8084j4265r207J683j2255J5918J4134m096k0009Q585
1133g95J2106j0250J2832j049k716N581j731j5999k295k791j0433J4954r138K0106
$$ plain form
1229 27621 15982 3943 -490 368 -943 -2701 -18201 991 -4969 -5518 9970 -4060 3557 -5150
1215 -5150 7688 -4060 4553 7043 13081 21657 23174 17151 -6248 2371 -12952 15162 18175 8815
1201 8815 -4658 -9356 -15023 -20281 5092 -2898 -6292 9785 1251 -19741 4652 4062 -8074 8015
1187 8015 392 -18024 -11914 -489 -29876 -15255 10012 5506 5759 15286 22018 22112 31187 123
1173 123 -3293 18321 19928 -2633 19394 40103 3869 9392 -2332 -7026 -8789 -6678 -9330 -3597
1159 -3597 29239 8795 -638 12052 -3769 -19082 -1244 -20233 -27740 -8700 -2450 -14968 8478
1146 8478 27283 5804 633 18717 4452 -4755 -3072 -15327 591 14725 10629 -9380 -795
1133 -795 11311 1061 13893 12844 10128 15709 13978 -2021 -4316 -7107 -17540 -2586 -11724 8382
1119H382J852J1415j6766j6202K7337j3891Q611j6489N005j0793J2158K2179j8844
1106C954k243j3286M298J2698K6342l8761J0311K4053k2260N989J768P623k9158
1093h672P432q607K2389P580k5426O321j3405L1147l4785K5135l492q407L628
1080H38k109L443k2403K0764j4475J2904j6320k010N471O641K0476m1371K7276
1067h75j058k1324J8937j42K69j3613J8727j7991J7757J0435L696j0860l918K99
1053C39k3790K9013j6172R617j074m609L559j5844J5440l686K831l648m007P273
1039d758R208J2956j4792J9649k3131j3652m521J2758k388p281J3624k1411K2364
1026a375o162J1052j0332P934J2348m737k961k6317R617J1568M180m764K579m137
$$ plain form
1119 8382 10234 21649 4883 -11319 16018 2127 10738 -5751 -746 -11539 619 22798 3954
1106 3954 1711 -11575 -7277 5421 31763 -6998 3313 27366 5106 11095 12863 20486 -8672
1093 -8672 -1240 -9847 12542 20122 -5304 1017 -12388 18759 -16026 9109 5617 -2790 838
1080 838 -1271 2172 -20231 533 -13942 -1038 -17358 -19368 -13897 -7256 13220 -28151 -875
1067 -875 -1933 -23257 -4320 -4462 -4193 -17806 921 -17070 687 11122 14818 3958 40 339
1053 339 -23451 5562 -10610 -993 -2067 -6676 -3117 -18961 -3521 -7207 -4376 -8024 -12031 -4758
1039 -4758 4450 17406 2614 22263 -868 -14520 -19041 -6283 -8671 -15952 -2328 -23739 -1375
1026 -1375 -7537 3515 -6817 1117 13465 8728 5767 -20550 -10933 635 4815 51 2630 -1507
1012a507j2561K7725m258k9349Q899M3871k6274J0314O190j9393l222N186P465
999A3086j2959J8901k4419Q4J5134k019k7366J2151J4123q816J9742j2325k612
986B705k100K9267k3364k0602L5593k0799o175l139O172j7060K0665O42M592J1882
972A8279j8629j9601j4172L1310O373R782l635j4727J0954l411p414n490R259
959a122j0616K168Q219j052m367m609K3046l860J1896k0870m439j100J8067j3001
945a640q867O290q013J5721O28J617k4404J9850k000p52N1J171m699P379J7476
930A9808l9597J8146K734k721q683J4135o70n854K1912j7685J6181o388k725q852
916b59J6716q861O908m685j9982J3365j3666J9933l25R855O851l1021J9933o259
$$ plain form
1012 -1507 -14068 13657 9399 -19950 -11051 32820 6546 16860 23050 3657 435 5621 13086
999 13086 127 19028 -5391 -5307 9827 7808 -19558 -7407 6716 -2100 17642 5317 2705
986 2705 605 29872 6508 -14094 21499 700 -5475 -8614 -2442 -19502 1163 1805 6397 18279
972 18279 -350 -19951 -34123 -2813 3560 13342 9707 -5020 5934 2523 -4891 -10381 -1122
959 -1122 -11738 -9570 -1351 -2403 -6770 -11379 11667 7807 19703 -1167 -5606 -6706 11361 -1640
945 -1640 -10507 -4217 -12230 3491 4119 5736 -18668 1182 -818 -1570 -1519 -348 -5047 2332 19808
930 19808 -19789 -1643 1091 -1630 -10313 3822 3152 -2702 19210 1525 17706 11318 8593 -259
916 -259 16457 7596 14504 9819 -10163 3202 -10464 9469 9144 18999 25850 -5171 14762 8503
902H503j0510r638K2668J5343k132R635j7438O657j9772K2986r669J1466q965
889A9134j0131N56j4872K8992k7938K9589m303j7257J6111j3225j6288l266J6920
876D022q344K6569k0671n495p63j7538J5451J1875o178j1841K716M307K029J2647
862H786P102j4986R94o11O317j1556J7149k032O31J8701j5363j5897J1986K1394
848C2615l8310O091O484O15K0313j0181l50j2141J6257p914K178p416j505k746
834C990j5859L4529k4119J8614j4585n057K3636q190j7149m3171N0543N991P731
821A6904K446r161P906j8375O034l1997K5295k208J0658J0345j8946Q60j4534
808a4773L2040k8018L156K118J6996p79j5681J5952l5904K5870k1640O518L455
$$ plain form
902 8503 -2007 -11645 11023 26366 24234 33869 16431 23088 3316 26302 16633 28099 19134
889 19134 9003 9559 -5313 23679 -4259 25330 21027 3770 19881 6656 -9632 -12898 4022
876 4022 -4322 22247 1576 -3919 -4682 -22220 -6769 5106 -1072 -12913 -10197 -5890 -3861 8786
862 8786 15888 902 1896 1285 7602 -3954 13195 11163 11794 30495 15132 -765 11221 32615
848 32615 -5695 396 6880 7495 27808 17627 17277 5136 21393 13479 15657 8241 6736 3990
834 3990 -11869 22660 -1459 17155 2570 -2487 21149 12959 -4190 -47361 3182 9173 16904
821 16904 19350 10189 18095 -280 5754 -26243 -948 -3156 7502 17847 -1099 -239 -14773
808 -14773 17267 -10751 -7595 -5477 11519 10740 -4941 11011 -24893 977 -20663 -14145 -10690
795a0690j489J3012j4137J9921n580J8240p706m816O852J729n821j5392P162r024
781g739J6491p665k0305J3837k2288K6261j0989K1737N001m814n599j3352N013
768d411o542J3899j7392J8706j2538n017P232N258M072j3465M0019k8872j0688
755i739r814q432K2071q5R391j2543J0699L44o91p06P641j3674j8744R342P574
740g366K045J6905N778o77J8171Q943j4479J1693p240k0042K446k716N071r004
726I528j4885L441j1113P586p462R940J11J3150Q873l323j970k9902Q885Q47j7593
711b3887L5671N474j7584J3055m410j8722J4558L6M183M384j1011K1624p991P086
697B2466k817j3831J3404j927L540k6797J0022J0723j7882M219J1359j7968Q344
$$ plain form
795 -10690 -12179 833 -13304 6617 1037 19277 11571 6755 13607 15336 9515 -5877 1285 -7739
781 -7739 8752 1087 -19218 -5381 -27669 -1408 -12397 9340 14341 9527 3928 -9424 -4411
768 -4411 -10953 2946 -14446 4260 -8278 -13295 -6063 -805 3267 -10198 29821 949 -9739
755 -9739 -19553 -27985 -5914 -5999 3392 -9151 1548 1892 1201 495 8136 -5538 -24282 -14940 -7366
740 -7366 -5321 11584 17362 16685 34856 43799 29320 41013 33773 13731 16177 13461 18532 9528
726 9528 -5357 -1916 -13029 -5443 -12905 -2965 -2854 10296 19169 15846 13876 -16026 -7141 -6294 -23887
711 -23887 11784 17258 -326 12729 8319 -10403 4155 4191 8374 12758 1747 23371 15380 22466
697 22466 19649 5818 19222 17295 20835 -5962 4060 14783 -3099 1120 12479 -5489 2855
684B855l960j5263K5545l944j5R73J772j941j3748J6212n464n93N92j6427J7770
669D364l21P854j7062K266M767p092J3017M929j1039j674p306Q392L751o125j841
654c120j778r58P838j8477q50J1034O7J0878O3M030J8290j1356p413n405O675
639I518j2885J6175j4191k084R384N816o831j6149J6855p210R867m148J7881o764
625A5234J240m253j0523J7973k8576K2127r863m807J4376n952r880j1033K4761
612A0824p146O180j2902Q723j5312r204P156R05J5180j4670J0523k961M348j577
598F7l837J6854j3629Q833l596J4993p572J3748j0508k0794J8010J71l180q942
584F18j564j0449J0171J836q614J0974P097K677m523J4226p374j6580O482Q695
$$ plain form
684 2855 -1105 -16368 9177 5233 5218 6191 7963 6022 -7726 8486 3022 2429 3021 -13406 4364
669 4364 4043 11897 -5165 -2899 1868 -5224 7793 12722 1683 9 -7297 1095 4846 -1279 -3120
654 -3120 -4898 -5856 1982 -16495 -17345 -6311 -6244 4634 4697 8727 27017 15661 8248 2843 9518
639 9518 -3367 12808 -1383 -3467 5917 11733 4902 -11247 5608 -1602 8265 4117 21998 15234
625 15234 16474 12221 1698 19671 -8905 13222 3359 -1448 12928 6976 -2904 -13937 10824
612 10824 3678 9858 -3044 5679 -9633 -18837 -11681 -10776 4404 -10266 257 -2704 1644 67
598 67 -3770 13084 -545 8288 4692 19685 12113 25861 15353 -5441 12569 12740 9560 618
584 618 -946 -11395 -1224 612 -8002 2972 10069 12746 8223 22449 15075 -1505 4977 13672
570A3672n569N343o7p08P37M483m717j4083K4071j2591j7954j370L809Q730l435
555C51J3519J599pQ206k1436q291J885N284j039J2191l833r167k2k755K220J2896
539A1601j2726j917J6149Q408k765j4058O328r646J4804m575j6066J7887o758
526F666m780P985J5133j2268o344J1003k21n838r17P908j2077J2189J353j8709
512A083j6728K8497o39r851l94J138j47J0338J3757n048N606k342P340K183k7348
497G445l465M282o401r91m333j5165K6088q098m077q477J7282K754n303K2328
483B3869m701m04j8642L8123j5710j4837j077j8714M538R362N949k6922J6739
470b427K3399j6728K877l220m186J8087m41j1232n518j4377k600L691K8889l595
$$ plain form
570 13672 8103 13446 13379 12671 13408 17891 13174 -909 23162 10571 -7383 -8753 -4944 3786 351
555 351 13870 15469 15462 23668 2232 -6059 -4174 1110 71 12262 8429 -738 -760 -3515 -1295 11601
539 11601 -1125 -3042 13107 21515 18750 4692 11020 1374 16178 11603 -4463 13424 6666
526 6666 1886 9871 25004 12736 6392 17395 17174 11336 10419 18327 6250 18439 19792 1083
512 1083 -15645 12852 12213 2362 1968 3106 2959 13297 27054 22006 27612 25270 32610 34793 7445
497 7445 3980 8262 1861 870 -3463 -18628 7460 -638 -4715 -13192 4090 6844 1541 23869
483 23869 19168 18764 122 38245 22535 7698 6621 -12093 -7555 1807 7756 -19166 -2427
470 -2427 20972 4244 7121 3901 -285 17802 17361 6129 611 -13766 -16366 -12675 16214 12619
456A2619k3460N004L085k60J0195L61L527o99M956p389J513P721j844r798J0883
441A6414j4197j4818k351O133L556j3585J4232q461J6437Q825j2757O527j5710
428i755J5109j1510O278N808L775j7223r60O839q052L28m104J3197j2565J475
414a1360N590K006j170r47J3583q514J3978m176o945O778j1168j180q569M893
400g201M376j1850j020J0213O330J6814N20K787l218j5527M324J7615k2917J0787
386A2033j235J579j4098j384j885l074L226j1701J2487O086M160K0379k3662m69
372B442Q456j2309r360J6649p482j1566R982j1782K763p584K7927q271J071O110
358G046K1841l551l429M090j2618j7529l3502K2349M412j0621J4502J54m493k485
$$ plain form
456 12619 -10841 -5837 -2752 -3012 7183 7544 11071 10372 15328 7939 9452 17173 15329 5531 16414
441 16414 2217 -12601 -14952 -8819 -5263 -18848 -4616 -13077 3360 12185 -572 5955 -9755
428 -9755 5354 -6156 122 5930 9705 -7518 -8478 -1639 -9691 -9363 -13467 -270 -12835 -11360
414 -11360 -5770 -3764 -4934 -5881 7702 -812 13166 8990 2045 8823 -2345 -3525 -12094 -7201
400 -7201 -2825 -14675 -15695 -5482 848 17662 18182 20969 17751 2224 6548 24163 1246 12033
386 12033 10798 12377 -1721 -3105 -4990 -8064 -4838 -16539 -4052 2034 6194 26573 2911 2442
372 2442 10898 -1411 -10771 5878 -1604 -13170 -3188 -14970 -12207 -19791 8136 -135 936 7046
358 7046 28887 25336 21907 25997 13379 -4150 -37652 -15303 -10891 -21512 -7010 -6856 -11349 -13834
344a3834P09J4296P801m095k515k993k051l541j0462J3083o043K651p414n375
330a9783J5096N598O621N708k1045K2194P207K08J735j7004P70p668J1932j969
316I600R150n620k9139P770k233l156J7823R200p868p35k603K969J0274j745J1136
301B4823j6838J7102k1522j4887k399R12J581m822J7509j4716R191J812L801J7932
287A9479l322j6058r118J5764l196K1351j9626O690l414k48J6983m1838J0114
274f439O42J5072q479q682Q063J025n482J6990m567m032J9460k6351J1200k873
260E547K722J833r382J0679j4742J0187K011o339j054j7806J8255J3026j2413
247B524O083m598L277R688o78j6526p938P497J0993j9870K2052J4161j1653k457
$$ plain form
344 -13834 -13125 1171 8972 4877 2362 -631 -2682 -6223 -16685 -3602 -9645 -6994 -14408 -19783
330 -19783 -4687 911 7532 13240 -7805 14389 21596 21804 23539 6535 7305 -363 11569 9600
316 9600 18750 13130 -16009 -8239 -10472 -13628 4195 13395 5527 4792 2189 5158 15432 13687 24823
301 24823 7985 25087 3565 -11322 -13721 -12809 -11228 -16050 1459 -13257 -4066 -2254 1547 19479
287 19479 16157 99 -9019 6745 3549 24900 5274 11964 8550 8302 25285 -16553 -6439
274 -6439 -5797 9275 796 -7886 177 1202 -4280 12710 8143 4111 23571 -2780 8420 5547
260 5547 8269 10102 720 11399 -3343 6844 8855 2516 1462 -16344 1911 14937 2524
247 2524 8607 4009 7286 16974 16296 -230 -8168 -671 10322 -9548 12504 26665 15012 12555
233A2555l059J841P057k705n085j778j2793P071Q440p692j2924j2223n648J3630
219a3313O304O433Q357j3371P926o98j4921O598J1769r62l66L255p473j5742p98
204a7002K5856j1309L3104j7114j7071J0870j745N487q890K0314R922j8216r03
191A3303j901j7102k178j0037m241J6778J861J3777k0691P785M088n198K0736
178A6980l442k150J494k951j3828R664Q503k1801J9766N259k0248q626J6221m053
164G88L545J861n523n87M943j3517r784Q251L693K233j5449J5919k421l849n465
149a5362j131J1044O293n040P479J9983l470j5215N77o5k764R808j2034L594P613
134A1310j3082j1427r97J9615j4204o80P893K032p948K3925K03m609m23J177p854
$$ plain form
233 12555 9496 11337 18394 15689 10604 8826 -3967 3104 11544 3852 -9072 -21295 -26943 -13313
219 -13313 -7009 -576 7781 -5590 2336 1638 -13283 -6685 5084 4122 3756 7011 -462 -16204 -17002
204 -17002 8854 -2455 30649 13535 -3536 7334 5589 11076 2186 22500 32422 14206 13303
191 13303 11402 -5700 -7878 -17915 -22156 -5378 -3517 10260 -10431 -2646 1442 -3756 16980
178 16980 13538 11388 12882 9931 -3897 5767 14270 -7531 12235 17494 -2754 -11380 4841 788
164 788 4333 6194 671 84 5027 -8490 -18274 -10023 -6330 -4097 -19546 -3627 -6048 -9897 -15362
149 -15362 -16493 -5449 844 -4196 3283 23266 19796 4581 5158 5093 2329 12137 103 3697 11310
134 11310 -1772 -13199 -14196 5419 -8785 -9465 -1572 460 -7488 16437 16640 12031 11608 12785 4931
119D931R258Q919o208n605K03k0152p56j874K98J0168N370J558M018m79P96j232
103I213K614O074j4980P615j4115K2004j2078j1783O682r492J0759j357L2131
90C3287k9819P012J7456k722o403q573K244k6453K0869j3079K1746o310j1486
77b231L156j6922L6926j5930p119J0069j672J179l143J9354n380n313N9l654q725
62F54J5997K801n850Q407k0021j910J4705k885o987L916k487j4717J3440N725
48A0788j8126R873k368L247j633j3285j508n998M792J75J229l771P935N997O212
33C559L971J01M813j0510k956R133M586K80n735Q902q246R780j5844p038J1244
$$ plain form
119 4931 14189 23108 16900 11295 11498 -8654 -9410 -11284 -10986 -818 4552 6110 10128 9649 10445 9213
103 9213 11827 17901 2921 10536 -3579 18425 6347 -5436 1246 -8246 2513 1156 33287
90 33287 3468 10480 27936 25214 18811 10238 12482 -13971 6898 -6181 15565 9255 -2231
77 -2231 925 -15997 20929 4999 -2120 7949 6277 7456 4313 23667 18287 12974 13033 9379 654
62 654 16651 19452 13602 22009 1988 78 14783 11898 4911 8827 6340 -8377 5063 10788
48 10788 -7338 2535 167 3414 1781 -11504 -13012 -19010 -14218 -14043 -12814 -16585 -8650 -2653 3559
33 3559 7530 7631 12444 1934 -1022 8111 12697 12977 7242 16144 7898 17678 1834 -5204 6040
$$ [...]
##END NTUPLES=NMR SPECTRUM
##END=
