##TITLE=1H_CG-1192-p
 CDCl3
 8 sc, 
 12.2.2024
##JCAMPDX= 6.0         $$ Bruker NMR JCAMP-DX V2.0
##DATA TYPE= NMR SPECTRUM
##DATA CLASS= NTUPLES
##ORIGIN= UXNMR, Bruker Analytische Messtechnik GmbH
##OWNER= root
$$ XWIN-NMR		Version 3.5
$$ Mon Feb 12 15:56:29 2024 Russian Standard Time (UT+4h)  she@DPX200
##.OBSERVE FREQUENCY= 200.1313
##.OBSERVE NUCLEUS= ^1H
##.ACQUISITION MODE= SIMULTANEOUS
##.ACQUISITION SCHEME= undefined
##.AVERAGES= 8
##.DIGITISER RES= 18
##SPECTROMETER/DATA SYSTEM= spect
##.PULSE SEQUENCE= zg30
##.SOLVENT NAME= CDCl3
##.SHIFT REFERENCE= (INTERNAL, CDCl3, 0, 15.4736)
##AUDIT TRAIL= $$ (NUMBER, WHEN, WHO, WHERE, WHAT)
$$ ##TITLE= Audit trail, XWIN-NMR		Version 3.5
$$ ##JCAMPDX= 5.01
$$ ##ORIGIN= Bruker BioSpin GmbH
$$ ##OWNER= she
$$ F:/spectra/data/she/nmr/H-F/1/pdata/1/auditp.txt
$$ ##AUDIT TRAIL=  $$ (NUMBER, WHEN, WHO, WHERE, WHAT)
(   1,<2024-02-12 15:55:07.56 +0400>,<she>,<DPX200>,
      <created by zg, POWCHK disabled, PULCHK disabled
       configuration hash MD5:
       00 E9 B6 7A A2 85 ED C7 34 08 36 98 17 FE 4E 26
       data hash MD5: 16K
       E8 9B 6F A2 BA 8B 6F F5 2C 14 84 57 91 27 58 1C>)
(   2,<2024-02-12 15:55:10.15 +0400>,<she>,<DPX200>,
      <Start of raw data processing
       efp BC_mod = 2 LB = 0.24 FT_mod = 6 PKNL = 1 PHC0 = -25102.28 PHC1 = 7.852696 SI = 16K 
       data hash MD5: 16K
       45 94 45 96 92 F1 C1 A6 5D 7B 6C F2 76 7D 9A BB>)
(   3,<2024-02-12 15:55:27.37 +0400>,<she>,<DPX200>,
      <pk PHC0 = 1.956918 PHC1 = -2 
       data hash MD5: 16K
       0B BC 63 36 5D EF C8 73 83 91 23 F5 D2 95 50 3F>)
(   4,<2024-02-12 15:55:31.03 +0400>,<she>,<DPX200>,
      <abs ABSG = 5 
       data hash MD5: 16K
       A4 6F A3 81 BA F3 2A 7A D8 1D 26 D0 C4 71 5F F5>)
$$ ##END=
$$ 
$$ hash MD5
$$ B3 30 27 DF 98 AF 9C F2 8E 60 12 00 25 43 DE 3F
##$RELAX= 
##$RELAX= 
##$RELAX= 
##$RELAX= 
##$RELAX= 
##$RELAX= 
$$ Bruker specific parameters
$$ --------------------------
##$DU= <F:/spectra>
##$EXPNO= 1
##$NAME= <H-F>
##$PROCNO= 1
##$TYPE= <nmr>
##$USER= <she>
##$AMP= (0..31)
100 100 100 100 100 100 100 100 100 100 100 100 100 100 100 100 100 100 
100 100 100 100 100 100 100 100 100 100 100 100 100 100 
##$AQSEQ= 0
##$AQ_mod= 1
##$AUNM= <au_zg>
##$AUTOPOS= <>
##$BF1= 200.13
##$BF2= 200.13
##$BF3= 200.13
##$BF4= 200.13
##$BF5= 200.13
##$BF6= 200.13
##$BF7= 200.13
##$BF8= 200.13
##$BYTORDA= 1
##$CFDGTYP= 0
##$CFRGTYP= 5
##$CHEMSTR= <none>
##$CNST= (0..31)
1 1 145 1 1 1 1 1 1 1 1 1 1 1 1 1 1 1 1 1 1 1 1 1 1 1 1 1 1 1 1 1 
##$CPDPRG= <>
##$CPDPRG1= <>
##$CPDPRG2= <>
##$CPDPRG3= <>
##$CPDPRG4= <mlev>
##$CPDPRG5= <mlev>
##$CPDPRG6= <mlev>
##$CPDPRG7= <mlev>
##$CPDPRG8= <mlev>
##$CPDPRGB= <>
##$CPDPRGT= <>
##$D= (0..31)
0 1.2 0 0 0 0 0 0 0 0.06 0 0.03 0 0 0 0 0.0002 0 0 0 0 0 0 0 0 0 0 0 0 
0 0 0 
##$DATE= 1707738906
##$DBL= (0..7)
120 120 120 120 120 120 120 120 
##$DBP= (0..7)
150 150 150 150 150 150 150 150 
##$DBP07= 0
##$DBPNAM0= <>
##$DBPNAM1= <>
##$DBPNAM2= <>
##$DBPNAM3= <>
##$DBPNAM4= <>
##$DBPNAM5= <>
$$ [...]
##$SUBNAM3= <"">
##$SUBNAM4= <"">
##$SUBNAM5= <"">
##$SUBNAM6= <"">
##$SUBNAM7= <"">
##$SUBNAM8= <"">
##$SUBNAM9= <"">
##$SW= 18.0517328524113
##$SWIBOX= (0..15)
0 0 2 0 0 0 0 0 0 0 0 0 0 0 0 0 
##$SW_h= 3612.71676300578
##$TD= 16384
##$TD0= 1
##$TE= 0
##$TE2= 300
##$TE3= 300
##$TEG= 300
##$TL= (0..7)
0 120 120 120 120 120 120 120 
##$TP= (0..7)
150 150 150 150 150 150 150 150 
##$TP07= 0
##$TPNAME0= <>
##$TPNAME1= <>
##$TPNAME2= <>
##$TPNAME3= <>
##$TPNAME4= <>
##$TPNAME5= <>
##$TPNAME6= <>
##$TPNAME7= <>
##$TPOAL= (0..7)
0.5 0.5 0.5 0.5 0.5 0.5 0.5 0.5 
##$TPOFFS= (0..7)
0 0 0 0 0 0 0 0 
##$TUNHIN= 0
##$TUNHOUT= 0
##$TUNXOUT= 0
##$USERA1= <user>
##$USERA2= <user>
##$USERA3= <user>
##$USERA4= <user>
##$USERA5= <user>
##$V9= 5
##$VALIST= <valist>
##$VCLIST= <CCCCCCCCCCCCCCC>
##$VD= 0
##$VDLIST= <DDDDDDDDDDDDDDD>
##$VPLIST= <PPPPPPPPPPPPPPP>
##$VTLIST= <TTTTTTTTTTTTTTT>
##$WBST= 1024
##$WBSW= 4
##$XGAIN= (0..3)
0 0 0 0 
##$XL= 0
##$YL= 0
##$YMAX_a= 146651
##$YMIN_a= -138998
##$ZGOPTNS= <>
##$ZL1= 120
##$ZL2= 120
##$ZL3= 120
##$ZL4= 120
##$ABSF1= 15.59484
##$ABSF2= -2.457011
##$ABSG= 5
##$ABSL= 3
##$ALPHA= 0
##$AQORDER= 0
##$ASSFAC= 0
##$ASSFACI= 0
##$ASSFACX= 0
##$ASSWID= 0
##$AUNMP= <proc_1d>
##$AZFE= 0.1
##$AZFW= 0.1
##$BCFW= 0
##$BC_mod= 2
##$BYTORDP= 0
##$COROFFS= 0
##$CY= -3
##$DATMOD= 1
##$DC= 0
##$DFILT= <>
##$DTYPP= 0
##$F1P= 0
##$F2P= 0
##$FCOR= 1
##$FTSIZE= 16384
##$FT_mod= 6
##$GAMMA= 0
##$GB= 0
##$INTBC= 1
##$INTSCL= 3.70164e-10
##$ISEN= 128
##$LB= 0.24
##$LEV0= 0
##$LPBIN= 0
##$MAXI= 10000
##$MC2= 0
##$MEAN= 0
##$ME_mod= 0
##$MI= 1.114404
##$NCOEF= 0
##$NC_proc= -9
##$NLEV= 6
##$NOISF1= 3.799351
##$NOISF2= 2.8
##$NSP= 0
##$NTH_PI= 0
##$NZP= 0
##$OFFSET= 15.47364
##$PC= 1
##$PHC0= -25100.32
##$PHC1= 5.852696
##$PH_mod= 1
##$PKNL= yes
##$PPARMOD= 0
##$PSCAL= 0
##$PSIGN= 0
##$REVERSE= no
##$SF= 200.130009617829
##$SI= 16384
##$SIGF1= 3
##$SIGF2= 2
##$SINO= 5.538805
##$SIOLD= 16384
##$SREGLST= <1H.CDCl3>
##$SSB= 0
##$STSI= 16384
##$STSR= 0
##$SW_p= 3612.71676300578
##$SYMM= 0
##$S_DEV= 0
##$TDeff= 16384
##$TDoff= 0
##$TI= <>
##$TILT= no
##$TM1= 0
##$TM2= 0
##$TOPLEV= 0
##$USERP1= <user>
##$USERP2= <user>
##$USERP3= <user>
##$USERP4= <user>
##$USERP5= <user>
##$WDW= 1
##$XDIM= 16384
##$YMAX_p= 515733665
##$YMIN_p= -4460267
$$ End of Bruker specific parameters
$$ ---------------------------------
##NTUPLES= NMR SPECTRUM
##VAR_NAME=  FREQUENCY,     SPECTRUM/REAL,   SPECTRUM/IMAG
##SYMBOL=    X,             R,               I
##VAR_TYPE=  INDEPENDENT,   DEPENDENT,       DEPENDENT
##VAR_FORM=  AFFN,          ASDF,            ASDF
##VAR_DIM=   16384,         16384,           16384
##UNITS=     HZ,            ARBITRARY UNITS, ARBITRARY UNITS
##FACTOR=    0.220516191357247, 1,           1
##FIRST=     3096.73981045918, 0,            0
##LAST=      -515.9769525466, 0,             0
##MIN=       -515.9769525466, -4460267,      0
##MAX=       3096.73981045918, 515733665,    0
$$ Real data points
##PAGE= N=1
##DATA TABLE= (X++(R..R)), XYDATA
$$ [...]
6286A722354J4972j76442P0723j17506j60733M1385K85463O6074J27055j1805
6276A861540R044Q3069K37174k43170j53907J53367j13203l864p7128M7288K50775
6265B050985K31101j91026L8100J13663J35477J6529K87203J1395k0751J53757
6255B826433q8625N3489M6635j78301j43850J89281L00240K51778P0227K58250
6245C585557r003M3979J52512k730k03008k5930N556J91569Q3345O2146J96630
6234D080623j8126m9791K31260L2070L6550K06761M6015J28726K49374k31364
6224D712098P6863L95861K92376J45433P3608o1106L13853K52542K91809m4093
6214F449244q1044J43856M0278K14726K33161M02529O4149P0327J53622L09957
$$ y = [1722354, 1737326, 1560884, 1631607, 1514101, 1353368, 1394753, 1680216, 1746290, 1873345, 1861540, 1870584, 1953653, 2190827, 1947657, 1793750, 1947117, 1833914, 1830050, 1752922, 1800210, 2050985, 2282086, 2091060, 2129160, 2242823, 2378300, 2394829, 2682032, 2693427, 2672676, 2826433, 2737808, 2791297, 2837932, 2659631, 2515781, 2705062, 3005302, 3257080, 3327307, 3585557, 3576554, 3620533, 3773045, 3770315, 3567307, 3541377, 3546933, 3738502, 3821847, 3883993, 4080623, 4062497, 4012706, 4243966, 4276036, 4312586, 4519347, 4565362, 4694088, 4943462, 4712098, 4788961, 5184822, 5477198, 5622631, 5696239, 5635133, 5948986, 6201528, 6493337, 6449244, 6368200, 6512056, 6552334, 6767060, 7000221, 7402750, 7466899, 7537226, 7690848, 8000805]
6204H000805j67795K81524M21254L68785j10470o130K25993K93629L34128O6333
6194I708056K5404o9321L38401M08818J50086L17322L67383K99309K92158N07296
6184A2344912L96859P8658N07370N30576L78548K79053J86434O05293L20064O07119
6174A6234886M07037J68273L88384M20632N04101N26236O29418N80676Q13790
6165B0673433N81690Q01447N68150Q75815Q08028R55765J275251J173354J047601
6156B8760534J584148J636203J596610J958455K094989K525287K793185L317129
6148D6266540L468843M197900N296476O184790O617982P564597O862448M349443
6140I0809019R40940k168851m468009n347988m769228m043660k773662k193848
$$ y = [8000805, 7833010, 8114534, 8535788, 8904573, 8794103, 8787973, 9013966, 9307595, 9641723, 9708056, 9733460, 9664139, 10002540, 10411358, 10561444, 10878766, 11246149, 11545458, 11837616, 12344912, 12741771, 12820429, 13327799, 13858375, 14236923, 14515976, 14702410, 15307703, 15627767, 16234886, 16641923, 16810196, 17198580, 17619212, 18123313, 18649549, 19278967, 19859643, 20673433, 21255123, 22056570, 22624720, 23500535, 24308563, 25264328, 26539579, 27712933, 28760534, 30344682, 31980885, 33577495, 35535950, 37630939, 40156226, 42949411, 46266540, 49735383, 53933283, 59229759, 65414549, 72032531, 79597128, 86459576, 90809019, 91749959, 89581108, 85113099, 79765111, 74995883, 70952223, 68178561, 65984713]
6132F5984713j233020j22598L31799R43392J599894K445254L318885M126028M921842
6123H2316189O292861Q022100R997140J1510252J3462321J4566259J3192774Q808297
6115A68168193J214987p385312j3446685j5971744j5279298j2972599j0674339
6108I3653203q325221o139473m883228l625229k669610j822403q09455j11848
6100F5266736P38666J264076K037993L380741M244518N062449O329684O326964
6092I4651827N291239L001402j013231n349798q397115r158304q898445p767113
6084F2360462o605990n363646m449649l694537l044706k668853k264673j697714
6076C2570694j457977j392149q29765j259928j245606q07009q67125q11544m78837
$$ y = [65984713, 64751693, 64629095, 64960894, 65904286, 67504180, 69949434, 73268319, 77394347, 82316189, 88609050, 96631150, 106628290, 118138542, 131600863, 146167122, 159359896, 168168193, 169383180, 161997868, 148551183, 132579439, 117300141, 104327542, 93653203, 85327982, 79188509, 74305281, 70680052, 68010442, 66188039, 65378584, 65266736, 66005402, 67269478, 69307471, 72688212, 76932730, 81995179, 88324863, 94651827, 99943066, 102944468, 101931237, 96581439, 88184324, 79026020, 70127575, 62360462, 55754472, 50390826, 45941177, 42246640, 39201934, 36533081, 34268408, 32570694, 31112717, 29720568, 28890803, 27630875, 26385269, 25578260, 24711135, 23899591, 23420754]
6067B3420754o93550q52433q04729o47844n99222m10811o39201m36399k40731
6058A8095834j44396m42914K00186L55166j32980J44978K58095J80360Q5164N32024
6048A9131517M67536J57719K76337k40031l52190q5038J45333L26689K58851M19615
6038B0506338O60135Q75389R05883O44961K13439l46233p20923q04931r27649
6029B1006409r51132o90104n63125k46689r0478l17945M56256N07798K11890M54742
6019A9777622J57646K58643L52738M74601N26130J118371J762744J615762J961839
6010B8006096K434760K147515J366061L41929j190511k515469l164239k483857
6002B4942285k409075j923927j477343j323438o95139p37002o65626j96115K185
$$ y = [23420754, 22727204, 21874771, 21070042, 20422198, 19822976, 19412165, 18772964, 18336565, 18095834, 17951438, 17508524, 17708710, 18063876, 17930896, 18075874, 18333969, 18514329, 18599493, 19131517, 19599053, 19756772, 20033109, 19793078, 19440888, 19355850, 19501183, 19827872, 20086723, 20506338, 21166473, 22041862, 22947745, 23592706, 23806145, 23459912, 22738989, 21934058, 21006409, 20055277, 19365173, 18802048, 18555359, 18464881, 18146936, 18603192, 19110990, 19322880, 19777622, 19935268, 20193911, 20546649, 21021250, 21547380, 22665751, 24428495, 26044257, 28006096, 30440856, 32588371, 33954432, 34296361, 33105850, 30590381, 27426142, 24942285, 22533210, 20609283, 19131940, 17808502, 17113363, 16376361, 15710735, 15514620, 15516805]
5993A5516805o9822n3006j24041k8954N42883N06965N95298P18282Q89057Q55982
5983A9349449J063639O91607M8763p87687j306785j395217j548944j293154j398835
5974A3422836r68654q62400q92182p51498k19772k44603p0723j11380J4715m99758
5964H816581n47238o02814r3958n0936n44238l86533k06594j62242k94477L4350
5954E961901r9038k94899j69294K31749q9421l18432L7385M1979j58332Q616q8294
5943E063920j56081L4140l9694N9907Q5766j09940j78380j38920l97793l74936
5933C847989l03614j65625J92144J80788l26245R2704l3781k12223j30127p8249
5923C063761J3080j64065M7784j8523J14465J50564k40695n3953M3758M2554J74162
$$ y = [15516805, 15446983, 15393977, 15269936, 15240982, 15783865, 16290830, 16886128, 17604410, 18493467, 19349449, 20413088, 21104695, 21153458, 20365771, 19058986, 17663769, 16114825, 14821671, 13422836, 12454182, 11591782, 10699600, 9948102, 9728330, 9483727, 9413004, 9301624, 9316339, 8816581, 8269343, 7666529, 7572571, 7521635, 6977397, 6590864, 6384270, 6222028, 5927551, 5961901, 5862863, 5567964, 5398670, 5630419, 5540998, 5222566, 5259951, 5301930, 5143598, 5152214, 5063920, 4907839, 4941979, 4902285, 4962192, 5047958, 4938018, 4759638, 4620718, 4222925, 3847989, 3544375, 3378750, 3570894, 3751682, 3425437, 3518141, 3484360, 3272137, 3142010, 3063761, 3076841, 2912776, 2960560, 2942037, 3056502, 3207066, 2966371, 2912418, 2956176, 2998730, 3172892]
5912C172892L1302L925l12648j77357K27845j32724k56307J946k24862Q1239r231
5901B406020L0755K71554l9279m21775J26897j29935J48606k7030J68423o4134
5891B470102j43676j63204K43668K09470p6131J14438L1286k9411k03542o2906
5881B390094K58769l4473P9874O7897l11867j21659o0541j77040J88164K12741
5871B491959l6559N5644o0920j27288j39726L7723L08753J51471q111j12818l11146
5860B248982R5630R6284K48967j87211j74267K96896J41884l4933J24923j89341
5850B667814K42852n3780j74009Q2692j28794j51547L53938l2871k12920L22564
5840B915939j17432J99562K08983k24316L2708J97396J85908J38578J11567k712
$$ y = [3172892, 3204194, 3208119, 2895471, 2718114, 2945959, 2813235, 2556928, 2558874, 2334012, 2415251, 2406020, 2436775, 2708329, 2669050, 2247275, 2374172, 2244237, 2392843, 2365813, 2534236, 2470102, 2326426, 2163222, 2406890, 2616360, 2540229, 2654667, 2685953, 2656542, 2453000, 2390094, 2648863, 2614390, 2694264, 2762161, 2450294, 2328635, 2268094, 2091054, 2279218, 2491959, 2455400, 2511044, 2450124, 2322836, 2183110, 2220833, 2529586, 2681057, 2672946, 2560128, 2248982, 2344612, 2440896, 2689863, 2502652, 2328385, 2625281, 2767165, 2732232, 2857155, 2667814, 2910666, 2856886, 2682877, 2765569, 2636775, 2485228, 2839166, 2806295, 2593375, 2915939, 2798507, 2998069, 3207052, 2982736, 3015444, 3212840, 3398748, 3537326, 3648893, 3646181]
5830C646181M5722m7304k74513Q0578K52806L61968J54485l33740j10912q6564
5820C688707K52776N9447J10609q454o0110K2200J69907L10396K21885n7573K34650
5809D944440J72158J41957M5393k96273p734J17850J9407k09215K4192K36020
5799E188195L17524J70260K0520k64585j74442L37269J85939j27025k02975Q172
5789E458852R8380J86141L20883R7510R3072k13223K17753Q5573K03201M49404
5779F997546m7369N8655k8094j82606L79379K45385k90502K6842K977m5854M37523
5768G553882o2106O4185J48224J44709k82329O5543J1322J67266L81693j72973
5758H019416L01987K53438J90941J5532K66578P2092J92435J99692K56845K41764
$$ y = [3646181, 3691903, 3644599, 3370086, 3450664, 3703470, 4065438, 4219923, 3886183, 3775271, 3688707, 3941483, 4000930, 4111539, 4103085, 4042975, 4065175, 4235082, 4545478, 4767363, 4709790, 4944440, 5116598, 5258555, 5303948, 5007675, 4999941, 5117791, 5137198, 4927983, 4952175, 5188195, 5505719, 5675979, 5696499, 5431914, 5257472, 5594741, 5780680, 5653655, 5450680, 5458852, 5557232, 5743373, 6064256, 6161766, 6254838, 6041615, 6259368, 6344941, 6548142, 6997546, 6950177, 7008832, 6980738, 6798132, 7177511, 7422896, 7132394, 7159236, 7162213, 7116359, 7553882, 7491776, 7555961, 7704185, 7848894, 7566565, 7632108, 7643430, 7810696, 8192389, 8019416, 8321403, 8574841, 8765782, 8781314, 9047892, 9119984, 9312419, 9512111, 9768956, 10010720]
5748A0010720L57733K75845M06268K92932L5398K80438L90263K92596K60779L30795
5738A2933767Q8054N21759N61482M83823R67337R14588O78911P00382L11038K96064
5728A8457205L77492K82155K76864K78692M45762N71825N99656O67588O46560
5719B2603799L23146M10460J91231N05625O66823P29874N08330N86016N77550
5710B7102854K32502P70989N29233L58610J22988K53976O64665O94361N35389
5701C1265567J219956J119367J056145J001036R70346J519630J264548J399548
5693D0816143J277816J759748K032212K330617L047219L192093L413168L994500
5685F1863516M512106N398215O776008Q232399R030059Q879784P561414L556113
$$ y = [10010720, 10368453, 10644298, 11050566, 11343498, 11378896, 11659334, 12049597, 12342193, 12602972, 12933767, 13021821, 13543580, 14105062, 14588885, 15556222, 16470810, 17149721, 17850103, 18161141, 18457205, 18834697, 19116852, 19393716, 19672408, 20118170, 20689995, 21289651, 21957239, 22603799, 22926945, 23337405, 23528636, 24034261, 24701084, 25430958, 25939288, 26525304, 27102854, 27335356, 28106345, 28635578, 28994188, 29117176, 29371152, 30035817, 30730178, 31265567, 32485523, 33604890, 34661035, 35662071, 36632417, 38152047, 39416595, 40816143, 42093959, 43853707, 45885919, 48216536, 51263755, 54455848, 57869016, 61863516, 66375622, 71773837, 78549845, 86782244, 95812303, 104692087, 112253501, 115809614]
5677A15809614j700335o225447q042839q167538p065608n467954m145698k940596
5669G2053599j626443q05044q90R18946J446332K679692L522192M310630N556814
5660H8055828P361485R420586J1956339J4531986J6437440J6482576J2129149
5653A76375389L574431o978878j4689255j7087453j6605431j4695932j1779195
5646I8113676r490571p618907o153756m878569l621026k674734j427959j087374
5638F1160780l12657P65334J310203K011980L011874L803523M592193N182483
5630H1525713N501207L919235O59657l004738o543153p927405p914143p152255
5622E9064118o196667m900250m096268l480501k852730k231155j988985j424102
$$ y = [115809614, 114109279, 107883832, 99840993, 91673455, 84607847, 79139893, 74994195, 72053599, 70427156, 69622112, 69621222, 70540168, 71986500, 74666192, 78188384, 82499014, 88055828, 95417313, 104837899, 116794238, 131326224, 147763664, 164246240, 176375389, 179949820, 172970942, 158281687, 141194234, 124588803, 109892871, 98113676, 88623105, 81004198, 74850442, 69971873, 66350847, 63676113, 62248154, 61160780, 60848123, 61613457, 62923660, 64935640, 67947514, 71751037, 76343230, 81525713, 87026920, 90946155, 91605812, 88601074, 82057921, 74130516, 66216373, 59064118, 52867451, 47967201, 43870933, 40390432, 37537702, 35306547, 33317562, 31893460]
5614C1893460j145585j093184j357244p75632p58184q48791m34641k00342k88480
5605B4991377m21490k45073l29932k4160Q4595j24256k39839K48794O5918k40920
5595B3765014l06751l80479k91800k10348q646k5144p3480k77967J01876J84934
5585B2477209k8278L98354J51872J11527K97353N46014M42717Q04654P21714J224730
5575B7147866J079777J140779J583238J742549J647152J418246J404989J057657
5567C8222253J304480O47588n93021j060868j366003j686290j254474q45593p48327
5558C2619745k01889l1722j11915k3299O06390M26182P98523Q69954Q38072J476902
5548C7266943J488706J482674K090310K664806K780257L114351L481414L206434
$$ y = [31893460, 30747875, 29654691, 28297447, 27521815, 26763631, 25914840, 25480199, 25279857, 24991377, 24569887, 24324814, 23994882, 23970722, 24055317, 23931061, 23691222, 23940016, 24005934, 23765014, 23458263, 23077784, 22785984, 22575636, 22566990, 22541846, 22468366, 22190399, 22292275, 22477209, 22448931, 22847285, 22999157, 23110684, 23408037, 23954051, 24396768, 25201422, 25923136, 27147866, 28227643, 29368422, 30951660, 32694209, 34341361, 35759607, 37164596, 38222253, 39526733, 40174321, 39581300, 38520432, 37154429, 35468139, 34213665, 33368072, 32619745, 32417856, 32386134, 32274219, 32250920, 32857310, 33283492, 34082015, 34951969, 35790041, 37266943, 38755649, 40238323, 42328633, 44993439, 47773696, 50888047, 54369461, 57575895]
5540E7575895J827497j24852j441640k472601k326672j805467j360905j013690
5532D8857565l86169K97392N45459J246739J743700K181017K531359K994802L415539
5523F3427403M423084N544813O506252P294913Q682718Q941374P538406L784382
5515A16143345l79241l303523n552633n755761n284657m089234l071163j892400
5507H6814733o94786L64777O48548J120819K252230K922721M294610O091742Q830345
5498A12645739J0706499J2026820J1598278Q963549L696094j195937m073745n938780
5490A48428517o852746p924717j0140830j0729605r713690q238729o421055m666382
5482H3740763k926939j468591q48777o18336r6790J44905J188419K256097L680895
$$ y = [57575895, 59403392, 59278540, 57836900, 55364299, 53037627, 51232160, 49871255, 48857565, 48471396, 48768788, 49314247, 50560986, 52304686, 54485703, 57017062, 60011864, 63427403, 67850487, 73395300, 79901552, 87196465, 95879183, 104820557, 112358963, 116143345, 115764104, 112460581, 106907948, 101152187, 95867530, 91778296, 88707133, 86814733, 86119947, 86484724, 87133272, 88254091, 90506321, 93429042, 97723652, 103815394, 112645739, 123352238, 135379058, 146977336, 155940885, 159636979, 158441042, 154367297, 148428517, 141575771, 133651054, 123510224, 112780619, 103066929, 94828200, 88407145, 83740763, 80813824, 79345233, 78496456, 77878120, 77781330, 77926235, 79114654, 81370751, 85051646]
5473H5051646M875795N510072N209130L907355J47130m829785q307800r622893
5465H1940650r477633q289970p019086n843863m602170l723126l257380l023912
5457C6703510k458559j800664j497483j498418j119776r98963j003114j104664
5449B5221869j104481j183065j064614j131492r19634o21604p19765q13140o71175
5440A6992899p84759o53015n65004l94149p44869m81907r0387m64900l31316n68192
5430A1914401k64607m91950m03036k50820j13989j27119l37350l38673r0558j54993
5420I341306j56747j33004j45748l51960k18593K56846N2886K12283m29917k66165
5410H161187l21642j40359j45614k17969k96577l27592q1688l63062J1369J80602
$$ y = [85051646, 89927441, 95437513, 100646643, 104553998, 104701128, 99871343, 91563543, 81940650, 72463017, 64173047, 57153961, 51310098, 46707928, 42984802, 39727422, 36703510, 34244951, 32444287, 30946804, 29448386, 28328610, 27329647, 26326533, 25221869, 24117388, 22934323, 21869709, 20738217, 19818583, 19196979, 18477214, 17664074, 16992899, 16208140, 15555125, 14990121, 14595972, 13851103, 13369196, 13278809, 12813909, 12482593, 11914401, 11649794, 11157844, 10754808, 10503988, 10389999, 10262880, 9925530, 9586857, 9496299, 9341306, 9184559, 9051555, 8905807, 8553847, 8335254, 8592100, 8644986, 8857269, 8427352, 8161187, 7839545, 7699186, 7553572, 7335603, 7039026, 6711434, 6629746, 6266684, 6278053, 6458655]
5400F458655j29985j8763R4746J40160j97208j95129M8104k54815j93672j06315
5390E645778N8372J07439N3469k15425l9808k23340j63414J15224J05079j1594
5380E431780k20098Q8666K55552l55115l39906J93538j62851j11556K64084R971
5370E054065m9429j16013K76980J90652N7095K08263K39461K93954L04045J59701
5360F618774L98526K53195q864q2016j28972J41656n16803l98304j96999k14006
5350E866187j3803l55806n710j99222q4800k6131k520K5960j01039J52303J8957
5339E274376j56960M22964M57063J08372K17069M87009K29471J76814O67999Q52223
5329H736400P72431Q14281J390132Q36154j27715p83471j009408p53180q66107
$$ y = [6458655, 6328670, 6309907, 6404653, 6544813, 6347605, 6152476, 6200580, 5945765, 5752093, 5645778, 5704150, 5811589, 5865058, 5649633, 5609825, 5386485, 5223071, 5338295, 5443374, 5431780, 5211682, 5300348, 5555900, 5200785, 4860879, 5054417, 4891566, 4780010, 5044094, 5054065, 5004636, 4888623, 5165603, 5356255, 5413350, 5621613, 5861074, 6155028, 6459073, 6618774, 7017300, 7270495, 7261631, 7179615, 7050643, 7192299, 6675496, 6277192, 6080193, 5866187, 5852384, 5496578, 5490868, 5291646, 5206846, 5180715, 5178195, 5204155, 5103116, 5255419, 5274376, 5117416, 5540380, 5997443, 6105815, 6322884, 6809893, 7039364, 7216178, 7884177, 8736400, 9508831, 10323112, 11713244, 12549398, 12421683, 11638212, 10628804, 9875624, 9009517]
5320I009517p96627n93689l07003n16772l72411k91492l28240j27071j52353n7360
5310E466499k6188j80801J33175M0603J22516L8773n661J68067O6663L78514M17025
5299F619185N55274L49168P53214R16271J259620P64051L67911k65701q97525
5290A0421468q00760j040823j032419o32505o06882m17963k24969j96506m06746
5281E061895p8691k66130m03988M239J75416j16740q8029m1334j73276k01847
5271C871515K7508P7026l345R61K82600L89815R649J75889M65590M51702M9669
5260E798579J94780l08720l03781j45945m36083j28237m2780r9366o06606p3031
5250C848810K50302k59492N27N4047J09898j38480J87930L00419l80362k08896
$$ y = [9009517, 8212890, 7619201, 7312198, 6795426, 6423015, 6131523, 5803283, 5676212, 5523859, 5466499, 5440311, 5259510, 5392685, 5433288, 5555804, 5594577, 5588916, 5756983, 5823646, 6202160, 6619185, 7174459, 7523627, 8276841, 9193112, 10452732, 11216783, 11584694, 11318993, 10421468, 9620708, 8579885, 7547466, 6914961, 6308079, 5890116, 5665147, 5468641, 5061895, 4983204, 4717074, 4313086, 4317325, 4492741, 4376001, 4287972, 4246638, 4073362, 3871515, 3899023, 3976049, 3972704, 3973665, 4256265, 4646080, 4655729, 4831618, 5297208, 5748910, 5798579, 5993359, 5684639, 5380858, 5234913, 4798830, 4670593, 4627813, 4528447, 3921841, 3848810, 4099112, 3839620, 3840147, 3894194, 4004092, 3865612, 4053542, 4353961, 3973599, 3764703]
5240C764703j41775K60806k9688r6503M5803J08363J911o3272J92217p1275K78204
5229D249494L21538Q8670J66141j8181J62801J15248J06207P9848j66793k14605
5219D890368K14855L14314j18866j98512n5624R8185j00366j38925o2738P8482
5209D921173q7953o0535q8117M15481l08651k82370Q3070L03709L29732L54894
5199E580433K69694J99492K93769J02925R295M53158j5482J15921J30257O258
5189G145720k74851n14394l18063k59191l16721K3337m65539m0741J75593M808
5179E159958j3123j70508l18266j6048L0199j7455r0396K66552k35964j44982
5169D449967J77538k17491j1461K8379K43120J26265J08082L6317O3139n77599
$$ y = [3764703, 3622928, 3883734, 3854046, 3757543, 3803346, 3911709, 3913620, 3850348, 4042565, 3971290, 4249494, 4571032, 4659702, 4825843, 4807662, 4970463, 5085711, 5191918, 5271766, 5104973, 4890368, 5105223, 5419537, 5300671, 5102159, 5046535, 5144720, 5044354, 4905429, 4842691, 4921173, 4833220, 4772685, 4684568, 5100049, 4791398, 4509028, 4592098, 4895807, 5225539, 5580433, 5850127, 6049619, 6343388, 6446313, 6455608, 6908766, 6893284, 7009205, 7139462, 7145720, 6870869, 6356475, 6038412, 5779221, 5462500, 5485837, 5020298, 4979557, 5155150, 5159958, 5146835, 4976327, 4658061, 4642013, 4672212, 4654757, 4564361, 4830913, 4594949, 4449967, 4627505, 4410014, 4398553, 4426932, 4670052, 4796317, 4904399, 4940716, 5003855, 4426256]
5159D426256L05803K2361j93549r1532k27445m17746j89408k84452J07318k03059
5149C254547q3272K31461K50216l46263l90201j66809J11921o568J61023K5646
5139C041701j57629j33892l00367m2496K5641j63611L6048k61371O1562M9728
5129B155314J28300K2863k4702n3194K59809l0908J45188J01202j44039j5782
5119B544051k29588j20961k2031N4793N4133R9253q4866j21030N4433K78755J49410
5108B656352N1413k45941N9698j06458j37927K91234j28899M8851L21031j03334
5098B706020j30987j27099Q1354J13787J21238j31820j1981K02664J26912r5703
5088B854385O9995l13285J98865k911P3570J89137k3968J58800J38640J4361k45921
$$ y = [4426256, 4732059, 4754420, 4560871, 4469339, 4241894, 3824148, 3634740, 3350288, 3457606, 3254547, 3171275, 3402736, 3652952, 3306689, 2916488, 2749679, 2861600, 2855032, 3016055, 3041701, 2884072, 2750180, 2449813, 2407317, 2432958, 2269347, 2305395, 2044024, 2105586, 2155314, 2283614, 2306477, 2281775, 2228581, 2488390, 2457482, 2602670, 2703872, 2559833, 2544051, 2314463, 2193502, 2171471, 2226264, 2280397, 2379650, 2294784, 2173754, 2228187, 2506942, 2656352, 2707765, 2461824, 2521522, 2415064, 2277137, 2568371, 2439472, 2488323, 2809354, 2706020, 2575033, 2447934, 2529288, 2643075, 2764313, 2632493, 2620512, 2823176, 2950088, 2854385, 2924380, 2611095, 2809960, 2807049, 2880619, 3069756, 3045788, 3204588, 3343228, 3357589, 3111668]
5077C111668K42703M8306M2870K43716j47464o4208k00752N2759r6737N29423
5067C762284K73441j09634k36061n1957J74702j54019k0352K67265l9077J81834
5057D048426j18134l5811J86661L63394J67433P7379k0118j38701J90944L27807
5047E049280J02051J76313J6576L6121j28879J42463M24782K40951N7731o619
5037F110770M59795K32618J91543J47687J65312P1054J66521K69582J73043M93800
5027H481725N46886L31270N39839P36380Q93797J086447J378614J471292J671248
5018A7137498J620295K269776P83629j710579k118742j776927j767899j159578
5010A3277473p69208r31740m69804j86610m70661k01623k18022j64557l2290k6120
$$ y = [3111668, 3354371, 3402677, 3445547, 3689263, 3541799, 3477591, 3276839, 3329598, 3232861, 3762284, 4035725, 3926091, 3690030, 3638073, 3812775, 3658756, 3638404, 3905669, 3866592, 4048426, 3930292, 3894481, 4081142, 4444536, 4611969, 4689348, 4669230, 4530529, 4721473, 5049280, 5151331, 5327644, 5344220, 5380341, 5251462, 5393925, 5818707, 6059658, 6117389, 6110770, 6570565, 6803183, 6994726, 7142413, 7307725, 7378779, 7545300, 7814882, 7987925, 8481725, 9028611, 9359881, 9899720, 10636100, 11529897, 12616344, 13994958, 15466250, 17137498, 18757793, 21027569, 21811198, 20100619, 17981877, 16204950, 14437051, 13277473, 12508265, 11576525, 11106721, 10920111, 10449450, 10247827, 10029805, 9865248, 9832958, 9806838]
5000I806838m1899K92862j06009L27K7505Q6675l05123n0732N5226k8283L2334
4989I769721k6982J20963o6788j31084m3662L08p7317l80604l00475q000r4019
4978H762061J11719M0925p3699m4518k04532m673q0590L77670r7666k51381K94181
4967H829497k74240k12768j24606J33302n8222J41428o860K38551K42197P4886
4957H983165n9466j71971k7630j94380k8865J93383q7431r3636M5994J26315l05751
4946H379727k82432J71988L3872L37331J21046J3665m513J91010J77458O7601
4936I206753k2700j32181K03665M00872j769P048J17285M44065M8503K23230k1617
4925A0473154Q1022K98294K88206K60807J20107J30391L7578M94226P2704J51825
$$ y = [9806838, 9764939, 10057801, 9951792, 9952119, 9979624, 10066299, 9761176, 9710444, 9765670, 9737387, 9769721, 9742739, 9863702, 9796914, 9665830, 9622168, 9622476, 9545159, 9164555, 8864080, 8856080, 8762061, 8873780, 8914705, 8841006, 8796488, 8591956, 8587283, 8506693, 8884363, 8786697, 8535316, 8829497, 8555257, 8342489, 8217883, 8351185, 8292963, 8434391, 8427531, 8666082, 8908279, 8983165, 8923699, 8751728, 8724098, 8529718, 8500853, 8694236, 8606805, 8513169, 8559163, 8685478, 8379727, 8097295, 8269283, 8303155, 8640486, 8761532, 8775197, 8770684, 8961694, 9139152, 9206753, 9184053, 9051872, 9255537, 9656409, 9654640, 9661688, 9778973, 10223038, 10271541, 10494771, 10473154, 10554176, 10852470, 11140676, 11401483, 11521590, 11651981, 11689559, 12183785, 12256489, 12408314]
4915A2408314L36361L46176P0445L92391P43796O61541N35366Q02453N75549L91255
4905A7263647K78164P83115J017349J465374J937289K700605L068887L331770
4897C1846200K807494l06312k419701k465948k331247k268922k146450j353200
4889B1361914q34048m47407n59317l23466j42337l21916J14431N2695n6637L77075
4879A9220987K12972L27619N35317J50867K12839M23585M33041K38153J40993
4870B1896373M14194M71346L68738N86695P87716M05573N02718L83990P73615
4861B6590958P45873N39059Q00668N29678O63936M52418J022520R59009Q39489
4852C3143608Q92804J524299J011359J169366J298478J448958J748067J718382
$$ y = [12408314, 12744675, 13090851, 13161296, 13553687, 14297483, 14959024, 15494390, 16296843, 16872392, 17263647, 17541811, 18324926, 19342275, 20807649, 22744938, 25445543, 28514430, 31846200, 34653694, 34347382, 31927681, 29461733, 27130486, 24861564, 22715114, 21361914, 20527866, 20080459, 19521142, 19197676, 19055339, 18733423, 18847854, 18900549, 18843912, 19220987, 19433959, 19761578, 20296895, 20447762, 20660601, 21084186, 21517227, 21755380, 21896373, 22310567, 22781913, 23150651, 23737346, 24525062, 24930635, 25433353, 25817343, 26590958, 27336831, 27875890, 28676558, 29206236, 29870172, 30322590, 31345110, 32304119, 33143608, 34036412, 35560711, 36572070, 37741436, 39039914, 40488872, 42236939, 43955321]
4844D3955321J899776K170519K306718K804448L069731K845555L136327L302941
4836F5491336L400690L127799L271113L373990L483680K982450K358442K230232
4828H9719732J947805J242644J110694J000158M16059K40691J20132O22189R55099
4819I7375203Q93237J049365J565944K292219K637038L293389L678407M248585
4811A17033387M523233M712949N090899N214070N088678M720297M126991L360328
4803A53870832J527742q393j364689k105124k702562k854363l689620m308417
4795A38365406m273144l918379l413860k818267j673977r48333J59181J016489
4787A22495116J965317K800970L250687L853526M573929N130644N275889N078761
$$ y = [43955321, 45855097, 48025616, 50332334, 53136782, 56206513, 59052068, 62188395, 65491336, 68892026, 72019825, 75290938, 78664928, 82148608, 85131058, 87489500, 89719732, 91667537, 92910181, 94020875, 95021033, 95437092, 95677783, 95797915, 96420104, 97375203, 98268440, 99317805, 100883749, 103175968, 105813006, 109106395, 112784802, 117033387, 121556620, 126269569, 131360468, 136574538, 141663216, 146383513, 150510504, 153870832, 155398574, 155390181, 154025492, 151920368, 149217806, 146363443, 142673823, 138365406, 134092262, 130173883, 126760023, 123941756, 122267779, 121319446, 121478627, 122495116, 124460433, 127261403, 130512090, 134365616, 138939545, 144070189, 149346078, 154424839]
4779A54424839N205704M469510L924237K718238J372572m66488k425173l707606
4771A65515833l794170m490707m623661m189704l447600k785318k372064j387968
4763A38424641n00096J45167J117680K108171K875057L818116M751238N341716
4755A58081690N352124N345501M770814M051189L539035L143459K711430K093338
4747A89088580R64479k52735j404815k612932l353899l552331k887770k287869
4739A73700708j905089p27055l64286O91645J900331L213751M545345N701777
4731A86757127O887344Q027998Q684019P928109N984677K248492k208416n898377
4723B18410973o857864p326966p611932o924666o372910n588367n012784m304012
$$ y = [154424839, 159630543, 164100053, 168024290, 170742528, 172115100, 171648612, 169223439, 165515833, 161721663, 157230956, 152607295, 148417591, 144969991, 142184673, 139812609, 138424641, 137924545, 138069712, 139187392, 141295563, 144170620, 147988736, 152739974, 158081690, 163433814, 168779315, 173550129, 177601318, 181140353, 184283812, 186995242, 189088580, 190053059, 189800324, 188395509, 185782577, 182428678, 178876347, 175988577, 173700708, 171795619, 171068564, 170704278, 171395923, 173296254, 176510005, 181055350, 186757127, 193644471, 201672469, 210356488, 218284597, 224269274, 226517766, 224309350, 218410973, 211553109, 204226143, 196614211, 189689545, 183316635, 177728268, 172715484, 168411472]
4715A68411472l707059k717692j602297n02216J144390K960758M599513O109633
4707A74696502O484449O155477N310012L911008J893870n01287l918997p577502
4699A86453532j0288824j1559651j1707685j0678776q611567p105306n693444
4692A20808279m228785l026933k167416j727512j502900n82660N49680J456441
4684A09578194K796070L533155M104972M304872K915574J32878l789918o684695
4676A16891102p821973p878497p323484o414879n722352n168616m623612m304470
4668F7633219l745456l285564l054861k605854k451452k191546j854159j713106
4660D6731221j754904j297457q94460q56320n93066p19621p70739p08697m45527
$$ y = [168411472, 164704413, 161986721, 160384424, 159882208, 161026598, 163987356, 168586869, 174696502, 181180951, 187336428, 192646440, 196557448, 198451318, 197950031, 194031034, 186453532, 176164708, 164605057, 152897372, 142218596, 133607029, 126501723, 120808279, 116579494, 113552561, 111385145, 109657633, 108154733, 107572073, 108121753, 109578194, 112374264, 115907419, 120012391, 124317263, 127232837, 127365715, 123575797, 116891102, 109069129, 101190632, 93867148, 87452269, 81729917, 76561301, 71937689, 67633219, 63887763, 60602199, 57547338, 54941484, 52490032, 50298486, 48444327, 46731221, 44976317, 43678860, 42784400, 41928080, 41335014, 40615393, 39844654, 39135957, 38690430]
4651C8690430m96837r73320r39710q12717p17206r72664j225121r53156j406880
4642C0192819j275154j187150p68264j040634r85808p26357j317935q47041n46384
4633B1498092o69602o16307m81887n27921o85808l12308o07807n33960K50406
4624A7312898m11271k80995l31680n04720j01567l46513k87060l48254o29401
4615A4071437k33514m55107l98819k57925l52087k78394k47512j11679j06315
4606A1630085l01811k10705l17190j37091r4118k78448m28529o9210k55867J2473
4596I549589K0835j88645r8341j21732l41357j23720m4648o2382j13345k48558
4586H227696k20504o6079j1073j74085n8788j31362k03252k86006J74961k55493
$$ y = [38690430, 38193593, 37220273, 36280563, 35467846, 34750640, 33777976, 32552855, 31599699, 30192819, 28917665, 27730515, 26962251, 25921617, 24935809, 24209452, 22891517, 22044476, 21498092, 20828490, 20212183, 19730296, 19202375, 18516567, 18204259, 17596452, 17062492, 17312898, 16901627, 16620632, 16288952, 15784232, 15682665, 15336152, 15049092, 14700838, 14071437, 13837923, 13382816, 12983997, 12726072, 12373985, 12095591, 11848079, 11736400, 11630085, 11328274, 11117569, 10800379, 10663288, 10569170, 10290722, 9862193, 9792983, 9537116, 9549589, 9570424, 9381779, 9283438, 9161706, 8820349, 8696629, 8651981, 8589599, 8476254, 8227696, 8007192, 7941113, 7930040, 7755955, 7697167, 7565805, 7362553, 7076547, 7251508, 6996015]
4576F996015r6792j18107j59222k10742L13431K888j30465j40971M1676J03046
4566F600757k54754j58008j03869J02877J27479J52715j34195k62806o7260r8358
4556E904578K43447k15072j95777j83103P5571m2170L0975k91984M881J70041
4546E501387p7213p7017l10977Q9356K15363P0812j31978J01121P3312j77450
4536E276716N8222K46165q7657J51073k42608R1276J20197j98354m8562M3024
4526E409492k34766r4711q9559M6271N8064n313M5682J46156l68178P5036J08763
4515E096937J44210j15548P4277j71628m05332P8205K90889O2241j82121R8039
4505D970169K5917j47713j5079K34892j2178P1043j07898J70139o2056m22543
$$ y = [6996015, 6899223, 6781116, 6621894, 6411152, 6724583, 6727471, 6597006, 6456035, 6497711, 6600757, 6346003, 6187995, 6084126, 6187003, 6314482, 6467197, 6333002, 6070196, 6002936, 5904578, 6148025, 5932953, 5737176, 5554073, 5629644, 5587474, 5618449, 5326465, 5331346, 5501387, 5424174, 5347157, 5036180, 5125536, 5340899, 5411711, 5279733, 5380854, 5454166, 5276716, 5334938, 5581103, 5493446, 5644519, 5401911, 5493187, 5613384, 5415030, 5366468, 5409492, 5174726, 5080015, 4990456, 5036727, 5094791, 5089478, 5135160, 5281316, 4913138, 4988174, 5096937, 5241147, 5125599, 5199876, 5028248, 4622916, 4701121, 4992010, 5054251, 4872130, 4970169, 4996086, 4848373, 4833294, 5068186, 5056008, 5127051, 5019153, 5189292, 5127236, 4704693]
4495D704693O0705J15622M9284J76877P5727J67268k83128l9308J24507L17252
4485E469499J80326k16006l78591K758L36389j0820l07941j51829K59636L0832
4475E214253K1224M5214j52914m4510L7030K06928k1720k9911Q6661L49917n8534
4464E653638j69264N7978l8857M0973j70775L68353j29541J89750K5826j71048
4454E657033M5019j77488N9565O5205P138j96220Q8187L5643j4225M3299L67741
4443E980897J43985m53395J8275k46019j57325K34169K69418K74814l00820O1155
4433E825154J87142j11787j55199J8863J42974M8242j11680j43555Q3537j7877
4423E765814K42784j72318j799j22855r298J1364J6779J29556K88445R3225k15188
$$ y = [4704693, 4765398, 4881020, 4930304, 5107181, 5182908, 5350176, 5067048, 5027740, 5152247, 5469499, 5649825, 5433819, 5055228, 5057986, 5394375, 5383555, 5075614, 4923785, 5183421, 5214253, 5235477, 5280691, 5127777, 5083267, 5120297, 5327225, 5305505, 5275594, 5362255, 5712172, 5653638, 5484374, 5542352, 5503495, 5544468, 5373693, 5742046, 5612505, 5802255, 5828081, 5657033, 5702052, 5524564, 5584129, 5649334, 5656472, 5460252, 5548439, 5584082, 5569857, 5613156, 5980897, 6124882, 5671487, 5689762, 5443743, 5286418, 5520587, 5790005, 6064819, 5763999, 5825154, 6012296, 5900509, 5745310, 5764173, 5907147, 5955389, 5843709, 5700154, 5783691, 5765814, 6008598, 5836280, 5834481, 5711626, 5702328, 5713692, 5730471, 5860027, 6148472, 6241697, 6026509]
4412F026509R091r2235l6288J45139J07341p2260K36317N0358k1778K70689J85075
4401F807958P2536O0045m113J70584p1034j14272L15206q243l50951J55936J5852
4390G049504k9568j49736N0324o0665J53032K70975J38927j3369l3368K9741J4039
4379G419836J24794j53296p0567K13232L0740K39057K16907k01212j1131N0302
4369G858662p9815K66307p2951R4370N8678J89366j46319J22357J9023q2999j81515
4358H045164J33493K81405P2816j7551Q7843K99688l4487J84799j26948J30046
4348I056268L23184j53586L4593L22557K31956J58387k10257M0220M09161O4152
4338A0276635J25714K75998P6290k44413J37229K25303j83952K62934K80417K23139
$$ y = [6026509, 6035600, 5943365, 5907077, 6052216, 6159557, 6087297, 6323614, 6373972, 6352194, 6622883, 6807958, 6880494, 6940539, 6936426, 7107010, 7035976, 6921704, 7236910, 7228667, 6877716, 7033652, 7049504, 7019936, 6870200, 6920524, 6859859, 7012891, 7283866, 7422793, 7409424, 7376056, 7405797, 7419836, 7544630, 7391334, 7320767, 7533999, 7564739, 7803796, 8020703, 7819491, 7808360, 7858662, 7778847, 8045154, 7972203, 8066573, 8125251, 8314617, 8168298, 8290655, 8309678, 8226679, 8045164, 8178657, 8460062, 8532878, 8515327, 8603170, 8902858, 8868371, 9053170, 8926222, 9056268, 9379452, 9225866, 9260459, 9583016, 9814972, 9973359, 9763102, 9803322, 10212483, 10276635, 10402349, 10678347, 10754637, 10510224, 10647453, 10872756, 10688804, 10951738, 11232155, 11455294]
4328A1455294K47399K70986j4328M8935J97017M92752K30192K90892K83069M61168
4318A3963376L08587N72314K23268N22753M01010Q29394R08602J171545J650541
4309B0551390K072322K887623M131342M460813M767777J01384n351816n047745
4301B8573090l858711k546857j849419j449528r99611p34992n59245j67771q6941
4292A6320015L5019l26078J73962J30331O3428j80818j55693k5439k8014L20202
4282A6326915J9085J5344J86483K73204K3926P0277J27777L8017L77741L47481
4272A7806250L51723R6577Q9403L08322K61695L25353M99345L16983q9541M81615
4262B0447725O95181M01776O08651R8063L21027M83166O70722M87330M80561M50166
$$ y = [11455294, 11702693, 11973679, 11959351, 12008286, 12205303, 12698055, 12928247, 13219139, 13502208, 13963376, 14271963, 14844277, 15067545, 15590298, 15991308, 16820702, 17729304, 18900849, 20551390, 22623712, 25511335, 29642677, 34103490, 38871267, 38972651, 33620835, 28573090, 24714379, 22167522, 20318103, 18868575, 17868964, 17133972, 16574727, 16406956, 16320015, 16355034, 16028956, 16202918, 16333249, 16396677, 16215859, 16060166, 16034727, 16006713, 16326915, 16346000, 16361344, 16547827, 16821031, 16844957, 16915234, 17043011, 17081028, 17458769, 17806250, 18157973, 18254550, 18343953, 18652275, 18913970, 19239323, 19738668, 20055651, 19966110, 20447725, 21142906, 21544682, 22153333, 22251396, 22572423, 23055589, 23726311, 24213641, 24694202, 25144368]
4252B5144368N34063M65981M77629O78133P10252K35838O24098M77684O54005
4243C0002051P75501O17134J001190P63218N13916O80457P54981J029758R56844
4234C7095050P18874J039193J107316J174427J057478R99739J051465J385224
4226D5628766J331331J534763J526500J528145J564650J384764J465806J697153
4218E7661878J614047J811596K167645J980025J795595K081829K067624K024610
4210G3204849K257690K278383J928554K477847K328888K338745K517902K326993
4202I1659851K567473K625825K649060K932637L063957L001345L473430K989323
4194A14962901L108614L069414L023721L271706L082497L482817L402774L565744
$$ y = [25144368, 25678431, 26144412, 26622041, 27300174, 28010426, 28246264, 28870362, 29348046, 30002051, 30777552, 31394686, 32395876, 33159094, 33673010, 34353467, 35108448, 36138206, 37095050, 37813924, 38853117, 39960433, 41134860, 42192338, 43192077, 44243542, 45628766, 46960097, 48494860, 50021360, 51549505, 53114155, 54498919, 55964725, 57661878, 59275925, 61087521, 63255166, 65235191, 67030786, 69112615, 71180239, 73204849, 75462539, 77740922, 79669476, 82147323, 84476211, 86814956, 89332858, 91659851, 94227324, 96853149, 99502209, 102434846, 105498803, 108500148, 111973578, 114962901, 118071515, 121140929, 124164650, 127436356, 130518853, 134001670, 137404444, 140970188]
4186A40970188L622710L480793L583617L427240L908022M063730L711403L476561
4178A70244264L654788L174435L175924L691982L145099K483161K390955K290347
4170A94250955K256971K141753J880885J584517J574921J713517J514025J270642
4162B08188186N34161M84852n72993r49937j284581j689325j995117k297412k566612
4153A97851222k216136k047325k147204k113821k627421k917509k897802l260788
4145A77623216l664895l730136m018026l774783m317485m372528m049309m049854
4137A45646200l826696l847205l819768l638596l236434l682080l247404k730915
4129A17617102k741665k495664k049839j699396j824606j991823k065501j759068
$$ y = [140970188, 144592898, 148073691, 151657308, 155084548, 158992570, 163056300, 166767703, 170244264, 173899052, 177073487, 180249411, 183941393, 187086492, 189569653, 191960608, 194250955, 196507926, 198649679, 200530564, 202115081, 203690002, 205403519, 206917544, 208188186, 208722347, 209207199, 208634206, 207684269, 206399688, 204710363, 202715246, 200417834, 197851222, 195635086, 193587761, 191440557, 189326736, 186699315, 183781806, 180884004, 177623216, 173958321, 170228185, 166210159, 162435376, 158117891, 153745363, 149696054, 145646200, 141819504, 137972299, 134152531, 130513935, 127277501, 123595421, 120348017, 117617102, 114875437, 112379773, 110329934, 108630538, 106805932, 104814109, 102748608, 100989540]
4121A00989540j765397j174014r91897j053417q54842q17574l97889k21108l02122
4112I3411280N6317L2723J50809K06216J69733M8026Q6674J50327M30347Q44612
4102I5587064J608308J956516K689676K860893K364726J781660J035960N03177
4094A10387980m8940J24849K55164M09035N51900N71467O56539N24804L45206
4085A13778004O11321Q54212Q36543R37734Q45187O15144M71781M08264P60008
4076A20118198Q39096J436269K402933K999603L652522M035177M331659L945790
4068A43761247L203171K727438K445697K111150K212572K033141J535895J500304
4060A61530615R64912J000071R81657M51122n8437k17540j92108l59039M7648
$$ y = [100989540, 99224143, 98050129, 97058232, 96004815, 95149973, 94332399, 93934510, 93713402, 93411280, 93467597, 93500320, 93651129, 93857345, 94027078, 94075104, 94161778, 94312105, 94742452, 95587064, 97195372, 99151888, 101841564, 104702457, 107067183, 108848843, 109884803, 110387980, 110339040, 110463889, 110719053, 111128088, 111679988, 112251455, 112907994, 113432798, 113778004, 114389325, 115243537, 116080080, 117017814, 117863001, 118478145, 118949926, 119358190, 120118198, 120957294, 122393563, 124796496, 127796099, 131448621, 135483798, 139815457, 143761247, 146964418, 149691856, 152137553, 154248703, 156461275, 158494416, 160030311, 161530615, 162495527, 163495598, 164477255, 164928377, 164869940, 164652400, 164460292, 164101253, 164148901]
4051A64148901P4809P41048Q90761L16125o0255j12561n20628k82714m56412l25792
4041A64413282m5938L16184O45801O37697Q09861O67995O66114J7489m78439o04143
4031A67045903n35373p51956m61463j409982j752537k041556j298164j384523
4023A57410349k028630k901202l691591l760076l693331l511886k842888j864986
4015A33115759j572158n83691n65244m51810p09534q84971j141609j210183j237094
4006A24759465j287253j171806j295618j368961j512820j467917j279901r56033
3998A14419156j41255K66154Q4573m40752j150030k040008l175955l125697k957175
3989A01739011k515258k577703k171821j992424k128855k252974k232212k289080
$$ y = [164148901, 164223710, 164964758, 165855519, 166171644, 166111389, 165998828, 165478200, 165195486, 164739074, 164413282, 164367344, 164683528, 165329329, 165967026, 166776887, 167444882, 168110996, 168128485, 167650046, 167045903, 166510530, 165758574, 165297111, 163887129, 162134592, 160093036, 158794872, 157410349, 155381719, 152480517, 148788926, 145028850, 141335519, 137823633, 134980745, 133115759, 131543601, 130959910, 130394666, 129942856, 129233322, 128348351, 127206742, 125996559, 124759465, 123472212, 122300406, 121004788, 119635827, 118123007, 116655090, 115375189, 114419156, 114277901, 114544055, 114628628, 114187876, 113037846, 110997838, 107821883, 104696186, 101739011, 99223753, 96646050, 94474229, 92481805, 90352950, 88099976, 85867764, 83578684]
3981H3578684k285099k005888j594026j639002j505322j482080j556106j111899
3973G0399262j084625j181094r92581q94518p24905j175531j439723j327757j598526
3964E9980002j662869j588092j078476j203219j219703j058436j144323q35434
3956E0189450q77044j104996p70966p25415o83530o84609m36337p18186j138754
3947D3049613p04303j110552q33236o22794o95437n37206o82094m75058j54138
3938C7234795m89988j93307K48798j46240r5572k17656L36456k63891j10464K85304
3928C6588235n0020K23429O1620J57845K25189R1985K72392L3155p0629K38911
3918C7772112J52958J38518L85697M05893K25764q4576J77353K55800L46355L32301
$$ y = [83578684, 81293585, 79287697, 77693671, 76054669, 74549347, 73067267, 71511161, 70399262, 69314637, 68133543, 67140962, 66246444, 65521539, 64346008, 62906285, 61578528, 59980002, 58317133, 56729041, 55650565, 54447346, 53227643, 52169207, 51024884, 50189450, 49312406, 48207410, 47436444, 46711029, 46027499, 45342890, 44906553, 44188367, 43049613, 42345310, 41234758, 40401522, 39778728, 39083291, 38546085, 37863991, 37388933, 37234795, 36744807, 36551500, 36800298, 36654058, 36558486, 36340830, 36677286, 36413395, 36302931, 36588235, 36538215, 36761644, 36823264, 36981109, 37206298, 37298283, 37570675, 37603830, 37533201, 37772112, 37925070, 38063588, 38449285, 38855178, 39080942, 38996366, 39173719, 39429519, 39775874, 40108175]
3908D0108175L24273N20096M75939J75807N07272J07369K02716P14091N89228
3899D3724966K77781P54934R08831Q80852O23569Q49660J019456Q25710R55976
3890E0821735J527352J150363J236890J498254J552522J450527J307092J845322
3882F2390057K235002K012184K142912K404259K534585K761410K879090K963036
3874H2322535L008298L049283L251139L102685K887722K314504J922956K313178
3866A04172300J586713J499576J450598J518696J478465J943247J435661J617653
3858A16702909J769242J285711J143396N10940L00112o4913n96273m37465p90458
3849A19823201r21777o46354k19061r6353J79552K71286K85930L60557J031843
$$ y = [40108175, 40432448, 40952544, 41428483, 41604290, 42111562, 42218931, 42421647, 43135738, 43724966, 44002747, 44757681, 45666512, 46547364, 47170933, 48020593, 49040049, 49865759, 50821735, 52349087, 53499450, 54736340, 56234594, 57787116, 59237643, 60544735, 62390057, 64625059, 66637243, 68780155, 71184414, 73718999, 76480409, 79359499, 82322535, 85330833, 88380116, 91631255, 94733940, 97621662, 99936166, 101859122, 104172300, 105759013, 107258589, 108709187, 110227883, 111706348, 113649595, 115085256, 116702909, 118472151, 119757862, 120901258, 121412198, 121712310, 121647397, 121051124, 120613659, 119823201, 118901424, 118255070, 118036009, 117939656, 118119208, 118390494, 118676424, 119036981, 120068824]
3840A20068824Q38706J030690J646094J816673J656136K191071K774281L032973
3832A35055448L307559L745951L608490L821422M444763M647666N212524O133960
3824A69977783O323432P165639P619134Q183151Q695808Q888176R315261R044537
3816B35212921Q624582Q346122P923388P554232P168976O711778O614898O504246
3808B94661143O188860O038076O091206N687032M968566M303480L457509K096703
3800C33492575J369926O6661q17547j878408k526449k720692k938926k494590
3792C21552550k163158j613025j516793j485300j026450n31890p37012q52652
3784C11626270n11712l81529k40926M68397J235887K026537L121735L436271M298839
$$ y = [120068824, 120907530, 121938220, 123584314, 125400987, 127057123, 129248194, 132022475, 135055448, 138363007, 142108958, 145717448, 149538870, 153983633, 158631299, 163843823, 169977783, 176301215, 183466854, 191085988, 199269139, 207964947, 216853123, 226168384, 235212921, 243837503, 252183625, 260107013, 267661245, 274830221, 281541999, 288156897, 294661143, 300850003, 306888079, 312979285, 318666317, 323634883, 327938363, 331395872, 333492575, 334862501, 334929162, 334111615, 332233207, 329706758, 326986066, 324047140, 321552550, 319389392, 317776367, 316259574, 314774274, 313747824, 313215934, 312478922, 311626270, 311114558, 310733029, 310492103, 310960500, 312196387, 314222924, 317344659, 320780930, 325079769]
3775C25079769N563184O746126P737905Q436002Q131570O981190N415450L630229
3767C77721425J381127j145812l412166m631132n721730n683130n511816n544802
3759C47451964n469263n135017n879642o755831q225271r299497j0708960j2025130
3751B83953353j3012177j3581485j4175799j4180451j3610934j2732812j1847144
3744A90812551j0687656r850041r031257q279229p369717o108224n272825m506959
3736A29706643l858705k946256k601961k221238j960975j156210j053611q88298
3728A13019389o29127q7916j70021m73931m94218j87196k27243k99116k81782
3719A10168839j36927M6929L27226M24954N04153N40119N11706K96827J23156
$$ y = [325079769, 330642953, 337389079, 345126984, 353562986, 361694556, 368675746, 374091196, 377721425, 379102552, 377956740, 374544574, 369913442, 364191712, 358508582, 352996766, 347451964, 341982701, 336847684, 330968042, 324212211, 315986940, 306687443, 295978483, 283953353, 270941176, 257359691, 243183892, 229003441, 215392507, 202659695, 190812551, 180124895, 170274854, 161243597, 152964368, 145594651, 139486427, 134213602, 129706643, 125847938, 122901682, 120299721, 118078483, 116117508, 114961298, 113907687, 113019389, 112390262, 112302346, 112132325, 111658394, 111164176, 110976980, 110749737, 110450621, 110168839, 110031912, 110078841, 110406067, 110831021, 111335174, 111875293, 112386999, 112683826, 112806982]
3710A12806982l41890n55153p06189r76354o06584j221264r89060j002036r77536
3701A05430916n90370o82090m84311l35657l92020j16056J02205m94404k21395
3692A02216818m54859l23763m00592L289m52145n95123m55519j94237k41941J60805
3682I9262733N47312K50232O12826P52738J070783J232987J082205R29019J079115
3673A06819950R02112R29419J348063J431981J420561J753756J716652K043004
3665A18365498K473986K687976K945474L118451L387374L578020M606353N301685
3657A46464817N277313O538623P532660Q571228R570375J1282412J2845347J4914040
3649B22996815J7530018K0165226K2903696K6540651K9423948L0820453L1718660
$$ y = [112806982, 112465092, 111909939, 111203750, 110227396, 109620812, 108399548, 107410488, 106408452, 105430916, 104840546, 104158456, 103674145, 103338488, 102946468, 102830412, 102932617, 102438213, 102216818, 101761959, 101438196, 101037604, 101040893, 100588748, 99993625, 99538106, 99343869, 99101928, 99262733, 99810045, 100060277, 100673103, 101425841, 102496624, 103729611, 104811816, 105740835, 106819950, 107722062, 108651481, 109999544, 111431525, 112852086, 114605842, 116322494, 118365498, 120839484, 123527460, 126472934, 129591385, 132978759, 136556779, 141163132, 146464817, 151742130, 158280753, 165813413, 174384641, 183955016, 195237428, 208082775, 222996815, 240526833, 260692059, 283595755, 310136406, 339560354, 370380807, 402099467]
3642D02099467L0492898K7908031K2970304J6810538J0769860M682567l22332
3635E15411333l714039n323192n016057l346219j762342k69476O47404J29835
3627D96757247j608344m732934r530133j5635390k1706334k6786699l0094010
3620C86663403l2092481l2118952l0682827k8055709k4844564k1878234j8614878
3613A98375758j5602038j3688816j2024403r980881q833457p975972p232120o690894
3605A16347177n668283m794653m669516m267828l552619l639058l344248k995348
3597H3415624l062665k342879k301025k382377j919047j415058j615034j741210
3589F6636329j537490j364164j207683r70371j053157j143449r88712q90407r79413
$$ y = [402099467, 432592365, 460500396, 483470700, 500281238, 511051098, 515733665, 515411333, 511697294, 506374102, 501358045, 498011826, 496249484, 495980008, 496627412, 496757247, 495148903, 490415969, 480885836, 465250446, 443544112, 416757413, 386663403, 354570922, 322451970, 291769143, 263713434, 238868870, 216990636, 198375758, 182773720, 169084904, 157060501, 147079620, 138246163, 130270191, 123038071, 116347177, 110678894, 105884241, 101214725, 96946897, 93394278, 89755220, 86410972, 83415624, 80352959, 78010080, 75709055, 73326678, 71407631, 69992573, 68377539, 66636329, 65098839, 63734675, 62526992, 61556621, 60503464, 59360015, 58371303, 57480896, 56501483]
3580E6501483p03639n94307n43188l57388n98884o63973m61860l92518o13392
3571E1572334n25557l52163l07767m88671P300l23491q1069M7861k26465k27481
3561D9094831m31266j21028l88584k22647R4489N8157j62121J25992K49986j1330
3551D8286479L25403J5813k44777J63220L45192l8812R8970J14609L6702J60861
3541D9263660N20140N27329L89062K32282K71198P21482L81369N98411M28729
3532E3333662O94127N99199O78945N24979P72715O11264P35101Q77518Q05029
3523E9632539Q88749P07652J156452R52861J117993Q21567Q03037O71278Q50874
3514F7603002O88577N13795J147333J409350J099726Q79545J005637J052202J389337
$$ y = [56501483, 55797844, 55203537, 54660349, 54302961, 53704077, 53040104, 52578244, 52185726, 51572334, 51046777, 50694614, 50386847, 49898176, 49905476, 49581985, 49500916, 49548777, 49322312, 49094831, 48663565, 48542537, 48153953, 47931306, 48025795, 48083952, 47921831, 48047823, 48297809, 48286479, 48611882, 48627695, 48382918, 48546138, 48891330, 48852518, 48951488, 49066097, 49102799, 49263660, 49783800, 50311129, 50700191, 50932473, 51203671, 51925153, 52306522, 52904933, 53333662, 54027789, 54626988, 55305933, 55830912, 56603627, 57214891, 57949992, 58827510, 59632539, 60521288, 61228940, 62385392, 63338253, 64456246, 65277813, 66080850, 66752128, 67603002, 68291579, 68805374, 69952707, 71362057, 72461783, 73341328, 74346965, 75399167, 76788504]
3505G6788504J492565J480394J282974J340468J768747K071073K344232K174908
3497I0743865K754504K835632L413356L443459L943601M374514M874474N142285
3489A21525690N558805O275414O582450P036658O978412O894428O809698O310348
3481A73971903M596712K959106R79551j930589m449542o385576p286179p238318
3473A55217068o255726n803720m840948l766500l590544l563472m125923m157119
3465A19113116l795866l502224l203257k658698k723378k467327k169850j928546
3457I6663970j578965j223987j352154j040505j190289r83124o85815o44941p36095
3448H7228095n80578m63920o02949m12896J96855L7010R0185P79454O25567J325724
$$ y = [76788504, 78281069, 79761463, 81044437, 82384905, 84153652, 86224725, 88568957, 90743865, 93498369, 96334001, 99747357, 103190816, 107134417, 111508931, 116383405, 121525690, 127084495, 133359909, 139942359, 146979017, 153957429, 160851857, 167661555, 173971903, 178568615, 181527721, 182507272, 180576683, 176127141, 169741565, 162455386, 155217068, 148961342, 143157622, 138316674, 134550174, 130959630, 127396158, 123270235, 119113116, 115317250, 111815026, 108611769, 105953071, 103229693, 100762366, 98592516, 96663970, 95085005, 93861018, 92508864, 91468359, 90278070, 89294946, 88609131, 87964190, 87228095, 86647517, 86183597, 85580648, 85167752, 85364607, 85401617, 85491802, 86271256, 86896823, 88222547]
3438H8222547K331600K199315J544618k06360j665047j351241j839720m178031
3430H5057681m645530m290730l656335k660278j779229j706158j499085q81024
3422F3939312r00154p26716k08116m43749n94252j20196k30254l52401J82340
3413F0545814J42008L1457N63141Q23577R81860J699905K464296K401925K662231
3404G2316214P04558k083145l046374k960122k240030j848757j610878j246569
3396E7984897r28793o93038r72113k34635J00437l92555J03670J68509J82568
3387E5318947L43090j76888J53236O33508Q70079R68993J643942J132286m15856
3378F0471337j264479j526680j447447q05922p76360n25687l45415l1233m93765
$$ y = [88222547, 90554147, 92753462, 94298080, 94091720, 92426673, 91075432, 89235712, 85057681, 80412151, 76121421, 72465086, 69804808, 68025579, 66319421, 64820336, 63939312, 63039158, 62312442, 62104326, 61660577, 61066325, 60946129, 60715875, 60363474, 60545814, 60687822, 60719279, 61282420, 62105997, 63087857, 64787762, 67252058, 69653983, 72316214, 73020772, 70937627, 67891253, 64931131, 62691101, 60842344, 59231466, 57984897, 57056104, 56363066, 55390953, 55156318, 55256755, 54864200, 54967870, 55136379, 55318947, 55662037, 55485149, 55638385, 56271893, 57141972, 58110965, 59754907, 60887193, 60471337, 59206858, 57680178, 56232731, 55426809, 54650449, 54124762, 53779347, 53748114, 53254349]
3369E3254349n4925O6938M3329K42573n2162O2696K53786L23571L51993L62773
3359E4854921J36686K97191M94551R33999P47119J280865J342094R33154l46692
3350F0673888j810470j493988j347545j030316n47597p55610l52536l25668n77257
3341E2432901l17539m16420k63671k28605m87018k64382l89271k16349k47225
3332D9602421m56829n96444k34836n95444l02566l78075m68073k92646k23969
3323D6053539m18484n87007o31964m79861l07799l20612j50570n08385k79432
3314D2369425m62945p15995k49059k45680l26279n86036n83247j05996k69488
3305C8824700m60874o01059k38438l53560l95848m56389m79120o63201k35804
$$ y = [53254349, 53199424, 53266362, 53309691, 53552264, 53500102, 53562798, 53816584, 54140155, 54492148, 54854921, 54991607, 55288798, 55783349, 56717348, 57464467, 58745332, 60087426, 61020580, 60673888, 58863418, 57369430, 56021885, 54991569, 54443972, 53688362, 53335826, 53010158, 52432901, 52115362, 51698942, 51435271, 51206666, 50719648, 50455266, 50065995, 49849646, 49602421, 49145592, 48549148, 48314312, 47718868, 47416302, 47038227, 46570154, 46277508, 46053539, 45635055, 45048048, 44416084, 43936223, 43628424, 43307812, 43157242, 42648857, 42369425, 41906480, 41190485, 40941426, 40695746, 40369467, 39783431, 39200184, 39094188, 38824700, 38363826, 37762767, 37524329, 37170769, 36774921, 36318532, 35839412, 35176211, 34940407]
3296C4940407l79532m04845k56290l51991l22892k87095k10792l76542m61370
3287C1889058k20169q8983k34648m55597l18453k56453l19547k31450l91424j6449
3277B9355885o17531o19969k14623m49155j98063l12695m53375j57599j95418
3268B6137457l34344m78429J00793k32270m27177p6900l12782k50877k61093j57976
3258B3706402k08850j60086k90713K0381j63776n1156j09937j57410L1340k07423
3248B2408772m9549k15398j79273l02431j80986m7944k13435J26322p6057l5662
3238B1234359j49052j52557q6941j78373J67334R4838K16671p5297j15730K10246
3228B1165498j85380J77727M50247K67331m2068k99593J42917j80798l69769j01125
$$ y = [34940407, 34560875, 34156030, 33899740, 33547749, 33224857, 32937762, 32726970, 32350428, 31889058, 31668889, 31579906, 31345258, 30889661, 30571208, 30314755, 29995208, 29763758, 29372334, 29355885, 28738354, 28118385, 27903762, 27454607, 27256544, 26943849, 26490474, 26332875, 26137457, 25803113, 25324684, 25425477, 25193207, 24766030, 24689130, 24376348, 24125471, 23864378, 23706402, 23497552, 23337466, 23046753, 23067134, 22903358, 22852202, 22742265, 22584855, 22616195, 22408772, 22359223, 22143825, 21964552, 21662121, 21481135, 21433191, 21219756, 21346078, 21270021, 21234359, 21085307, 20932750, 20845809, 20667436, 20834770, 20929608, 21146279, 21070982, 20955252, 21165498, 20980118, 21157845, 21608092, 21875423, 21833355, 21533762, 21676679, 21495881, 21126112, 21024987]
3218B1024987M43215P772p1604J36981R6850k87543J78611K15573P350M8153O0950
3207B1861295Q0105k61703J71413J60237J87754j22056k44944L07884K53851M71355
3197B2865191L56982L12632R5572O51833O63082p13Q6457K2329J11934L34211
3187B5499510L52171K02009L73562N36815O20325N99123L68978K88961M78343
3178B9319797K59610N65898M65832N70859L97980O62124O68216N39409M11091
3169C3860816N48642P79686L76259M74893K87490K13989K96168K10737L27648
3160C7376328K96078K18835N67824M70981K09241N07325N19321O92448J080415
3151D1938796J207603J127651J131360J457385J535830J763364J691265J860702
$$ y = [21024987, 21468202, 21475974, 21404370, 21541351, 21638201, 21350658, 21529269, 21744842, 21752192, 21800345, 21861295, 21941400, 21679697, 21851110, 22011347, 22199101, 22077045, 21832101, 22139985, 22393836, 22865191, 23222173, 23534805, 23630377, 24282210, 24945292, 24944579, 25031036, 25053365, 25165299, 25499510, 25851681, 26053690, 26427252, 26964067, 27584392, 28183515, 28552493, 28841454, 29319797, 29579407, 30145305, 30611137, 31181996, 31579976, 32242100, 32910316, 33449725, 33860816, 34409458, 35189144, 35565403, 36040296, 36327786, 36541775, 36837943, 37048680, 37376328, 37672406, 37891241, 38459065, 38930046, 39139287, 39646612, 40165933, 40858381, 41938796, 43146399, 44274050, 45405410, 46862795, 48398625, 50161989, 51853254, 53713956]
3143E3713956J737754K110952J979499R47098O79385l7748o19917j343826j848888
3134E7318265k201699k044778j771741j055285r19893n85820k8496K5774K99194
3125D9035521O11952O93983P27612J064981J198731J456556J552188J408085J311665
3116E9061274J172474R76830J099059Q50031K51577n63925m96142j122513j572455
3107E9656210j680705k146210k332000k194481j986281j851516j387131j307125
3099D4770761r58343n76700k83064k24292j91363J90838M24014N8123J90683K64902
3089D3665559j87049l63459k57305n73586r48634r65033j353624j913910j786541
3080C5316418j576899j488054j877048j418225j071959j303981r26449j051496
$$ y = [53713956, 55451710, 57562662, 59542161, 60489259, 61168644, 61130896, 60510979, 59167153, 57318265, 55116566, 53071788, 51300047, 50244762, 49324869, 48739049, 48710553, 48736327, 49035521, 49647473, 50341456, 51069068, 52134049, 53332780, 54789336, 56341524, 57749609, 59061274, 60233748, 61210578, 62309637, 63159668, 63411245, 62847320, 62351178, 61228665, 59656210, 57975505, 55829295, 53497295, 51302814, 49316533, 47465017, 46077886, 44770761, 43812418, 43235718, 42952654, 42728362, 42536999, 42727837, 43151851, 43209974, 43400657, 43665559, 43478510, 43115051, 42857746, 42284160, 41335526, 40370493, 39016869, 37102959, 35316418, 33739519, 32251465, 30374417, 28956192, 27884233, 26580252, 25653803, 24602307]
3072B4602307p98830l31786p10601q68343n81611k12421n46330n28117l96781
3063A9627487l38698l98536m42100k00610l00268m12583m84379n64237l68107
3054A6117969o10322o68156l43897m07730n48797l31776k78250n85988m07884
3045A1935169j29148j89877j88582l37165n09341r6792j29407R3336k32155k03646
3035A0012392k27067j56570l69280j34533N8355j38707K4144k92269k71181J19787
3025H625071q8970k47190k58927j01981L6341L904m3592l22661k63979O7148l84938
3014G020226o9999j31626p7258l69473j1443l253j40386j04339j37039R5042N6206
3003F126658n6012q5351r9604j48198p4309j73699j08595q7206J18554k4550Q2790
$$ y = [24602307, 23803477, 23471691, 22761090, 21892747, 21311136, 21098715, 20552385, 20024268, 19627487, 19288789, 18890253, 18448153, 18247543, 17947275, 17534692, 17050313, 16486076, 16117969, 15507647, 14839491, 14495594, 14087864, 13539067, 13207291, 12929041, 12343053, 11935169, 11806021, 11616144, 11427562, 11090397, 10581056, 10484264, 10354857, 10448193, 10216038, 10012392, 9785325, 9628755, 9259475, 9124942, 9183297, 9044590, 9068734, 8776465, 8505284, 8625071, 8536101, 8288911, 8029984, 7928003, 7964344, 7968248, 7924656, 7601995, 7338016, 7405164, 7020226, 6950227, 6818601, 6741343, 6371870, 6360427, 6357174, 6216788, 6112449, 5975410, 6070452, 6126658, 6070646, 5985295, 5885691, 5737493, 5663184, 5489485, 5380890, 5293684, 5412238, 5387688, 5470478]
2992E470478k69956l73986l01J13868n2389l01168k80572P3223j95874r9682J95020
2981D278661N4716p7621M2672r81j32120n2213j11100k94405J74787J00949k34659
2970C748686j31332M953K1471q796j01404j863J22703J2421k25636j74174J48938
2959C415967j76932j28646R5589k0426P6905m02265R2102j96448p1823K22241
2949B906264J25747l51277J08022L5187J05688j93275m02764O3903O0140J53423
2939B611058j03333N0840M1770j37692k3014J26320j29196N000j84492L12270
2929B569531N146k50644m3271N1862o4755J49159P8708l54034R6969R3226j64871
2918B167026n6073J74891L4354j72659J18707k00104O0443P4179K832j53493q9823
$$ y = [5470478, 5200522, 4826536, 4826235, 4940103, 4887714, 4586546, 4305974, 4379197, 4183323, 4083641, 4278661, 4333377, 4255756, 4298428, 4297447, 4165327, 4113114, 4002014, 3707609, 3882396, 3983345, 3748686, 3617354, 3622307, 3643778, 3634982, 3533578, 3531715, 3654418, 3666839, 3441203, 3267029, 3415967, 3239035, 3110389, 3205978, 3185552, 3262457, 2860192, 2952294, 2755846, 2684023, 2906264, 3032011, 2680734, 2788756, 2823943, 2929631, 2736356, 2333592, 2397495, 2457635, 2611058, 2507725, 2558565, 2600335, 2462643, 2439629, 2565949, 2436753, 2441753, 2257261, 2569531, 2574677, 2324033, 2280762, 2332624, 2267869, 2417028, 2495736, 2141702, 2238671, 2331897, 2167026, 2110953, 2285844, 2320198, 2147539, 2266246, 2066142, 2126585, 2200764, 2203596, 2050103, 1960280]
2907A960280K03762j85316j07556K28977J11807J7223j34696K2624K3334j31246
2897B009193J03874l06903N9358J08007j45987Q9594o7221J3223l37783J23922
2887A649277N3087R2277J0699J0261R5117j29197L2706m978l9000j1224K4630
2876A783655j55409o1212P3104J06381L4474j53180M2875Q1113p3934k08295O2935
2865A532507K58361j25945l8602K39043n1769R5362O0442j81310J02916k82518
2855A608487L16746M318l89870k46545Q9328J19947J44577o8335j08674J93648
2845A663627O4142j92848r6811o7748J72271K68707K0374j50944k32321J13124
2835A561573k53887Q3542p1967R0747l2644k00849J44028J72003J90982j05366
$$ y = [1960280, 2164042, 1978726, 1871170, 2100147, 2211954, 2229177, 2094481, 2117105, 2140439, 2009193, 2113067, 1806164, 1865522, 1973529, 1827542, 1917136, 1849915, 1863138, 1525355, 1649277, 1702364, 1794641, 1805340, 1815601, 1910718, 1781521, 1814227, 1809249, 1770249, 1759025, 1783655, 1628246, 1567034, 1640138, 1746519, 1780993, 1627813, 1670688, 1751801, 1677867, 1469572, 1532507, 1790868, 1664923, 1626321, 1865364, 1813595, 1908957, 1969399, 1788089, 1891005, 1608487, 1925233, 1929551, 1539681, 1293136, 1382464, 1502411, 1646988, 1578653, 1469979, 1663627, 1727769, 1534921, 1438110, 1370362, 1542633, 1811340, 1831714, 1680770, 1448449, 1561573, 1307686, 1391228, 1319261, 1410008, 1377364, 1176515, 1320543, 1492546, 1683528, 1578162]
2825A578162o5372j02500q168q2764R782n821K12288j45033j04079l82613J04376
2814A008258k90342J24305M16102k73914J25515Q0070j57942j9637L6651j8620
2804A030446K50794k4588J7120n0599J7988l7888j21642j3148m6733J7056j41402
2793H97404J14021j12343O180K10125j32282J85607j5662P9760m6996j43757N3102
2782A095159J3361n875l2890k06927J20703j89561J28543j81104J8705J50271
2772I10385Q7340J68152J19836o8375j44816k46337J85796J52925j16880p5320
2762I72706j08031k9349m0405r7279J30824j53563j72555M4090K50964j18704
2752F78698R367O6549r8085k45335J78295K97676R289n4611k07220r201j03100
$$ y = [1578162, 1512790, 1410290, 1402122, 1319358, 1329140, 1323319, 1535607, 1390574, 1286495, 903882, 1008258, 717916, 842221, 1258323, 984409, 1109924, 1189994, 1032052, 1012415, 1049066, 1030446, 1281240, 1256652, 1273772, 1223173, 1241161, 1203273, 1081631, 1068483, 1021750, 1038806, 897404, 1011425, 899082, 905262, 1115387, 983105, 1168712, 1153050, 1232810, 1185814, 1042057, 1095159, 1108520, 1102645, 1069755, 862828, 983531, 793970, 922513, 741409, 760114, 910385, 997725, 1165877, 1285713, 1217338, 1072522, 826185, 1011981, 1164906, 1048026, 972706, 864675, 835326, 794921, 697642, 828466, 674903, 502348, 546438, 797402, 678698, 688065, 754614, 656529, 411194, 589489, 887165, 896454, 841843, 634623, 625422, 522322]
2741E22322K2810J52625J25028M2565j56560k36748J33332J27047j94283L9529
2731E77667l3899j41286J44987N874O0825o4990J39655l3238R7436o3015R548
2720F99564k07891R3837r4963j07885p8449L31160J95100k4589j73404k16868
2710D15612J12088J18845N8389j67016J857K89487K7092q5499P2990r9142k08455
2699E36248k26020J57353L17640j93244q9079j54333K15892j12225K59258Q8113
2689G99603J42952N1826J2494k02829k22543j43702p0424J8679l9057J73816k73584
2678B47231j08467J45699J14825J44153L7598k03243o6627l3362Q7600J17818
2668D83225J33587l65520L8376M2542j70221n6035J02410j38587j15310K50881
$$ y = [522322, 545132, 697757, 822785, 865350, 708790, 472042, 605374, 732421, 538138, 577667, 543768, 402482, 547469, 553343, 614168, 549178, 688833, 655595, 753031, 690016, 699564, 491673, 585510, 490547, 382662, 304213, 635373, 830473, 805884, 632480, 415612, 527700, 646545, 704934, 537918, 539775, 829262, 856354, 770855, 843845, 744703, 536248, 310228, 467581, 785221, 591977, 502898, 348565, 564457, 452232, 711490, 799603, 942555, 994381, 1006875, 804046, 581503, 437801, 367377, 386056, 346999, 520815, 247231, 138764, 284463, 399288, 543441, 581039, 377796, 311169, 277807, 365407, 483225, 616812, 251292, 289668, 332210, 161989, 105954, 208364, 69777, -45533, 205348]
2658B05348J63882K23708P9679R7380k53202l24228K36540L885j44835o8782J51508
2647C70883N681J66708L9018j19668j05379k8341O8938P5078m2928n5391m3880
2636C30719m9981O9429o1259j83409J0688J44143q0139j52197j16547j34246K87924
2625F5125J33385M88611j51848l94234o4887M0442K11026Q2617n852l68552m907
2614C0926K00903k0398L15540k13347j29160K02929q3559j42386Q7667j84215
2604F4900K8289J14323m6306J72059o3891k42036o7195J40578l3003q7266Q2167
2593F2619P5151J19831j06694k35540K711J82382J49495k0499j62990p0777J28681
2582A24370L302p7646k73347J79010j8568l4453O9336Q8391M2769P1462N1192
$$ y = [205348, 369230, 592938, 672617, 769997, 516795, 192567, 429107, 432992, 288157, 219375, 370883, 376564, 543272, 582290, 462622, 357243, 328902, 397840, 472918, 429990, 374599, 330719, 280738, 350167, 288908, 105499, 116187, 260330, 180191, 27994, -88553, -222799, 65125, 198510, 687121, 535273, 141039, 76152, 116594, 327620, 410237, 404385, 35833, 30926, 231829, 211431, 526971, 313624, 184464, 387393, 303834, 161448, 249115, 64900, 93189, 207512, 161206, 333265, 269374, 27338, -39857, 100721, 67718, -19548, 62619, 137770, 257601, 150907, -84633, -81922, 100460, 249955, 229456, 66466, -4311, 124370, 127672, 50026, -223321, -44311, -62879, -97332, -27996, 60395, 103164, 174626, 225818]
2571B25818k14249r4910O1302j12821J12321K68867p957O4085l36151J37514Q8317
2560A92136k11241J50913k46235m8484p8684J54723N5640j00962L58693R5384
2550C21883k55855k10889m337J25188P9755M7779J30845q7877m5608R9875j57618
2539D3141J2300J94005k93750j46443R4344J29488R2227q3390K74867r2641j5694
2528B08454m7848q3303p0553J65190k24214r9482K34875P196k37409N8777R5499
2517G182J92259M8077l0118L1178k7555n1774j49245Q0743O6340n8518M7735L9929
2505A96233l18235M0615J62846J09378q3234M3261N3874o6675J31103o5510J02098
2494C05754J65701J3928k32957r4486n5463N8954r7319l0534J14702J19861m2139
$$ y = [225818, 11569, -83341, -22039, -134860, -22539, 246328, 238371, 302456, -33695, 103819, 192136, -19105, 131808, -114427, -162911, -241595, -86872, -31232, -132194, 226499, 321883, 66028, -144861, -149198, -24010, 55745, 103524, 234369, 146492, 100884, 200759, 43141, 55441, 249446, -44304, -190747, -96403, 33085, 125312, 41922, 316789, 224148, 208454, 160606, 77303, 6750, 171940, -52274, -151756, 83119, 90315, -147094, -88317, 7182, 199441, 247518, 217400, 248578, 221023, 169249, 20004, 100747, 167087, 108569, 156304, 196233, -122002, -81387, 81459, 190837, 107603, 150864, 204738, 138063, 269166, 203656, 305754, 471455, 485383, 252426, 157940, 102477, 161431, 64112, 33578, 148280, 268141, 226002]
2483B26002r4452Q6280n6291J08697N1821k85154j63489K46723n164J77704k6491
2472B66186n3939P7715n8551K6978J3386l46976J62624k5045J87728K05589p1302
2461C84393N2093l17799j59266J28848J43828L437L5183j1032o7097j53003J99105
2450B38690R7484m9716r6016j71029q7801N47578K92968j28727j75059j06222
2440C62150L99640j27804O9147j0166l11416Q8411K45307p5006J75619J68168
2430I84050j87106K3357J55291p6877m2621L8102m5067j2376r2754l7123J67281
2419H74157K32962K00137j98966K18173j32072l32116O4380N8708J66019K03093
2409A354475J4925k2327r8318J54128n9785L5408L22998k1924j63392m0704L63906
$$ y = [226002, 131550, 217830, 161539, 270236, 322057, 36903, -126586, 120137, 114973, 292677, 266186, 212247, 289962, 231411, 258389, 271775, -75201, 87423, 62378, 250106, 455695, 384393, 436486, 118687, -40579, 88269, 232097, 235534, 270717, 259685, 192588, 39585, 238690, 336174, 286458, 190442, 19413, -68388, 479190, 772158, 643431, 468372, 362150, 761790, 633986, 703133, 692967, 381551, 469962, 715269, 640263, 815882, 984050, 796944, 820301, 975592, 898715, 856094, 894196, 849129, 836753, 743999, 706876, 874157, 1107119, 1307256, 1108290, 1326463, 1194391, 862275, 926655, 985363, 1151382, 1354475, 1369400, 1347073, 1248755, 1402883, 1343098, 1378506, 1701504, 1679580, 1516188, 1475484, 1839390]
2398A839390K3678k79878k4843L36679J05453J2280L19157k57694J24692J89212
2388B388126j7984Q3917N9239j4963M3147K76004J77454J6879J92916M7362M3351
2377C295448K32352J19585J36538K56805L46270l7964O5652O1795K33905R9068
2367D809454j01065L07316L27353P9989K64565L64766J51806K81051M76869K91838
2357G253942O21955Q43595Q78190N38486L35131L26645Q78559J245475J604095
2348A4526073J834433K275978K956771M470905N637417P175912J1011671J3236103
2340F3125263M377155q433708j2766232j1077701p636268n103155m039942k930024
2332A5515388k271053j817050j213822p49929n24140j56186l20291m48291l64821
$$ y = [1839390, 1863068, 1583190, 1558347, 1895026, 2000479, 2012759, 2331916, 2074222, 2198914, 2388126, 2370142, 2454059, 2513298, 2498335, 2541482, 2817486, 2994940, 3011819, 3204735, 3252097, 3295448, 3527800, 3647385, 3783923, 4040728, 4386998, 4349034, 4414686, 4476481, 4710386, 4809454, 4708389, 5015705, 5343058, 5423047, 5687612, 6052378, 6204184, 6485235, 6962104, 7253942, 7875897, 8719492, 9597682, 10136168, 10471299, 10797944, 11676503, 12921978, 14526073, 16360506, 18636484, 21593255, 26064160, 31701577, 38877489, 49889160, 63125263, 67502418, 59068710, 46302478, 35224777, 27588509, 22485354, 18445412, 15515388, 13244335, 11427285, 10213463, 9463534, 8939394, 8783208, 8462917, 8014626, 7649805]
2323G649805o40825p43559p11250l68620l01285k98242n44788k10641l25326j32418
2313C372851k50146j58784q546l51169J77041o34l34434k47782R0702j77698j19093
2302A992308l17383J59280j42727K4810R2275l28315m5243J31636R0086j78697
2292A478030k69773j86191J497l1559L2899m0755R9036j86739j4793j06465O2656
2281H37843n1449K87614K43781j18170l87508o3857J61770l57281j45290J67737
2271E75190k8310J21047N9947J62585j51164k06016M6149J60019m1499m00836
2261B97112O9463p6507Q036j99287Q6517M191N4779J11363j50284J58996p6028
2250B88351j78987J98249n660J18937M4622j91345Q4083n0591j96266j48425K96879
$$ y = [7649805, 7008980, 6265421, 5554171, 5185551, 4884266, 4586024, 4041236, 3830595, 3505269, 3372851, 3122705, 2963921, 2955375, 2604206, 2781247, 2780613, 2446179, 2198397, 2289099, 2111401, 1992308, 1674925, 1834205, 1691478, 1716288, 1808563, 1480248, 1435005, 1566641, 1656727, 1478030, 1208257, 1022066, 1023563, 992004, 1024903, 984148, 1083184, 896445, 881652, 775187, 837843, 786394, 1074008, 1317789, 1199619, 812111, 748254, 910024, 552743, 407453, 575190, 546880, 667927, 727874, 890459, 739295, 533279, 579428, 739447, 697948, 297112, 366575, 290068, 298104, 98817, 185334, 189525, 244304, 355667, 205383, 364379, 288351, 109364, 307613, 301953, 420890, 465512, 274167, 358250, 307659, 111393, -37032, 259847]
2239B59847J32863J20588j30766Q7922k20364r4713K11410P7942k23238q2345
2229A39146j34174J80884j85865J89638P1418K04155O6890j62140o3527j31238
2219A75187j29103m5966K7940J40199R687j14095j03005j43438K28154J19473
2209A65033K2136k27938P780l7645J72552j40199j3977p6149K18564Q1106l51797
2198a80534J71767L7118k72845K98236K2525q7744M6575j65556p9813K18930j38733
2187a30074K60481L6247n1642P9065j21972K0052J11155l59538K95J23321M1639
2176I029L5810j59006M4482k69983L3090K98869O7253j66731m0645J34194k7578
2165d1216j40378J41278m6914J65115j1166l58330J99295o1117J2970J46146Q3458
$$ y = [259847, 392710, 513298, 382532, 470454, 250090, 155377, 366787, 444729, 221491, 139146, 4972, 185856, -9, 189629, 261047, 465202, 532092, 369952, 306425, 175187, 46084, 118, 28058, 168257, 177944, 63849, -39156, -182594, 45560, 165033, 187169, -40769, -32989, -70634, 101918, -38281, -52258, -128407, 90157, 171263, -180534, -8767, 28351, -244494, 53742, 76267, -11477, 35098, -130458, -210271, 8659, -130074, 130407, 166654, 115012, 194077, 72105, 92157, 203312, -156226, -155931, -32610, 9029, 44839, -114167, -69685, -339668, -306578, -7709, 59544, -107187, -147832, -13638, -41216, -181594, -40316, -87230, 77885, 66719, -291611, -92316, -153433, -140463, 5683, 89141]
2154H9141M425j40115k3160L5462J91973n4200k64913l1291L7464K13816J47828
2143B06430j31291M2533p4765k37844K072j08987k8876K19342K19746O0566o7750
2132A01176k17138r3937J60942O3129q5982K10361j16997k44998L3739O1157N7121
2121g1427l3299m2698J91677N3789o6169J05903j48206l7058o3524N1220r1741
2110a51533J60294J20311J25145k91023k14471q4844J20452K65213J18506m1632
2100A26418k18480J43589k19433j17517K28464l3110k33225K9675J43519J58705
2090H605O1691j80261l9063k5650m6985j5491M6763j610j23174L76519p0481P6079
2078F6942j67945j8809j86168j91304L91057J229K49887k2840l9307k44424N9714
$$ y = [89141, 93566, -46549, -69709, -34247, 157726, 103526, -161387, -192678, -155214, 58602, 206430, 75139, 117672, 42907, -194937, -192865, -301852, -330728, -111386, 108360, 168926, 101176, -115962, -209899, -48957, 14172, -71810, 138551, 21554, -223444, -189705, -128548, -71427, -104726, -147424, 44253, 98042, 31873, 137776, -10430, -47488, -111012, -59792, -151533, 8761, 129072, 254217, -36806, -251277, -336121, -215669, 49544, 168050, 126418, -92062, 51527, -167906, -285423, -56959, -90069, -323294, -293619, -150100, 8605, 70296, -109965, -149028, -174678, -221663, -237154, -190391, -192001, -315175, 61344, -9137, 66942, -101003, -119812, -305980, -497284, -106227, -104998, 144889, 122049, 82742, -161682, -101968]
2067a01968J44170k1248K2630j62545J5229N5635J90666J50029j89871n3367j73786
2056a24426r7120k3956N8939j64313O8035N8830j4386j3108j67821J77637k73935
2045e15624O3866J94559l4377r8182J5064J31495K5870P2247J16290k2890k1825
2034g3507J88806p8759j21786k8488j29882m9696J10435P6647m4578R429k18977
2023c60356K11819R7495j25068Q9957m7279j26530R692K6946j65680K72366j3530
2012a30168k8822j30473Q7056O9184l3259J84430J07086M8179m8497M688j91804
2001f2400K48125j62183r9309O1407j94222k8652k15430Q4529L00598j49075m4244
1990b60856L10803N5159j37045j02530Q5435n1706J49675J5756R9258j85534l21447
$$ y = [-101968, 42202, 20954, 43584, -118961, -103732, -48097, 142569, 292598, 102727, 49360, -124426, -221546, -245502, -186563, -350876, -282841, -224011, -238397, -251505, -419326, -241689, -515624, -451758, -257199, -291576, -389758, -374694, -243199, -217329, -145082, -28792, -51682, -73507, 115299, 36540, -85246, -113734, -243616, -293312, -182877, -106230, -150808, -141379, -360356, -148537, -51042, -176110, -86153, -133432, -259962, -250270, -223324, -389004, -116638, -130168, -158990, -289463, -202407, -133223, -166482, 17948, 125034, 173213, 124716, 129404, -62400, 185725, 23542, -75767, -14360, -208582, -237234, -452664, -368135, -67537, -216612, -260856, 49947, 105106, -31939, -134469, -49034, -100740, 48935, 64691, 163949, -21585, -343032]
1979c43032J29238J42801R5787l45634L5676M3098n5329Q8589n7002j3651K56488
1968b2971J9854k30870J21937k08692J64851j95932j94364L9810L85513J00091
1958b0773k27260J09837k45386j87868K37560L39933R9180l02987p1472L42630
1948G3394N2586m1303j79407Q0233k8193j98397J41001j26906j77900O2380j23245
1937d65757J46245L81762j33425k2222j94151q2900K23954n6255k45953r4265
1927e42967K79238j5670j15897j25782L16271P7282j59063J65228q2733m2978
1917b47071K24814l34051k72147L96451J2760n4372K51944m6968o2011l5947k4928
1906a91526J8142N2578k17972J06266J29412l5395j74493j9825j40490j8871n6113
$$ y = [-343032, -213794, -70993, 24794, -320840, -285164, -242066, -297395, -208806, -265808, -279459, -22971, -3117, -233987, -112050, -320742, -155891, -351823, -546187, -506377, -120864, -20773, -248033, -138196, -383582, -571450, -333890, 6043, 105223, -197764, -269236, 73394, 125980, 84677, -94730, -14497, -42690, -241087, -100086, -226992, -404892, -342512, -465757, -319512, 62250, -71175, -93397, -287548, -370448, -146494, -202749, -448702, -542967, -263729, -279399, -395296, -521078, -204807, -127525, -286588, -121360, -204093, -247071, -22257, -356308, -628455, -232004, -219244, -273616, -21672, -68640, -130651, -166598, -191526, -173384, -120806, -338778, -232512, -103100, -138495, -312988, -332813, -473303, -492174, -548287]
1895e48287K24872K03642J27325j9718J37837j91944l12044J40057n5203R7262
1885a96201J66292K48330m1637p7745j63381j82566j76844L6391J29082R062l2322
1874b81539M6271O8174K6661K32588K6570q0492l06216J32742K3140j73622m6418
1863c32141m7802K49273J13112Q315p7417j12727k38900R461R1617K49884J34198
1852D6873o5972m4864P5370k05946J53031O9691j67029n8089p6664J84654q7022
1841a75967J45110o0070R7516j66688r5112J39855n381J71521k40374O9509k742
1830a22823j57310j63531K71475J97656l0617j27978p4617q0049K18183M7702
1820b1909r4380K03597j69122k86643J45447O0480J12566K13347M833P1543k79606
$$ y = [-548287, -323415, -119773, 7552, -12166, 125671, -66273, -378317, -238260, -293463, -196201, -29909, 218421, 176784, 99039, -64342, -246908, -423752, -387361, -258279, -249217, -281539, -235268, -167094, -140433, 92155, 118725, 38233, -267983, -135241, -112101, -285723, -332141, -379943, -130670, -17558, -9243, -86660, -199387, -438287, -428826, -337209, -87325, 46873, -19099, -63963, 11407, -194539, -41508, 28183, -138846, -196935, -273599, -88945, -175967, -30857, -90927, 6589, -160099, -255211, -115356, -120737, 50784, -189590, -120081, -122823, -280133, -443664, -172189, 25467, -5150, -133128, -207745, -287794, -69611, -21909, -116289, 87308, -81814, -368457, -223010, -162530, -49964, 163383, 168216, 239759, -39847]
1809c9847k60724K60495J40376k47036N090M7736k09614p9187R7525K75176k6157
1798c6167O2338P1158o4421m4181R0434m9484j26956L9703N9575L8440m4275k174
1786f010j32844q8669J81240j55243j1596k2318N8718j56994Q871j10684J64538
1775b70991K54227k0852M776p632N8122j25912M8274k13773k10545L1399o6237
1764e19144N859J30362J00330J62357J08150k21686K36016J32134q7877J11724
1754A58225k13559j27510o2918o67J77100Q4484p5873J25082j14984n5937r1054
1743a97611O3408K18781k794k50319j76355K02597J94244n4324j30781k1769J51248
1732c675j28743N2127n5874n9591p9714K76851j34539k6048k50997J27320k0558
$$ y = [-39847, -300571, -40076, 100300, -146736, -141646, -93910, -303524, -382711, -285186, -10010, -36167, 26171, 97329, 32908, -11273, 79161, 29677, -97279, -57576, 1999, 40439, -3836, -6010, -138854, -227523, -46283, -201526, -213122, -235440, -176722, -333716, -324845, -435529, -270991, -16764, -37616, -32840, -40472, 17650, -108262, -59988, -273761, -484306, -452907, -519144, -513285, -382923, -282593, -120236, -12086, -233772, 2244, 134378, 46501, 158225, -55334, -182844, -245762, -246429, -69329, 15155, -60718, 64364, -50620, -106557, -197611, -134203, 84578, 81784, -168535, -344890, -142293, 51951, -2373, -133154, -154923, -3675, -132418, -80291, -136165, -195756, -275470, 1381, -133158, -159206, -410203, -282883, -303441]
1721c03441O5660j3812P7550j13428o6203K33670o4294J03390j71697j74723k7950
1710d55278J39104L44882k16174o3496j4131J04396J35798K7894m0939j97791
1700b35735J88055j02604j59111J71377P3379P7078K17434K029j3664L4574r9852
1689A52960k19124O9267j68380K20105p4167j3403R4013M4075j16899R3264k9611
1678E2100q178j48474j23930J42732n4659l4147m1510j76875m9698k2388J10339
1667c54688J85538J43076m6088j09008l01273M1255L19448n0245n3508n2839O5563
1656b12769R4471k40343O0021J80332k1535r0304j92887K60186J01313k72767
1646c34282N4612r3392J94632J51781p0882Q8349J20013j00804O1506K19571j1397
$$ y = [-303441, -237781, -251593, -174043, -287471, -353674, -120004, -184298, -80908, -252605, -427328, -455278, -316174, 28708, -187466, -250962, -265093, -160697, -24899, 2995, -37944, -235735, -47680, -150284, -309395, -138018, -64639, 12439, 229873, 231902, 218238, 252812, 152960, -66164, 3103, -165277, 54828, -19339, -32742, 61271, 105346, -11553, 81711, 52100, 43922, -104552, -228482, -85750, -140409, -174556, -216066, -392941, -442639, -465027, -354688, -169150, -26074, -72162, -181170, -482443, -441188, -121740, -171985, -225493, -278332, -212769, -118298, -358641, -298620, -118288, -139823, -230127, -423014, -162828, -61515, -334282, -279670, -373062, -178430, -26649, -97531, -9182, 110831, 10027, 71533, 291104, 279707]
1635B79707l2486K6155j71249m9958j29738m0096K00181q6568k41128J05736q6607
1624b26051k36539J32881q5518L84696J44732L3047j69852j75266l301R9600J8167
1613h3404k9546J3152j0402M47851J379j14150l03041j12720J23779L4230j25565
1602a58437P3593K11277l85491L7819K23658p8081k18465J81899j14124K93002
1592F6650J39745j16988j46648n6389q9318k13062K39873P3995j86325k40440
1582e28907J24314N3242Q6875L7978k53819j9701J54510R1737R9278m2434k42275
1571d39202k2825P6644J18573p5581o4393J66023L3903J67499M8595k39266p3135
1560c03165j92297J07734J6878Q8048J74419J93353k85025k45149J98348K51869
$$ y = [279707, 247221, 273376, 102127, 52169, -77569, -117665, 82516, -4052, -245180, -139444, -226051, -462590, -329709, -415227, -30531, 114201, 147248, -22604, -197870, -201171, -101571, -83404, -112950, -99798, -110200, 337651, 339030, 224880, -78161, -190881, -67102, -32872, -158437, -84844, 126433, -259058, -221239, 2419, -75662, -294127, -112228, -226352, 66650, 206395, 89407, -57241, -113630, -202948, -416010, -176137, -102142, -288467, -528907, -404593, -351351, -264476, -226498, -480317, -500018, -345508, -253771, -154493, -196927, -439202, -462027, -385383, -266810, -342391, -406784, -240761, -206858, -39359, 9236, -230030, -303165, -495462, -387728, -370850, -282802, -108383, 84970, -200055, -445204, -246856, 5013]
1550E013K53564k55911K41757q1289l43080J63136J0509k61653R2923N6151O3488
1539e5392o9769j03579J14313K52070j83990j0876R6913k20538l2810j51454K00535
1528a64577P8338P8945n3805p0774R1729K1447k45082r906M00094l18592R7606
1517i4577L12l9875K55110k3626J27032l82364j93633J69107p3442j3266j70519
1506d39741k09106K33291J06099k6151k79502J34978L55995q5014p9229L4124
1496b54256J1933K06067q556k304j23291j57029K63698J15081n8302p9890K15654
1485A28805p4158R0940r9046j27160p6040L40489j61207p4889k24535M9025L43214
1474A15438J61629q9205k87294P1829q333Q9098j95061j10154R6285K4409J46975
$$ y = [5013, 258577, 2666, 244423, 163134, -179946, -16810, -6301, -267954, -175031, -118880, -55392, -125161, -228740, -114427, 137643, -46347, -57223, 39690, -180848, -213658, -365112, -164577, -86239, -7294, -61099, -131873, -40144, -18697, -263779, -273685, 126409, -192183, -94577, -94265, -134140, 120970, 97344, 224376, -157988, -351621, -182514, -255956, -269222, -439741, -648847, -415556, -309457, -335608, -615110, -480132, -124137, -209151, -288380, -254256, -242323, -36256, -44812, -47116, -170407, -327436, -63738, 51343, -6959, -86849, 128805, 54647, 145587, 46541, -80619, -156659, 183830, 22623, -52266, -276801, -227776, 115438, 277067, 187862, -99432, -27603, -35936, 53162, -141899, -252053, -155768, -131359, 15616]
1463A5616o9924j19582M0309K68761j66747J2130l3649j82459j47012j94363O4886
1452e12034K31878L49872k9388J4518k22270K5871N8315Q3814Q4235p555M7302
1441A24558J85580q1061k41726l8334r154K2834k86270k02337M613K54509J74760
1430i2028k91452M8173K54413R6585p4215n6021j03250J38469J76653j3447O2321
1419A46201M5591j91003k98248p5989R2116L91324R0634j32191J30823j93176
1409F082m5842k88777J09430M0500K13232K22198j31898l04820J57325K05817
1399A83247n6590p2546m06787j3546J34584K07608J44741m1188k97778j15689
1389c33944K50917l3914J54097j9101k00007o5064j77465k1638K38486Q7662N4783
$$ y = [15616, -54308, -173890, -133581, 135180, -31567, -19437, -53086, -235545, -382557, -576920, -512034, -280156, 69716, 40328, 54846, -167424, -141553, -83238, 576, 84811, 77256, 124558, 310138, 229077, -12649, -50983, -60137, -37303, -323573, -525910, -521297, -266788, -92028, -383480, -335307, -80894, 15691, -58524, -114545, -217795, -79326, 97327, 83880, 146201, 191792, 789, -297459, -373448, -281332, 109992, 200626, 68435, 199258, 6082, -39760, -328537, -219107, -178607, 34625, 256823, 124925, -179895, -22570, 183247, 126657, 54111, -352676, -366222, -231638, -24030, 120711, 79523, -218255, -333944, -83027, -116941, 37156, 18055, -181952, -247016, -424481, -446119, -207633, -119971, -65188]
1378f5188l21069J48402K16866J36476K56m0070j75020J75438J74361p4448k17317
1367d1313J88998q7511J06375J39576j47622j65919k55507L7100J57154J0923
1357e7746Q0495k8913j73200J32582l89165L37200o058J50720J69669r6424k43789
1346a24629J16334k9435N0118p4533m4704J53709P5959j25244m5064o9185m0189
1335a56863J27063M4988J16760j00266J75823l4771k66824M684j91100J59318
1325a21188j30303J23266n8517M765J21277j63504J7876K25195P299O4565n1619
1314C9112j8145Q5126j28137J13199q8276k46299l0638P2290J63433L3014K76368
1303B71047o1321j19979k03193Q5846N7181k72533K9873P9374K519J6653j09317
$$ y = [-65188, -386257, -237855, -20989, 115487, 115743, 75673, -99347, 76091, 250452, 176004, -41313, 147685, 60174, 166549, 306125, 158503, -7416, -262923, -225823, -68669, -57746, 22749, -6164, -179364, -46782, -435947, -98747, -104805, 45915, 215584, 119160, -124629, -8295, -37730, 12388, -62145, -106849, 46860, 122819, -2425, -47489, -116674, -156863, -29800, 15188, 131948, 31682, 207505, 172734, -94090, -89406, -280506, -121188, -251491, -128225, -186742, -181977, -60700, -224204, -206328, 18867, 26166, 90731, 39112, 20967, 106093, -22044, 91155, 2879, -243420, -274058, -201768, -38335, -5321, 271047, 209726, 89747, -113446, -27600, 29581, -242952, -213079, -133705, -131186, -114533, -223850]
1292b23850J15697J53030J1783n3002j23030J26785j78641J52072J33428m5438
1282F8834j53256k9190O5649l9723r1384o4658K88093Q2361j62776j79167J10653
1271a04564l6798P9759k475K8150o184o7700r7937J29153R3239J04393K12559
1260C31595J17245P1194k59672k02594j41J37337j99050j65578q7782J17424m9443
1249a89465k34040J44780K79342n2995m3340j84048K9726j06783J14511q0861
1239c23173N2772j91328L19846m4223J86829L09528j42791p4395j80290j51488
1229b38713J31850J9680J64209J26381J541J67817l04699m20765L0211J23051
1219a99437J33361j47779m8400L4572M3414K5192J08273K0287M8083P3164j94076
$$ y = [-223850, -108153, 44877, 56660, 3658, -119372, 7413, -171228, -19156, 114272, 68834, -84422, -113612, -47963, -87686, -179070, -243728, 44365, 126726, -36050, -215217, -104564, -141362, -61603, -64078, -35928, -42112, -109812, -207749, -78596, 14643, 119036, 331595, 448840, 520034, 260362, 57768, 57627, 194964, -4086, -169664, -257446, -140022, -189465, -423505, -278725, 617, -52378, -95718, -279766, -250040, -356823, -242312, -323173, -270401, -461729, -141883, -186106, 723, 310251, 167460, 93065, -87225, -238713, -106863, -87183, 77026, 203407, 204948, 372765, 68066, -352699, -322488, -199437, -66076, -213855, -262255, -227683, -184269, -159077, -50804, -30517, 17566, 90730, -103346]
1208a03346K26663j35885O4183q916J13945k50525j18437j09477j60800M24590
1198e8005K04529k58364L0872J01920k5621J08014k35112J6200J31211J67873
1188A83517O5836Q8720k19386J21458L306j43254p016j14484k2711k19660j04056
1177c67730K66204J15555k00957p6789J35973J48639j20722J18550K35823q6771
1167A67775j85465Q5849j501k57997J92996M4496j64644j5477J14177J32096P4457
1156A86762J0532j96209n2221M8157k72027J76095M5449J20880K19147k14422
1146G2143j01562L29043P7828j40670j5123l05484o0426l5763J80252m2772K4130
1135a8404j23540Q0144p1971o1206K62028j3173l2417J5318o4016k78891K607
$$ y = [-103346, 123317, -12568, 51615, 42699, 156644, -93881, -212318, -321795, -482595, -58005, 146524, -111840, -80968, 20952, -4669, 103345, -131767, -115567, 15644, 183517, 249353, 338073, 118687, 240145, 243451, 100197, 93181, -21303, -44014, -263674, -367730, -101526, 14029, -186928, -263717, -127744, 20895, -99827, 18723, 254546, 167775, -17690, 68159, 66658, -191339, 1657, 46153, -118491, -133968, -19791, 112305, 186762, 197294, 1085, -51136, -2979, -275006, -98911, -53462, 67418, 286565, 72143, -29419, 299624, 377452, 236782, 221659, -83825, -144251, -180014, 238, -42534, -18404, -141944, -61800, -133771, -194977, 67051, 53878, 21461, 36779, -27237, -306128, -303521]
1124c03521J87862J01923l8386l7483Q0060J11266k5007r8640l8555k4490K9117
1113e5854n5957r4146j4306K61972r1422n6430J10588K33833k25405l9275j28629
1102a55031K60870j26999j38009L70959J82097k81769r2054j53635J22652P8165
1092F7246J03608k94733L11483m3630k56967J71057j07806j55147k3052K51914
1082B3973j52134k8870L93069J31483p9195k89358o6176j77661J53336K15328
1072A23795j554l8208l01242o2916N0721J03720J27447m7986l98764L12319K27353
1061I4685p6106j33523l2473O8991K392j56722O1632o7968M82151J04902k15210
1050A32751n2230k9385O0755n2354k09455o1975J88204K08506j7663l17763j49734
$$ y = [-303521, -115659, -13736, -52122, -89605, -9545, 101721, 76714, -21926, -60481, -84971, -55854, -111811, -205957, -220263, 41709, -49713, -106143, 4445, 238278, 12873, -26402, -155031, 105839, -21160, -159169, 211790, 393887, 112118, 20064, -133571, -10919, 67246, 170854, -123879, 187604, 143974, -112993, 58064, -49742, -204889, -227941, 23973, -128161, -157031, 236038, 367521, 288326, -1032, -67208, -244869, -91533, 123795, 122241, 84033, -217209, -280125, -229404, -125684, 1763, -46223, -444987, -132668, 94685, 18579, -114944, -147417, -78426, -76034, -232756, -171124, -239092, 243059, 347961, 132751, 80521, 51136, 111891, 59537, -149918, -211893, -23689, 184817, 167154, -150609, -300343]
1039c00343N3342L3445J67526k6377O1042j9691o7134j35689K94465k65730j63756
1028c68900K44043j33102o6834J78016R9690j3696R5148J63450l9020n7946j58339
1017e7490K6659o2235J42031R6703J09434j08099k00517r7639K73672O8566k26580
1006c5495k41643K07161J11796J76404q6959N3016k62151l8464P9386Q1926q5655
995d0678k03273L10294j68266j64565j168N2681P8232L20646J29541k37195p7955
984a706J4012j55452J73557q0527j9693L10158J0469P3526j81575r9681J28041
973A71129P0886q3025k51026p6913J18880K25933k92539J81630m2884K7281J57909
962B07261k07892L590j72142N3522K28603k85395o7877K52246o5332n85K8426
$$ y = [-300343, -247001, -213556, -46030, -72407, -11365, -31056, -98190, -233879, 60586, -205144, -368900, -124857, -257959, -324793, -146777, -47087, -60783, 34365, 197815, 158795, 100849, -57490, -30831, -93066, 48965, 145668, 255102, 147003, -53514, -151153, 122519, 191085, -35495, -277138, -69977, 41819, 218223, 131264, 184280, -77871, -116335, -36949, 44977, -40678, -243951, 66343, -101923, -266488, -267656, -214975, -136743, 183903, 313444, 76249, -1706, 12306, -143146, 30411, -50116, -69809, 240349, 250818, 324344, 142769, 43088, 171129, 242015, 158990, -92036, -168949, -50069, 175864, -116675, 64955, 22071, 49352, 207261, -631, 2959, -169183, -115661, 112942, -172453, -240330, 11916, -53416, -54001, -25575]
951b5575M532k15435j3245L95700j50378J12483P6393j46654J41778M7201j90724
940C6076L0193J1280K4472L747j37112o48L0042l88590K25680M0801O9809k5715
928g9965J58675j2591J58649p0507n6485O55N147r3905k8055j17966J77870Q6965
916A28487J5038j24995n4104Q4947n5769J35913p4379m7978j01490j08186o7398
905b69914L04151N5560O283J50630m14012l6201L70039R4990P8562k04831j89893
894e4636L3265l5941j8156M0407J95799j68761m7532K03255k00420J66231J67033
883B80544k54665R2508J29330o5393J23228j49783Q2014j23237n7236K1875J67511
872B46696J46322l55121j42093K03779p3559N2236R292J9711k02008o0484K19131
$$ y = [-25575, -21043, -236478, -249723, 145977, -4401, 108082, 184475, 37821, 179599, 226800, 36076, 66269, 77549, 102021, 105768, -31344, -31992, -1950, -390540, -164860, -124059, -54250, -79965, 78710, 66119, 224768, 154261, 97776, 98431, 103578, 9673, -18382, -136348, 41522, 128487, 143525, 18530, -35574, 49373, -6396, 129517, 55138, 7160, -94330, -202516, -269914, 34237, 89797, 96080, 246710, -167302, -203503, 166536, 261526, 340088, 135257, -54636, -21371, -57312, -75468, -35061, 160738, -8023, -55555, 147700, -52720, 113511, 280544, 25879, 118387, 247717, 182324, 305552, 155769, 237783, 114546, 57310, 79185, 246696, 393018, 37897, -104196, 99583, 26024, 78260, 87552, 107263, -94745, -155229, 63902]
861F3902k8401J12141J07820j99622r5205N7665k4411n1801r0888K2866K7614
850i8320L6227M02978j7872l15238q7187K07539K22347j28721j69963l8378j37056
839a23644O0397j16412J07360L28561Q0968l73709j31552L25549K9338M8615M1418
828B76889j47309j14097K7697K23220r9344n8014m5317J39171l3071j65631O4775
817F8969J17989k55999j4727J23666k11341M06112p4528j6748Q4604J06209j69855
806A64351q0834O4415j6600m072j13059J37948q0351k0581O2395Q3366J4023j45049
794F5952j93795K51839J24258l34027J66560o3272r2452p3359k4880K34917p3699
783a1958k31941n0974J39317R6639l0198k9447N6064J25670J04669j84207j01226
$$ y = [63902, 35501, 147642, 255462, 55840, -39365, 18300, -6111, -57912, -148800, -125934, -98320, -62093, 340885, 323013, 7775, -79412, 128127, 350474, 221753, 51790, 13412, -123644, -63247, -179659, -72299, 256262, 337230, -36479, -168031, 157518, 186856, 235471, 276889, 129580, 15483, 43180, 266400, 167056, 109042, 63725, 202896, 169825, 4194, 68969, 186958, -69041, -83768, 39898, -171443, 234669, 160141, 143393, 227997, 334206, 164351, 83517, 147932, 131332, 127260, 14201, 152149, 71798, 51217, 113612, 196978, 211001, 65952, -127843, 123996, 248254, -85773, 80787, 17515, -74937, -148296, -173176, 61741, -11958, -243899, -294873, -155556, -58917, -89115, -118562, -62498, 63172, 167841, -16366, -117592]
772a17592j9602Q314J2531J80968j3484K10682j10380k3486K24326N835k30273
761A27839n8176J34734m6361q3733K0711j21120p3239J15105j05786j35494K76681
750E1161L75448L2910j53643p1065r5044l19357N7732J19086P4839j61264M1209
739d7988J85364O7740j44313j2974K23625j21099j40295J34895k37206m7035j56797
728b96083J82892K94787N5295J24306j16845j28979K1340k8098Q4836k06462p6460
717h9471L02405K8873k9543l24759l1140J62401P9575Q6626j39191l1100J3946
706B8622K8188J46914R9872j04680l71446L25528L06520p3668n9009j98521j39882
695a1562q1553J99791J53171k55502J99709J16742j53465r5217j07307p279J10741
$$ y = [-117592, -137194, -128880, -116349, 64619, 51135, 261817, 151437, 127951, 352277, 358112, 127839, 69663, 204397, 158036, 74303, 95014, -26106, -99345, 15760, -90026, -225520, 51161, 426609, 459519, 305876, 234811, 139767, -179590, -121858, -2772, 72067, -89197, -47988, 137376, 205116, 60803, 47829, 271454, 150355, 10060, 144955, -92251, -139286, -296083, -113191, 181596, 236891, 361197, 244352, 115373, 136713, 108615, 193451, -13011, -89471, 212934, 241807, 212264, -112495, -143635, 18766, 98341, 184967, 45776, 14676, 28622, 56810, 203724, 303596, 198916, -172530, 152998, 459518, 385850, 326841, 128320, -11562, -93115, 106676, 259847, 4345, 204054, 320796, 167331, 72114, -35193, -42472, 68269]
684F8269M2586J73779J12623j16278j02601J56730J95573k24741k41379m9838
674A4723J32036k64009j96327J9795L00717K56487m2562J56519k27858n8423j08290
663a7192l2325J03675r8169O0164L58824L6474o6060K1916k84017j27613m224
$$ y = [68269, 110855, 284634, 397257, 280979, 178378, 335108, 530681, 305940, 64561, 14723, 146759, -117250, -313577, -293782, 6935, 263422, 220860, 377379, 149521, 91098, -17192, -49517, 54158, -44011, 16153, 374977, 411451, 345391, 367307, 83290, -44323, -48547]
$$ [...]
##END NTUPLES=NMR SPECTRUM
##END=
