##TITLE=1H_CG-1192-1
 CDCl3
 8 sc, 
 13.2.2024
##JCAMPDX= 6.0         $$ Bruker NMR JCAMP-DX V2.0
##DATA TYPE= NMR SPECTRUM
##DATA CLASS= NTUPLES
##ORIGIN= UXNMR, Bruker Analytische Messtechnik GmbH
##OWNER= root
$$ XWIN-NMR		Version 3.5
$$ Tue Feb 13 14:36:20 2024 Russian Standard Time (UT+4h)  she@DPX200
##.OBSERVE FREQUENCY= 200.1313
##.OBSERVE NUCLEUS= ^1H
##.ACQUISITION MODE= SIMULTANEOUS
##.ACQUISITION SCHEME= undefined
##.AVERAGES= 8
##.DIGITISER RES= 18
##SPECTROMETER/DATA SYSTEM= spect
##.PULSE SEQUENCE= zg30
##.SOLVENT NAME= CDCl3
##.SHIFT REFERENCE= (INTERNAL, CDCl3, 0, 15.4648)
##AUDIT TRAIL= $$ (NUMBER, WHEN, WHO, WHERE, WHAT)
$$ ##TITLE= Audit trail, XWIN-NMR		Version 3.5
$$ ##JCAMPDX= 5.01
$$ ##ORIGIN= Bruker BioSpin GmbH
$$ ##OWNER= she
$$ F:/spectra/data/she/nmr/H-F/1/pdata/1/auditp.txt
$$ ##AUDIT TRAIL=  $$ (NUMBER, WHEN, WHO, WHERE, WHAT)
(   1,<2024-02-13 14:35:02.32 +0400>,<she>,<DPX200>,
      <created by zg, POWCHK disabled, PULCHK disabled
       configuration hash MD5:
       00 E9 B6 7A A2 85 ED C7 34 08 36 98 17 FE 4E 26
       data hash MD5: 16K
       95 A0 44 05 81 72 3B A5 90 28 83 00 5E BE 4A 7A>)
(   2,<2024-02-13 14:35:04.54 +0400>,<she>,<DPX200>,
      <Start of raw data processing
       efp BC_mod = 2 LB = 0.24 FT_mod = 6 PKNL = 1 PHC0 = -24949.78 PHC1 = 12.4527 SI = 16K 
       data hash MD5: 16K
       45 39 5B 4B 1E 8D 02 B2 F3 44 A4 85 62 25 F3 D3>)
(   3,<2024-02-13 14:35:26.89 +0400>,<she>,<DPX200>,
      <pk PHC0 = 6.09376 PHC1 = -7.6 
       data hash MD5: 16K
       A6 1E FB FC 45 04 18 54 28 9C F3 93 55 E1 53 D0>)
(   4,<2024-02-13 14:35:30.03 +0400>,<she>,<DPX200>,
      <abs ABSG = 5 
       data hash MD5: 16K
       01 B4 D2 5E F1 D8 03 FD DA 3E EB D0 E6 0B C8 26>)
$$ ##END=
$$ 
$$ hash MD5
$$ C0 70 E7 C4 8C E8 E2 F9 9C A6 65 D3 24 2B 84 19
##$RELAX= 
##$RELAX= 
##$RELAX= 
##$RELAX= 
##$RELAX= 
##$RELAX= 
$$ Bruker specific parameters
$$ --------------------------
##$DU= <F:/spectra>
##$EXPNO= 1
##$NAME= <H-F>
##$PROCNO= 1
##$TYPE= <nmr>
##$USER= <she>
##$AMP= (0..31)
100 100 100 100 100 100 100 100 100 100 100 100 100 100 100 100 100 100 
100 100 100 100 100 100 100 100 100 100 100 100 100 100 
##$AQSEQ= 0
##$AQ_mod= 1
##$AUNM= <au_zg>
##$AUTOPOS= <>
##$BF1= 200.13
##$BF2= 200.13
##$BF3= 200.13
##$BF4= 200.13
##$BF5= 200.13
##$BF6= 200.13
##$BF7= 200.13
##$BF8= 200.13
##$BYTORDA= 1
##$CFDGTYP= 0
##$CFRGTYP= 5
##$CHEMSTR= <none>
##$CNST= (0..31)
1 1 145 1 1 1 1 1 1 1 1 1 1 1 1 1 1 1 1 1 1 1 1 1 1 1 1 1 1 1 1 1 
##$CPDPRG= <>
##$CPDPRG1= <>
##$CPDPRG2= <>
##$CPDPRG3= <>
##$CPDPRG4= <mlev>
##$CPDPRG5= <mlev>
##$CPDPRG6= <mlev>
##$CPDPRG7= <mlev>
##$CPDPRG8= <mlev>
##$CPDPRGB= <>
##$CPDPRGT= <>
##$D= (0..31)
0 1.2 0 0 0 0 0 0 0 0.06 0 0.03 0 0 0 0 0.0002 0 0 0 0 0 0 0 0 0 0 0 0 
0 0 0 
##$DATE= 1707820501
##$DBL= (0..7)
120 120 120 120 120 120 120 120 
##$DBP= (0..7)
150 150 150 150 150 150 150 150 
##$DBP07= 0
##$DBPNAM0= <>
##$DBPNAM1= <>
##$DBPNAM2= <>
##$DBPNAM3= <>
##$DBPNAM4= <>
##$DBPNAM5= <>
$$ [...]
##$SUBNAM3= <"">
##$SUBNAM4= <"">
##$SUBNAM5= <"">
##$SUBNAM6= <"">
##$SUBNAM7= <"">
##$SUBNAM8= <"">
##$SUBNAM9= <"">
##$SW= 18.0517328524113
##$SWIBOX= (0..15)
0 0 2 0 0 0 0 0 0 0 0 0 0 0 0 0 
##$SW_h= 3612.71676300578
##$TD= 16384
##$TD0= 1
##$TE= 0
##$TE2= 300
##$TE3= 300
##$TEG= 300
##$TL= (0..7)
0 120 120 120 120 120 120 120 
##$TP= (0..7)
150 150 150 150 150 150 150 150 
##$TP07= 0
##$TPNAME0= <>
##$TPNAME1= <>
##$TPNAME2= <>
##$TPNAME3= <>
##$TPNAME4= <>
##$TPNAME5= <>
##$TPNAME6= <>
##$TPNAME7= <>
##$TPOAL= (0..7)
0.5 0.5 0.5 0.5 0.5 0.5 0.5 0.5 
##$TPOFFS= (0..7)
0 0 0 0 0 0 0 0 
##$TUNHIN= 0
##$TUNHOUT= 0
##$TUNXOUT= 0
##$USERA1= <user>
##$USERA2= <user>
##$USERA3= <user>
##$USERA4= <user>
##$USERA5= <user>
##$V9= 5
##$VALIST= <valist>
##$VCLIST= <CCCCCCCCCCCCCCC>
##$VD= 0
##$VDLIST= <DDDDDDDDDDDDDDD>
##$VPLIST= <PPPPPPPPPPPPPPP>
##$VTLIST= <TTTTTTTTTTTTTTT>
##$WBST= 1024
##$WBSW= 4
##$XGAIN= (0..3)
0 0 0 0 
##$XL= 0
##$YL= 0
##$YMAX_a= 786088
##$YMIN_a= -949862
##$ZGOPTNS= <>
##$ZL1= 120
##$ZL2= 120
##$ZL3= 120
##$ZL4= 120
##$ABSF1= 15.50339
##$ABSF2= -2.548459
##$ABSG= 5
##$ABSL= 3
##$ALPHA= 0
##$AQORDER= 0
##$ASSFAC= 0
##$ASSFACI= 0
##$ASSFACX= 0
##$ASSWID= 0
##$AUNMP= <proc_1d>
##$AZFE= 0.1
##$AZFW= 0.1
##$BCFW= 0
##$BC_mod= 2
##$BYTORDP= 0
##$COROFFS= 0
##$CY= -3
##$DATMOD= 1
##$DC= 0
##$DFILT= <>
##$DTYPP= 0
##$F1P= 0
##$F2P= 0
##$FCOR= 1
##$FTSIZE= 16384
##$FT_mod= 6
##$GAMMA= 0
##$GB= 0
##$INTBC= 1
##$INTSCL= 3.70164e-10
##$ISEN= 128
##$LB= 0.24
##$LEV0= 0
##$LPBIN= 0
##$MAXI= 10000
##$MC2= 0
##$MEAN= 0
##$ME_mod= 0
##$MI= 1.114404
##$NCOEF= 0
##$NC_proc= -6
##$NLEV= 6
##$NOISF1= 3.799351
##$NOISF2= 2.8
##$NSP= 0
##$NTH_PI= 0
##$NZP= 0
##$OFFSET= 15.46483
##$PC= 1
##$PHC0= -24943.69
##$PHC1= 4.8527
##$PH_mod= 1
##$PKNL= yes
##$PPARMOD= 0
##$PSCAL= 0
##$PSIGN= 0
##$REVERSE= no
##$SF= 200.130011382418
##$SI= 16384
##$SIGF1= 3
##$SIGF2= 2
##$SINO= 5.538805
##$SIOLD= 16384
##$SREGLST= <1H.CDCl3>
##$SSB= 0
##$STSI= 16384
##$STSR= 0
##$SW_p= 3612.71676300578
##$SYMM= 0
##$S_DEV= 0
##$TDeff= 16384
##$TDoff= 0
##$TI= <>
##$TILT= no
##$TM1= 0
##$TM2= 0
##$TOPLEV= 0
##$USERP1= <user>
##$USERP2= <user>
##$USERP3= <user>
##$USERP4= <user>
##$USERP5= <user>
##$WDW= 1
##$XDIM= 16384
##$YMAX_p= 424363967
##$YMIN_p= -341788
$$ End of Bruker specific parameters
$$ ---------------------------------
##NTUPLES= NMR SPECTRUM
##VAR_NAME=  FREQUENCY,     SPECTRUM/REAL,   SPECTRUM/IMAG
##SYMBOL=    X,             R,               I
##VAR_TYPE=  INDEPENDENT,   DEPENDENT,       DEPENDENT
##VAR_FORM=  AFFN,          ASDF,            ASDF
##VAR_DIM=   16384,         16384,           16384
##UNITS=     HZ,            ARBITRARY UNITS, ARBITRARY UNITS
##FACTOR=    0.220516191357247, 1,           1
##FIRST=     3094.97668369089, 0,            0
##LAST=      -517.740079314889, 0,           0
##MIN=       -517.740079314889, -341788,     0
##MAX=       3094.97668369089, 424363967,    0
$$ Real data points
##PAGE= N=1
##DATA TABLE= (X++(R..R)), XYDATA
$$ [...]
8691 5985486 5846796 5708720 5716556 5595089 5470300 5457433 5377760 5324788 5377011 5251983 5117343
8680 5117343 5115662 5153051 5191029 5137269 5090604 4944361 5003839 5003936 4939236 4899861 4936969 4946957
8668 4946957 4875579 5000681 5029943 5006951 4972851 4949408 4878488 4907874 4995292 4975495 5008129
8657 5008129 5050936 5135814 5239781 5110824 5208760 5253599 5245481 5201307 5233398 5399672 5523812
8646 5523812 5542787 5576424 5833899 5807196 5909528 5999829 6112107 6183157 6248700 6372285 6550386
8635 6550386 6637499 6695810 6851934 6873977 6949940 7240897 7418223 7547237 7640013 7787407
8625 7787407 7862741 8002920 8259450 8294501 8581343 8897087 9062106 9311271 9528755 9706799
8615 9706799 10023140 10306982 10654653 11054892 11557648 11973730 12514927 13157365 13866944 14706628
8605 14706628 15786608 17034828 18405291 20129045 22377616 25252145 28728932 32066596
8597 32066596 34366576 34740865 33307797 31126076 29187797 27937076 27489082 27994204 29285205
8588 29285205 31187726 33522806 35460357 36018634 34552250 32026980 29185476 26534293
8580 26534293 24396705 22977698 22016278 21375457 20866666 20594553 20392315 20207532 20208956
8571 20208956 20318092 20364728 20517836 20904860 21435743 22296602 23248282 24458118 26115928
8562 26115928 28134495 30799900 34322445 38444546 43176337 47738954 51072643 52792373
8554 52792373 52502646 50046122 46995656 44241635 42588176 42391338 43564377 45767133
8546 45767133 48282677 50323504 50997574 50052483 47155488 42810437 38176734 33831123
8538 33831123 30316004 27748009 25693282 24118584 22828395 21734513 20670243 19829500
8530 19829500 19110067 18478796 17849495 17359267 17003576 16828326 16844090 16781047 17014172 17551718
8520 17551718 18335492 19660314 21208030 23272979 25649678 27676704 28571779 27597163 25636147
8511 25636147 23696185 22166426 21187490 20941462 21339262 22299611 23558628 24835285 25572629
8502 25572629 24930899 22897077 20418708 17817060 15762931 14175549 13060707 12113432
8494 12113432 11366573 10542609 9916433 9471961 9118293 8692864 8115100 7734876 7334032
8485 7334032 6809728 6432559 6122498 5817172 5570476 5257882 5067963 4822659 4668780 4460413
8475 4460413 4289281 4124515 4132628 4123159 4016359 3856919 3744177 3717619 3572192 3548534 3459128
8464 3459128 3322126 3294032 3291299 3281668 3138551 2982119 3023594 2995026 2951605 3017665 3024079
8453 3024079 3014591 3081444 3282857 3432873 3498999 3412408 3156576 2910102 2610272 2442033
8443 2442033 2257860 2187141 2160984 2148055 2005522 1999788 1926427 1874387 1950330 1866545 1796928
8432 1796928 1766129 1731580 1780609 1869534 1778639 1717645 1668918 1658509 1524371 1359245 1451931
8421 1451931 1431568 1504095 1563717 1592309 1640703 1506050 1486297 1566125 1551786 1480096 1443598
8410 1443598 1317231 1307631 1172812 1089463 1196676 1190317 1133766 1095069 988815 1019281 962005
8399 962005 921739 968679 954251 921705 927176 961953 946003 822704 837369 919137 912335 860409
8387 860409 968562 1002233 1021250 967340 918463 885769 930028 844792 746751 896282 960611
8376 960611 870889 829834 826607 874497 820170 714647 746667 727874 684596 547154 673414
8365 673414 785214 657329 608632 516494 524970 681476 677776 566980 614083 658148 596813
8354 596813 566646 635278 621844 625286 704474 692219 658902 608794 537395 547251 511740 507117
8342 507117 520530 464031 570151 552251 530796 573053 488866 398102 358378 555135 593809
8331 593809 575545 613970 507326 497749 544716 518466 460393 410297 367998 419216 430477 451669
8319 451669 434450 540325 409586 350785 417343 501645 530103 504828 520661 626051 666451
8308 666451 612890 663197 621469 624142 588827 591408 535275 543285 493954 546711 619526 617098
8296 617098 578166 544985 588335 627410 697958 650009 656209 614992 485213 543333 718194
8285 718194 736423 712526 688056 738604 671122 579417 698818 749044 652440 664327 656007 733735
8273 733735 729897 707890 803155 814302 757763 895809 953459 912183 823613 849195 918179 889136
8261 889136 886981 757624 768444 583764 606281 716614 826573 718011 568693 653087 790883
8250 790883 727050 712416 731514 745718 811032 846403 859494 817660 826598 745224 744396 700872
8238 700872 694986 690263 640474 723713 701989 630258 651968 622822 668272 723431 811382 818665
8226 818665 894094 895350 911024 828357 802472 749423 785446 828321 820736 873562 850707 890823
8214 890823 806490 865892 837978 761228 722396 705289 719404 696345 741375 746273 683082 590023
8202 590023 688004 710553 741354 776828 758870 752097 787268 804638 864492 980844 785187
8191 785187 633566 726821 727073 817566 973079 1044101 951665 855584 809131 821785 891499 820004
8179 820004 955959 884771 781224 877759 946226 905916 971642 918453 737029 757002 716823
8168 716823 577533 588186 575826 573580 600609 522640 518104 552488 695451 754918 763689 717582
8156 717582 712878 785101 894637 906292 845562 897563 960879 919017 945875 999248 981263 966153
8144 966153 895316 988086 900607 730290 662870 555333 543403 618397 590401 600489 551798
8133 551798 544837 629104 681314 639132 632726 893552 867270 808379 760732 645808 555377 451665
8121 451665 530936 512458 607733 574978 574056 422408 335922 399254 402537 393052 422090 404000
8109 404000 440832 522418 483159 373476 341307 358427 295158 355835 291471 360019 271766
8098 271766 133474 245866 147277 159014 234146 234463 253556 189343 271233 252494 216799 216378
8086 216378 284222 236883 226856 209787 143826 25444 26714 102931 17284 48450 138735 90957
8074 90957 128624 179972 29347 26987 15036 8416 21556 52649 80616 59029 14909 20933
8062 20933 -60800 -166259 -89968 -63688 -48796 -3316 -15135 -86296 -65419 -123236 -41477 -2187
8050 -2187 -60172 -13566 -72264 -64625 -12478 37852 -479 -29581 -25712 23850 -10662 -6346 -66564
8037 -66564 -92698 20480 104743 -60919 -88594 -36114 -71985 -34156 -994 -28390 -73562
8026 -73562 -56198 1344 58470 157574 38381 -18726 -24619 -131922 -90793 -95088 -61085 -88701
8014 -88701 -141510 -143025 -29256 -194949 -65004 -100252 -127217 -69600 -93241 -125000 -147125
8003 -147125 -153443 -182263 -143987 -123376 -94950 -122358 36988 90547 -109557 -215997 -176401
7992 -176401 -66197 -24072 -102166 -200785 -240329 -211842 -132372 -1988 -33297 -8319 15116
7981 15116 9329 -50431 -90063 -71701 -46137 -100144 1886 -7495 -183279 -233023 -149395 -92114
7969 -92114 -99339 -46184 -42858 -19711 -48320 -30249 56545 26020 -68747 -64710 -93098 -55953
7957 -55953 -104749 -66298 -111055 -39239 -65439 -106789 -73495 -166197 -69599 35764 7932 19464
7945 19464 4040 -64140 20056 34339 -6558 24452 1018 -17207 30440 -70042 -123606 11655
7933 11655 118960 20558 -49767 -85441 -68956 10686 -8572 -85708 -87412 -13704 -38308 -135400
7921 -135400 2288 61903 -13754 -22726 -14550 1787 68016 59684 90978 208688 185803 165517
7909 165517 203777 88886 34051 117976 110537 101022 169728 209818 211084 295680 353857 234374
7897 234374 175516 148667 268899 412774 290911 319672 282309 256894 272888 268744 321389
7886 321389 383656 462502 353181 421923 381642 232091 273580 331958 380790 247012 223293
7875 223293 189413 125924 111954 34809 71845 71216 142755 105101 48909 138649 233334 172733
7863 172733 210191 118541 38240 106734 168819 165795 263829 322932 295957 227025 256248 245826
7851 245826 268782 345862 337043 302299 238878 227848 328686 389249 304148 386070 323770 408051
7839 408051 415179 370179 320485 186027 256624 273140 189814 208935 215134 261860 237984 155232
7827 155232 119569 123101 118348 168947 265782 171440 153609 281799 258580 143998 155356 179435
7815 179435 147346 174117 215846 210239 229330 145686 147237 199816 181450 219487 322417 190242
7803 190242 -41712 78385 152386 65696 129988 233556 218193 250673 167699 219940 262741
7792 262741 291696 233794 136538 179108 262418 292219 312772 262166 195342 169767 226024 300642
7780 300642 398330 363044 212505 220205 216407 71802 162143 122571 36814 17342 -56245 65625
7768 65625 154981 92116 113483 162300 152271 219106 270932 238421 220446 137961 133641 109056
7756 109056 131435 243437 106240 121595 188014 176187 157482 92287 162502 278576 245457
7745 245457 235472 265836 182799 96203 92117 154516 116266 72119 116165 30411 47823 96910
7733 96910 51558 23997 19621 -24807 -3726 19684 28344 32114 10764 -39694 -67727 -46415
7721 -46415 59424 28302 180242 244751 243809 69723 75348 191053 55201 59039 88208 11581
7709 11581 -52975 129119 99795 84394 69996 -5661 71628 -9384 -58060 -40846 77050
7698 77050 148637 116811 66845 20933 17399 66137 77138 -21113 -40339 -15964 5636 70486
7686 70486 42949 55165 106798 139888 165712 216615 172324 136802 229262 288375 226164 230994
7674 230994 219638 91980 142667 89939 234002 182419 204038 213336 176243 127898 -99492
7663 -99492 -96366 9791 47908 85445 70661 145914 42875 -22628 17726 143713 177106
7652 177106 69399 -8313 4655 17062 92710 152192 89104 123241 17824 44965 -42410
7641 -42410 36091 15761 -30566 -17477 69891 86599 63595 98993 25640 -30409 -31692 -18701
7629 -18701 23579 41934 -23557 -73218 -26534 109492 45106 -12062 55109 30983 -11500 -33921
7617 -33921 16066 -24065 -51090 -99412 -69880 -27781 62010 51635 76259 46794 48907 108496
7605 108496 98640 25186 47001 95875 23090 35630 136775 89132 32345 -50910 21898 194128
7593 194128 209230 147717 76274 15167 1795 118951 39752 40324 142155 143203 63938 194084
7581 194084 61599 118680 51754 39997 59935 28794 72518 149510 234472 253163 230318
7570 230318 246356 269486 230044 183347 312792 286095 299679 317041 336942 341708 361134 347538
7558 347538 271729 294180 276558 356775 358398 371827 266250 181584 165158 106554 96341 70748
7546 70748 -17040 -39887 -77392 -29098 -23383 23939 94070 136335 210612 75398 -17568 101799
7534 101799 118342 84991 130729 188919 69568 11424 91969 135249 97565 133873 157621
7523 157621 170111 63426 -407 63989 86503 7465 48636 -22405 -1716 36429 -8805
7512 -8805 -331 -94913 -19285 -78081 -25256 -101971 -213659 -147708 -59058 54153 20550 -3307
7500 -3307 -42080 -107803 -102198 -126681 -105286 -68402 1256 31610 3523 -30968 16193 -3129
7488 -3129 55637 189303 39848 9513 38740 -32330 -108138 -56217 -23182 13644 -14435 -83014
7476 -83014 -34086 -49315 -54558 47324 -9243 26397 87986 85650 220201 184941 174609 206946
7464 206946 111813 67775 146829 129756 61374 164073 209648 253898 315358 190607 140297
7453 140297 143204 147509 126517 125396 111439 96396 106829 133586 187993 195693 226050 204771
7441 204771 224214 204453 236339 180107 158654 210345 171450 229086 225953 199337 270198 290452
7429 290452 246232 198367 222850 206839 251845 305026 153378 133533 112012 169502 123964
7418 123964 161079 193383 75673 170472 188051 122229 60495 183366 174953 114966 145587
7407 145587 99130 65451 219492 278075 228557 191048 153866 42997 50429 78734 98684
7396 98684 86602 103414 116003 42222 41425 115713 261177 188593 16509 -36516 -35419 -5579
7384 -5579 32219 24322 56500 35772 90687 -8693 -147947 -194434 -118725 -81683 -53207 -62432
7372 -62432 -70182 -77828 -62852 -59682 -17857 43708 -4740 -38708 -78486 -88847 -46583 -17767
7360 -17767 108677 105764 -81336 -108816 -164435 -208312 -190819 -159865 -165330 -165993 -112096 -22970
7348 -22970 30102 -62265 -158848 -204085 -244478 -279953 -253664 -265293 -170968 -51303 -88853 -65664
7336 -65664 -89677 -86873 -60090 -88923 -158954 -170993 -75745 -36078 -100241 -112664 -157016 -270242
7324 -270242 -211149 -103589 -38749 -84772 -291113 -218650 -152328 -243747 -190530 -130962 -98417
7313 -98417 -56336 -102237 -125810 -66164 -19252 -15110 -6807 3691 -116625 -176716 -57419 16041
7301 16041 -50388 -115550 -104753 -60621 -59395 5554 -49905 -85628 -82859 -50436 -120054 -40147
7289 -40147 -65317 -49438 -51132 -121984 -60809 -45720 -196999 -171233 -116947 -92854 -35287 -55647
7277 -55647 -97359 -122820 -58319 -107753 -244963 -271902 -160190 -110502 -129823 -187884 -75975
7266 -75975 -235245 -207790 -124081 -86969 -167989 -172996 -128799 -224468 -236018 -147586 -37688 -95017
7254 -95017 -93511 -42836 -194198 -157043 -149519 -197039 -234411 -127675 -198594 -311315 -293877 -203260
7242 -203260 -163672 -198705 -180398 -145938 -70713 -110513 -109063 -84684 -36816 -92012 -185404 -141853
7230 -141853 -127776 -153784 -105521 -95888 -83849 -121394 -99838 87889 82964 14890 -40932 -47958
7218 -47958 -38430 -94853 -190726 -180578 12692 -10845 -82751 -194860 -179379 -108257 -129335 -79077
7206 -79077 -95464 -170744 -191323 -189328 -6962 -130061 -115482 -103996 -167798 -189681 -138290 -130708
7194 -130708 -111997 -84129 -182118 -111325 -39075 -81541 -112999 -17283 -7487 -38832 -30984 -19134
7182 -19134 -31751 -133047 -205806 -141755 -146928 -97909 -71970 -99859 -184882 -192351 -243967 -225926
7170 -225926 -261453 -241811 -180409 -237563 -112382 10878 44973 -118031 -171766 -196060 -166276
7159 -166276 -84846 -131411 -125010 -239664 -246370 -188993 -83386 -59614 -161402 -151410 -100754 -88203
7147 -88203 -140155 -160553 -234591 -157825 -11478 42695 -111455 -186213 -206254 -214634 -263954 -198318
7135 -198318 -164541 -234648 -87047 -25345 -83021 -141456 -129039 -128837 -193023 -160075 -120281 -129809
7123 -129809 -133130 -176675 -198134 -78122 -153766 -137292 -32653 -86074 -36676 -126005 -209483
7112 -209483 -215717 -127032 -154771 -211807 -167653 -159277 -59113 -75841 -211202 -207061 -210405 -131055
7100 -131055 -47111 46605 -106262 -111632 -107420 -147473 -137123 -142718 -163947 -113501 1678 -61746
7088 -61746 -132661 -120074 -153121 -165080 -102739 -99406 -162303 -126731 -7244 -130119 -113141 -64801
7076 -64801 -70053 -186372 -217688 -48149 -67714 -163912 -220402 -87358 -19639 -77901 -144567
7065 -144567 -107684 -22468 -12216 -6278 1304 -38708 -37400 8320 37135 68515 -11255 -86900
7053 -86900 -63085 -77415 28659 -16990 -65013 -11576 -118753 -111497 -83918 -42805 -23350 -65081
7041 -65081 -38042 2166 -13849 -34881 -89362 -20170 -122115 29220 -85906 -166968 -121555
7030 -121555 -142164 -128702 -129074 -62096 -60121 -106807 -121515 -59516 -120870 -72877 32218 11243
7018 11243 -152075 -116465 -22052 22162 45527 21976 7267 44689 -40329 12518 110173 244334
7006 244334 196087 140542 263892 346557 300828 260275 314883 126653 166147 76377 62238
6995 62238 107673 96450 -20260 14746 150318 40957 5776 -16675 -70287 -130296 -50935
6984 -50935 -16135 -30861 37197 32382 1051 -40635 -42213 -29805 -34108 -76271 -54033 -76031
6972 -76031 -14959 63490 -7723 -44287 -154800 -138462 -81313 23694 -4402 -118369 86504
6961 86504 -24007 -85846 -167400 -139365 38989 -66326 -71537 -92574 6384 14112 -66356 -137346
6949 -137346 6742 2942 -115519 -115053 -67460 -99810 -39701 -172383 -106133 -11272 36907 -935
6937 -935 -51228 -70768 -73459 77158 -21012 -83099 12510 140409 74369 -9349 -63967 -30355
6925 -30355 47074 2431 54978 -553 -119641 -134791 -69681 -43636 -86659 -122684 -105742 -152040
6913 -152040 -116747 -95343 -117774 -92394 -126205 -111374 -70040 -59828 -95610 -94935 -39064 -7558
6901 -7558 -49378 -125151 -120597 -37741 -12087 -61901 -126061 -125655 -122868 -111238 -98919 -13527 -81515
6888 -81515 -69156 -85700 -90834 -159308 -79212 38061 19345 104781 -70962 -176286 -207796
6877 -207796 -181265 -5937 -41227 -122156 -84254 -15366 -19455 -76728 -130045 -74230 -75662 23901
6865 23901 -41066 -136350 -169342 -166763 -146120 -122476 -56886 -214436 -192000 -59330 -44746 -50662
6853 -50662 -36061 -148294 -55429 -85264 -79776 -64623 -33700 -10084 -90917 -91869 25703 117590
6841 117590 39827 -19497 -92133 -37821 37243 106896 21092 -33097 -136627 -31780 -12522
6830 -12522 -87584 -88720 -56415 48360 -41381 -133764 -127806 -170086 -135631 -83879 -34619 14443
6818 14443 -1228 26430 -62212 -154674 -60330 -114808 -100189 -3532 -36681 -62534 -62997 -50421
6806 -50421 -31458 -84382 -191738 -169442 -219007 -192444 -141052 -143657 -37141 1979 28674 7262
6794 7262 14017 69830 1119 -33105 874 -22860 -37781 -4411 -29773 -68767 -11602 -33840
6782 -33840 -34351 -30754 -12798 23694 42915 -21454 -67904 11011 41079 102760 36652 18258
6770 18258 26229 -15274 5037 3136 -49825 -78873 -99152 71077 82349 103415 8827 -18754
6758 -18754 -109110 -150280 -16059 -16174 28784 -31162 -10463 14480 -43005 -74281 103257 -10660
6746 -10660 -97791 -116427 13703 43771 -36143 -121752 -85301 33168 80630 106376 -49364
6735 -49364 -26394 -6024 -27183 2026 39579 25026 137760 46154 102139 1566 25322
6724 25322 -68957 13544 157581 -35223 -39079 -52275 -18350 13978 49110 58459 73724 2557
6712 2557 -43992 77278 83615 45348 -55851 7117 15656 17756 67993 43224 8619 49526
6700 49526 17665 -109927 -41964 30119 -52596 -40593 -1245 23718 24700 22184 114280 55441
6688 55441 9049 14361 105049 164894 112898 89350 131593 30397 -6886 -178512 -104035 -20350
6676 -20350 -26939 15086 23511 -35997 -118796 -61663 49161 168437 33986 -99313 -45522
6665 -45522 69426 114093 -27586 15233 -30420 -46596 4298 9304 -54075 -49016 -34745 -37566
6653 -37566 8013 -21447 631 29878 -33349 11992 95420 85521 11243 -106777 -5394 86766
6641 86766 -9079 -100267 -50268 17984 -74155 -14222 162793 138926 107640 6534 -35033
6630 -35033 -39522 55170 49430 77451 178702 42260 -30833 46855 129361 43431 82911 32762
6618 32762 18437 91785 153510 145031 200142 125632 63550 101150 123717 25037 71513 148647
6606 148647 148000 139291 84563 167573 50440 77827 75681 92468 23583 88782 130212 136057
6594 136057 80313 35629 176078 170993 163593 138466 100731 96650 202390 168690 200667 179755
6582 179755 172500 208120 201430 110902 73801 137163 143512 104310 96911 150354 110465 197158
6570 197158 193031 44439 129516 215454 234589 233858 126173 91754 90709 141956 96571 64604
6558 64604 175400 202857 173343 198934 134116 254220 192464 223852 246595 236757 278680 384267
6546 384267 333784 303064 360131 293103 281166 258440 303318 319784 327830 368580 259228 291857
6534 291857 198910 162863 270679 286750 341254 379507 347531 357703 213922 145173 132413
6523 132413 112608 199610 282405 292605 220570 361093 241308 177701 246830 273056 177024
6512 177024 239891 269568 261624 294107 239695 318121 369196 282894 263797 324069 353844 386590
6500 386590 348550 311507 486243 447544 349180 298277 426301 468942 317763 383415 392733
6489 392733 480916 360828 256778 331093 259152 296283 302515 369211 400598 441308 456535
6478 456535 467697 445796 526691 555075 508299 481268 408942 446513 511279 473787 335807
6467 335807 441347 528873 493957 520224 598950 553050 461450 473260 489336 418776 550536
6456 550536 527834 536885 637311 615179 594964 533607 592750 702854 685228 764806 822382
6445 822382 731885 680989 711410 769765 848439 883528 877724 881350 737170 711715 680352 803629
6433 803629 784198 695238 678508 733170 838438 866295 783056 880461 1037354 931568 963983
6422 963983 1174177 1169759 1244529 1268619 1142930 1163606 1151418 1045259 882092 925127 865223
6411 865223 883978 840565 752304 888813 836614 743274 755333 818419 938393 896835 786984
6400 786984 775448 791046 863547 898876 940964 818958 846272 906979 821957 773535 814732
6389 814732 863560 875120 913314 865149 814746 719087 718812 704014 769565 754207 806940 687216
6377 687216 773695 905139 797838 845166 808111 847891 828416 817849 914422 988932 847134
6366 847134 860398 920990 941531 821135 770699 858207 829272 840872 867015 909007 858605
6355 858605 826684 794833 852354 895290 993249 948014 1026532 1045707 1011057 1015595 1060295 1043726
6343 1043726 1018158 1093955 1027170 1128142 1164944 1076953 1063249 1115526 1047264 1060379 1129857
6332 1129857 1233582 1243964 1129639 1139347 1176310 1143669 1265381 1207477 1276422 1345823 1337184
6321 1337184 1535942 1587073 1520514 1401777 1395791 1427647 1550608 1548642 1521652 1539197 1525175
6310 1525175 1437794 1421326 1565233 1587642 1566477 1643757 1673070 1683164 1681332 1743038 1717924
6299 1717924 1625058 1703228 1733154 1766375 1842346 1834175 1973386 2000361 1960690 2005392 1922082
6288 1922082 1917636 1991314 1980911 1941155 1958486 1961702 2047609 2068183 2066842 2141657 2231164 2243507
6276 2243507 2219245 2273249 2215573 2162938 2212256 2270994 2309141 2461488 2503750 2517089 2563075
6265 2563075 2561319 2573501 2594260 2481748 2596812 2681294 2693555 2799199 2826260 2900391 2934788
6254 2934788 2982640 3029377 3022819 3050518 3077357 3119680 3163633 3247993 3280399 3315366 3443509
6243 3443509 3498284 3537831 3586069 3660286 3711865 3867285 3941718 4090419 4194714 4260745 4448456
6232 4448456 4542980 4690742 4722379 4620787 4661950 4753307 4916669 4961484 4992068 5077862 5187303
6221 5187303 5324007 5419161 5376727 5547038 5786703 5988495 6107471 6337822 6494927 6537172
6211 6537172 6568598 6746414 6887998 6952961 7135996 7271827 7472205 7581414 7470179 7626142
6201 7626142 7756956 7933412 8094143 8070716 8162815 8417449 8597152 8825869 8966791 9071149
6191 9071149 9292514 9487327 9681482 9944150 10295597 10568162 10772055 10923078 11202200 11425921
6181 11425921 11658493 11823889 11986710 12232277 12395994 12610619 12939675 13300832 13564331
6172 13564331 13859497 14173133 14530945 14941098 15328309 15781364 16188589 16490473 16911020
6163 16911020 17473284 17974423 18563660 19160439 19909158 20614624 21274662 21901961 22783210
6154 22783210 23654307 24720922 25806749 27045798 28371647 29940160 31650707 33672244
6146 33672244 35944743 38676089 41918391 45489953 49782651 54738260 60038943 65511390
6138 65511390 70656549 74341471 75864496 74918066 72009608 68315157 64389568 61092756
6130 61092756 58524590 56647537 55493519 54957271 55006044 55598839 56799985 58657849 61248048
6121 61248048 64621476 68953594 74241710 80765817 88537155 97708632 108105416 119155356
6113 119155356 129409079 136769763 138818335 134426516 124894267 112904807 100790023 90001034
6105 90001034 81114851 73876151 68095365 63693470 60288013 57709719 55948542 54958709
6097 54958709 54570562 54946335 55887782 57648023 60173313 63401527 67397001 71962722 76801662
6088 76801662 81018750 83388649 82842617 79043361 73069971 66083327 59014487 52654798
6080 52654798 47201280 42768667 39067397 35862822 33315651 31228943 29470643 27676442
6072 27676442 26332844 25104191 23927413 22860863 21836183 20800143 19967151 19213992
6064 19213992 18437875 17769183 17220118 16759224 16291029 15862451 15462931 15121253 14959957
6055 14959957 14865590 14698049 14631572 14766647 14919854 15064428 15492622 15814957 16172275 16503472
6045 16503472 16581979 16473915 16255360 15822486 15309599 14727515 14432804 14140147 13825054 13898865
6035 13898865 14211505 14789695 15409718 16104659 17276387 18585269 20021215 20633354 20242075
6026 20242075 19003144 17361768 16179562 15250713 14614064 14092039 13840110 13662494 13447266
6017 13447266 13261672 13080030 12894539 12684866 12417935 12123355 11912756 11657850 11600694 11748507
6007 11748507 11930506 12201189 12763038 13351677 13898645 14191601 14178595 13728936 12959276 12042942
5997 12042942 11216354 10370931 9727620 9176682 8737687 8325070 8013276 7852043 7565011
5988 7565011 7441642 7386833 7335324 7222518 7253139 7486249 7645597 7764163 7878505 8100985
5978 8100985 8369042 8589308 8788713 8722516 8471801 8020742 7576083 7203188 6803903 6313046
5968 6313046 6036672 5691761 5377574 5043921 4848899 4575248 4480217 4406349 4272871 4178597
5958 4178597 4073371 3992140 3815133 3724121 3546525 3443157 3514996 3383214 3391891 3369960 3337738
5947 3337738 3297882 3216863 3206900 3102933 3050865 3039416 3014750 3045245 3051102 2953817 2937493 2807929
5935 2807929 2790156 2717988 2613667 2516472 2563425 2623026 2588861 2508528 2469769 2429671 2438948
5924 2438948 2346080 2294638 2240310 2270009 2331660 2412398 2480840 2344554 2387562 2344627 2278750
5913 2278750 2274839 2327372 2288278 2314068 2432266 2456615 2353884 2293649 2323502 2357621 2435397
5902 2435397 2364443 2431726 2398651 2254036 2204378 2334745 2323403 2278907 2296577 2309000 2335538
5891 2335538 2380634 2341382 2350749 2380094 2365896 2371043 2398605 2440400 2421450 2470571 2566810 2676938
5879 2676938 2651402 2581738 2635622 2725565 2859860 2861671 2845820 2841958 2829521 2917116 2837518 2917396
5867 2917396 2907691 2934935 3020782 2979272 2913486 2962694 2966589 3039256 2990083 3026107 2965662 2930016
5855 2930016 2943993 2934171 3122813 3197210 3199342 3152726 3195131 3339145 3301339 3347926 3482554
5844 3482554 3460331 3577674 3616164 3647529 3641731 3783709 3758265 3785797 3923134 3989415 3960136
5833 3960136 4044427 4053070 4054689 4250141 4235687 4190752 4159290 4305493 4355923 4487953 4479358
5822 4479358 4426707 4502279 4617156 4758131 4796234 4903152 5154177 5230213 5343305 5471662
5812 5471662 5487880 5424519 5513695 5624695 5802856 5902482 5829921 5914306 5964485 6192104 6348808
5801 6348808 6553854 6664725 6916371 7194060 7493998 7634120 7904730 8339524 8754650 9296329
5791 9296329 10006404 11026929 12225098 13887525 15847672 17575512 17699665 16210592 14224470
5782 14224470 12435319 11205141 10307681 9642617 9163539 8884665 8749195 8648178 8603623
5773 8603623 8429897 8314574 8241956 8203270 8377011 8458042 8493307 8560685 8633968 8810860 8972842
5762 8972842 9359849 9584578 9704856 9718350 9523584 9544131 9549205 9537705 9549336 9656322 9841598
5751 9841598 9961356 9996546 10145310 10393988 10655217 10762084 10909360 11146914 11326484 11479394
5741 11479394 11742044 12043340 12349405 12669046 13082066 13506886 14061846 14690601 15004895
5732 15004895 15209720 15253467 15364409 15542147 15744561 16003749 16362263 16777242 17156007 17615350
5722 17615350 18093364 18478651 18807391 19192215 19604379 19908295 20367716 20751573 21112257
5713 21112257 21611568 21922616 22166063 22460696 22709055 22877695 23208440 23548664 23930875
5704 23930875 24407749 24836154 25467140 25907136 26405918 27138784 27826862 28744266 29676621
5695 29676621 30718126 31816580 33082702 34597097 36117843 37534722 39195491 40870290
5687 40870290 42837080 45129842 48174981 51815504 56155688 61175119 67086182 73903841
5679 73903841 81123918 87680239 92285596 93600002 91326896 86532837 80534700 74890837
5671 74890837 69819100 65901616 62978507 60915146 59623200 59055468 59194776 60022696 61753989
5662 61753989 64351135 67668846 72019774 77425539 84295131 92785093 103024662 115065078
5654 115065078 127849796 139328884 146161511 145497864 137609277 125279338 111834231 99243855
5646 99243855 88456057 79484829 72197265 66311775 61569266 57910363 55268998 53384669
5638 53384669 52220188 51498044 51433445 52084116 53498735 55460874 58000016 61243503 65100380
5629 65100380 69137163 72532065 74381856 73633969 69943679 64245633 57889208 51853087
5621 51853087 46623395 42097622 38341619 35343955 32859612 30688368 29093737 27539435
5613 27539435 26081727 24895862 24046003 23295762 22430621 21628674 20972166 20608510 20339135
5604 20339135 19944283 19667658 19609481 19572733 19588388 19528907 19303971 19138823 18849325 18614781
5594 18614781 18420238 18127069 17803722 17435495 17335913 17299327 17181704 17038675 17003041 17074718
5584 17074718 17211762 17391031 17503630 17687113 17887548 18193997 18576527 18971513 19577749
5575 19577749 20184388 20869707 21537278 22124746 22558382 22659923 22745780 22556031 22488128 22571221
5565 22571221 22832214 23208294 23431740 23639619 23625039 23441052 23261290 22980146 22800724 22696637
5555 22696637 22732711 22717089 22934784 23111839 23586356 24076460 24530937 25209211 25905017 26621655
5545 26621655 27224009 27950055 28681051 29561486 30480123 31493571 32683951 34017299 35302037
5536 35302037 36318955 36899390 36907143 36846350 37030591 37268402 37861060 38921170 40393520
5527 40393520 42067125 44194101 46733891 49995601 53817132 58373219 63847191 69898955
5519 69898955 76317095 82477854 86700163 87887386 86286898 82895744 78957421 75291530
5511 75291530 72471374 70694022 69732923 69266055 69357824 69961175 70684860 71780090 73629690
5502 73629690 76549890 80626208 86005193 92936063 101162213 109863329 117319639 122103930
5494 122103930 123975069 123186502 120307948 116080360 110842763 104206919 96352771 88342578
5486 88342578 81010832 75177970 70664571 67608981 65647445 64613377 64083886 63869894
5478 63869894 63967290 64463911 65827668 68247017 71466891 75658758 80404664 84249096 85636163
5469 85636163 83612273 78292065 71056406 63377632 56041627 49699517 44434760 40042554
5461 40042554 36313572 33251151 30637644 28373337 26491840 24825759 23359662 22308470
5453 22308470 21317424 20350639 19471962 18624056 17715584 16984484 16262801 15446306 14747324
5444 14747324 14161835 13567993 12990069 12455562 12114454 11603872 11294521 11084041 10855204
5435 10855204 10569712 10303999 9975771 9697287 9544788 9363722 9101941 8777199 8522601
5426 8522601 8201082 7890623 7731755 7631208 7427675 7255509 7100381 6966893 6755886 6594419
5416 6594419 6572441 6508002 6393587 6219130 6113344 6065427 5817997 5683182 5646528 5563920
5406 5563920 5420518 5216758 5166638 5068437 4991737 5028756 4995744 4966984 4880799 4846032 4768897
5395 4768897 4765322 4678600 4648035 4588513 4562449 4554050 4413308 4496074 4432429 4324608 4254954
5384 4254954 4233887 4173208 4039971 4058789 3962852 3939288 3929573 4047177 3961332 3932126 4033685
5373 4033685 3962810 3967823 3996865 3914952 3906067 4036129 4149387 4118300 4161495 4216792 4111642
5362 4111642 4155622 4358155 4455220 4617096 4824171 4903811 5063519 5069469 4925224 4783596
5352 4783596 4558456 4381270 4292019 4218007 4123252 3959120 3857956 3795456 3743797 3733912 3697507
5341 3697507 3658847 3703230 3878106 3973418 3958969 3903307 3964325 4303135 4511892 4615057 4838266
5330 4838266 5103103 5300402 5613934 6006010 6470402 6952603 7285415 7212097 6977659 6550435
5320 6550435 6021614 5580232 5185763 4922288 4675849 4560471 4371087 4260695 4230664 4017107
5310 4017107 3937055 3873110 3806619 3933986 3908391 3919709 3853244 3846954 3914426 4088818 4185093
5299 4185093 4295073 4421815 4649218 4954903 5369309 5888523 6403278 6823110 6981702 6880941
5289 6880941 6491219 6027986 5420370 4990776 4634915 4402558 4199497 3916782 3796365 3739279
5279 3739279 3556526 3417066 3414345 3346898 3243349 3222130 3123252 3236418 3325301 3342538 3323665
5268 3323665 3303329 3373549 3428504 3534789 3570857 3625591 3831955 3907200 4063935 4162328 4112404
5257 4112404 4082786 3905682 3785044 3586080 3407040 3484725 3498059 3531489 3600472 3614943 3675954
5246 3675954 3589391 3503601 3558686 3551625 3633415 3661490 3614026 3746489 3884300 3977178 4025018
5235 4025018 4113644 4207595 4407853 4636913 4756311 4855717 5008187 5116326 5126601 5082228
5225 5082228 5013000 4972378 4874481 4901709 4767146 4704363 4675011 4611773 4669485 4641917 4569899
5214 4569899 4613090 4554448 4528443 4493612 4587200 4708012 4798013 4846747 4904952 5009969 5252150
5203 5252150 5457169 5624841 5853611 6308948 6634576 6919632 7315256 7466554 7577452 7621330
5193 7621330 7464595 6986130 6869127 6461899 6005538 5644206 5335059 5178623 5048820 4906372
5183 4906372 4736843 4582808 4639588 4625643 4571098 4554053 4576828 4528635 4527535 4578773 4694718
5172 4694718 4806832 4906658 4846965 4836566 4946486 5122055 5220847 5286858 5215603 5079967 5002105
5161 5002105 4915209 4718134 4525970 4400532 4147141 4045439 3856702 3613440 3587544 3617058
5151 3617058 3452901 3351090 3360632 3335838 3157879 3085438 3077172 3025695 2943525 2870438 2823770
5140 2823770 2713803 2810372 2687052 2569062 2497683 2513968 2575814 2561656 2475832 2506171 2645134
5129 2645134 2469706 2332065 2340024 2341568 2379578 2444488 2385324 2368917 2316869 2407909 2463604
5118 2463604 2548878 2583605 2606962 2626744 2773240 2695101 2527425 2496145 2551654 2524421 2442382
5107 2442382 2535033 2733658 2657462 2648110 2716235 2643963 2633048 2524140 2666390 2665461 2592212
5096 2592212 2638580 2657760 2770292 2854126 2848900 2723706 2718719 2765162 2748183 2863273 2910082
5085 2910082 2896090 2941845 2838787 2870065 2991943 3064970 3022838 2919978 2883664 2972023 3140136
5074 3140136 3171584 3142959 3077628 3095309 3297927 3351326 3395476 3331998 3403686 3444681 3561119
5063 3561119 3636440 3544627 3635481 3590071 3494274 3529772 3446666 3449324 3627808 3625283 3672807 3716925
5051 3716925 3679990 3686221 3776129 3761785 3829016 3908451 3862542 3853788 3977682 4112806 4300915
5040 4300915 4413774 4341371 4417437 4592865 4655168 4779096 4892139 4800258 4874704 4877433 5007029
5029 5007029 5126962 5106074 5184310 5192985 5151090 5242076 5331650 5331902 5380706 5408357 5475457 5668505
5017 5668505 5649109 5700272 5823093 5945654 6190513 6297997 6495493 6532925 6781499 6808647
5007 6808647 6892733 6708887 6676814 6812804 6741659 6622606 6648665 6589345 6614707 6673082 6577863
4996 6577863 6549112 6549380 6626337 6760238 6713819 6871965 7046512 7006493 7109065 7313350 7447413
4985 7447413 7457826 7471428 7505183 7580011 7591860 7648993 7598952 7588720 7550009 7548048 7496430 7377050
4973 7377050 7283447 7292455 7340475 7387102 7311026 7336659 7355994 7385968 7485404 7643787 7800195
4962 7800195 7793768 7876281 7934632 8006040 8144491 8161916 8089489 8214418 8346447 8354855 8277229
4951 8277229 8268471 8304784 8238337 8294211 8315456 8298298 8369401 8443969 8449549 8414048 8520934 8630170
4939 8630170 8751289 8928366 8973757 9090391 9152430 9285948 9325579 9250984 9225487 9478882
4929 9478882 9391200 9622630 9816700 9802249 9988938 10154019 10222445 10307969 10591804 10612596
4919 10612596 10703607 10877098 11062084 11165448 11359931 11599022 11739568 11879780 12075696 12322922
4909 12322922 12608541 12799542 13025828 13349845 13606798 13912195 14182267 14402670 14828781
4900 14828781 15228102 15823616 16648875 17619499 18746357 20204859 21864538 23581518 24109498
4891 24109498 23293870 22118183 20829814 19880780 19024856 18453166 18171025 18042457 17868611
4882 17868611 17862580 17927700 18112899 18226538 18485041 18690885 18823973 19214261 19557017 19866124
4872 19866124 20237855 20534708 20915194 21318208 21717385 22090681 22469821 22878598 23317189
4863 23317189 23811946 24370776 24931301 25460990 26032870 26640646 27167789 27765332 28570471
4854 28570471 29352879 30360468 31275870 32267304 33339904 34412381 35529240 36843030 38360254
4845 38360254 39816745 41505322 43490775 45617595 47722663 50009915 52612602 55337087
4837 55337087 58141727 61061323 64162942 67102390 69980889 72513197 74673323 76414426
4829 76414426 77897374 79112875 80188489 80916412 81403919 81869055 82200417 82537968 82944641
4820 82944641 83714902 84682176 85871525 87687243 89870978 92611943 95719707 99162875
4812 99162875 102989420 106927852 111003028 115143567 119366112 123327906 126818480 129436673
4804 129436673 130827102 131105747 130342354 128788806 126778815 124179374 121419877 118279880
4796 118279880 114849165 111674135 108952802 106788925 105349381 104778177 104914196 105975532
4788 105975532 107690865 109971664 112788801 116102796 119805453 123643086 127470976 131224082
4780 131224082 134903521 138053392 140423717 141643256 141320712 139555888 136793926 133414144
4772 133414144 129802448 126249515 122922816 120101110 117705689 115750635 114343534 113772600
4764 113772600 113811388 114404843 115891824 118146481 121197918 124722484 128629246 132581834
4756 132581834 136384180 139890081 142647212 144967204 146865503 148206293 148848045 148456275
4748 148456275 146887827 144327444 141281987 138155875 135242946 132656832 130338121 128450324
4740 128450324 127049824 126388012 126176378 126881430 128679994 131062953 134229514 138220363
4732 138220363 142772678 147947282 153423096 159064333 164320400 168020880 169544037 168026420
4724 168026420 163911368 158081749 151576152 144872527 138596696 133174019 128752319 125019238
4716 125019238 121924879 119456221 117647654 116597827 116440881 117480136 119529290 122711488
4708 122711488 126971433 131630013 136208995 140124465 142947490 144433858 144093374 141650595
4700 141650595 136974570 130234678 122371572 114181079 106456053 99754248 94150715 89683920
4692 89683920 86469267 84152111 82296858 80806873 79895178 79224395 79118242 79798016 81094418
4683 81094418 83173011 85520807 87845387 89220768 88899519 86510203 82144026 76531532
4675 76531532 70642280 65231587 60215342 55801087 51846257 48337395 45313539 42619625
4667 42619625 40347600 38364196 36750569 35076178 33680653 32483518 31415142 30565195
4659 30565195 29762781 29201196 28541825 27945263 27234927 26422383 25573026 24711793 23866493
4650 23866493 23102564 22411580 21575297 20792915 20142282 19554347 18978386 18400168 17792706
4641 17792706 17176044 16645001 16151722 15673097 15213293 14650789 14281986 13941880 13586818
4632 13586818 13185275 12920171 12860788 12694190 12418663 12261653 12098495 12044110 11914487 11714298
4622 11714298 11453503 11155215 10952143 10619860 10154595 9761025 9352352 9129808 8947187
4613 8947187 8654089 8392510 8285210 8058536 7900900 7854889 7740485 7588005 7441319 7304819
4603 7304819 7205410 7073588 7069177 7064151 6919743 6751911 6596820 6558986 6436750 6298134 6238581
4592 6238581 6208852 6131301 5934998 5895909 5827095 5729748 5621976 5456963 5257814 5207475 5237656
4581 5237656 5191346 5082281 5073531 5172858 5047675 5112832 5173305 5062705 4928832 4930296 4891277
4570 4891277 4980105 5061736 4881473 4795237 4779430 4753271 4840098 4760280 4789391 4782550 4813341
4559 4813341 4809078 4819104 4788167 4620175 4526259 4616939 4543285 4567124 4549316 4438494 4339419
4548 4339419 4308845 4327020 4438424 4540030 4407643 4492849 4540933 4568899 4441551 4464794 4440329
4537 4440329 4580713 4659843 4733411 4745110 4629047 4776318 4809659 4829213 4681668 4712751 4640933
4526 4640933 4603278 4568117 4461553 4546603 4517164 4454514 4480990 4547455 4447253 4258693 4340481
4515 4340481 4367309 4380715 4301062 4454222 4453138 4389269 4436099 4440523 4424261 4421942 4437597 4411388
4503 4411388 4447351 4444890 4366716 4272781 4308059 4390001 4432163 4397989 4416092 4391941 4564802
4492 4564802 4425721 4409624 4497293 4538865 4520433 4612327 4557697 4577556 4650231 4580273 4573831
4481 4573831 4617091 4674159 4792877 4740577 4660512 4667311 4657449 4722114 4732414 4839404 4877873
4470 4877873 4861117 4829177 5048777 5091544 5039707 5054449 5092179 5109098 5046913 5082985 5135373
4459 5135373 5113408 5134211 5107434 5079690 5115710 5010911 5049557 5059288 5121252 5166751 5199102
4448 5199102 5214464 5098599 5011521 4874257 4940915 5007248 5065463 4971494 4932443 4949896 4961741
4437 4961741 5019130 5052146 5105998 5100289 5094773 4959790 5073101 5158054 5027510 5019370 5136981
4426 5136981 5127219 5210212 5255052 5123805 5093313 5135382 5093675 5023279 5151412 5232164 5204569
4415 5204569 5176447 5263460 5394621 5402014 5355881 5451240 5527617 5525987 5550391 5740757 5830306
4404 5830306 5859592 5967174 6100530 6215809 6274205 6243882 6253122 6286915 6337413 6420295 6578229
4393 6578229 6579221 6608611 6449869 6342991 6265517 6196826 6315466 6176431 6088103 6148724 6281902
4382 6281902 6281767 6396926 6498988 6506105 6578539 6655557 6678851 6731383 6677647 6597139 6682414 6706460
4370 6706460 6686862 6790013 6704263 6675302 6711510 6847065 6823467 6951000 6926474 6952119 6868471
4359 6868471 6946126 7036885 7081567 7192405 7362146 7430483 7405920 7460058 7458543 7551428 7487196
4348 7487196 7572249 7650501 7825293 7836096 7840433 7907891 7954800 7880561 7936971 7982152 8039293
4337 8039293 8006690 7978622 7970030 8157613 8215866 8293291 8401756 8436512 8517163 8613181 8657890
4326 8657890 8790812 8821785 8923663 9018453 9013164 9147722 9125336 9169207 9282085 9605862 9637334
4315 9637334 9706723 9776117 10053077 10250374 10360240 10790282 11198560 11456207 11646528 11716607
4305 11716607 11560919 11465650 11248962 10998829 10737651 10616330 10633217 10600889 10598091 10732887
4295 10732887 10709966 10825699 11047112 11173482 11246177 11233703 11336604 11469987 11656099 11772453
4285 11772453 11933353 12076587 12282832 12495553 12741027 12931107 13063423 13310273 13490215
4276 13490215 13590182 13813860 13990772 14209193 14389328 14562825 14954872 15152932 15308387 15670622
4266 15670622 15967365 16214638 16504039 16724967 17076857 17342988 17606519 17852700 18173426
4257 18173426 18496353 18805821 19115318 19421324 19802709 20073425 20355759 20792461 21069717
4248 21069717 21248508 21655079 22071005 22500876 22818462 23003842 23285952 23683168 24084303
4239 24084303 24459058 24775601 25128125 25494481 25784938 26197652 26676581 27195669 27599719
4230 27599719 28086241 28518920 29042595 29382835 30022736 30704628 31288833 31836739 32481938
4221 32481938 33137964 33755663 34600840 35426121 36326968 37289508 38300801 39367341 40474063
4212 40474063 41637124 42929609 44201947 45539403 47095577 48714671 50329836 52084197
4204 52084197 53856095 55982815 58140735 60477414 62961010 65437998 68124927 70992767
4196 70992767 73874110 76884206 80118699 83398586 86530054 89834458 93238318 96648244
4188 96648244 100087726 103828038 107538120 111454977 115343503 119323927 123282801 127215006
4180 127215006 131069950 134735874 138045249 141262579 144444393 147215207 149836188 152215348
4172 152215348 154488030 156720720 158848084 161063870 163048708 164785700 166295292 167276648
4164 167276648 167709162 167705772 167234233 166282945 165126102 163795460 162311736 160699918 159007418
4155 159007418 157312371 155486291 153470092 151455970 149113243 146544420 143775265 140730253
4147 140730253 137491683 134246537 130884917 127492180 123889243 120458462 117162225 113846518
4139 113846518 110610654 107506406 104657413 101773898 98973585 96407450 93955902 91713044
4131 91713044 89816464 88030572 86398427 84961539 83457510 81942881 80509112 79079976
4123 79079976 77954071 77024681 76126975 75548177 74979130 74591996 74388243 74236523 74196336
4114 74196336 74219311 74349029 74513641 74614779 74777013 75003793 75250801 75778995 76571176 77828303
4104 77828303 79611167 81576779 83588503 85479692 86976686 87723501 88001450 88007787 87895592
4095 87895592 88035160 88401692 88728014 89071860 89422974 89833917 90219622 90726643 91258075
4086 91258075 91922037 92623519 93265773 93780009 94111399 94454336 94741407 95451802 96750137
4077 96750137 98621302 101059779 103978979 107381549 110780243 113923146 116542797 118682120
4069 118682120 120316153 121962493 123551678 125027703 126097669 126930489 127640448 128281646
4061 128281646 128704583 128810419 128476664 127904046 127399251 126927934 126734350 126703227 126825805
4052 126825805 126889970 127029004 126900584 126795824 126344560 125852786 125579801 125448865 125465441 125696106
4042 125696106 126036557 126561522 127195492 127575044 127559364 127382109 126862891 126296793 125531373
4033 125531373 124726806 123547430 121961177 120032932 118272740 116596426 114708689 112254487
4025 112254487 109121516 105785078 102460035 99464406 96851404 94768799 93267844 92321238
4017 92321238 91876132 91531220 91120406 90653361 89954210 89128614 88149019 87164861 86006201
4008 86006201 84813175 83689370 82681105 81542351 80482710 79728684 79270503 79070204 79031712
3999 79031712 78738774 78012056 76529491 74475496 72150575 69715266 67530997 65803966
3991 65803966 64232618 62959229 61849308 60780718 59581695 58233193 56840118 55505674
3983 55505674 54249852 52911904 51766475 50758828 49708585 48784083 48028971 47266361 46562471
3974 46562471 45768259 45074757 44383310 43608540 42520843 41260315 40108388 38861251 37864873
3965 37864873 36945471 36071635 35328241 34741548 34184709 33521111 32990876 32434914 31928984
3956 31928984 31531439 31074975 30627481 30141117 29526274 28860795 28297738 27665235 27082264
3947 27082264 26620202 26274204 25942054 25460498 25101559 24843201 24733910 24639154 24495809 24448354
3937 24448354 24466977 24557712 24557054 24570233 24643587 24754024 24950078 25067925 25222126 25381952 25551915
3926 25551915 25794676 26026546 26090917 26309350 26399530 26534718 26646047 26716173 26884816 27080228
3916 27080228 27386109 27528880 27702686 27905515 28191965 28408746 28792285 29161890 29255382 29467065
3906 29467065 29686786 29928458 30002548 30223679 30558632 30924806 31299852 31860272 32414423 32959024
3896 32959024 33599551 34129375 34930037 35706306 36464934 37278051 38112701 39109652 40205837
3887 40205837 41259489 42562100 43854835 45294393 46841521 48517293 50463615 52592517
3879 52592517 54753692 57029121 59217681 61475817 63794281 65911074 67990193 69924982
3871 69924982 71534743 72872066 74082094 75439718 76735480 77923641 79218317 80479505
3863 80479505 81758381 82825785 83737782 84516653 85043254 84945840 84726464 84321190 83785865
3854 83785865 83174499 82463408 81693018 80951465 80404829 80002137 79686149 79272474 79056804
3845 79056804 78823034 78635058 78602159 78677113 78844483 79122050 79585103 80385572 81349688 82565722
3835 82565722 84021490 85748638 87735802 90002971 92671468 95715315 99392243 103239746
3827 103239746 107526635 112136730 117263096 122706832 128301758 134034154 139668155 145247674
3819 145247674 150637346 155819578 160650715 165275217 169783736 174151789 178576613 182979038
3811 182979038 187254554 191379818 195335627 199062630 202058046 204377291 205787825 206236795
3803 206236795 205774808 204672441 203100496 201201056 199119646 197261793 195675962 194460816
3795 194460816 193624345 193224898 192984803 192729487 192563828 192570594 192448528 192298214 192126096 191839303
3785 191839303 191632524 191367854 191073136 190815319 190715429 190751849 191235603 191987895 193018392
3776 193018392 194178896 195474395 196839032 197948479 198716560 198854078 198220468 196839055
3768 196839055 194822662 192161115 188932035 185358153 181164584 176471722 171549705 166471140
3760 166471140 161144191 155928703 150939230 146076643 141369051 136618540 132039254 127322391
3752 127322391 122288868 117300372 112307057 107178541 102146167 97397672 92840407 88683358
3744 88683358 85062486 81994377 79392151 76963882 75045947 73718140 72849651 72357813
3736 72357813 72001846 72018483 72282313 72682657 73115679 73785429 74381639 74841609 75230581 75591511
3726 75591511 76058668 76469203 76964022 77681886 78371778 79120553 79895957 80879462 81758401
3717 81758401 82559516 83100762 83338308 83406757 83279959 83111169 82558365 81928634 81254194 80434644
3707 80434644 79653031 79175895 78737517 78376560 77956639 77857689 77877092 77812231 77838339 77905880
3697 77905880 77906447 77760258 77550136 77339992 77239524 76979260 76794649 76622478 76628647 76618081
3687 76618081 76780287 77118150 77407388 77996211 78645657 79466288 80328885 81144256 82011568
3678 82011568 82848402 83820556 84622817 85473216 86495088 87417444 88467898 89669289 91084003
3669 91084003 92639300 94461202 96447372 98728694 101143726 104033703 107167902 110604211
3661 110604211 114552703 118916349 123804703 129325514 135819135 143222903 151654998 161232323
3653 161232323 172308905 185349494 200262446 217209647 236834726 258880025 282945136
3646 282945136 308430946 334090666 358701302 380811259 399017907 412451398 420838262
3639 420838262 424363967 424048548 421287290 417579516 414064470 411454156 409824384 409300440
3631 409300440 409246786 408714672 406639552 401667039 392289642 378274422 359666184 337069386
3623 337069386 311938570 285414584 259119124 233969682 210986445 190345768 172387349
3616 172387349 156910613 143415684 131774617 121591787 112657559 104807069 97778258
3609 97778258 91601212 86259547 81523001 77175407 73293100 69717266 66553813 63692798
3601 63692798 61030836 58572299 56113540 54024595 52035545 50169633 48501254 46922235
3593 46922235 45441937 44053787 42767163 41515810 40437751 39324343 38226181 37339271
3585 37339271 36502421 35651048 34793692 34066490 33314884 32571927 31873272 31297844 30752977
3576 30752977 30017240 29472910 28886338 28424408 27990343 27553229 27137288 26676013 26392166
3567 26392166 26096355 25789474 25430245 25185102 24866096 24560070 24373666 24227351 24093874
3558 24093874 23788066 23627095 23426583 23298923 23163763 23111894 23127878 23153454 23057531 22909210
3548 22909210 22927563 22854717 22806032 22814622 22915702 22816580 22820199 22936889 23049861 23132617 23250601
3537 23250601 23576663 23669749 23648458 23869847 24126483 24358367 24543116 24899910 25164759 25423298
3527 25423298 25744415 25844147 25974335 26270068 26572209 26799901 27133840 27430768 27784539 28150186
3517 28150186 28395814 28721568 29082843 29321570 29629536 29897118 30391704 30832965 31223835
3508 31223835 31714539 32273525 32835902 33610189 34536116 35394055 36469840 37641457 38799942
3499 38799942 40189713 41795868 43443520 45308278 47397851 49573435 51799400 54069560
3491 54069560 56258365 58364310 60233849 61743988 62450627 62477700 61665154 60018521 57948349
3482 57948349 55653201 53461417 51525507 49998462 48898075 48096902 47264398 46075136
3474 46075136 44483580 42886697 41453691 40430149 39770111 39036970 38127612 36981619 35717644
3465 35717644 34607113 33595622 32651100 31872505 31237616 30511999 29888684 29434190 28965010
3456 28965010 28667046 28285541 27671916 27255404 26745997 26183398 25691088 25262643 24947246
3447 24947246 24652303 24363202 24125771 24052101 24004082 24148908 24294212 24697628 25281484 26215010
3437 26215010 27069010 26975162 26089717 24886955 23865200 22751034 21588290 20846971 20211873
3428 20211873 19808129 19339036 19024476 18797842 18661052 18529565 18248317 17753308 17356560
3419 17356560 16948021 16749207 16491035 16235527 16198709 16115252 16035700 15914107 16007480 16108322
3409 16108322 16363197 16567075 16809628 17251317 17657590 17870333 17689480 17198349 16673418
3400 16673418 16115308 15709746 15322259 15084941 14899844 14818033 14800413 14789694 14779204 14830816
3390 14830816 14675979 14474332 14391436 14459698 14649827 14732376 14707766 14456489 14048394 13945920
3380 13945920 13772316 13534125 13388561 13209241 13090613 12937770 12922047 13043502 13051433 12913899
3370 12913899 12929327 12980514 13004039 13191134 13336097 13407983 13531090 13632779 13759440 13983100
3360 13983100 14063045 14437269 14728521 15059132 15154213 15068410 14802848 14520638 14466725 14403232
3350 14403232 14335491 14265485 14370759 14297931 14233724 14158227 14269669 14231134 14108696 14125402 14160114
3339 14160114 14184140 13978380 14089038 14042017 13836822 13877933 13974381 13804452 13614940 13675705
3329 13675705 13621747 13526981 13421496 13447362 13506987 13612881 13579374 13612701 13652070 13727002 13653150
3318 13653150 13734604 13770783 13855998 13883525 13836570 13846404 13886754 13858511 13899037 13917674 13962688
3307 13962688 14019738 14122528 14188750 14217621 14329801 14285611 14330046 14439938 14503713 14642568
3297 14642568 14832652 14772478 14785815 14977637 14991868 15091144 15251509 15271947 15413634 15431932
3287 15431932 15474671 15647398 15731582 15765530 15851158 16035498 16139840 16175682 16295087 16333604
3277 16333604 16419056 16473093 16561986 16624882 16647597 16698007 16813654 16885201 17049946 17069581 17152736
3266 17152736 17362803 17486317 17506598 17507354 17663875 17800488 17956990 18100122 18124567 18166154
3256 18166154 18298782 18434606 18362380 18425561 18481407 18499104 18581842 18728873 18731944 18835059 18958318
3245 18958318 18930052 18797398 18831315 19059347 18979559 18977854 18960330 19079139 19076819 19087273 19057673
3234 19057673 19107212 19165153 19242205 19251417 19204348 19251617 19244182 19299200 19093144 19009039 18983226
3223 18983226 18950106 18969796 18966516 18902349 18875888 18978419 18900158 18832427 18831312 18682805 18555849
3212 18555849 18454202 18332800 18416115 18424077 18240450 18154403 18053467 17973835 18019064 17994830 18160530
3201 18160530 18212315 18122288 18156753 18254191 18335254 18320309 18310510 18279474 18186789 18160217 18086643
3190 18086643 18136850 18159164 18201399 18375299 18489943 18628752 18790901 18775740 18850598 19016440
3180 19016440 18966840 19044374 19103379 19205870 19349371 19396675 19369603 19370036 19437260 19345218 19385098
3169 19385098 19311094 19347661 19354948 19399599 19505140 19585993 19640604 19763897 19920721 20015666 20231862
3158 20231862 20381763 20689420 21172377 21624908 22095951 22644837 22997359 23634270 24193621
3149 24193621 24754189 25139106 25304293 25478549 25382741 24985101 24299817 23525186 22787959 22059576
3139 22059576 21562202 21253503 20920669 20714107 20516180 20519643 20686929 20685388 20880450 21100454
3129 21100454 21373394 21734757 22073577 22384287 22730539 23107530 23467514 23767242 23975963
3120 23975963 24102965 24047258 23792310 23428775 22940970 22432878 21723742 20940345 20301276 19569749
3110 19569749 18964224 18376183 17784756 17462588 17240758 16859674 16781881 16692626 16557954 16599531
3100 16599531 16583450 16559857 16562613 16511963 16331901 16266631 16002287 15677645 15253120 14656797
3090 14656797 14204406 13674268 13146773 12609837 12052086 11498531 11104350 10770692 10461136
3081 10461136 10040969 9736961 9442907 9136783 8809532 8547634 8380481 8205797 8125508 8034124
3071 8034124 7846613 7657314 7483616 7426045 7335725 7236640 7068419 6856391 6747363 6639856
3061 6639856 6391368 6208357 6058461 5864357 5718690 5591956 5563821 5371263 5268450 5165492
3051 5165492 4982809 4793668 4814195 4747314 4732912 4597037 4428457 4302863 4221298 4152486
3041 4152486 4103483 4111291 4037441 3902095 3732741 3738189 3784670 3796940 3743786 3506974 3488223
3030 3488223 3535301 3461315 3386536 3356486 3378190 3299334 3218745 3310366 3241698 3097175 3058562
3019 3058562 2982722 2978758 2904643 2825918 2779508 2760358 2838176 2767853 2705079 2647360 2452959
3008 2452959 2459133 2541513 2365241 2359888 2353292 2234263 2184149 2330184 2316361 2223435 2215480 2176238
2996 2176238 2209470 2143480 2099271 2011740 1945244 1785988 1769009 1952301 2007327 1919967 1872188
2985 1872188 1823588 1794313 1839986 1818874 1783958 1711020 1586516 1576619 1630369 1645399 1519803
2974 1519803 1495126 1435185 1435830 1406468 1499712 1511562 1485715 1375856 1384301 1247106 1290834 1273330
2962 1273330 1259679 1206990 1173340 1193921 1288194 1241428 1160262 1214425 1058538 1109873 1094775
2951 1094775 1115954 1206800 1138716 1155528 1112648 1001117 967482 1090419 1129689 1039704 957184
2940 957184 1013380 1025288 1023036 1121201 1110250 983991 840493 974410 980466 880326 777054
2929 777054 860801 972860 1003365 956632 971666 838863 780091 759559 786371 871514 990500
2918 990500 943887 916679 905408 843017 922908 849687 828755 878857 906501 877372 797045 821252
2906 821252 736118 784371 797290 733822 797843 818464 680865 631080 673356 830310 741486
2895 741486 725121 623592 700860 681034 698151 765866 692908 737636 696431 603526 527430
2884 527430 610160 572571 564547 694613 665978 629608 550568 620712 614556 535819 578449 536716
2872 536716 519916 496065 451292 552636 559835 534001 616059 607343 687074 640323 729230 517610
2860 517610 482048 562167 554098 631017 635421 631162 660770 601072 594449 655473 603922 600672 709071
2847 709071 601185 439677 442101 483883 522239 507774 483693 420963 394653 539736 481000
2836 481000 419710 379442 491069 421130 383707 468137 400324 400804 382180 395134 417035 401467
2824 401467 342540 353237 423587 394426 300189 235834 179672 356613 502621 418380 326793
2813 326793 297073 338861 323711 321706 378702 360734 489170 400472 376479 226248 197598
2802 197598 246862 352165 364624 189018 237536 263850 202612 176633 185096 294039 282430
2791 282430 215545 206378 179397 165172 162633 223053 187077 342618 339404 274455 185210 137060
2779 137060 98765 54309 95501 147001 68099 155488 151506 119126 160978 87238 75177 37093
2767 37093 41275 47363 -46817 14161 120243 91799 122008 116358 163696 197870 264357 228129
2755 228129 103521 93453 91549 -15036 -66972 -17796 66809 146834 158278 244197 151428
2744 151428 82378 38515 -41590 -17587 128178 61319 49355 -19187 -79240 54389 151542
2733 151542 140864 131296 170904 158543 116323 145666 107014 48988 108921 55623 40834 90909
2721 90909 77611 -22218 66500 86083 82440 110269 -5088 -48294 -62458 -4683 -97 -38074
2709 -38074 -49445 -6526 73926 16250 -21852 -69158 -92565 -101257 -35406 100207 87695 42570
2697 42570 105669 70302 69076 -49251 -110010 -42294 -53120 -23488 -41080 -136279 -121360 -29059
2685 -29059 50776 56223 34486 27339 6689 76706 -5181 55073 115043 -47151 46701 128241
2673 128241 124921 -1565 478 -78214 -116139 -61588 43469 94383 60564 46565 65024 14926
2661 14926 -48523 -41019 -41707 115086 58650 -71099 -2193 -132056 -64897 -27064 42249 -36570
2649 -36570 50195 32919 1309 5670 33888 104275 26318 -37068 -80584 -119742 -186164 -71740
2637 -71740 -38836 -25920 -101608 -152278 -119095 17734 5448 -15647 -51815 44043 45012 2000
2625 2000 8624 35897 24706 -48845 -70256 13153 85405 29534 68818 -31517 43717 220
2613 220 -86801 -26782 -93385 -87142 -76394 45680 -3542 -123006 -143537 -110055 -45671 -74405
2601 -74405 -58780 -93358 -135457 -79942 -52102 6885 -89228 -150903 -143373 -223554 -231386 -97867
2589 -97867 -97131 -119498 -76333 23872 -40015 85713 23647 15833 21665 -81568 -23290 -81692
2577 -81692 -84616 -75622 -125372 -92228 -46581 -57563 -149513 -79236 14041 3752 -54180 4140
2565 4140 -5254 -15879 -50422 3224 -69964 -34052 -71922 2658 29200 -92779 -152616 -65025
2553 -65025 -10360 -47770 52697 42468 101028 116041 121650 87618 40580 -69526 -154391 -146018
2541 -146018 -106425 -105390 -74016 -34637 52957 -1740 65778 2099 -157871 -174659 -140139 -123700
2529 -123700 -81902 -64331 -93445 -106296 -82546 -68232 31516 -113810 -37419 -38075 -157726 -104662
2517 -104662 -149318 -125282 -61644 -2924 71312 48369 116943 70571 -55170 -101042 -79825
2506 -79825 -96807 1167 3703 -2010 30032 36558 102136 -40431 -127818 -102628 -98611 -1383
2494 -1383 26997 -84716 -96587 -52078 -3966 -62745 11429 7925 -8066 156104 136379 82962
2482 82962 45611 68747 -92394 -120924 -123423 -102596 -56290 -32407 149626 215121 13182
2471 13182 -37776 -7800 -74485 -40862 -72672 -27011 31414 53466 31671 68268 -5728 64632
2459 64632 47622 -53935 -53127 37045 149525 235868 166241 64871 140219 231943 181081 87431
2447 87431 142932 192242 92267 88353 136372 135067 209743 207460 238197 218583 234791 302709
2435 302709 343339 347607 416235 381778 367387 314562 335577 271984 297072 392763 350191 370828
2423 370828 332759 373628 495437 663986 700113 582143 481163 500900 498929 522700 506599
2412 506599 533967 550193 600080 576129 511181 503426 438224 618663 759379 735101 643894
2401 643894 582971 708853 643162 725441 696558 754483 881963 937791 948664 1034173 1057998
2390 1057998 901067 990095 1086692 1144380 1191919 1305924 1415487 1430002 1443363 1517524 1603956
2379 1603956 1675287 1826626 1822685 1866201 2014301 2008350 2145088 2206795 2220517 2211529 2404729
2368 2404729 2623130 2719550 2867991 3177529 3560888 3812363 3965298 4127843 4284679 4622968
2358 4622968 5149037 5657922 6388804 7419905 8680527 10210694 12206729 14737177 18506001
2349 18506001 23880083 26801814 23914999 18874214 14466506 11216755 9131314 7521182
2341 7521182 6319941 5374970 4698363 4185907 3702319 3376772 3146956 3073693 2886485 2640011
2331 2640011 2308944 2145288 1992729 1738652 1613318 1434740 1452667 1361537 1247916 1306460
2321 1306460 1248016 1105286 910715 841115 870361 905876 815167 794847 734495 670082 536421
2310 536421 534454 536549 518219 467605 370478 444717 430012 487829 373305 441217 427401 381380
2298 381380 501057 330437 171506 218265 308647 317907 258169 184834 181437 136420 105202
2287 105202 176109 127235 159121 164087 143493 240994 219508 130692 51604 -67025 -48981 1817
2275 1817 92034 53203 103135 79304 20671 -92869 -26469 118447 105254 88800 41628 35030
2263 35030 42850 99499 212249 134422 108498 -46608 -115489 -135153 -118176 -148546 -78702 -17343
2251 -17343 48582 -3041 -88114 -48940 19638 5519 -30000 -67892 -163859 -125528 -113639 -34102
2239 -34102 -106090 -153249 -81444 -10997 -89152 -156503 -19178 -119301 -179063 -18759 -56910
2228 -56910 12987 -106112 -128962 -113376 -83799 -90205 -2270 -136430 -155418 -165205 -95310 -78013
2216 -78013 -118640 -136015 -182541 -115080 -31041 -2361 -31400 -68710 -123092 -165360 -179580 -152496
2204 -152496 -123176 -104274 -133005 -107689 -256200 -287823 -152242 34177 -101032 -215577 -144531
2193 -144531 -30635 49602 94777 -142728 -91232 -32311 -121691 -42446 -77604 -96051 -98346
2182 -98346 -138897 -23476 26530 -60958 -83089 -112509 -62848 -5355 -122678 -237035 -136162
2171 -136162 -138447 -124116 -153192 -123820 -85855 -84638 -74242 -81800 -3884 -74189 -107795 -135514
2159 -135514 -46033 23624 -63011 32691 51417 -58739 -149335 -133562 -14396 -54590 -100048
2148 -100048 -137825 -228343 -204479 -257128 -187591 -212740 -200480 -203137 -94384 -111040 -157964 -167469
2136 -167469 -180104 -140233 -79938 -69138 -3663 100807 20211 -19835 27750 48205 -78198
2125 -78198 -90173 36251 -14342 -102570 -145280 -161873 -185722 -115732 -16062 8068 -24240 31862
2113 31862 -44259 -158602 -103495 -41263 -135329 -105001 -91516 -47840 -2485 -107344 -95282
2102 -95282 -40464 -41403 -179191 -171864 -181550 -88534 -122051 -99460 -127975 -138551 -80065 -58504
2090 -58504 47319 58733 49136 -3833 -84817 -158029 -241755 -176261 -171879 -143850 -54295 -38775
2078 -38775 -120073 -42433 10855 -96212 -142203 -67175 -138490 -82383 -34899 -62040 -28357 -101654
2066 -101654 -171905 -106997 -57531 -72813 -65666 -46002 -80650 -98156 -131012 -125073 -105375 -171133
2054 -171133 -133466 -24278 -21509 -58514 20542 -121160 -93795 -100539 -88864 -99385 -72198 -14722
2042 -14722 27981 -11787 -18193 -57075 -135870 -54548 -1216 -45108 -129211 -59908 -141936 -182681
2030 -182681 -98476 -91360 -57864 -58314 -160336 -204326 -95975 -161143 -224011 -241544 -237247 -188606
2018 -188606 -122333 -151106 -213398 -139782 -182534 -149027 -20761 3253 -106587 -123855 -169495
2007 -169495 -95081 -43930 -55553 -69175 2069 1233 2510 -33838 -155786 -127696 -119162 -103377
1995 -103377 -99114 -92894 40059 7091 -68358 -104700 -168696 -246134 -134390 -43149 -85770 -152522
1983 -152522 -161529 -165023 -127716 -128617 -99769 -98884 -150136 -139597 -202244 -56998 -100955 -163133 -168792
1970 -168792 -174730 -128905 -35316 3440 -79759 -84237 -108149 -48638 -18937 -26370 -128377 -60136
1958 -60136 -65937 -121793 -203720 -94692 -68753 -181983 -69169 -91689 -172573 -191380 -138984
1947 -138984 -237087 -341788 -139054 2389 -62941 -65530 -141889 -147557 -168368 -162401 -194384 -162399
1935 -162399 -147765 -91258 -37329 -57148 -90269 -60869 -134687 -31230 1985 -77193 -175928
1924 -175928 -157687 -186378 -160578 -142279 -138052 -140315 -71294 -181220 -123212 -95436 -73281 -80320
1912 -80320 -11550 58368 -47991 -186710 -106093 15249 -154022 -52 -131890 -104962 -63616
1901 -63616 -174266 -179447 -144914 -113217 -212599 -183391 -174729 -173776 -69736 -58192 -163703 -113256
1889 -113256 -10320 -77762 -123737 -145760 -169747 -251342 -199859 -71262 -40490 -66600 -126786
1878 -126786 -166000 -229161 -206724 -140144 -87744 -9406 -54540 -104314 -121238 -105612 -95505 -15585
1866 -15585 -164106 -188772 -179305 -200399 -179446 -141426 -72123 13145 47151 -12188 -89893 -8554
1854 -8554 -88716 -23239 -47606 -223 19185 -159279 -237841 -175195 -48192 -20662 -46503 -155825
1842 -155825 -182260 -152993 -140788 -185755 -160983 -110987 -97011 -127874 -117805 -86893 -55910 -146081
1830 -146081 -135719 -88541 -123851 -139549 -186018 -216765 -96959 -19888 -73865 -110472 -143368
1819 -143368 -139086 -115804 -94538 -190943 -204301 38486 -48752 -71891 -69103 5936 127239 137331
1807 137331 -29830 -95838 22922 -43768 -87390 -136610 -149864 -124185 -121265 -102406 -100906 15804
1795 15804 23912 -66287 -111719 -117342 -20900 26928 -225 15298 -19392 -15574 -19062 -31858 -46990
1782 -46990 -97091 -110906 -49860 27060 -53019 -12495 -76313 -69839 -18960 -67168 -127812 -40830
1770 -40830 93833 -93947 -157655 -3932 34254 49083 22729 76337 91454 28723 33895
1759 33895 7033 -58170 -99502 -108979 -52387 -80341 -72678 -6370 14720 20383 -40642 -70562
1747 -70562 44854 -8097 -31173 -125036 -133909 -107337 52889 117056 6025 -19836 -180155
1736 -180155 -202646 -173060 -73884 -9128 -35861 -68272 -162682 -142660 -101701 14874 5208 -101388
1724 -101388 -72831 3274 -6667 -40925 -3972 20331 -38043 -63410 -55368 -135092 -114558 -61678
1712 -61678 -43781 -75166 -44667 -77988 -48387 -93747 -39561 -89857 -147438 -138564 -146016 -54347
1700 -54347 1717 -60049 -80007 -79790 -155388 -128255 -113933 -136953 -78368 -126076 -88558 -31080
1688 -31080 2350 13777 59426 71183 24071 -7545 70542 -60884 -77748 -148127 -165931 -65576
1676 -65576 -72018 -44636 39443 71397 -16173 -6250 -19688 -64930 -143898 -125391 -152629 -81500
1664 -81500 -53316 -147538 -185403 -182311 -99098 -72171 -32518 1421 -98907 -137397 -119734 -100411
1652 -100411 -92395 -91957 -121336 -165918 -151321 -90497 32394 71942 19638 13956 -129272 -64427
1640 -64427 -77464 -136914 -61305 -78882 -34355 97334 36346 -13754 -93410 -103497 25220
1629 25220 64721 3856 4211 52085 33601 47282 -30951 24 49728 -62291 -121375 -77758
1617 -77758 -105571 -26530 15861 -54966 -105585 -162415 -153858 -130701 -55998 -35309 -25739 -8190
1605 -8190 -30187 -3066 -185493 -142988 -71605 -61026 -70156 -27208 -93853 -63648 -45805 -128700
1593 -128700 -66872 -38181 -12290 -58313 -29001 -92948 -67714 -91333 -94300 -105416 5057 4537
1581 4537 -11663 -59587 -94649 -159825 -185613 -103715 -63355 7699 4339 -17934 -26109 34658
1569 34658 43165 -7801 -40547 -16731 30776 27523 -25416 -100871 -19233 -15122 -70741 -119519
1557 -119519 -141130 -13468 -33586 -112044 -64809 -99863 -46114 -529 50247 70753 63017 103807
1545 103807 9299 -3674 -119047 -83847 60345 -57544 -207292 -145574 -84868 -247335 -240372
1534 -240372 -157823 -94416 -23687 5525 -11256 -2735 -48878 -61592 -66873 -27967 24002 98390
1522 98390 -71083 -81327 -44401 -76223 -23001 37872 11492 47357 5046 -51791 -16699 -41527
1510 -41527 -22109 -66928 -29294 -98958 -13530 -63809 -20248 -18817 -48248 -43070 167198 158426
1498 158426 40296 68086 52990 43424 63202 -9295 6615 15861 -17124 20230 -262 -16464
1486 -16464 -94723 -97008 -33554 -56270 97362 85954 -32506 -49181 -124840 -29634 -70242 -9570
1474 -9570 -40649 5894 65679 60820 -76257 9506 100717 10033 -65888 -116565 -78374 -92381
1462 -92381 -37652 30604 47650 -67177 -46308 23668 50479 63286 28350 -113323 -123354
1451 -123354 -124861 96865 96228 83157 75417 -51405 -17986 29661 47791 -7369 -66121 -86700
1439 -86700 -58716 -26988 -102242 -93421 -84165 19685 80697 49141 62469 62520 55562 60495 11667
1426 11667 -43136 -8581 2414 -29755 -33417 15086 157064 111180 77394 -38960 2152 4725
1414 4725 -87182 -124127 -72501 -46722 34251 59457 -46896 52788 27771 67074 -32512 -81061
1402 -81061 4544 38860 4007 -10448 -42121 -50045 -47234 87471 60150 -38974 -99931 -43912
1390 -43912 36751 -29403 -32447 -18523 -62428 26906 62865 36168 -138404 -98610 -43178 -60756
1378 -60756 -19957 -1061 28317 34315 62894 141872 76963 130172 80469 -65680 -74458 -113559
1366 -113559 -51495 -92846 -130025 -109491 -76904 79665 110199 -50018 30511 42659 33434
1355 33434 38808 -41722 74983 109488 76665 45601 150298 52704 61502 108482 100211 70268
1343 70268 -16864 -159829 -123563 -86203 5331 21948 -46752 90275 131894 99576 -9425
1332 -9425 127785 90797 20468 -49355 -123291 -98856 -59320 33529 25709 11178 -58577 21181
1320 21181 168285 168203 189077 19301 -13949 36567 -6370 -7265 -48903 -52338 -55765 25178 -64674
1307 -64674 10148 70708 73562 38950 -247 -48727 -93571 -33747 -36620 27412 93150 1360
1295 1360 26017 16658 -7597 -28197 -89914 12602 -49826 16049 75218 8828 -86831 -100269
1283 -100269 45830 60671 -95865 -173768 -35970 312 -39230 -9752 89017 100072 40723
1272 40723 109676 67346 78782 22679 160747 161055 105742 3866 -75072 -88418 -53566 1713
1260 1713 -92095 -149105 -8998 -141643 -79362 -12075 -37233 -29260 -75777 -89051 -14737 52951
1248 52951 42386 -4809 -5577 -55106 -33612 11723 -36667 -61186 734 48695 -71128 32556
1236 32556 75272 50006 -23378 56716 88007 70772 1496 -75499 -45531 -149301 -46523
1225 -46523 139779 121562 137030 164087 68321 55726 34751 99438 132633 118170 111744 84456
1213 84456 4454 26255 74288 -3264 10300 -105854 -120362 8073 -19359 140395 93674
1202 93674 73595 4163 1821 31230 48227 91373 90612 45778 36453 138975 81431 47703
1190 47703 12314 -19433 -71887 -164899 -208361 -200279 -97668 -21094 -17818 -38653 -146608 9915
1178 9915 63426 73836 116209 155593 131274 69527 12209 20720 7821 66259 68150 161925
1166 161925 98190 138 -11568 1224 -14170 -29298 -37610 22820 70122 177581 149084 81951
1154 81951 43259 54245 110521 121440 4225 -38136 53049 19766 5028 -69246 -83601 -53852
1142 -53852 -82685 -174161 -260689 -142815 -50362 14682 -17339 2944 65116 -2596 -147063
1131 -147063 -11001 19874 -44339 15848 92986 54015 91380 14228 21569 36629 13884 69294
1119 69294 54784 145766 111135 -5029 53974 142290 46054 8494 -42836 -5996 -91385 -17427
1107 -17427 94520 37355 42181 86200 -26972 -87562 -65098 -78295 -73380 12777 14830 -63621
1095 -63621 -90521 -34267 51927 31909 38800 25312 -89221 -95078 21524 70406 -1611 49889
1083 49889 49987 53367 150207 161689 105995 99280 42276 -150035 -125669 19648 -7169 -7186 -15373
1070 -15373 -79481 16930 78118 50510 -36587 -87453 62617 57182 -4103 27726 31733 50136
1058 50136 97141 -92667 -84178 96475 153571 137599 89733 32735 50006 -45206 -71673 -44095
1046 -44095 -75879 -98724 -89590 -30596 32550 88369 66259 73641 53473 61831 158563 107932
1034 107932 64835 11423 127896 8160 -11399 62098 58494 55846 88626 59187 11779 7636
1022 7636 9475 -12411 -44512 -46791 50677 104942 59725 58980 -28265 -68521 -126278 -19241 61426
1009 61426 79935 19310 -35736 -30910 82608 148996 105111 159791 46413 94245 197967
998 197967 162239 4900 -12051 -54087 -75491 25500 164122 59138 35724 29593 -96170
987 -96170 -108540 -62060 -34137 -6657 -43088 -149622 -173823 -151094 94507 162339 145410 107546
975 107546 55582 -1670 192254 144958 87446 10722 55342 77881 14216 -49303 73857
964 73857 55642 67985 74022 -33033 -38511 -14868 41068 18857 53542 -12497 -66476 124409
952 124409 99727 -29728 -66079 10663 22824 120210 101694 -16811 7798 -54860 -41256
941 -41256 -9724 -15858 -62993 -54930 -16911 14022 80871 106662 122244 38466 -112252 -19682
929 -19682 6766 -33523 59914 107076 163983 82262 111893 32453 88547 137208 22533 5160
917 5160 67822 48858 60955 76865 118025 69080 118387 23414 -7188 105840 34110 130222
905 130222 43873 -16148 5954 33510 57666 45272 13181 -9709 24478 55 -95761 32176
893 32176 68378 110491 51481 -15491 -8982 -39460 -86427 13488 -33242 -38136 1401 -35200
881 -35200 76208 85253 108930 116722 174193 56156 32771 74627 103157 17572 -8623 40616
869 40616 -24579 -6619 -50689 -38548 7182 12716 65321 12154 -68745 -72325 -205004 -159078
857 -159078 -71440 -44459 51458 412 13391 127530 69615 91215 91341 120348 15724 -34213
845 -34213 -16244 82634 52545 62926 24106 -34387 -177933 -71113 4587 78011 -38588
834 -38588 53242 72591 101355 97473 130653 27926 -40350 35966 15529 668 -2791 28
822 28 -30558 34665 -32553 16185 -74218 -54817 -53999 30601 98558 161092 89478 65430 90774
809 90774 150380 88862 -44526 -17099 -60521 -56188 111390 191442 88909 -41150 -55379
798 -55379 115736 134379 42040 -36249 18968 61028 37448 105386 153094 230795 134987 -16399
786 -16399 80515 143076 -24355 44867 97026 141169 -4692 -8360 91136 87104 86742 104709
774 104709 74490 -3871 32538 108678 1921 -64480 -34082 32488 83363 173440 52822
763 52822 67780 158714 47993 33776 30277 36326 121805 103840 -10119 -11149 57061 13429
751 13429 -29212 -93983 3658 85769 22580 17502 41278 47129 24593 -37217 -8714 101737
739 101737 49952 -44755 -70977 -6871 113403 54805 17421 -21021 3313 121942 51193
728 51193 -6718 -31910 -77530 -107013 -206277 -10766 165191 123530 147154 47863 74661 81902
716 81902 78109 -34200 -38718 3717 7981 1279 -77941 -102633 50068 113349 -39359 96535
704 96535 131232 6710 39853 50263 10697 -48007 -24391 -2832 -58827 -31584 -90201 -155760
692 -155760 -2856 -644 -104781 -37329 76996 115269 157929 -8574 -78217 -102089 -39095
681 -39095 145704 91810 116002 95252 123461 44102 44207 119767 95824 106565 45394 -66123
669 -66123 -25554 79171 8778 -21522 -91863 4817 80663 74675 97247 109991 59283 -57249
657 -57249 55139 194797 44302 63192 35421 52297 4930 53145 193073 168051 164509
646 164509 189739 189603 86907 87490 108566 65696 48543 36972 2881 109734 194629 170778
634 170778 63101 -41047 -52889 -16239 4122 14654 86266 38796 66204 142705 55970
623 55970 49649 131531 84943 119686 91715 -29361 7188 59209 57133 14676 -10513 -3392
611 -3392 -46510 8021 -4655 -55196 -12782 8566 28429 22373 92084 5481 -46570 -16523
599 -16523 28217 -17357 -124983 -60623 -69557 -4832 47672 74782 61482 -18118 -30635 79798
587 79798 73828 -4866 -82500 -50026 -9155 50408 39828 26594 142805 122760 100840 129324
575 129324 105107 -19403 -27917 -90464 7411 110495 126307 119702 23832 -79358 -89967 -42966
563 -42966 -34271 9950 73800 58717 5493 62545 135093 84217 17013 -11710 -15355 -34014
551 -34014 -5900 29309 5651 -36711 41437 86765 33356 -58424 -10116 -17380 -54795 -136127
539 -136127 -23983 79294 3614 4965 10155 53772 37858 258 -13176 -413 -6096 -49300
527 -49300 -8001 -18901 -107967 -37429 76386 44718 -5281 -21302 1396 -11564 36870 67583
515 67583 60619 95600 12764 42903 84249 -9846 3978 -12632 -10424 184976 162990 43502
503 43502 -20100 -57644 96849 145162 224263 165574 90650 -55849 -33785 37326 67130 54013
491 54013 -7852 25058 19150 19603 72992 133925 84936 78258 -33943 -63876 -92113 -11059 -97353
478 -97353 -128974 50136 -1559 28765 100750 15915 -27603 24280 16029 54984 26865 -34069
466 -34069 78801 28734 31458 -46694 16350 32393 -928 -125822 -123475 -124520 -72612 49943
454 49943 24931 -31976 -48618 -73550 -81331 54358 -7233 77151 74780 32834 92859 12267
442 12267 78565 72729 18316 -66303 -23691 24294 8784 -33664 29853 120642 98462 111592
430 111592 87398 -8752 -50975 -91982 -64905 50217 49370 -37711 -4805 -53332 -11145 124214
418 124214 126788 54356 -74666 -90530 -107976 -17819 -2560 -10956 -61187 -61300 -13523 -29075
406 -29075 -40243 -47620 16049 -38929 28469 17053 -37804 -5651 -31955 -56925 -43035 -48038
394 -48038 -77414 -27810 -106194 -137450 -137721 -141126 -119914 -80938 -57921 22022 12369 99765 54987
381 54987 -53257 -142136 -120800 -148553 -160599 -181247 -173176 -172104 -115321 -108413 -60036 -64714 -88291
368 -88291 -128418 -43482 -79547 -52339 35449 -70719 90416 130267 158634 109883 -81636
357 -81636 -42037 84140 11087 50797 10965 -68730 -53170 -99968 -130248 -38809 16026 88319
345 88319 23059 -83870 -108239 -71948 -55656 -171815 -119697 -5303 4740 -8852 -33909
334 -33909 -27292 -49783 -69048 10795 -35383 -148375 -115484 -55046 -82053 -46080 -55926 -21175
322 -21175 -30911 -74928 -73334 -37188 -64185 -110441 -126207 -5048 -36868 -1140 -39613 -48804
310 -48804 -35941 -98550 42393 92214 40408 -47249 -70173 -90129 -33027 -196362 -141917 -146746
298 -146746 -66156 -2184 56446 -15518 -25495 -7987 -69861 -133772 -15695 -151138 -154193 -176158
286 -176158 -97350 -97458 -115172 -102073 -40320 58236 -27227 -1622 -65770 -30879 41898 22462
274 22462 -52869 -43925 -37347 8476 -26205 -61771 -55649 -51487 -147846 -139513 -148723 -85759 -50767
261 -50767 -63761 1500 41671 -89654 -24325 -8384 69140 -73701 -44571 145300 -20243
250 -20243 -109401 -120077 -95295 -55461 -54266 -22009 -24460 -88846 -63694 -43820 -14440 -122633
238 -122633 -173284 -11562 20546 29981 -66463 -117418 -90902 -171614 -95757 -13423 -28876 -5391
226 -5391 7655 20445 -77227 7970 22105 -46325 -110747 -95053 -261269 -200716 -173517 -152083
214 -152083 -9830 -153135 -168381 -126120 -84484 -26089 -41484 -114984 -108105 -113410 -127121 -70586
202 -70586 28250 13615 -77429 -156171 -121191 -103663 -33697 76545 -56576 -169574 -127497
191 -127497 -215396 -37287 -88191 -85829 25857 -117515 -10876 -10035 1815 7680 -176201 -216187
179 -216187 -80947 13847 67540 66117 -134104 -166704 -106568 -129619 -123061 -158022 -130911 37770
167 37770 85820 109168 6587 18933 54725 52542 -18225 -33902 -4907 -50257 -93848 -95993
155 -95993 -67907 -73388 7938 9859 -19424 -152369 -187392 -87941 -135398 -96292 -95548 -38787 43873
142 43873 53280 35764 -10397 -99296 -104947 -96492 -111034 -51439 -120358 -66387 -52138 48 55243
129 55243 38497 -23533 -40453 -68998 -162802 -151664 -49315 -13486 -66812 -12222 -78755 -13050
117 -13050 39386 13705 -15827 -32286 -33192 -103950 -127204 -81253 -99408 -103824 -26862 -62515 -92583
104 -92583 -69530 -45422 -79492 -6778 -52191 -103114 -71986 -56738 -72562 -18293 31745 -106955
92 -106955 -184422 -175621 -131383 -70686 -157612 -181557 -181373 -76363 -4317 -6002 -24824 -49603 -82852
79 -82852 -95617 -58413 -80265 -110793 -99976 -58016 -20816 -38137 -85978 -64135 -87295 -128035
67 -128035 -94313 -82542 7619 22494 -1380 -46317 -26628 -56340 -115098 -131810 -91361 -39625
55 -39625 -63885 -31333 -32136 -108127 -70105 -94146 -107099 -97454 -55828 -62530 -60272 -63401 -147188
42 -147188 -86779 -134136 -58793 -28718 -26111 -81458 -99902 -127867 -39374 -37957 -72235 -39297
30 -39297 -72804 -28017 -44703 -89423 -105814 -59222 -49899 -101117 -76060 -146480 -172704 -117982
18 -117982 -102208 -40486 -50701 -68797 -45521 -4934 -4452 -6998 -94772 -76645 -9143 -63878 -40133
5 -40133 -3321 -57439 -60895 -77318 -177337
0 -177337
$$ Imaginary data points
##PAGE= N=2
##DATA TABLE= (X++(I..I)), XYDATA
16383 -3013919 -3009914 -2879331 -2795225 -2819727 -2767010 -2718469 -2672443 -2613810 -2679130 -2586095 -2419359
16372 -2419359 -2384466 -2450807 -2379066 -2317943 -2321548 -2218048 -2125149 -2158967 -2157081 -2109374 -1931362
16361 -1931362 -1908738 -1913686 -1893577 -1815241 -1754507 -1746902 -1703797 -1643523 -1647284 -1570297 -1525661 -1479485
16349 -1479485 -1417374 -1347218 -1240720 -1103021 -1085857 -1088434 -1122592 -1112890 -994738 -1003930 -950016
16338 -950016 -957349 -880436 -856378 -813514 -759040 -702388 -679634 -607359 -506653 -452637 -536902
16327 -536902 -556470 -457171 -367182 -281878 -280035 -254878 -191610 -161738 -180629 -85970 3164 10079
16315 10079 26273 109112 101654 141913 135607 228407 341987 357119 405373 496293 572878 626625
16303 626625 589084 543811 613605 650144 629168 706103 732105 823023 830178 809683 797099 837755
16291 837755 974468 965847 962809 1015702 1135266 1211679 1192746 1183295 1216480 1350244 1371571
16280 1371571 1288380 1273791 1393649 1316091 1364205 1439396 1455186 1560419 1603127 1704252 1705096
16269 1705096 1690522 1644407 1691042 1753339 1853945 1771346 1783557 1974952 1950475 1947618 2020152
16258 2020152 2110757 2141220 2046206 2090198 2163239 2163239 2203475 2281578 2232120 2315501 2295142 2376094
16246 2376094 2370633 2410466 2371325 2341727 2433461 2401936 2432887 2489357 2566476 2723362 2692635
16235 2692635 2635654 2561883 2703401 2740030 2742797 2783275 2689901 2761616 2782112 2791831 2881801
16224 2881801 2841384 2856338 2917578 2908662 2914085 2891315 2832148 2894779 2999599 3067475 3057375
16213 3057375 3046185 3029309 3065676 3072835 3189659 3225956 3166413 3236510 3201906 3299848 3324300
16202 3324300 3315060 3233538 3281502 3281198 3359766 3385985 3403476 3412033 3385295 3400019 3357280 3401706
16190 3401706 3531763 3530010 3453561 3568203 3568714 3485965 3533986 3504556 3516565 3540500 3547207 3563971
16178 3563971 3567189 3618533 3630891 3620492 3605317 3621961 3725359 3740823 3831789 3822354 3835002
16167 3835002 3889185 3855629 3892099 3911272 3876159 3781412 3739662 3810768 3796258 3876828 3872130
16156 3872130 3906157 3899996 3800162 3861847 3982773 3866202 3900131 3964098 3880924 3865748 3953291
16145 3953291 4047617 4102828 4090942 4068662 4083910 4087019 4142679 4072044 3999714 3977787 4033575
16134 4033575 4077241 4061513 4058756 4004832 3985441 4036433 4097145 4170584 4118852 4067310 4127009
16123 4127009 4113942 4051853 4084944 4068605 4037300 4194258 4091439 4039455 4117268 4198485 4136227
16112 4136227 4182535 4156192 4190197 4186811 4169238 4223608 4313225 4286931 4215279 4256225 4247330 4228161
16100 4228161 4129785 4152539 4174380 4232673 4184032 4256498 4278127 4322610 4214804 4193773 4308365
16089 4308365 4343541 4245967 4301074 4347705 4246661 4198092 4172289 4272645 4246771 4296821 4337034
16078 4337034 4244896 4270543 4178876 4164100 4202181 4224493 4217593 4190176 4145962 4304534 4349921
16067 4349921 4384521 4324731 4312395 4337844 4325616 4266068 4286468 4343844 4348843 4251175 4269758
16056 4269758 4354407 4314547 4305127 4408014 4415137 4397999 4440713 4334609 4368814 4255087 4307806
16045 4307806 4414886 4384446 4379493 4320994 4277771 4328931 4345872 4303444 4390301 4346832 4320663
16034 4320663 4311359 4272506 4373637 4411614 4323545 4407033 4391680 4345074 4311513 4469696 4471123
16023 4471123 4398964 4360768 4331449 4242111 4237760 4362242 4313021 4195111 4192376 4337708 4424807
16012 4424807 4433287 4386350 4332651 4391724 4325823 4247461 4252303 4283349 4393387 4424198 4330206
16001 4330206 4285900 4370639 4365244 4273111 4311254 4383257 4273248 4368310 4406772 4435325 4276992
15990 4276992 4289308 4261000 4194533 4216263 4334195 4280207 4311288 4331328 4494793 4504984 4500042
15979 4500042 4392673 4317678 4364321 4427688 4455450 4317574 4347584 4378571 4301688 4322015 4395656
15968 4395656 4402636 4376338 4433724 4415792 4315484 4330228 4476981 4530602 4529986 4489864 4411559
15957 4411559 4440457 4523946 4432806 4332051 4372678 4385272 4396939 4380358 4484145 4396327 4386209
15946 4386209 4407325 4451748 4479050 4411653 4464341 4439034 4284843 4328345 4453461 4460112 4414633
15935 4414633 4495930 4471407 4362745 4385649 4365640 4374378 4346408 4436260 4439874 4363495 4413167
15924 4413167 4333950 4356840 4378227 4367267 4420864 4420927 4388328 4375497 4412769 4379561 4466530 4497473
15912 4497473 4394366 4389969 4434172 4366314 4447769 4550823 4560267 4597951 4426753 4277794 4310428
15901 4310428 4350503 4299328 4322725 4360293 4450139 4476389 4486714 4495376 4469953 4451921 4444823 4334190
15889 4334190 4303052 4353117 4325982 4268748 4345572 4377182 4423416 4509998 4386326 4194641 4361839
15878 4361839 4256762 4355584 4494793 4411343 4467592 4425366 4372075 4416031 4464831 4467469 4415372
15867 4415372 4443263 4424855 4274324 4307341 4523284 4469062 4478985 4500216 4462844 4536208 4445991
15856 4445991 4437249 4359260 4387733 4416440 4466592 4518678 4474108 4496652 4445673 4419504 4465990
15845 4465990 4355522 4290629 4358054 4376374 4411086 4498449 4517132 4471118 4463443 4438407 4506575
15834 4506575 4469580 4454387 4562805 4438213 4482287 4552877 4469125 4407734 4429303 4490104 4604139
15823 4604139 4536280 4439176 4427836 4378965 4319859 4405201 4377012 4362488 4448074 4520863 4545710
15812 4545710 4438705 4483476 4548954 4458401 4418757 4431756 4559492 4560336 4548327 4507068 4541459
15801 4541459 4564648 4555863 4561406 4524416 4492338 4476923 4622511 4651768 4583309 4541127 4424207
15790 4424207 4456597 4498787 4517898 4487591 4421048 4358864 4369156 4380697 4367872 4503513 4530543
15779 4530543 4517455 4516947 4495269 4445544 4515872 4507650 4573114 4509968 4540119 4479154 4470596 4477818
15767 4477818 4463838 4380376 4423337 4398724 4466621 4567527 4616952 4493385 4425551 4488700 4519188
15756 4519188 4571878 4493973 4488513 4506447 4556843 4541777 4540017 4398286 4441473 4435713 4509823 4405752
15744 4405752 4384193 4403365 4443936 4545488 4424243 4390306 4377511 4352598 4486921 4542707 4495828
15733 4495828 4503822 4601727 4558314 4542516 4533764 4497155 4378143 4429604 4550736 4458360 4470099
15722 4470099 4452668 4459753 4412586 4477102 4476186 4398731 4383138 4498212 4438227 4312076 4412097
15711 4412097 4486233 4515372 4506884 4428130 4394301 4482754 4560001 4569190 4516100 4486098 4498487 4538284
15699 4538284 4508732 4477175 4395457 4412311 4498209 4452369 4450608 4514176 4519674 4605170 4647450 4681116
15687 4681116 4513224 4428066 4399528 4442666 4426219 4500887 4528445 4603277 4554107 4579437 4553389
15676 4553389 4448672 4504148 4406903 4485319 4570646 4520731 4470029 4506953 4464495 4554445 4636018
15665 4636018 4515959 4463243 4556195 4614643 4644792 4528722 4491890 4500394 4628231 4524354 4429021
15654 4429021 4451758 4513577 4600232 4525055 4496404 4479491 4462855 4462488 4490180 4496030 4496789 4507883
15642 4507883 4441320 4435729 4465640 4483301 4550503 4562903 4587326 4566088 4468234 4568501 4529213
15631 4529213 4494554 4494293 4600470 4592586 4620068 4527222 4462746 4503000 4521526 4557291 4590039 4561756
15619 4561756 4488093 4440221 4488361 4524222 4516060 4510476 4568144 4596678 4571626 4552808 4453146 4489179
15607 4489179 4481230 4483609 4527895 4572067 4572981 4624395 4582057 4643701 4583759 4482440 4553589 4472716
15595 4472716 4462738 4551536 4477874 4507612 4515448 4441782 4442090 4639344 4689436 4510024 4443297 4409860
15583 4409860 4475826 4547103 4622810 4624345 4665626 4616222 4642200 4709454 4755133 4750695 4671922 4615175
15571 4615175 4656957 4640667 4629935 4616123 4476665 4388618 4493087 4665902 4585042 4488222 4562932
15560 4562932 4668032 4644099 4588328 4495982 4422592 4534384 4614714 4602275 4653569 4613698 4579295
15549 4579295 4578604 4634679 4649359 4622145 4549163 4481079 4558185 4609460 4607954 4551844 4592104 4590846
15537 4590846 4546318 4509339 4472659 4612963 4592428 4615047 4620330 4619019 4589024 4579020 4610915
15526 4610915 4560149 4547853 4611997 4496998 4483209 4574750 4664647 4615166 4578916 4509806 4551881
15515 4551881 4548573 4604242 4668362 4570873 4556704 4540723 4525523 4528665 4605745 4491609 4489159 4493921
15503 4493921 4639547 4678465 4680091 4687551 4584702 4598613 4488100 4656841 4636647 4606455 4720479
15492 4720479 4679729 4661295 4656104 4721220 4690664 4643293 4611852 4549318 4577569 4692525 4712173
15481 4712173 4700271 4662567 4593863 4609780 4538554 4625853 4628781 4565442 4500702 4665015 4617370
15470 4617370 4576851 4648948 4528372 4521503 4545664 4561245 4639605 4641105 4618690 4591598 4559671
15459 4559671 4596516 4570669 4585667 4552748 4651722 4569454 4615145 4694879 4704485 4605467 4519300
15448 4519300 4582256 4640802 4670776 4679578 4594248 4681679 4627207 4668198 4713405 4612919 4534113
15437 4534113 4418008 4523977 4613259 4683148 4640009 4598080 4652587 4608190 4640975 4653202 4611162
15426 4611162 4561985 4668119 4620398 4703754 4733288 4710459 4648601 4665991 4610882 4510896 4508085
15415 4508085 4535153 4571056 4568697 4567995 4565184 4535523 4612401 4632649 4573693 4666146 4622146 4552271
15403 4552271 4569256 4655020 4671107 4692763 4623543 4626890 4593829 4635529 4581929 4641645 4667941
15392 4667941 4649307 4691850 4594995 4589155 4522684 4533895 4588774 4675134 4583354 4648372 4662865
15381 4662865 4655697 4722557 4668404 4642432 4546035 4495367 4528995 4550816 4428082 4385531 4504240
15370 4504240 4642220 4680674 4622383 4674877 4753351 4690312 4636918 4687981 4713627 4619047 4614152
15359 4614152 4500531 4637060 4648403 4635402 4607928 4594379 4655807 4640381 4648983 4646063 4631392
15348 4631392 4640963 4631055 4699633 4747891 4667727 4691699 4618715 4700641 4627735 4558964 4619570 4579995
15336 4579995 4617770 4623130 4584211 4617612 4713441 4664426 4699746 4681306 4666095 4748897 4623057
15325 4623057 4468708 4508329 4582281 4722605 4748600 4822566 4812584 4707304 4781614 4659562 4649084
15314 4649084 4688821 4641491 4611445 4564414 4702077 4750871 4726676 4806386 4755574 4671816 4657374
15303 4657374 4584169 4593687 4635798 4631965 4679519 4741573 4747179 4805007 4684046 4533061 4526450 4699514
15291 4699514 4777164 4689772 4586223 4595382 4623582 4701753 4726618 4716737 4779853 4726031 4731013 4715151
15279 4715151 4721956 4625031 4556278 4626720 4671208 4731371 4751691 4748449 4771641 4695582 4608350 4661643
15267 4661643 4777180 4741751 4797367 4805579 4745113 4672407 4729081 4706361 4616870 4649651 4649033 4648681
15255 4648681 4666453 4692028 4727224 4710028 4746920 4659624 4610340 4672887 4647253 4644472 4719953
15244 4719953 4720930 4648905 4682634 4678536 4739842 4728241 4658955 4690423 4680706 4702747 4663583 4708742
15232 4708742 4708951 4796583 4814711 4633469 4614985 4648412 4747841 4659606 4581008 4537625 4617906
15221 4617906 4677100 4605921 4710921 4785996 4746307 4718077 4783598 4709998 4748360 4851716 4739069
15210 4739069 4654105 4572036 4539603 4604535 4682030 4750630 4725196 4724558 4649203 4719394 4794332 4814001
15198 4814001 4882578 4703935 4727499 4888120 4883327 4859574 4818238 4748159 4734476 4600937 4651570
15187 4651570 4711776 4708650 4759418 4734330 4703523 4599969 4737408 4802590 4775617 4668618 4627502
15176 4627502 4698070 4731654 4730710 4755331 4843290 4840751 4762918 4769338 4776512 4713427 4668982 4670283
15164 4670283 4605010 4678125 4723797 4699153 4710460 4731167 4838282 4869148 4815128 4743174 4780323
15153 4780323 4704977 4788792 4857352 4791711 4695020 4723423 4798247 4774345 4805216 4743948 4650659
15142 4650659 4689518 4834432 4782179 4847656 4826364 4734085 4775827 4743455 4778793 4766278 4783259
15131 4783259 4791280 4835848 4934118 4797557 4668875 4752871 4642789 4677638 4666843 4736216 4863708
15120 4863708 4785359 4666578 4784793 4847563 4903128 4861942 4869529 4780722 4683840 4737177 4779307
15109 4779307 4921645 4808743 4769651 4803740 4769318 4802596 4790534 4775229 4798803 4717902 4785601
15098 4785601 4893460 4809291 4689925 4701512 4585014 4572218 4659462 4784759 4809664 4802285 4817428
15087 4817428 4823264 4847693 4802227 4840143 4817969 4806272 4962456 4966030 4945690 4892410 4848697
15076 4848697 4889805 4872339 4847608 4741545 4654278 4710140 4738967 4782132 4814921 4755345 4668450
15065 4668450 4710864 4804003 4868610 4748478 4880366 4910052 4864323 4839997 4741013 4789398 4751250
15054 4751250 4730295 4725346 4753092 4735433 4737847 4747638 4861611 4926435 4910866 4878494 4911833 4936855
15042 4936855 4891757 4889407 4801672 4759921 4764170 4813983 4876656 4908125 5001447 4940704 4825763
15031 4825763 4899002 4901273 4777722 4742749 4790720 4839495 4871592 4947978 4812411 4777952 4705358
15020 4705358 4807165 4775632 4798009 4772684 4833041 4712969 4802812 4951418 4891428 4949312 4915559
15009 4915559 4872819 4873433 4888956 4922403 4927928 4842819 4831237 4898544 4842812 4827249 4918508 4889812
14997 4889812 4876774 4818886 4869626 4742641 4867315 4918798 4831313 4831454 4841485 4777618 4902024
14986 4902024 4926305 4900788 4840606 4849245 4940809 4928425 4832097 4790095 4767653 4800335 4843079
14975 4843079 4808074 4918242 4900342 4849702 4890546 4905358 4875310 4774162 4794837 4826026 4851633
14964 4851633 4816048 4890295 4883765 4870124 4943705 4916380 4885721 4834230 4767738 4834548 4826555 4909818
14952 4909818 4885428 4821720 4871186 4864559 4853634 4859556 4861429 4825428 4820194 4799620 4871161 4857174
14940 4857174 4952253 4932589 4875953 4985448 4915093 4943689 4946191 4875312 4938376 4851306 4796704
14929 4796704 4863279 4928848 5004715 4912247 4838065 4856771 4853987 4813735 4738029 4879661 4886342
14918 4886342 4871958 4854540 4835696 4823902 4895448 4876976 4888399 4941509 5025034 5004453 4893720
14907 4893720 4833560 4881798 4881646 4960827 4973887 4947810 4907847 4927706 4915353 4808284 4957248
14896 4957248 5018117 4938515 4880062 4812044 4845656 4912486 4880154 4816401 4866415 4856658 4853560 4926556
14884 4926556 4874412 5050024 4935807 4809533 4874207 4899973 4919349 4925375 4910879 4867733 4939686
14873 4939686 5023871 5018843 5116230 5065389 5016526 4962121 4895191 4902570 4917650 4911352 4859729 4873622
14861 4873622 4886167 4940099 5032919 5048739 4970200 4941105 4884799 4905423 4974539 5028240 4962235
14850 4962235 5057739 4922215 4749872 4861553 4861420 4971022 4990434 4956215 4854187 4908472 5005188
14839 5005188 4958986 4983011 5039035 4910322 4865489 4917112 4765427 4820857 4909762 4868118 4960607
14828 4960607 5021870 4970045 4927091 4910743 4893559 4748093 4849170 5016800 5009370 5001440 4951965
14817 4951965 4896475 4965920 5030399 5000468 4896500 4878397 4810114 4894442 4958623 4923407 4892900
14806 4892900 4894140 4928098 4883824 4977996 5044465 5031297 4933185 4927509 4881504 4953362 4986751 4952444
14794 4952444 4905050 4821344 4793935 4838559 4894488 4928712 4980663 4921689 4895598 4903675 4759834
14783 4759834 4849652 4945871 5000436 4959337 4912995 4909411 4969898 4963229 4985262 4986047 4995670 5039356
14771 5039356 5074686 5168169 5179377 5105154 5092654 4974799 4952916 4966131 4993141 5087253 5036170
14760 5036170 5038882 4961484 4993762 4943720 4935494 4891271 4963914 4944943 4991810 5023069 5048335 5053996
14748 5053996 4969931 5013123 5092662 5001174 5033014 4921261 4877178 4906245 4973556 4925500 4841020
14737 4841020 4791382 4908951 5125704 5068594 4982707 4984966 4996059 5028409 5003963 4861173 4920691
14726 4920691 4895769 4891804 4928892 4974678 5096083 5048174 5004751 5093355 4974230 5049698 5072165
14715 5072165 5061580 5093147 5102282 5044187 5008350 5058336 5020090 4987736 5090673 5089173 4967591
14704 4967591 5019401 5020556 5005892 5010655 4991790 4895039 4956526 4907624 4939311 5011785 4964302 5048392
14692 5048392 5003590 4919791 4848268 4861186 4923040 4988152 5003550 5066344 5038624 5021756 5055520
14681 5055520 5056460 4954350 4948702 4978649 5103294 5074063 4958731 4926878 4957048 4956108 4935402 4950951
14669 4950951 4914241 4967712 5054980 5092973 5096498 5089822 5059917 5084450 5011984 4991534 5003734 4969194
14657 4969194 5070431 5030283 5099367 5075204 5025151 5053515 5090044 5016169 4891408 4854343 4960670
14646 4960670 5081318 5045599 4938248 5019065 5106580 5093261 5105426 5007393 4976531 4882710 4987079
14635 4987079 4937473 4838255 4969054 5021389 5089086 5010797 4886298 4937646 4940818 4987173 4977538
14624 4977538 4926138 4976010 5130573 5041429 4969854 4937798 4994750 4951963 4850834 4921121 4880247
14613 4880247 4832366 4948962 5027844 5008955 5076344 5017694 5042896 4931914 4891040 4970457 4960889
14602 4960889 4992656 5041560 5050477 4939537 5030305 5021099 5067262 5067991 5137729 5104596 5039139 5053099
14590 5053099 5030908 4979711 5075200 5034017 5002115 5038876 5002261 4975817 4965267 5029722 4896725
14579 4896725 4894981 5071288 5132131 5114526 5131365 5101448 5107303 5020238 5107154 5237446 5248718
14568 5248718 5208015 5194170 5175948 5151022 5138788 5092102 5202745 5166915 5096879 5093795 5180872
14557 5180872 5096795 5149785 5030296 4974554 5029829 5141600 5182204 5158589 5138287 5030741 5057217
14546 5057217 5099990 5166986 5098110 5079926 5150517 5115193 5015524 4974625 5027780 5087812 4897265
14535 4897265 4952543 5007918 5058161 4989698 4993479 5044642 5106969 5054268 5179530 5224485 5199508
$$ [...]
##END NTUPLES=NMR SPECTRUM
##END=
