##TITLE=1H_CG-1192-0
 CDCl3
 8 sc, 
 12.2.2024
##JCAMPDX= 6.0         $$ Bruker NMR JCAMP-DX V2.0
##DATA TYPE= NMR SPECTRUM
##DATA CLASS= NTUPLES
##ORIGIN= UXNMR, Bruker Analytische Messtechnik GmbH
##OWNER= root
$$ XWIN-NMR		Version 3.5
$$ Mon Feb 12 14:53:58 2024 Russian Standard Time (UT+4h)  she@DPX200
##.OBSERVE FREQUENCY= 200.1313
##.OBSERVE NUCLEUS= ^1H
##.ACQUISITION MODE= SIMULTANEOUS
##.ACQUISITION SCHEME= undefined
##.AVERAGES= 8
##.DIGITISER RES= 18
##SPECTROMETER/DATA SYSTEM= spect
##.PULSE SEQUENCE= zg30
##.SOLVENT NAME= CDCl3
##.SHIFT REFERENCE= (INTERNAL, CDCl3, 0, 15.4516)
##AUDIT TRAIL= $$ (NUMBER, WHEN, WHO, WHERE, WHAT)
$$ ##TITLE= Audit trail, XWIN-NMR		Version 3.5
$$ ##JCAMPDX= 5.01
$$ ##ORIGIN= Bruker BioSpin GmbH
$$ ##OWNER= she
$$ F:/spectra/data/she/nmr/H-F/1/pdata/1/auditp.txt
$$ ##AUDIT TRAIL=  $$ (NUMBER, WHEN, WHO, WHERE, WHAT)
(   1,<2024-02-12 14:52:36.68 +0400>,<she>,<DPX200>,
      <created by zg, POWCHK disabled, PULCHK disabled
       configuration hash MD5:
       00 E9 B6 7A A2 85 ED C7 34 08 36 98 17 FE 4E 26
       data hash MD5: 16K
       14 3E B6 4B 45 44 B1 42 60 0F 8D F1 BF 8E 54 40>)
(   2,<2024-02-12 14:52:39.09 +0400>,<she>,<DPX200>,
      <Start of raw data processing
       efp BC_mod = 2 LB = 0.24 FT_mod = 6 PKNL = 1 PHC0 = -24943.58 PHC1 = 4.452696 SI = 16K 
       data hash MD5: 16K
       B6 FF F7 9B 56 5C F0 B0 61 F3 29 3A 3D 8C F5 FC>)
(   3,<2024-02-12 14:53:00.46 +0400>,<she>,<DPX200>,
      <pk PHC0 = 3.100498 PHC1 = -1.6 
       data hash MD5: 16K
       AA E0 DE F4 02 E7 93 35 55 5B 05 58 61 7A E1 C9>)
(   4,<2024-02-12 14:53:03.96 +0400>,<she>,<DPX200>,
      <abs ABSG = 5 
       data hash MD5: 16K
       90 06 B5 F4 E8 E1 4A 5D 7A 0F 06 0A 7A 52 58 F3>)
(   5,<2024-02-12 14:53:20.87 +0400>,<she>,<DPX200>,
      <pk PHC0 = 0.04227187 PHC1 = 0 
       data hash MD5: 16K
       2A 05 FB 72 B4 1C 9C 20 BE 8B B4 B2 B6 AA 4C 7E>)
(   6,<2024-02-12 14:53:24.51 +0400>,<she>,<DPX200>,
      <abs ABSG = 5 
       data hash MD5: 16K
       D7 63 EE 2F EB 15 59 2B F2 AC 66 31 CE CF 7D E7>)
$$ ##END=
$$ 
$$ hash MD5
$$ F0 3C C2 AF 58 ED 1C 29 50 E6 BB 1F 7A C3 28 DF
##$RELAX= 
##$RELAX= 
##$RELAX= 
##$RELAX= 
##$RELAX= 
##$RELAX= 
$$ Bruker specific parameters
$$ --------------------------
##$DU= <F:/spectra>
##$EXPNO= 1
##$NAME= <H-F>
##$PROCNO= 1
##$TYPE= <nmr>
##$USER= <she>
##$AMP= (0..31)
100 100 100 100 100 100 100 100 100 100 100 100 100 100 100 100 100 100 
100 100 100 100 100 100 100 100 100 100 100 100 100 100 
##$AQSEQ= 0
##$AQ_mod= 1
##$AUNM= <au_zg>
##$AUTOPOS= <>
##$BF1= 200.13
##$BF2= 200.13
##$BF3= 200.13
##$BF4= 200.13
##$BF5= 200.13
##$BF6= 200.13
##$BF7= 200.13
##$BF8= 200.13
##$BYTORDA= 1
##$CFDGTYP= 0
##$CFRGTYP= 5
##$CHEMSTR= <none>
##$CNST= (0..31)
1 1 145 1 1 1 1 1 1 1 1 1 1 1 1 1 1 1 1 1 1 1 1 1 1 1 1 1 1 1 1 1 
##$CPDPRG= <>
##$CPDPRG1= <>
##$CPDPRG2= <>
##$CPDPRG3= <>
##$CPDPRG4= <mlev>
##$CPDPRG5= <mlev>
##$CPDPRG6= <mlev>
##$CPDPRG7= <mlev>
##$CPDPRG8= <mlev>
$$ [...]
##$SUBNAM3= <"">
##$SUBNAM4= <"">
##$SUBNAM5= <"">
##$SUBNAM6= <"">
##$SUBNAM7= <"">
##$SUBNAM8= <"">
##$SUBNAM9= <"">
##$SW= 18.0517328524113
##$SWIBOX= (0..15)
0 0 2 0 0 0 0 0 0 0 0 0 0 0 0 0 
##$SW_h= 3612.71676300578
##$TD= 16384
##$TD0= 1
##$TE= 0
##$TE2= 300
##$TE3= 300
##$TEG= 300
##$TL= (0..7)
0 120 120 120 120 120 120 120 
##$TP= (0..7)
150 150 150 150 150 150 150 150 
##$TP07= 0
##$TPNAME0= <>
##$TPNAME1= <>
##$TPNAME2= <>
##$TPNAME3= <>
##$TPNAME4= <>
##$TPNAME5= <>
##$TPNAME6= <>
##$TPNAME7= <>
##$TPOAL= (0..7)
0.5 0.5 0.5 0.5 0.5 0.5 0.5 0.5 
##$TPOFFS= (0..7)
0 0 0 0 0 0 0 0 
##$TUNHIN= 0
##$TUNHOUT= 0
##$TUNXOUT= 0
##$USERA1= <user>
##$USERA2= <user>
##$USERA3= <user>
##$USERA4= <user>
##$USERA5= <user>
##$V9= 5
##$VALIST= <valist>
##$VCLIST= <CCCCCCCCCCCCCCC>
##$VD= 0
##$VDLIST= <DDDDDDDDDDDDDDD>
##$VPLIST= <PPPPPPPPPPPPPPP>
##$VTLIST= <TTTTTTTTTTTTTTT>
##$WBST= 1024
##$WBSW= 4
##$XGAIN= (0..3)
0 0 0 0 
##$XL= 0
##$YL= 0
##$YMAX_a= 1011583
##$YMIN_a= -1120967
##$ZGOPTNS= <>
##$ZL1= 120
##$ZL2= 120
##$ZL3= 120
##$ZL4= 120
##$ABSF1= 15.56069
##$ABSF2= -2.491161
##$ABSG= 5
##$ABSL= 3
##$ALPHA= 0
##$AQORDER= 0
##$ASSFAC= 0
##$ASSFACI= 0
##$ASSFACX= 0
##$ASSWID= 0
##$AUNMP= <proc_1d>
##$AZFE= 0.1
##$AZFW= 0.1
##$BCFW= 0
##$BC_mod= 2
##$BYTORDP= 0
##$COROFFS= 0
##$CY= -3
##$DATMOD= 1
##$DC= 0
##$DFILT= <>
##$DTYPP= 0
##$F1P= 0
##$F2P= 0
##$FCOR= 1
##$FTSIZE= 16384
##$FT_mod= 6
##$GAMMA= 0
##$GB= 0
##$INTBC= 1
##$INTSCL= 3.70164e-10
##$ISEN= 128
##$LB= 0.24
##$LEV0= 0
##$LPBIN= 0
##$MAXI= 10000
##$MC2= 0
##$MEAN= 0
##$ME_mod= 0
##$MI= 1.114404
##$NCOEF= 0
##$NC_proc= -6
##$NLEV= 6
##$NOISF1= 3.799351
##$NOISF2= 2.8
##$NSP= 0
##$NTH_PI= 0
##$NZP= 0
##$OFFSET= 15.45161
##$PC= 1
##$PHC0= -24940.44
##$PHC1= 2.852696
##$PH_mod= 1
##$PKNL= yes
##$PPARMOD= 0
##$PSCAL= 0
##$PSIGN= 0
##$REVERSE= no
##$SF= 200.130014028412
##$SI= 16384
##$SIGF1= 3
##$SIGF2= 2
##$SINO= 5.538805
##$SIOLD= 16384
##$SREGLST= <1H.CDCl3>
##$SSB= 0
##$STSI= 16384
##$STSR= 0
##$SW_p= 3612.71676300578
##$SYMM= 0
##$S_DEV= 0
##$TDeff= 16384
##$TDoff= 0
##$TI= <>
##$TILT= no
##$TM1= 0
##$TM2= 0
##$TOPLEV= 0
##$USERP1= <user>
##$USERP2= <user>
##$USERP3= <user>
##$USERP4= <user>
##$USERP5= <user>
##$WDW= 1
##$XDIM= 16384
##$YMAX_p= 464369980
##$YMIN_p= -734530
$$ End of Bruker specific parameters
$$ ---------------------------------
##NTUPLES= NMR SPECTRUM
##VAR_NAME=  FREQUENCY,     SPECTRUM/REAL,   SPECTRUM/IMAG
##SYMBOL=    X,             R,               I
##VAR_TYPE=  INDEPENDENT,   DEPENDENT,       DEPENDENT
##VAR_FORM=  AFFN,          ASDF,            ASDF
##VAR_DIM=   16384,         16384,           16384
##UNITS=     HZ,            ARBITRARY UNITS, ARBITRARY UNITS
##FACTOR=    0.220516191357247, 1,           1
##FIRST=     3092.33084831329, 0,            0
##LAST=      -520.385914692492, 0,           0
##MIN=       -520.385914692492, -734530,     0
##MAX=       3092.33084831329, 464369980,    0
$$ Real data points
##PAGE= N=1
##DATA TABLE= (X++(R..R)), XYDATA
$$ [...]
8625 8646400 8957746 8972207 9111232 9399368 9736065 9848346 9966422 10331818 10650369 10769953
8615 10769953 11036420 11307909 11768064 12391849 12869416 13385472 14148669 15264771 16536743
8606 16536743 18000737 19817744 22285343 25761339 30097480 35059727 39470325 40563216
8598 40563216 38346648 34896969 32014792 30206049 29466804 29861844 31470059 34172110
8590 34172110 37509600 41131719 43365792 42663817 40070667 37180229 34446737 32050951
8582 32050951 29718352 27511953 26278088 25168665 24337286 24124551 24273971 24646453 25070372
8573 25070372 25796811 26132766 25840286 25518681 25268674 25434969 26241136 27688925 29783828
8564 29783828 32665162 36449185 41511953 48004476 54681255 59505366 62342523 62738285
8556 62738285 59617915 54725226 50355430 47706016 47541637 49220080 52462178 56906010
8548 56906010 60813519 63057422 63621282 61571795 57433439 52474661 47547791 43060783
8540 43060783 38753761 34979951 32341714 30309524 28770155 28019583 27669753 27720821 27708505
8531 27708505 27097919 26303162 25203724 23789193 22379505 21379534 20879787 21155051 21818796
8522 21818796 22816857 24446774 27081331 30408943 33612010 35277615 34215593 31521275
8514 31521275 28582188 26127630 24934824 24723574 25061686 26375712 28266914 30561498
8506 30561498 32653859 32854961 30820680 28041556 25557334 22942012 20291322 18085493
8498 18085493 16596180 15332271 14255909 13553571 12979358 12742970 12817743 12672532 12158669
8489 12158669 11610201 10841231 9884911 9083702 8446653 7801728 7482092 6931073 6619573
8480 6619573 6431648 6283714 5956666 5431714 5356330 5518350 5247815 5073014 5050891 4913223
8470 4913223 4841163 4879180 4518886 4604521 4541614 4249128 4168445 3988096 3883413 3958495 3786651
8459 3786651 3826065 3610109 3545701 3602988 3609592 3586368 3555872 3466622 3446455 3444793 3393769 3317756
8447 3317756 3064486 2846407 2851233 2879569 2659685 2641537 2497883 2428642 2516392 2365976 2160653
8436 2160653 2196785 2202033 2073448 2065417 2230245 2011554 2083448 2077121 2082954 2110627 2268883
8425 2268883 2075168 2042829 2047715 1953779 1936763 1930062 1811451 1748992 1952625 2075109 2019076
8414 2019076 1912592 1995785 1883249 1616764 1619320 1415241 1288533 1152385 1269625 1373701
8404 1373701 1485703 1191456 1278474 1328760 1348130 1284161 1158760 1211510 1396011 1340631 1222357
8393 1222357 1260428 1083671 1098519 1132049 1277448 1345412 1379026 1312709 1398336 1473006 1463063
8382 1463063 1296197 1174739 1130719 1097785 1080837 1132744 1050923 1083419 1110515 1176948 1175261
8371 1175261 1073727 980190 1034283 1086829 938347 670006 720621 716026 895219 842586 732841
8360 732841 768263 657214 650377 624745 739466 787908 689382 680463 648651 755954 760404 724206
8348 724206 712153 615671 577614 738461 751483 854785 968909 821358 603413 633506 480182
8337 480182 577616 691271 450028 442468 660950 630491 540840 535123 702217 706012 393475
8326 393475 330019 333505 472754 859485 691124 484927 618641 525709 565353 498677 551095
8315 551095 588895 665004 747873 794750 623005 563745 508666 384928 516643 508444 342875
8304 342875 528695 780114 632291 565431 575188 571940 480543 590653 736248 515422 730004
8293 730004 847885 849165 747526 610693 407667 592022 635677 562123 450360 507586 593762
8282 593762 607232 672753 703446 644771 724831 932688 1044762 1039946 1041451 1001307 772968
8271 772968 802869 723925 695586 815910 885188 815410 642775 549403 539599 430070 483535
8260 483535 656355 810363 809379 936931 1060108 1022209 1063801 1004896 626911 623160 713357
8249 713357 630363 643766 801728 684626 650074 704981 553718 421537 546024 671286
8239 671286 594879 482370 587406 577698 581420 528713 548303 567419 705327 758178 847774
8228 847774 959675 948042 915100 843778 829902 720266 541639 688643 809509 756053 595393
8217 595393 724860 694014 655159 708212 655080 648903 573133 479720 404048 570806 798041
8206 798041 580126 370733 666855 885647 822092 564654 579359 923002 924450 469264
8196 469264 510946 649977 1021804 733644 2127158 1863414 1283974 1519551 1139359 1099430
8186 1099430 1244737 1276784 1193174 1211950 1060209 1025871 1110808 899189 737106 1045729
8176 1045729 1087347 975190 887294 857955 865911 952048 680839 508364 620848 830722 774328
8165 774328 681180 706276 885942 1142083 1052392 849722 1137833 1212331 1140060 1159335 884854
8154 884854 687917 911894 980198 785432 497731 677316 955788 1078406 725358 512455
8144 512455 759048 1046872 756897 615006 664099 906312 936258 872370 883417 1067311
8134 1067311 989554 630167 591254 700461 665347 444809 290572 522387 648251 559055
8124 559055 389764 478993 594809 616827 544512 334015 341835 518379 533156 353475 346018
8113 346018 346022 283698 271474 160263 141193 196432 155696 282253 297676 256081 148269 278948
8101 278948 352711 354639 160161 73774 164628 231544 93185 17281 57341 77723 68481 107767
8089 107767 206935 83468 33465 42580 59819 212324 -21006 -216993 -134177 105433 -77323
8078 -77323 -44458 24887 66190 240257 270618 163773 126880 155747 72352 -61814 -79769
8067 -79769 -131725 -92797 38629 206375 152949 -44123 -67208 -579 43930 -13762 29314
8056 29314 10642 -19426 -148573 -215702 -355523 -30570 42496 -127494 -139319 44945 208700
8045 208700 192813 -124421 -199845 -155615 75555 27233 2350 94420 200868 56118 -42742
8034 -42742 14683 -46341 -26804 58491 103356 -7705 -20118 -110609 -200527 -107435 -94828 -235125
8022 -235125 -75094 57093 9145 147836 17685 -152423 5360 -181394 -162743 -204031
8012 -204031 -186275 -209274 -9958 62313 -209309 -446923 -199955 -155854 -99637 -27264 -177171
8001 -177171 -104812 160142 6120 -189009 -379764 -327473 -198781 -131332 -135103 -86287 -112876
7990 -112876 -123038 -61643 -162164 -270925 -340356 -258530 -181810 -10552 -7913 -205215 -110505
7979 -110505 -95369 -239568 -158085 -187745 -93193 57549 -74337 -249963 -26886 -27086 -161585
7968 -161585 -109375 -185091 -134675 -49032 -228004 -196218 -67952 -178623 -261777 -163343 -199613
7957 -199613 -251451 -223452 -286990 -176884 -91439 -268571 -143434 -6953 -49101 -45692 18475
7946 18475 -84726 -254942 -58705 -60972 -243497 4848 28463 -150463 -65422 -147413 -268636
7935 -268636 -274368 -332842 -241334 -117788 -15039 -3765 57037 -233310 -209519 -157978 -225252
7924 -225252 -196726 12895 40614 -128110 -80848 31524 -283564 -314380 -273150 -286824 106346
7913 106346 139437 -80138 72268 12936 26116 121437 16579 -83825 42731 219144
7903 219144 422650 343826 195538 334897 334005 264026 313244 220750 278516 433440 292335
7892 292335 170175 104615 207620 198085 173410 94437 -11723 30361 146845 1342 58004
7881 58004 43575 105699 84773 95250 53142 45849 164947 205729 90162 126673 346309
7870 346309 453339 200053 51919 230659 168016 -23646 192769 292175 273109 216225
7860 216225 374561 418654 458499 325973 87923 279317 460539 186539 202607 347311
7850 347311 327819 283372 108070 -41864 97425 1204 85558 204795 156704 51664 -80030
7839 -80030 -104462 -80372 101951 11394 -82144 26865 99117 179858 207621 69422 65425
7828 65425 292990 344003 24507 134727 165247 207089 -1512 -46783 -42256 84427 162980
7817 162980 43966 183368 337869 250305 11973 1322 147260 52675 -83190 55116
7807 55116 212442 40068 396837 351987 258120 374527 240859 159655 94804 254544 213968
7796 213968 123584 129307 185077 60981 -12050 94192 34724 178632 215040 146021 97183
7785 97183 22122 23223 -82680 -75813 -20906 198693 179240 116432 68158 -32932 132582
7774 132582 217847 175241 137411 103689 116271 165179 66298 143448 110442 -124486 -139924
7763 -139924 54126 152647 72235 231701 361548 102495 -11982 130901 43748 -32503
7753 -32503 103347 46783 46802 79180 -46087 -85469 -26796 -150280 -210148 113713 68054 -10760
7741 -10760 -36763 -159414 -152022 -70860 -250455 -279439 -183159 -49587 9979 -3217 -143687
7730 -143687 -68680 2030 14229 53277 -113988 -219118 -78801 7087 -8015 -109069 -156944
7719 -156944 -125692 -163704 13161 -14353 -175893 -229840 -342697 -178013 96051 742 -167847
7708 -167847 -173853 28122 -74337 -310169 -82552 64097 -50674 -29613 -89486 -216639
7698 -216639 -181537 -125847 17314 65498 -151976 -313198 -87247 92610 190404 153790 -6820
7687 -6820 69473 -102886 -363611 -142280 -50979 -96674 -42624 81943 194944 212983 170038
7676 170038 186136 233128 -163765 -323191 -130317 100576 96514 -16666 -172536 22232
7666 22232 47635 -51513 22728 49277 124860 78368 54639 90245 -221756 -142655 -12266
7655 -12266 28322 29017 -158425 -73688 169518 62859 -269775 -246747 -167498 -160845 -195522 -317849
7643 -317849 -153161 -60379 -109647 -36683 -156049 -85234 -33223 -125250 -258551 -214278 -200712
7632 -200712 1127 -143658 -199149 -78315 -203544 -283537 -182936 -90514 -113437 -129008 -186312
7621 -186312 -57995 79525 23335 -141639 -298850 -223926 -56789 -66634 -182441 -186830 -239770
7610 -239770 -255802 -43542 -149979 -262382 -94971 77275 34284 -262220 -290641 -11306
7600 -11306 117849 -171887 -287829 -172508 20564 190264 -67415 -24750 62229 92541
7590 92541 98063 26222 -132469 -180834 -118171 -57770 12114 -121297 -154119 -21145 80397
7579 80397 221584 185735 168145 103589 -84806 -23369 69426 19913 -160568 -168405 -3077
7568 -3077 131550 72280 -36606 -26029 103205 -19772 -180980 -115453 -127906 98441 -10192
7557 -10192 -274075 -297093 -232167 -28963 82131 33620 -48904 -54247 -34767 -190319 -355268
7546 -355268 -348835 -312317 -337762 -278421 -278975 -166709 27880 -39270 -129582 -95202 -26993 -247125
7534 -247125 -309128 -114126 57110 -100950 -258794 -234506 -328639 -264850 -342353 -290677 -64335
7523 -64335 -109937 -205765 -35863 -61225 -231889 -389848 -614924 -304633 -279624 -425072 -180301
7512 -180301 -151834 -130232 -115936 -361201 -333516 -89646 -113691 -222316 -380140 -342505 -159211
7501 -159211 -377721 -504440 -199377 -122094 -250598 -209554 -174973 -9834 -46813 -245109
7491 -245109 -275418 -222960 14966 -126607 -264220 -30248 -95824 -48814 -167571 -224962 -155702
7480 -155702 -89712 -99577 -60668 38262 109646 17010 -25541 -36243 -125482 -285527 -187992 -56121
7468 -56121 4369 20979 -53395 -30988 74777 -87237 -287033 -234203 -240149 -78397 18961
7457 18961 12765 -22037 -135950 -145091 158146 270199 46627 60488 32041 96359 239749
7446 239749 31092 -30048 48000 -76333 67995 117707 18583 99007 -47279 -29394 58095
7435 58095 -26765 2920 -21642 -42603 50997 108604 7275 -125680 -140879 -10391 -9263
7424 -9263 -257213 -87427 -66769 228563 127957 -195803 -209410 27317 98354 -57986 -172347
7413 -172347 -101639 -59354 -53608 -164551 -68566 -163888 -278058 -227851 13632 130776 203173
7402 203173 300386 190185 22575 -6915 -195946 -196810 -96567 -15435 221684 68856 -123181
7391 -123181 -225571 -188219 14304 1218 -160738 -68791 -108417 -60445 -43676 -10396 -83313
7380 -83313 -226055 -192691 -162879 -349657 -316099 -354642 -257532 -239378 -326279 -125619 -279492
7369 -279492 -465271 -323712 -155435 -126303 -315939 -433227 -389726 -120973 -190271 -378093
7359 -378093 -486034 -322388 -134070 -265389 -371411 -212680 -130674 -243538 -340724 -283059
7349 -283059 -333703 -230862 -151213 -170433 -350410 -434403 -251469 -154344 -184943 -202439 -282274
7338 -282274 -225068 -222793 -240899 -233422 -33970 -121214 -289371 -176658 -200421 -258609 -483008
7327 -483008 -484253 -315257 -153540 -269627 -365310 -433414 -459297 -399095 -214263 -354523 -295718
7316 -295718 -291105 -352679 -143011 -170755 -354300 -302739 -209017 -300736 -334816 -254461 -257421 -241282
7304 -241282 -227339 -123436 -148922 -169995 -311378 -620463 -489487 -374872 -318787 -166048
7294 -166048 -267753 -239257 -100699 -47892 -113018 -377915 -553218 -237733 -235447 -270523 -208986
7283 -208986 -109228 -43918 -345262 -416247 -551972 -507587 -349427 -312793 -282373 -90366 -209954
7272 -209954 -410490 -372843 -552608 -605976 -517375 -514995 -242482 -305971 -187332 -237105 -365157
7261 -365157 -225635 -307382 -415641 -369750 -453741 -412717 -143119 -85249 -220277 -393687 -305298
7250 -305298 -240623 -503070 -582009 -445646 -321119 -255540 -308213 -333317 -222062 -248984 -373380
7239 -373380 -481185 -413129 -175475 -199569 -311752 -375224 -461926 -254975 -377744 -472765 -294066
7228 -294066 -71217 -34488 -253039 -360522 -237869 -150112 -204721 -162674 -97068 -122596 -206818
7217 -206818 -264695 -231230 -213199 -303775 -312762 -385163 -198157 -112718 -108335 -24676 -209162 -301772
7205 -301772 -177900 -376031 -445624 -551145 -197588 139487 -136553 -130820 -155823 -253540 -200107
7194 -200107 -502541 -541357 -239147 -293818 -275255 -278934 -386813 -269982 -257590 -284156 -321172
7183 -321172 -470821 -374778 -41363 -114513 -57024 -157190 -173809 -267971 -269199 -405550 -497420
7172 -497420 -531486 -215282 -385270 -259132 -158738 -299882 -453783 -272568 -242696 -445380
7162 -445380 -539637 -417467 -251134 -195030 -231774 -392896 -309942 -356045 -466150 -411331 -277304
7151 -277304 -347370 -228268 -379722 -328863 -433392 -432106 -311496 -333248 -563668 -374259 -390010
7140 -390010 -299650 -331109 -303726 -277930 -254721 -211829 -310057 -478550 -256333 -327523 -355659
7129 -355659 -143017 -116420 -245994 -59010 -204801 -359653 -360528 -294220 -421722 -436163 -302137
7118 -302137 -69456 -116545 -111757 -284199 -377173 -228474 -292370 -456704 -649254 -425541 -279896
7107 -279896 -456373 -501604 -373395 -518293 -282166 -299614 -406383 -317684 -186999 -310209
7097 -310209 -452785 -327112 -318924 -325006 -265120 -348605 -438005 -368661 -400088 -312791 -142132
7086 -142132 -322765 -429866 -472135 -505496 -417426 -376126 -306340 -262863 -177978 -208909 -227889
7075 -227889 -181425 -394566 -542965 -369839 -113741 -309692 -429198 -644779 -343640 -194170
7065 -194170 -373551 -474758 -464388 -305691 -316855 -335669 -300055 -226163 -150589 -410460 -410341
7054 -410341 -327242 -337915 -480123 -443995 -75544 37578 -142943 -472502 -624523 -551946
7044 -551946 -247515 -414175 -570926 -459803 -389813 -204384 -224356 -443205 -478079 -263431
7034 -263431 -329303 -222846 -101145 -80016 -139346 -317291 -86794 -51845 -265119 -312967 -514994
7023 -514994 -354069 -98718 -197796 -292255 -200759 -285819 -268598 -342178 -473607 -631326 -378246
7012 -378246 -88455 -89900 -232387 -342993 -213727 -144780 -332861 -445887 -453276 -441772 -278104
7001 -278104 -207621 -195577 -328788 -238411 -294331 -352481 -395637 -359553 -355809 -224007 -74767
6990 -74767 -124955 -161666 -171406 -111962 41302 19068 -331074 -553421 -454431 -290308 -21663
6979 -21663 -253224 -286521 -110819 35596 -141865 -383233 -540170 -263584 -206255 -273145
6969 -273145 -307194 -390117 -298733 -396985 -282386 -173817 -370175 -395413 -247102 -199874 -194579
6958 -194579 -339406 -422989 -263078 -229720 -245698 -355744 -608279 -441368 -177651 -121865
6948 -121865 -251488 -374704 -384398 -269696 -282577 -432248 -600521 -480367 -358887 -271652
6938 -271652 -375291 -409212 -408120 -488438 -258888 -21198 -299204 -455557 -310678 -287057 -70890
6927 -70890 -387909 -734530 -638900 -246546 8976 -147979 -447331 -389303 -259317 -376063
6917 -376063 -439892 -484176 -388925 -108062 -143968 -407933 -487171 -488308 -328946 -423709 -441834
6906 -441834 -285196 -285766 -202327 -349283 -422171 -190155 -443558 -706526 -572677 -369862 -371551
6895 -371551 -392523 -365475 -114830 -98954 -172224 -287958 -407401 -283220 -283574 -409169 -358352
6884 -358352 -441271 -334595 -39873 -75499 -348968 -195313 -46136 -133049 -269401 -365021
6874 -365021 -267277 -175603 -159366 -197714 -297577 -191673 -221846 -276813 -338833 -236602 -268130
6863 -268130 -460946 -315211 -148812 -300781 -396957 -425335 -595513 -480724 -419245 -462480
6853 -462480 -364852 -308570 -264988 -369592 -378388 -212145 -344733 -308307 -306377 -464734 -376637
6842 -376637 -42436 -182863 -388370 -323238 -238451 -322431 -411143 -351430 -208338 -229570 -149135
6831 -149135 -127920 -119931 -190279 -215563 -382439 -593397 -458456 -242711 -171390 -183322 -308182
6820 -308182 -358553 -165546 -142827 -482198 -530586 -260103 -164340 -306704 -525479 -376838
6810 -376838 -195023 -386400 -599039 -556661 -315342 -321305 -453573 -422437 -271083 -224239 -308936
6799 -308936 -396774 -405987 -416672 -275059 -420340 -399283 -353074 -244670 -109966 -178296 -223126
6788 -223126 -117249 -70699 -203229 -347225 -222430 -153753 -235928 -445587 -393427 -114494
6778 -114494 -91408 -336404 -340717 -205185 -137837 -132602 -296360 -325502 -223552 -452159 -558338
6767 -558338 -290235 -356736 -195089 -191487 -229968 -334617 -539934 -528841 -378976 -369278 -242918
6756 -242918 -229885 -251578 -198959 -348001 -455490 -300199 -468006 -471339 -137070 76507 -49521
6745 -49521 -176465 -208636 -8089 -154351 -336171 -470243 -486225 -271496 -54649 19663
6735 19663 7517 -265968 -297348 -253658 -170104 -232768 -342434 -221089 -80890 -91512 -153350
6724 -153350 -347964 -229167 -314407 -426443 -400762 -359586 -218670 -135581 -53054 166059 111377
6713 111377 -226540 -218534 -227489 -276820 -265239 -308127 -332682 37518 -56929 -178599 -255973
6702 -255973 -216137 -119612 -202941 -298097 -216533 -211224 -27569 -3775 -259881 -195420 -37205
6691 -37205 -10806 -118458 -146699 -38946 -93950 -26550 -8514 -58424 -19020 -51460 -435683
6680 -435683 -304639 -265783 -187458 -53700 -81735 2839 161736 -59451 -98765 -67342 -231118
6669 -231118 -49535 68120 -176845 -148651 7846 -30586 91619 140837 150026 154573 97320
6658 97320 4615 -6960 116010 139818 -54621 -66417 54411 -14842 -26012 177740 20031
6647 20031 19997 152399 -83853 -111033 19147 -142007 -36149 124596 -40736 -100916 -127446
6636 -127446 -262741 35134 -197556 -154917 -105195 -265389 -116115 -117209 -115904 -137053 -124934
6625 -124934 -57904 -154307 -275611 -16463 13783 -89370 -4267 -91052 -143662 -12985 80006
6614 80006 -61161 -106745 15818 -61649 -191505 -183952 -60206 -17291 -20628 -84566 -289460
6603 -289460 -116042 -34304 -98677 -30781 34396 41775 -83118 -46423 -79001 -15310 69719
6592 69719 235072 15846 137031 184731 -919 -86118 -34841 -181940 -65089 22240 -5949
6581 -5949 21583 73086 203053 211117 -121657 -179442 -19708 -35738 -152029 -115468 56309
6570 56309 204703 188869 -34832 -50115 -93866 -148382 -254916 -48096 48324 -87321 -173591
6559 -173591 -87390 71156 18608 -12608 101600 -9563 200968 264900 104264 -13350
6549 -13350 -154003 -113158 -32947 -82983 128048 291911 250204 455084 296658 -17519 81946
6538 81946 -24489 156961 301196 26582 28275 235909 153439 264591 63586 -164808
6528 -164808 -55583 101250 -20728 247947 246525 177578 132120 10065 -96930 72060
6518 72060 89093 85027 183316 240078 298351 201261 66525 11028 -96777 -88122 3728 -189092
6506 -189092 21017 275425 242869 109921 221089 388091 461493 365250 231464 397472
6496 397472 599863 642227 534633 326983 387320 334963 224651 304280 346615 244564 247349
6485 247349 228662 325221 241418 240990 334615 276122 358048 547339 487772 648828 515804
6474 515804 511497 795030 870597 784123 872170 933324 1031371 751640 648541 694225 384308
6463 384308 362786 609265 490326 636177 556148 316019 205398 328481 409039 456295
6453 456295 435213 513764 679779 632180 602258 649609 552373 628228 797962 868693 1045153
6442 1045153 1099890 942870 825546 787813 716818 688341 558434 673392 694334 790137 846184
6431 846184 804021 681660 779660 729172 752676 836554 889808 719310 746737 740285 716305
6420 716305 726418 662388 702940 830479 1094759 1065167 791178 944567 1089251 1000579 911818
6409 911818 966460 1107591 1073873 1073820 1092920 873324 877745 759329 593640 636512 784422
6398 784422 899885 1056893 937771 795936 700340 606650 774491 872389 847756 1005709
6388 1005709 1145094 1244611 1180262 1052274 1003669 1014519 954343 958088 1035454 1001722 1059661
6377 1059661 1076285 894063 811008 741985 519494 430320 798697 1028096 931874 952180 829897
6366 829897 728971 907852 810879 640750 624595 700795 951241 943913 825953 837385 933548
6355 933548 938899 867302 578439 704757 1016263 1049528 1168686 1039133 875483 736850
6345 736850 715122 762596 789435 852272 812222 1150463 1191318 1195410 1016265 1045980 1196938
6334 1196938 1236485 987888 1019711 1025583 1054228 1094594 1209582 1071394 1020989 987561 1233890
6323 1233890 1312779 1159176 1067740 1103096 1140943 1145643 946514 948171 1127445 1112440 1002905
6312 1002905 1113287 1299731 1237711 1353450 1498405 1356837 1383137 1440278 1116251 1267259
6302 1267259 1430343 1496899 1545615 1518765 1421661 1647778 1712841 1751323 1786953 1800832 1941115
6291 1941115 1881279 1618403 1745944 1804412 1667028 1720933 1742779 1795625 1877781 1921389 1943950
6280 1943950 1944681 2089093 1961874 1772523 1848587 1993574 2014156 2050205 2075611 2033372 1927713
6269 1927713 2099475 2266289 2302661 2381007 2477493 2477555 2453017 2366360 2845815 3044377 2708456
6258 2708456 2621893 2760897 2792379 2948134 2653709 2695369 2956778 3092809 2960702 2858906
6248 2858906 2621574 2678901 2892537 2859013 2836208 3111596 3191794 3090959 3242132 3451852
6238 3451852 3612803 3619804 3377656 3326729 3707821 3995644 3896433 3906793 3973845 4210207 4118057
6227 4118057 4030888 4010538 4160298 4469236 4271297 4099848 4153464 4276010 4491114 4772770
6217 4772770 4692930 4740187 4822120 4990319 5329688 5473922 5355979 5628910 5643452 5768495
6207 5768495 5784338 5813718 5923420 6026878 5977668 5988024 6102977 6219096 6215190 6450870 6576743
6196 6576743 6691201 6635690 6711082 6745586 6972291 7185678 7280321 7364666 7734758 8053615
6186 8053615 8303104 8220097 8435205 8575661 8558195 8749221 8903127 8947415 9147918 9238614
6176 9238614 9295268 9329308 9473215 9482819 9577006 9770289 10292413 10707785 10770599 11181886 11649389
6165 11649389 11912346 12165997 12295760 12707530 13300628 13488998 13870725 14453392 14929824
6156 14929824 15566860 15909915 16184687 17135618 17854230 18505353 19470117 20359997 21093507
6147 21093507 21905453 22587218 23710325 24800374 25901988 27366301 29031860 30900147
6139 30900147 33192468 35804248 39018738 42880372 47359543 52576438 58600872 64867136
6131 64867136 71069342 76168643 79044254 79517593 77684494 74107599 70563180 66851172
6123 66851172 63696494 61519797 59621903 58144369 57421591 57244732 57699596 58882877 60997730
6114 60997730 63816542 67663885 72938335 80015272 88776504 99493019 111525649 124362309
6106 124362309 136670695 145962393 150196474 147995989 139472997 126802098 113202721 100691344
6098 100691344 90205565 81780723 75113771 69743862 65406621 62079457 59527193 57882998
6090 57882998 56980475 56761467 57856879 59857526 62510183 66411922 71125598 76642993
6082 76642993 82466994 87065403 89719374 89766568 86218053 80111232 72824329 64946293
6074 64946293 57668193 51521701 46533720 42439989 38749464 35700255 33339460 31161376
6066 31161376 29390289 27604123 26004355 24817382 23789704 22629868 21862456 21224491
6058 21224491 20444927 19669890 19350458 18747154 18081894 17605565 17349890 17333126 17111373 16995339
6048 16995339 16881129 16700816 16898606 17327492 17462284 17964466 18462674 18543175 18641079 18399360
6038 18399360 17922865 17361010 16793961 16455664 16176763 16002875 15998876 16015800 15919885 16144268
6028 16144268 16561219 16841024 17439200 18590203 19823709 21001171 22371359 23493610 24586407
6019 24586407 25570905 26073392 26249308 26228948 25838438 25028600 23942068 22774258 21775518
6010 21775518 20918888 20130627 19427310 19041019 19188805 19025133 18790789 18874062 19149614 19746676
6000 19746676 20635470 21618578 23043424 24954152 27247322 29830613 32440167 34912961
5992 34912961 36991579 38262423 38236863 36682661 33943092 30849345 27811220 24977216
5984 24977216 22626694 20861608 19568807 18517629 17484024 16844005 16671034 16294721 16009924
5975 16009924 16076926 16428530 16841642 17281514 17809697 18686591 20060510 21056528 21970242
5966 21970242 22838344 23313475 23065934 22141678 20711594 19039074 17580922 15917641 14445914
5957 14445914 13250892 12084585 11176615 10643976 9752965 9155997 9010717 8491743 8348550
5948 8348550 7875039 7383800 7386645 7095847 6576469 6573452 6568210 6480446 6441851 6293108 6134551
5937 6134551 6047067 6023119 5992821 5899033 5734336 5422874 5268464 5213633 4848676 4769901 4923995
5926 4923995 4729577 4517085 4294623 4171584 4016924 4032152 4004974 3926068 3961027 3909456
5916 3909456 3792810 3712520 3704342 3697273 3660235 3521056 3557239 3887113 3971631 4047295 4136722
5905 4136722 3936453 4042690 4096409 3599095 3452992 3652385 3756443 3723894 3491679 3342977
5895 3342977 3437199 3444290 3411663 3204370 3161586 3284597 3237375 3264001 3287247 3436541 3537641
5884 3537641 3549328 3317399 3261741 3379691 3577888 3424486 3534676 3723838 3564883 3500403
5874 3500403 3635082 3561321 3679640 3406154 3207525 3260878 3459307 3565251 3622544 3637694
5864 3637694 3787126 3614587 3356631 3444813 3392516 3418281 3548634 3830084 3871439 3755243
5854 3755243 3758547 3591138 3621821 3607851 3432421 3411275 3544441 3833368 3821170 3751951 3669406
5843 3669406 3628272 3560483 3855640 3931900 3725731 3954689 4125197 4225978 4353050 4111643
5833 4111643 4284634 4318423 4229521 4058137 4110871 4131212 4369510 4217451 4034606 4230670
5823 4230670 4284029 4258845 4330335 4330348 4409462 4513747 4680944 4647030 4689999 4981846 4954721
5812 4954721 4938888 5025401 5170355 5074884 4976274 4871439 4872596 5222228 5232168 5204684 5244283
5801 5244283 5283456 5491281 5617010 5448044 5501101 5508503 5666847 5850172 5854537 6094503 6455716
5790 6455716 6494406 6371363 6416535 6687623 7094257 7643530 8068368 8500955 9003940 9138050
5780 9138050 8208659 7557938 7493948 7225625 6983193 6770988 6921362 7304429 7392204 6902070
5770 6902070 7005828 7062866 7241179 7215003 6918060 7181074 7729737 7821708 8020505 8115993
5760 8115993 8093452 8134109 8241220 8191175 8276221 8421142 8792141 8889490 9004408 9108915
5750 9108915 9223377 9494376 9548574 9377436 9575484 9963741 10484981 10961898 11515489 12167551
5740 12167551 12865430 13400799 13763987 13991172 14177563 14020105 13906514 13855840 13913534 14203855
5730 14203855 14428902 14688243 15166903 15665395 16078497 16615168 17050329 17651463 18593477
5721 18593477 19166238 19399043 19511704 19749254 20059484 20124479 20288110 20491893 20693361 20763562
5711 20763562 20930302 21225443 21456972 21662012 21916804 21937721 22248858 22856409 23292412 23907504
5701 23907504 24725505 25433140 26379685 27416704 28808040 30295165 31409341 32152180 32489414
5692 32489414 32335685 32538034 33005763 33528720 34339085 35626322 37339056 39309785 41527453
5683 41527453 44420823 48048212 52503462 57885026 64215456 71897079 80725344 88977216
5675 88977216 96087815 100333478 100312134 96597043 90425910 83606205 77420852 72277024
5667 72277024 68373213 65094300 62587578 60992795 60319353 60319195 60877479 62464239 65152666
5658 65152666 69127465 74555665 81733419 91184475 103048594 117134907 132634559 147811986
5650 147811986 158960536 162468055 156644310 143967712 128502135 113123393 99788276
5643 99788276 88561606 79579802 72352475 66523002 61894582 58240402 55505714 53641988
5635 53641988 52612861 52135720 52714984 54103148 56163585 59240891 63388225 68232968
5627 68232968 73389313 77887105 80843882 81175251 77982845 72116353 65081584 58172171
5619 58172171 51840658 46636393 42230548 38470579 35526344 32824316 30441715 28816179
5611 28816179 27503252 26005746 24899480 24250150 23700625 23101502 22627014 22415870 22342649
5602 22342649 22283742 22187367 22075556 22066245 21909529 21491361 21098985 20919718 20561166 20126182
5592 20126182 20111509 19622341 19473712 19216874 19030274 19051179 18875107 18798062 18869977 18808401
5582 18808401 19223015 19766778 20102921 20659156 21275063 21655096 22358196 23061382 23708395
5573 23708395 24402236 24841467 24746223 24616362 24592436 24376840 24211033 24415026 24856307 25321732
5563 25321732 25944464 26900528 28288562 29821230 31498090 33442117 35398151 37194058
5555 37194058 38403023 39022837 39170396 38712937 37931009 36979910 36044521 35544420 35145472
5546 35145472 35178014 35309347 35131814 35313042 35881323 36288960 36822481 37701059 38807065
5537 38807065 40470105 42783906 45521459 48998690 53183158 57653817 62428617 67174821
5529 67174821 71308130 73797141 74859316 75488163 76458651 78797004 82389055 87241195
5521 87241195 93090423 98491091 102363337 103079172 100059111 95337537 90346018 85700463
5513 85700463 82218008 79819052 78628617 78495235 79196711 80395712 82075923 84523184
5505 84523184 88056191 92460983 98680861 106461739 115524398 126217622 137811884 147798519
5497 147798519 153148638 152470003 148257396 142442110 136012622 128867998 120194039 110018989
5489 110018989 100043772 90840886 83381677 77918069 74113290 71484207 69708999 68708664
5481 68708664 67864546 67792229 68294582 69460849 72321771 76778837 81956970 87524652 92192666
5472 92192666 94007543 92020800 85579570 76886135 68154424 59982000 53002711 47173428
5464 47173428 42250090 38281928 35075636 32172633 29737054 27761338 26237289 24814719
5456 24814719 23758569 22885295 21971465 21382112 20971257 20040427 19106055 18279934 17477961
5447 17477961 16702521 16105204 15233350 14567912 14139115 13380132 12619942 12286306 11964327
5438 11964327 11335276 10863550 10693207 10349636 10285026 9999259 9684862 9417906 9332601 9226468
5428 9226468 8912548 8495207 8478471 8428591 8457232 8367989 7988568 7852157 7811008 7553336
5418 7553336 7372990 7309420 7211000 6922159 6784283 7086544 7084397 7017580 6916932 6910025 7017857
5407 7017857 6862210 6399357 6407882 6360718 6359463 6064233 5613515 5669153 5540709 5290354 5254636
5396 5254636 5070720 4950530 4937923 4846625 4811867 4696617 4687984 4880319 4806594 4692440 4785090
5385 4785090 4594838 4419491 4406940 4361322 4411270 4319880 4315799 4483464 4674259 4446130 4236680
5374 4236680 4194713 4117984 4199429 4217278 4197202 4485274 4366217 4228782 4224734 4243584 4231704
5363 4231704 4356746 4363582 4645277 4819288 4960712 5248320 5432474 5678351 6104782 6584844
5353 6584844 7233478 7625607 7636988 7434088 6867628 6224491 5823274 5375348 5024231 4976224
5343 4976224 5058892 5184935 4822056 4667984 4760211 4679967 4830706 5047126 4955650 5326979
5333 5326979 5444807 5476926 5606248 5873408 6133452 6320162 6731500 7410021 8265345 9269888
5323 9269888 10429503 11825513 13358639 14681500 15160938 14619633 13114778 11526645 10306879
5314 10306879 9056759 8028401 7487255 6842768 6512975 6234750 6063315 5879573 5805726
5305 5805726 5520039 5364959 5531773 5572472 5562029 5583186 5560366 5732973 5895444 6228968
5295 6228968 6420843 6743261 7455826 8321691 9508413 11067086 12680963 14092130 15239373
5286 15239373 15059161 13577735 11721835 10141746 8798100 7833901 6906272 6348486 5961764
5277 5961764 5792647 5496226 5152704 5206133 5184594 4906577 4860571 4815113 4663842 4392716
5267 4392716 4340229 4300695 4556378 4737092 4618177 4671711 5065047 5311181 5526676 5923634
5257 5923634 6411122 7169523 7567560 7407965 7209820 6732002 6255984 5983790 5530276 5363058
5247 5363058 5521274 5459884 5509669 5608872 5519484 5420022 5092766 4839090 5041068 5027033 5044809
5236 5044809 5152029 5268946 5638924 5836812 5908693 6000933 5902610 5875718 5896715 5700102
5226 5700102 5491263 5255349 5192556 5070270 4958586 5023022 5129803 5140648 5509049 5539595
5216 5539595 5727628 6091303 6342946 6430662 6320387 6457585 6549719 6484912 6375884 6390449
5206 6390449 6533543 7107574 7368210 7573770 8126928 8342516 8501792 8532337 8158946 7954909
5196 7954909 7744347 7169482 6870215 6682718 6373899 6318804 5975397 5632334 5554808 5296474
5186 5296474 5105539 5286791 5492229 5439819 5583548 5527802 5558544 5900860 5986218 6142158
5176 6142158 6383431 6392625 6476339 6367459 6119694 6271794 6233242 6036308 5975406 5759494
5166 5759494 5646545 5552420 5233024 5123060 4958019 4758655 4683357 4358357 4235302 4232496
5156 4232496 3795937 3786633 3772031 3702438 3776400 3761010 3627350 3638638 3660765 3518388 3507966
5145 3507966 3613200 3611896 3647930 3566854 3241259 2920170 2931202 2877095 2787998 2905828 2833157
5134 2833157 2874724 2797641 2795381 2941728 3036109 2989928 2984164 2801076 2773726 3091584 2979708
5123 2979708 2853417 2980132 2909854 2916944 3077194 3178793 3154753 3322463 3272651 3338301 3258961
5112 3258961 3273585 3285904 3274020 3359663 3193423 3046259 3171687 3329109 3361490 3376822 3394740
5101 3394740 3388874 3483434 3484695 3576485 3699115 3519008 3366057 3516695 3621946 3714096 3764910
5090 3764910 3741037 3911607 3873850 3806648 3879045 3718463 3800211 3905248 3912720 4116340 4073952
5079 4073952 3927116 4142658 4117570 3925022 4057131 4165169 4256428 4343919 4334824 4426813 4464921
5068 4464921 4305981 4442199 4530971 4499217 4350162 4610131 4946187 4812724 4689051 4852185
5058 4852185 4743819 4658776 4579262 4533686 4812036 4906435 4706600 4896926 5236427 5424169
5048 5424169 5355645 5240576 5382230 5633053 5611571 5732363 5905602 6090747 6331380 6152831
5038 6152831 6080559 6171735 6387476 6557070 6615820 6871697 7135323 7347551 7666715 7720387
5028 7720387 7696088 7950730 8099399 8222855 8487790 8732195 8800227 9003403 9227779 9329072
5018 9329072 9413830 9437342 9444409 9692136 10001197 10138661 10185653 10572016 10851304 11019629
5008 11019629 11208120 11593442 11990743 12101276 12650302 13549151 14465841 15620609 16981798
4999 16981798 18754689 21095696 23015131 24727387 26419104 27247297 26169569 23564768
4991 23564768 20942832 18937331 17278489 15951473 14830901 13987963 13488577 13116254 12722204
4982 12722204 12306224 12188697 12107707 11706875 11471016 11351468 11166299 11005675 11000775 10940773
4972 10940773 11093615 11212003 11153010 11084618 11159153 11018239 10826729 10759707 10866597 11033364
4962 11033364 10857707 10746471 10739574 10692046 10525068 10350632 10514855 10485929 10161509 10124460
4952 10124460 10173908 10303517 10240350 9888682 9824683 10040913 9925121 9755858 9898964 10044379
4942 10044379 9974833 10129949 10286058 10184840 10210037 10124439 10131049 10326710 10427009 10647761
4932 10647761 10702864 10609259 10577049 10660562 10689325 10803573 11037589 11209990 11433677 11622007
4922 11622007 11630478 11852905 12082122 12071379 12167955 12402808 12661481 12952513 13390612 13628964
4912 13628964 13676628 13979254 14203238 14375559 14545218 14700187 14949659 15178993 15578405 15719099
4902 15719099 15972583 16514218 17088784 17446677 18102040 18443922 18558712 18879485 19204459
4893 19204459 19781778 20643335 21709735 23439418 25903877 29113516 33420906 37243285
4885 37243285 41630866 46111579 46220533 42044550 36689023 31863847 28784082 26818507
4877 26818507 25375268 24399577 23792254 23378392 23320120 23036726 22902389 22878100 23046632 23512889
4867 23512889 23776455 23932134 24277467 24826749 25285248 25643018 26088898 26631692 27363805
4858 27363805 28075443 28426599 28931706 29803678 30821479 31579640 32521160 33647632 34774683
4849 34774683 35898897 37235129 38640893 40335335 42341095 44358265 46534113 49053728
4841 49053728 51600778 54444379 57270507 60329592 63671212 66903339 69931467 72866491
4833 72866491 75539415 78021052 80119873 81439551 82611711 83576410 84421331 85059476 85368371
4824 85368371 85805668 86200545 86752168 87428500 88491063 90045853 91873899 94141392 97322785
4815 97322785 100831217 104703853 108981521 113183367 117925313 122880569 127529411 132075144
4807 132075144 136030297 138604567 140026262 139916654 138732111 137039835 134606892 131829710
4799 131829710 128596117 125185646 122002702 118684821 116053621 114480335 113656997 113843720
4791 113843720 114845470 116549014 119226982 122476971 126070291 129877321 133917654 138094723
4783 138094723 142371798 146440471 149640849 151474912 151881365 150641447 148533599 145667696
4775 145667696 142242904 138935292 136182238 133673139 131658272 130185826 129196048 128818557
4767 128818557 129174443 130465956 132798435 135978834 139757663 144049573 148823191 153460673
4759 153460673 157097265 160413664 163585060 166027272 167641077 168142998 167716280 166052627
4751 166052627 162961981 159202828 155663213 152522533 149854716 147641060 146107638 145311005
4743 145311005 144774185 144426451 144902125 146207793 147640301 149523403 152075916 155226787
4735 155226787 158961341 163063095 167388326 172445520 178015492 183735216 189204467 193347422
4727 193347422 194870035 192892919 187272016 179561281 171027807 162600859 155221948 148994514
4719 148994514 143970577 140701195 137724148 135755953 134776003 134755556 135846457 138058846
4711 138058846 141788765 146931734 153066626 159341482 165303273 170170746 174053461 176121908
4703 176121908 175961870 173927080 169226460 161880856 152628488 142401081 133083369 124696302
4695 124696302 117481795 111884942 107618849 104594415 102079375 99542809 97857293 96876197
4687 96876197 96299376 96804934 98431602 101240781 104907695 108786361 112018900 113376016
4679 113376016 112273189 108697135 102815424 96214786 90254158 84584754 79917722 75861381
4671 75861381 71694794 68232770 65191130 62238172 59434053 56973280 54678846 52557186
4663 52557186 50442250 48289738 46392753 44519309 42815319 41165842 39527844 38249370
4655 38249370 37185650 36039312 34848829 34027034 33268769 32633682 31993876 31284061 30949067
4646 30949067 30422823 29786563 28984004 27937075 27075246 26262859 25453070 24742104 23968714
4637 23968714 23183119 22569315 21687237 20794467 20038848 19526168 18881851 18289297 17785994
4628 17785994 17253866 16638764 16019987 15732726 15144340 14473824 14147221 13753401 13315313
4619 13315313 13042806 12637580 12381216 12140051 11706839 11192932 10996697 10766949 10457959
4610 10457959 10263071 10202686 10110924 9978036 9760000 9557828 9398981 9206784 9124029 8985788
4600 8985788 8702892 8644742 8660359 8502541 8243589 8270357 8208354 8112631 8050053 7706303 7741597
4589 7741597 7867035 7616071 7344669 7227604 7127708 7023628 6930425 6995030 6959058 6815670
4579 6815670 6842358 6727272 6830170 6910442 6690426 6632085 6633583 6277447 6112505 6173763 6070097
4568 6070097 5973316 6123306 6318007 6340122 6248111 6178876 6188034 6339877 6148435 6005841 6050889
4557 6050889 6025926 6038646 6073341 5893505 5662892 5808775 5831051 5756212 5729893 5775214 5758282
4546 5758282 5655182 5616265 5449365 5470237 5610525 5490203 5503924 5808137 6076470 6115315
4536 6115315 5892446 6016522 6250025 6009161 5953350 5947222 5878306 5904626 5809668 5667603 5803179
4525 5803179 5767313 5694283 5718108 5842073 5848239 5808905 5955980 6196744 6129879 6489966 7035550
4514 7035550 7733265 8132662 7811715 7367663 7016001 6720913 6331808 6053508 6165922 6008676
4504 6008676 5811565 5807806 5871507 5856120 5940932 5793127 5760549 5690783 5632329 5835699 5786745
4493 5786745 5890462 6099180 6045444 5892568 5976569 5876348 5692438 5733858 5860289 6007363
4483 6007363 6204553 6197933 6118175 6190575 6451107 6338351 6123985 6124291 6047398 6135522 6212687
4472 6212687 6233075 6285411 6421649 6417995 6297541 6265588 6422950 6502455 6462890 6712324 6593007
4461 6593007 6585898 6620325 6687568 6704588 6511952 6360197 6420205 6539464 6653890 6533200 6420014
4450 6420014 6456809 6455916 6231588 6223714 6228379 6182916 6168243 6287974 6476625 6512097 6488372 6512567
4438 6512567 6296687 6291999 6466476 6363539 6350608 6481140 6681458 6737507 6802075 6774036 6748336
4427 6748336 6809694 6928298 6812883 6763727 7072045 7221628 7003571 6922225 6966266 7031532
4417 7031532 7115671 7134897 7175329 7129858 7448069 7586703 7576645 7700502 7790720 7762418 7863238
4406 7863238 7901498 7910015 8255671 8591637 8910064 9256018 9480347 9924959 10301141 11138338
4396 11138338 11921976 12246809 11776142 10823006 10076178 9818642 9687229 9292682 9036171
4387 9036171 8974106 9016373 9075440 9014157 8892068 9133151 8989329 8799452 8824589 8897605 9078539
4376 9078539 9209844 8989168 9118067 9177694 9379295 9568040 9830081 9987704 10084132 9978610
4366 9978610 9915600 9953278 9898865 9875820 9952043 10005892 10004548 10107579 10211925 10150556 10367684
4355 10367684 10537627 10528040 10354486 10420519 10457253 10625360 10862270 10936963 11005697 11115755
4345 11115755 11235161 11398222 11181302 11302836 11419526 11365724 11538306 11742038 11827103 12128022
4335 12128022 12447666 12593476 12777069 12883044 12883940 12872727 13127476 13250180 13316898 13467156
4325 13467156 13753975 13855831 14113674 14355171 14424458 14948532 15655172 15942745 16269776 16499055
4315 16499055 16720866 16738902 17073820 17450928 18266303 19280066 20896573 23191124 25864001
4306 25864001 29076897 31954631 33914639 34790114 33555579 31420812 28731313 25761862
4298 25761862 23142039 21453038 20406380 19601682 18853996 18466737 18059423 17726694 17637322
4289 17637322 17734671 17591605 17622933 17776624 17891975 17980011 18039312 18088202 18176218 18272151 18301227
4278 18301227 18481067 18690685 18764968 18744765 18922824 19209328 19547719 19624348 19769285 19949954
4268 19949954 20122998 20336798 20574499 20760028 21049769 21351551 21581982 21835903 22114982
4259 22114982 22140321 22437401 22891156 23264835 23254169 23622739 24064234 24496818 24637819 24879148
4249 24879148 25233327 25626575 25863175 26119779 26407197 26613939 27052613 27395283 27602185
4240 27602185 28144478 28556153 28771462 29164961 29620299 30031819 30714353 31076390 31566869
4231 31566869 32125623 32845408 33498133 33934447 34566164 35386043 36147644 36996460 37895610
4222 37895610 38833340 39988968 41125180 42252656 43523016 44950420 46388795 47878822
4214 47878822 49496358 51122728 52789571 54891237 57096585 59138134 61237560 63643332
4206 63643332 66427496 69155821 71943784 75033612 78283556 81544591 84846305 88322093
4198 88322093 91659772 95253830 98595934 102303584 106336673 110429128 114382294 118409150
4190 118409150 122865104 127578061 131926022 136133586 140090991 143927176 147624302 151081810
4182 151081810 154024364 157007569 159902146 162532544 165010753 167533567 169858262 172134064
4174 172134064 174335039 176256253 177699687 178647531 178900300 178419244 177550855 176403614 174983183
4165 174983183 173157054 171491979 169904636 167967454 165980701 163971817 161840531 159620071
4157 159620071 156911322 153737755 150397374 147189992 143479630 139743106 135995706 132196638
4149 132196638 128442009 124864075 121451178 117866716 114354932 110829014 107590573 104354688
4141 104354688 101161382 98347922 95745153 93297127 90963422 89302942 87669731 86370011
4133 86370011 84989040 83712598 82561730 81319164 80029591 78971916 78268418 77725064
4125 77725064 77109551 76694819 76423643 76231565 76240907 76439486 76560069 77099593 77477662 77775732
4115 77775732 78273038 78661663 79268986 80290040 81521253 83205104 85510002 88050231 90737097
4106 90737097 93032933 94877566 95788887 96267536 96399463 96403837 96711865 96990901 97555559
4097 97555559 98241038 98670643 99128061 99593137 100405459 101408555 102214482 102812147 103648188
4088 103648188 104375104 105129037 105609244 105958401 107056203 108873484 111247791 114313414 117991722
4079 117991722 122068427 126247343 129889571 133020850 135665338 137671339 139785181 141723030
4071 141723030 143509718 144878182 145968638 147051479 148125223 148760407 148819974 148372238 147967139
4062 147967139 147905014 147972272 148038646 148583716 149212543 149939426 150549076 150905028 150912937 150847491
4052 150847491 151053516 151384119 151747451 152052138 152690334 153440030 154386274 155313118 155550350
4043 155550350 155662560 155645998 155446919 155226079 154870032 153973702 152747780 151415604 149893878
4034 149893878 148366737 146570649 144429247 141703926 138740366 135719950 133067548 130886803
4026 130886803 129256749 128259488 127819103 127393621 127214306 126938549 126522481 125542279 124245358
4017 124245358 122725844 121490672 120002851 118240818 116711335 115311591 113894330 112656376
4009 112656376 111753398 111321762 111026315 110839441 110635712 110093235 108942003 106801665 104112631
4000 104112631 101905366 99964703 97964153 95984615 94233632 92836627 91250992 89239356
3992 89239356 86624139 83962401 81767359 79664902 77519735 75429091 73753369 72191169
3984 72191169 70886910 69624285 68263971 67275855 66275967 65238805 64076512 63152524 62037612
3975 62037612 60468824 58962426 57520088 56178476 54856655 53558848 52620448 52118314
3967 52118314 51338927 50287692 49284985 48301641 47705331 46878518 45817697 44949886 44133388
3958 44133388 43269622 42574113 41688735 40648296 39889597 39209558 38554007 37793563 37203579
3949 37203579 36671271 36261838 36126261 36039587 35847725 35482394 35223582 35166941 35283371 35174601
3939 35174601 34892508 34832504 35164507 35131672 34992827 34967771 35071517 35262577 35412074 35397121
3929 35397121 35588271 35815442 36213091 36430745 36372886 36522321 36733154 36964350 37395072 37576593
3919 37576593 37680985 38072203 38444068 39020872 39397849 39702116 40148165 40520692 40888903
3910 40888903 41024396 41043472 41137956 41272564 41702646 42188955 42484650 42853610 43551403 44175988
3900 44175988 44917077 45852029 46680939 47554159 48257577 49239344 50555304 51710787 52875918
3891 52875918 54428188 56164174 58017385 59901334 61701814 63925689 66504758 68746323
3883 68746323 71175553 73813222 76272204 78729822 81056844 83159639 85186833 87147614
3875 87147614 88904274 90390788 91748600 92981178 94022991 94744937 95549854 96118067 96640753
3866 96640753 96941350 96726742 96139561 95767055 95428100 94653830 93624669 92670787 91677382
3857 91677382 90605774 89523968 88528213 87638484 86926940 86065553 85171379 84821228 84695845
3848 84695845 84513844 84701606 85426408 86239993 87328905 88727274 90382896 92330642 94892253
3839 94892253 97561642 100685126 104075771 108119870 112714649 117694388 123053473 129118893
3831 129118893 135590317 142236270 148813468 155190383 161461965 167580915 173274339 178500973
3823 178500973 183584042 188510178 193314926 198569271 203688538 208676810 213524464 218117278
3815 218117278 222142893 225270061 227561678 228761425 228835397 227840750 225954285 223781047
3807 223781047 221247534 218770117 216711973 215240821 214305867 213862673 213635722 213894503 214152784
3798 214152784 214088892 213823707 213709999 213199580 212757306 212129759 211358973 210925813 210258679
3789 210258679 209626323 209632832 210101216 210855310 212100657 213771746 215677149 217807111 219894976
3780 219894976 221336169 222112885 222181009 221636869 220111739 218265787 215497695 212076937 208250640
3771 208250640 203254110 197553237 191965838 185951159 179860716 174351182 169226480 164501481
3763 164501481 159672446 154527531 149622670 144399026 138832280 132649092 126409375 120414647
3755 120414647 114303364 108251973 102800512 97866572 93448033 89520927 86534367 84112203
3747 84112203 82213776 80596720 79876575 79522579 79407065 79346586 79537460 79890574 80360111
3738 80360111 80501409 80586481 80792046 81058627 81386753 81623698 81589776 82118330 82888673 83650265
3728 83650265 84683698 85531034 86213169 86956621 87407025 87434537 87231251 86684610 86093303
3719 86093303 85369830 84483685 83448739 82284213 81160009 80289587 79798403 79362270 78727720
3710 78727720 78266468 77955867 77705821 77286402 76805654 76162982 75753245 75171560 74687172
3701 74687172 74270697 73758706 73132398 72922841 72669432 72363889 72034604 72090922 72177351 72467446
3691 72467446 72818957 73265027 73833470 74450078 75076900 75755713 76188132 76801638 77689849
3682 77689849 78528686 79140729 79884485 80514474 81448147 82618048 83683828 85031859 86728815
3673 86728815 88495160 90556487 92857753 95237891 97878222 100748973 104087349 107939554
3665 107939554 112214131 117022587 121972775 127824921 134372683 141685726 150276171 159894046
3657 159894046 171227683 184954119 200770212 219341742 241554317 266587372 294859256
3650 294859256 325419616 356315050 386114286 413241430 435230011 451125016 460682846
3643 460682846 464369980 463006336 458699449 453641419 449009523 446005044 445300718 446029096
3635 446029096 447851423 449718507 449521762 445544221 436602763 421627041 400563763 374769589
3627 374769589 345783299 315078530 284740042 256301789 230655385 208007734 188329027
3620 188329027 171301432 156512297 144208333 133418521 123984520 115896369 108949299
3613 108949299 102817456 97428538 92661960 88440519 84894977 81697772 78891912 75993007
3605 75993007 73362494 71105178 69100566 67096240 65276938 63616639 62212800 61006889
3597 61006889 59805314 58817935 57863548 56878709 55992401 55173746 54578394 54059761 53430103
3588 53430103 52946026 52702366 52456615 52097532 51647630 51367156 51191354 51066435 50972128 50692827
3578 50692827 50542721 50501351 50080190 49958380 50117529 49753374 49670232 49808156 49742674 49731814
3568 49731814 49833420 49969347 50050550 50210499 50285840 50505721 50906806 51363399 51592854 52120554
3558 52120554 52932827 53403681 53687174 54234979 54894622 55662216 56532723 57206599 58128959
3549 58128959 58880434 59187153 59559349 60277560 60910565 61728434 62353441 62900477 63780397
3540 63780397 64839019 65718591 66638339 67462453 68298477 69376034 70450731 71669894 72900337
3531 72900337 74167142 75563178 76983549 78541682 80203370 82128059 84131888 86175676
3523 86175676 88514788 90731562 93081719 95867094 98792418 102333273 106026976 109750531
3515 109750531 113588946 117791520 122289641 127324029 133090827 139304229 146297873 154352335
3507 154352335 163240262 172834900 182821771 193214980 203534563 213208816 221028114 225908779
3499 225908779 227519556 224957794 217897502 207975876 196813482 185855120 175669446 166414898
3491 166414898 158219373 151583861 146180960 141618290 138107344 135606502 134156818 133559480
3483 133559480 134347845 137251954 142424630 147294057 147647951 141274231 131744021 123039327
3475 123039327 116548072 111920063 109114895 107482392 106628406 105799118 104076182 100901374
3467 100901374 97019045 92678595 88642693 85388287 82691257 80486550 78021792 75380701
3459 75380701 73224804 71206562 69283915 67518327 65991342 64535905 63336068 62160534
3451 62160534 61020159 60314107 59552490 58645928 58030468 57673453 57136191 56996842 57697320
3442 57697320 58524238 59916683 62465918 65585015 68787975 71132939 70303778 66639583
3434 66639583 62123834 58086739 55016656 52963046 51140762 49165619 47564747 46694965
3426 46694965 45767310 44885851 44673347 44717114 45079539 45483228 46144649 46863998 47083983 46083992
3416 46083992 44843328 43746995 43135762 42644993 42217366 42262297 42699477 43071550 43724771
3407 43724771 45088976 46675373 48117704 48596058 47534049 45792990 44133815 43013433
3399 43013433 41892374 40959514 40511054 41144125 42366234 44664189 47592849 50122733 50312123
3390 50312123 47985521 44362412 41045117 38718538 36991059 35770410 34930716 34292735
3382 34292735 33882082 33380616 32801363 32425006 32246442 32245030 32070406 32129018 32534238 32944884
3372 32944884 33129866 33238886 33050565 33205605 34159707 35234523 36837937 39595618 41185770
3363 41185770 40131673 37646478 35297713 33794660 32996200 31982292 31432636 30742904 30205675
3354 30205675 30013745 29798387 29474776 29537500 29547800 29304220 29216105 29194416 29148090 29119091
3344 29119091 28930695 28892600 28833156 28582530 28257512 28098348 28017118 27956241 27909395 27410143
3334 27410143 27249366 27325564 27204774 27243958 26874900 26733600 26545452 26389675 26265240 26155542
3324 26155542 26152425 25990037 25892153 25992941 26123214 26085676 26163979 26018979 25956362 26063922
3314 26063922 25947546 25913344 26058611 25930433 25781970 25905500 26237495 26193451 26060889 26087652
3304 26087652 26107537 26102919 26050708 25926596 26146758 26119219 25946681 26075046 26052568 26011519 26227139
3293 26227139 25905418 25690122 25971694 25981170 26000951 26136848 26141307 26272063 26400180 26483142
3283 26483142 26497110 26310812 26344550 26575297 26737048 26808065 26752613 26810946 27145554 27341031
3273 27341031 27109322 27362563 27546602 27643722 27773894 27554248 27834918 28114835 28058767 27641201
3263 27641201 27688859 28127733 28328411 28381221 28200684 28479534 28676990 28676153 28677600 28699740 28974934
3252 28974934 29193786 28908219 28793192 29136092 29221285 29396584 29581328 29825580 30038139 30158149
3242 30158149 30233146 30453051 30810606 31100495 31312785 31367331 31391656 31470711 31395010 31195090
3232 31195090 31113397 31145263 31121010 31313201 31538288 31706509 31863972 31989831 32181446 32119152
3222 32119152 31921470 31623168 31406090 31427775 31507308 31526371 31459158 31836363 32153861 32301518
3212 32301518 32632230 32997483 33367874 33956375 34409298 35033265 35772812 36172528 36565673
3203 36565673 36755047 36768892 37028015 37472357 37721896 38296815 38760865 39456712 40657176
3194 40657176 41710502 42805454 43877319 44727881 45628470 46157653 46344624 46716059 47055138
3185 47055138 47003017 47027524 47085963 47419991 47561814 47440086 47699123 48226572 48821014 49468903
3175 49468903 50022418 50868371 52217884 53125622 53785321 54995820 56582112 58218092 59868693
3166 59868693 61671152 64121781 66985733 69644615 72229765 75007238 77404548 79099122
3158 79099122 79523500 78612607 76848577 74012448 70600447 67657623 65401644 63598447
3150 63598447 62451048 61659088 61492239 61987232 62542701 62887635 63507467 64934894 66418455
3141 66418455 67759463 69098946 70651407 72319727 74032133 75541266 77162147 78540085
3133 78540085 79383709 79383522 78804519 77532191 75860272 74036905 71977885 69547874 66557415
3124 66557415 63454913 60624996 58540478 56809004 55220885 54075936 53436688 52985646
3116 52985646 52736731 52667491 52954823 53337499 53494689 53709685 53666804 53061315 52249655 51529242
3106 51529242 50647683 49456252 47790376 45780215 43761293 41595822 39297768 37109393
3098 37109393 35287194 33551207 31986825 30548559 29145858 28178100 27226523 26216432
3090 26216432 25432422 24745062 24103662 23775052 23100628 22632628 22416816 22178503 21797541
3081 21797541 21216945 20575675 20113807 19387908 18662442 18304920 17563217 17179093 16666651
3072 16666651 16124262 15849397 15588041 14991049 14583931 14122494 13652454 13319751 12946107
3063 12946107 12452365 12348853 12140359 11872644 11565152 11338739 11144621 10728804 10372905
3054 10372905 10209140 10070775 10151735 10317184 10011504 9736962 9581872 9597043 9515387 9287479
3044 9287479 8892075 8916684 9046357 8908809 8743680 8630204 8643684 8302933 7891517 7501120
3034 7501120 7333904 7280580 7135102 7038472 7080391 6942223 6819347 6630677 6450652 6449460
3024 6449460 6263203 5956058 5824117 6027209 6073833 6062767 5821803 5665196 5657826 5518317
3014 5518317 5455923 5658420 5401644 5448538 5528450 5405328 5235439 4821147 4488378 4562771
3004 4562771 4424072 4370809 4359873 4171629 4244428 4428199 4272835 4076184 3842437 3774904
2994 3774904 3886818 3564620 3516892 3812797 3699576 3586654 3399262 3306420 3513980 3154017
2984 3154017 3098674 3363895 3270696 3060812 3189519 3185858 3153301 3013618 2822210 2672086
2974 2672086 2801769 2744095 2581482 2741292 2825153 2790783 2708849 2524136 2478808 2583133
2964 2583133 2423571 2426839 2502469 2425718 2602860 2518627 2504226 2606180 2503477 2335367 2220164
2953 2220164 2194270 2304018 2421786 2318799 2286809 2278160 2176786 1966497 1821412 2002062
2943 2002062 2094694 2124346 2036460 1921673 2050214 2054631 1912755 1869389 1943319 2030607 2009526
2932 2009526 1919764 1978156 1917968 1906090 1930502 1719198 1809696 1738579 1695299 1801786 1761116
2921 1761116 1595658 1663356 1672648 1666385 1758413 1698722 1744018 1692694 1643516 1670374 1826440
2910 1826440 1691900 1505772 1521160 1858148 1810750 1514058 1317028 1401533 1587947 1657510
2900 1657510 1591573 1411632 1535198 1723604 1613221 1473340 1448758 1568616 1776356 1645507
2890 1645507 1534205 1561923 1524775 1400875 1254099 1152702 1364104 1491003 1336590 1494954
2880 1494954 1460498 1502029 1543695 1384622 1233512 1300195 1337770 1493093 1448591 1380332 1470965
2869 1470965 1453372 1215631 1190052 1117118 1118011 1193735 1093174 1050232 1075224 1239295 1229946
2858 1229946 1175816 1203947 1277483 1142371 1094292 1132481 1199079 1295885 1308689 1352672 1343788
2847 1343788 1343703 1237259 1185678 1112968 1014175 1081551 1152090 1180710 1266073 987739 979016 1046661
2835 1046661 966724 929491 916308 943356 1048456 1186699 935448 888886 952114 884472 793407
2824 793407 850453 757969 774210 847265 915562 873172 987731 931340 930167 751593 764817
2813 764817 897284 884162 702508 712180 773183 796415 670087 573249 649280 827943 761871
2802 761871 498972 427732 622634 659171 543705 532304 652974 543109 552782 574116 637959
2791 637959 594435 545603 569026 601678 499703 732816 740798 544487 450624 478391 524049
2780 524049 578482 472225 395749 520655 715674 793890 714224 574954 405868 412329 296527
2769 296527 359104 379561 461334 500428 626991 478417 291500 232833 421437 333514 443505
2758 443505 559450 627452 563177 575179 360663 219475 202472 224508 165806 298766 226453
2747 226453 328099 443865 503352 326389 237024 205803 291994 265879 305176 250637 388237
2736 388237 444466 447112 256352 260066 366642 371716 258142 365652 598443 436135 317517
2725 317517 222202 150486 180952 91143 -59894 166412 354943 603053 481406 260794
2715 260794 313449 422418 379113 251453 27537 264318 523109 321181 100976 120358
2705 120358 167092 172097 2171 34592 244971 278169 150485 109238 79743 23898 -88749
2694 -88749 -69825 -60595 252491 213986 123594 245659 96889 152520 262365 50847 -12809
2683 -12809 58672 349792 146275 29667 -9187 -31968 1178 158025 95589 60773 63388
2672 63388 140437 9313 -25558 -79374 -47508 103242 54527 123380 160616 177416 236874
2661 236874 140494 -1213 267720 399428 262184 209070 195208 60053 44986 -40905 -196842
2650 -196842 -143908 -3870 49861 316496 248997 28876 9728 -32458 -174739 -179606 -20001
2639 -20001 68059 13274 170105 -6582 46618 -84439 -242239 -79529 65293 -4684 21283
2628 21283 177645 251342 183500 -87188 -363587 -209142 144641 93878 -160292 -99500 152064
2617 152064 274930 235690 -111120 -374183 -280400 -191935 5521 116484 -54849 2432
2607 2432 72051 -85001 -229489 -320861 -248190 167422 96244 -45949 77909 119713 -16490
2596 -16490 59598 -84490 -191833 -225605 -253633 -96963 238557 84990 52549 -55743 -106969
2585 -106969 126231 -89040 -370575 -273970 -141199 -146156 -301840 -452870 -223197 -45972
2575 -45972 41488 -151829 -386098 -152387 7515 -265622 -84582 -116416 -221598 -42488
2565 -42488 -65364 -269975 -121427 -166589 -117363 -68107 -99959 -69787 -59225 -151021 -199815
2554 -199815 -164246 -131361 -205671 -101212 -25799 -81590 -100151 -253932 -160778 -17231 3667
2543 3667 -84396 -225745 -223709 -137563 -49598 -101949 -277359 -308447 18678 -76642 -250596
2532 -250596 -208627 68527 124755 -81593 -292172 -344070 -284181 -238166 -247258 -308167 190992
2521 190992 188375 20279 -8411 -15236 61942 -32952 -65201 143582 46948 -49792 -219792
2510 -219792 -266163 -108168 -99736 -423912 -321243 -210818 -292024 79891 149518 114612 64556
2499 64556 -158144 -103249 -224279 -219354 -44982 -106658 -171770 42655 -37239 -182706 -34410
2488 -34410 4900 34183 -31998 -80272 -128803 16719 -77006 -104992 -57541 396 88096 -140141
2476 -140141 -143704 119271 178117 -81431 9608 168515 -87480 -119537 -179459 -104120 87361
2465 87361 6697 -99917 -105668 -116854 -174605 -220276 21348 143615 -100900 -50172 20656
2454 20656 -225570 -76271 11828 70073 115004 196454 -62143 -161907 77100 176905 84697
2443 84697 -59200 97034 102844 193624 277637 -94325 -133151 202729 283717 60881 14622
2432 14622 203388 145754 59143 23064 127068 61806 91232 -143399 -118807 -53172 120024
2421 120024 28369 106210 339833 207330 -107759 -43480 -45650 -76210 6340 95742 221879
2410 221879 348302 416582 237505 268416 457406 356918 326288 464687 460601 437847 556477
2399 556477 590181 747404 642955 527496 579695 460704 686308 802229 767077 706881
2389 706881 894524 972533 1011544 1103600 909558 819274 1032715 1201359 1385221 1467023 1773166
2378 1773166 1861977 1995136 2025352 2005179 1900555 2019715 2093018 2267700 2769864 3292191
2368 3292191 3822234 4621134 5586457 7215088 9535676 13096242 17368529 18227330 15551555
2359 15551555 12068846 8886058 6868028 5638810 4548491 3512759 2914877 2559146
2351 2559146 2256329 1990609 1989759 1919276 1790849 1644775 1310090 934237 773792 797171
2341 797171 711600 881411 943703 873530 852506 874458 539609 327764 380885 427585 410465
2330 410465 264843 589166 866363 538214 256939 225171 172633 74117 -73361 -159372
2320 -159372 168540 377023 239970 -15630 68249 228575 33873 -39570 105929 -4721
2310 -4721 126717 280334 114328 151942 80217 -214980 -21341 -91188 -123850 -41316 -122255
2299 -122255 -2460 60667 6345 192950 146606 -135868 93919 93148 -367329 -277288 20334
2288 20334 193587 34459 17694 86395 21042 -5153 -111721 -59399 -11842 97118 104384
2277 104384 115009 181941 213065 145994 191048 81867 -195399 -232723 -66482 -46996 -148713
2266 -148713 -169391 -67255 -94962 -110724 -94860 -277380 -92511 34170 -64534 -57438 89507
2255 89507 76743 -60274 -52937 2791 6641 -135991 -260113 -146874 -15356 -10057 10690
2244 10690 -38635 -86319 14109 34572 -246566 -285302 21989 39862 -164311 -266108 -49979
2233 -49979 357702 134240 -20929 -121880 1340 -12963 -61770 -173963 -102538 30064
2223 30064 103209 2155 -148915 -144307 -135419 -27555 68871 -79946 -151755 -189902 -114035
2212 -114035 -39157 -147335 -174069 -316501 -184115 -65635 -147490 -315002 -19667 17181
2202 17181 -47494 -9672 -184072 -198875 -235893 -91459 -218720 -283008 -148070 -225326 -56577
2191 -56577 79219 -14729 -139850 80228 67587 -56515 -248270 -443521 -434710 -59873 116246
2180 116246 7053 -56772 -76861 125936 101827 -60657 89856 -69227 -181013 85858
2170 85858 92647 -214987 -383117 -294864 -70493 -54897 -84636 -129108 30135 192144 -88683
2159 -88683 -266530 -180318 -13875 -126711 -269640 -213187 -118729 -122282 -104289 -268899 -204036
2148 -204036 -83723 -195730 -192906 -117819 -31522 -192258 -248530 -140812 -55598 -198772 -440558
2137 -440558 -300388 -140041 12591 50106 -215687 -174609 124801 -117437 -349649 -231079
2127 -231079 -179605 81676 58078 -44502 -164581 -100973 -113186 -112823 -45020 -2628 -116398
2116 -116398 84578 261350 99883 -151131 -411459 -240080 -159237 -223246 -133035 -35899
2106 -35899 21570 -11620 -10573 52765 20683 -254483 -266319 -93060 -66189 29524 -161055
2095 -161055 -78734 84848 -100156 -310741 -164554 -120788 -31343 50571 62734 68829 53076
2084 53076 -43281 -192983 -231800 -175749 -156782 83373 -4373 17309 118560 117737 61122 -139976
2072 -139976 -256095 -156128 -225043 -135168 131012 163006 45940 54682 -128489 -222190 -222273 -101548
2060 -101548 -108794 -60956 -192758 -190710 -37603 29923 -212759 -99741 123858 119805 86989
2049 86989 82424 -41884 -103117 -188281 -145692 -126584 -163352 -108766 -107611 19346 -90079 36009
2037 36009 -15021 -247257 -292576 -139365 -151656 -80979 -131818 -285355 -124558 -81237 -274703
2026 -274703 -26354 38236 21102 41021 32613 -205843 -133528 -42337 46073 -76726 -87434
2015 -87434 -54585 94101 86327 -11860 -76965 -72423 -136288 -92230 -246065 -158693 -76816 -90245
2003 -90245 -66021 -76427 -245157 -95633 -234896 -110897 50189 -55782 -103025 -44743 -8985
1992 -8985 -145325 -307942 -183703 -71366 -64685 61808 83756 -33293 -25809 -207202 -168699
1981 -168699 49195 -30810 -90678 -227013 -146551 -152684 -46333 -79451 -70361 -81795 -1341
1970 -1341 -77920 143405 145519 147962 -30432 -132433 -121917 -117957 -171988 57484 56960 7406
1958 7406 26794 -112940 -34806 131702 -44701 17854 28182 -93695 30946 -165750 -151017
1947 -151017 -22341 -148307 -214131 -286793 -240304 -179030 1933 -31044 -90551 -309 148719
1936 148719 -127849 -328269 -261974 -230354 -213875 -113708 29021 119025 -19427 -122128
1926 -122128 21723 45508 109058 15850 -158176 -126387 -108017 -23237 141093 11267 40628
1915 40628 -26503 -37086 58450 -70049 -128100 38065 1362 44745 -13489 -103776 -54253
1904 -54253 60263 -93005 -158799 -174539 -131687 -85524 -264142 -239101 -69651 -49898 -23574
1893 -23574 14158 58522 13726 -106193 -261732 -178270 95751 -63781 -219575 -117887 -66972
1882 -66972 -6406 -62022 -330638 -292326 -57438 -51219 -194085 -116567 -100190 -9531 158568
1871 158568 -117903 -328840 -255831 -29637 -87958 -61765 53832 -43957 89299 11993 39169
1860 39169 65590 -132609 -85241 85793 64798 68811 122243 3662 -82263 -82368 -262496 -243209
1848 -243209 -102333 -20272 46861 135607 966 -121055 -61990 34046 29393 -26375 -138431
1837 -138431 -104887 -29062 25607 8530 -80858 -139390 -97871 -126915 -309586 -249927 -66542
1826 -66542 12562 143034 15953 -127774 99726 179978 82528 68013 -9573 -126000 -151389
1815 -151389 -188683 -16907 -48358 -70033 -122687 -59575 124113 -111055 -328617 -143093 -135005
1804 -135005 -86299 25392 -118389 -111421 -13114 -77440 21523 78920 -23379 -70705 -9038
1793 -9038 22839 246539 44874 1379 123895 -40089 -277023 -153371 -66475 -96076 -69602
1782 -69602 -63294 -87162 -24005 -42193 -190969 -83535 134660 55236 16665 23951 78226 61062
1770 61062 -32692 -104036 -40817 47653 -34101 -170342 -157601 39375 99032 -103084 -204663
1759 -204663 -81584 -49260 -11955 -84910 -192285 -44317 125778 -121444 -127323 54938 107905
1748 107905 95386 109131 -77847 -85974 82852 116431 -288201 -268140 6524 6583 17513 -19750
1736 -19750 -36371 -53594 -189144 -82536 18279 -106256 -53042 -37789 -87795 63935 8026
1725 8026 -160760 -22747 6056 86391 243329 11109 -71193 -54855 48359 110644 -83289
1714 -83289 -394361 -67240 150644 28174 -235353 -141530 -77367 104161 119784 -32748
1704 -32748 61654 115192 12367 26921 214509 46264 33544 31315 -49838 26228 87340
1693 87340 16870 -97491 -64392 142293 -141384 -154254 -124397 -85310 -16219 -147657 -397537
1682 -397537 -173555 260573 195679 178198 -22680 53664 148992 -37278 -40213 66554 -17588
1671 -17588 181070 202187 -84657 -85196 -156413 -251658 -159709 -46841 -52379 136992 202480 210563
1659 210563 -34309 -231777 -228390 -357030 -196356 145846 73773 108204 21433 72237 -39851
1648 -39851 -40885 -51770 -172409 -63154 196671 242823 62132 164657 -89573 -263847 -160444
1637 -160444 -216144 -121534 179014 286551 241759 186676 271798 138620 -34472 -121717 -58404
1626 -58404 -77194 -106739 -47437 -115412 -32588 -111364 -182922 -121234 15462 -43428 -174490
1615 -174490 -19213 215749 -120178 -274427 -26479 110465 -90769 -19414 -23501 -15471 248649
1604 248649 123424 -15859 35631 -103591 -84006 -97437 -127591 1589 -191477 -16328
1594 -16328 57681 -166127 -141975 77680 -41736 154186 141841 -126434 83949 302828
1584 302828 313428 120586 -58015 -4413 158581 162521 113689 -69359 -13843 185604 -127272
1573 -127272 -81760 -23679 25925 175118 -51101 -217580 79204 -1597 -51639 78004 162261
1562 162261 129307 67821 76706 106437 112528 -15330 -96128 -77000 193935 -2293 21393
1551 21393 32887 -17966 74623 153697 -112253 -204917 -47143 10614 118090 15686 28449
1540 28449 -68982 -26937 71442 122773 -100119 7549 254535 340672 335887 53258 -194959
1529 -194959 -124332 95726 19644 -35443 -90207 -61783 98353 155235 -50137 -147783 -255498
1518 -255498 -114851 -111847 -14131 137773 62111 63918 -12678 -164828 -107028 -146514 -123575
1507 -123575 258193 122076 -56042 93377 -7739 120025 141896 -73867 157294 283348
1497 283348 186021 48998 88195 -65108 -192181 -179230 -49179 -53015 -159301 -99849 -84149
1486 -84149 182980 -65724 -229357 -120591 32325 -43457 -84625 -1210 206720 195020 -98050
1475 -98050 62790 80440 18009 114206 -72373 82345 221942 -50 -63494 103571 17169
1464 17169 24982 -42001 -321805 -138296 -33299 159851 57783 42460 97258 177620 -120864
1453 -120864 -229192 -254921 -27388 2304 -137734 51581 162140 133848 84663 -24942
1443 -24942 -72275 68296 93488 101946 332998 244695 151293 211933 183401 -61824 -111274
1432 -111274 -238408 -168525 73130 57575 70497 115571 -109183 -88017 -40676 -8896 -78051
1421 -78051 20121 74520 54465 36535 15901 48072 -129004 -279688 -69626 120570 80962
1410 80962 119399 234185 208393 34976 -16604 -244653 -34487 73733 -79582 -120452 166763
1399 166763 165058 168355 24775 78562 149601 92926 -137076 -49320 1067 254760 201588
1388 201588 115807 -114624 81534 186912 52335 -95250 21830 5690 69970 90349
1378 90349 -10319 40295 244159 154068 -21983 117408 173917 91221 -223213 -237154 1643
1367 1643 102841 107070 -133082 -177375 -111619 -26288 -42724 -9919 7749 12753 -14213 -108624
1355 -108624 206360 88675 71481 107937 146996 256762 60252 16005 111373 42371 40734
1344 40734 -38150 -44133 45753 78996 -260389 -38612 10553 72585 185733 130762 -82181
1333 -82181 -21501 7907 72081 -145973 -22450 -21939 20225 131507 48236 84231 117260 -9466
1321 -9466 -143033 174543 333257 277573 133849 -52798 5469 -9856 -20844 -92079 -150022
1310 -150022 -118892 172439 116867 26179 66641 32948 -18986 43877 -25043 -111828 54578
1299 54578 137870 195993 291771 156227 59124 -2581 57988 114319 47390 46483 -13497 26722
1287 26722 74380 20774 -182638 -49490 -24856 -37945 125246 87882 95641 88774 44550 219856
1275 219856 43806 -80052 119085 157409 -18240 137146 5164 139344 253448 287481
1265 287481 137174 167171 228876 -67583 -319021 -103586 -69648 -236462 -216072 14870
1255 14870 -43780 145119 149850 81752 49034 89119 149810 128158 107422 -113272 -133079 98705
1243 98705 173972 -93776 -202099 -107482 -110435 -218009 7916 221773 286054 252913 174685
1232 174685 52705 -35980 -173763 -126712 -16746 214088 280596 164514 62655 237056
1222 237056 107201 97266 268091 -73991 -123217 56822 199297 290770 29862 5073 63116
1211 63116 107096 206594 17279 68953 237520 27243 108268 176176 -150875 -149173 85718
1200 85718 -42240 -157545 -287019 -167549 161039 230074 105636 226098 252791 193341
1190 193341 -53221 -329141 -187009 64618 18282 207694 292448 19514 28230 165061
1180 165061 121322 -117055 -75137 203213 341945 388182 134505 57392 226742 -8083
1170 -8083 -127533 -79978 57043 52690 196201 200165 296768 273836 15680 -74245 -151759 -95699
1158 -95699 -18742 -51753 -2882 265903 363108 242113 125891 34702 -94089 -57311 -167271
1147 -167271 -183937 77612 230942 91579 -92988 48791 -5440 -63323 -119968 -9997
1137 -9997 34209 143509 217083 222496 143745 -70981 -344474 -219329 -312917 -379089 -121655
1126 -121655 32129 197384 226713 40786 77900 91888 -147685 -77724 13439 38366 4737
1115 4737 7250 216347 248599 82185 -147662 -101475 183473 108310 -146664 -57825 65473
1104 65473 21707 -120244 -147066 -158799 -62169 -67870 -172033 -53114 28427 186034 106500
1093 106500 47543 -25400 -11503 -6784 22159 -33054 -113191 -131583 -157597 -107155 -40297 71335
1081 71335 117706 -24779 191999 31132 6078 -88467 -116894 2026 79938 1988 -143064
1070 -143064 -37250 -50590 -46530 -79947 -50534 67276 56290 269979 345243 167501 -33504
1059 -33504 -1141 -50830 74755 693 -291880 -46369 157730 171112 -124280 -156365 12442
1048 12442 35684 44884 41980 15905 164602 194558 -48008 -27364 -18720 -159517 1849 24003
1036 24003 108448 4464 -53970 -77976 -107330 -107611 8047 -38588 -261343 -36640 21045
1025 21045 157276 155484 -5444 54362 8254 97946 143919 7184 68480 78561 -67665
1014 -67665 39640 173362 32187 -65012 -40340 152339 315398 154475 111880 7227
1004 7227 -68055 -27151 66828 19237 130768 90698 37840 40559 -32370 19782 -91919 -29618
992 -29618 33105 35665 -106102 -156793 47725 130700 165746 104648 -70864 127789 55121
981 55121 -118718 -135738 -21837 140145 212834 293227 205403 108247 51484 46013 -155161
970 -155161 -129066 6696 43322 192274 307686 40325 3656 -68619 -21437 170472 122594
959 122594 32884 211746 267741 169639 91092 35990 -123322 -179097 -128125 101671 172683
948 172683 -9261 62883 -42717 -61001 -131526 -117940 1770 94269 15458 27370 29750
937 29750 -21630 108897 -101600 -169048 32632 63261 188733 274913 120444 -114729 21510
926 21510 -5129 -49100 -49445 -89636 86522 -80407 -214639 -223555 -184949 -70033 -109957 -128019
914 -128019 108528 271711 110755 125466 49588 73920 -67045 -85213 52114 96398 213801
903 213801 192216 134601 76615 -22390 -268735 -48213 61969 -45325 67266 -185106 -214349
892 -214349 -48656 5805 -23892 -236850 18807 281650 104242 -64645 45549 171471
882 171471 211821 59604 -96116 -81203 -83608 35006 18262 -8397 30657 176078 232085
871 232085 96394 145177 -19608 -134811 -21739 42761 -31026 69322 253913 105190
861 105190 186724 69699 -78095 -223212 -103741 123080 73871 39694 -122362 -98621 176009
850 176009 152972 -85411 -110788 -144960 -48131 149118 -180714 -254577 -65910 117651 139480
839 139480 -60946 -152211 -170301 67838 105405 66416 52675 -40005 -18561 -7798 239262
828 239262 191004 -5426 -122006 -96856 -1127 118825 -77281 -66339 254260 152879 -71340
817 -71340 -47030 -126127 66127 216190 97459 11076 180 149676 188701 60334 100715
806 100715 246275 32530 64178 -76247 -153839 -27496 128923 20912 96379 58865 36698
795 36698 130043 172336 64683 5967 -22311 95742 110501 -8350 -176820 -119807 103422
784 103422 72542 -113908 -10241 -35020 -59158 -26603 -55588 11148 -32476 -128248 464
773 464 42393 -7634 -21182 -3919 137422 209560 -10259 30803 27937 -25969 -40060 -22887
761 -22887 -16705 24044 -87543 -86356 31453 -82738 -99485 -3482 -30984 9479 -92421 -164828
749 -164828 72856 44046 -8636 -28475 -139409 -52059 199067 -15057 -90182 -50495 248987
738 248987 473133 165297 -132544 -6878 101348 161022 -146652 -317397 -75136 128887
728 128887 108395 29201 -90920 197597 291394 194039 -180583 -228761 76686 363717 404856
717 404856 134345 -29836 -10463 -132843 -38093 -54039 122002 92832 19603 -34715 49336
706 49336 2837 -153365 -242409 -237740 2343 130226 11234 3431 85158 306582 346676
695 346676 -90582 -279583 237490 324791 -87582 -283038 -85345 216012 58551 -169794
685 -169794 -199583 120206 164117 64449 -120328 -49931 -46422 73518 -8414 -20150 44600
674 44600 -41070 -91546 85645 -25654 228664 130614 -64766 46223 146221 78541 -20777
663 -20777 -144058 -138126 -207344 -124878 -169915 -241370 82927 275448 1410 144264 -5859
652 -5859 -98291 -89948 -10137 -25244 6835 -841 2435 85116 -58465 -35263 -42253 -52548 -121565
639 -121565 -116784 -86155 -96071 77042 21489 117956 144663 -108422 -48143 68413 -38194
628 -38194 83485 57071 -57620 -11077 47431 177759 100390 -15473 -99610 -13905 7363
617 7363 22635 -57705 67823 122837 130402 -133231 -161778 3500 135749 -135749 -169623
606 -169623 -133209 -93113 -212875 75867 52672 -50648 -254504 46795 95972 -8743 -100461
595 -100461 -170274 123026 271411 16406 14870 -127484 -170124 -78618 -173130 39225 207852
584 207852 27683 -18762 -718 -77377 -46003 -12941 -69445 -16786 -12641 25899 -27390 -21390
572 -21390 100981 71628 -7557 -50149 -42802 -159559 9171 107168 21521 27526 -70593 -251147
560 -251147 -205777 -60055 -54043 -118640 105560 100701 -5180 -7747 249157 121737 -19707
549 -19707 -159418 -104295 -38575 43497 -190872 -164972 69619 150751 -179326 -158924 -15241
538 -15241 -74466 -84096 176366 35488 174204 226688 -20793 -87037 29120 -18218 -1917
527 -1917 46949 85909 -85410 -239734 -19170 -27538 -106597 25858 -95184 38698 73388
516 73388 -51135 -48881 57631 91098 -59830 -182380 -163340 -26643 -141008 -27420 19397
505 19397 -94594 -114836 -52199 -53643 36368 75177 -35263 -155818 -47579 5785 -69774
494 -69774 -127435 81695 14645 109130 208627 148510 -52779 -182589 -133364 -46457 63737
483 63737 131594 112247 165948 17444 -152383 -59932 210131 43673 -91953 -217675 -47522
472 -47522 -82781 -283022 -162386 -256142 -186343 -25719 -11872 -174968 -32688 91793 -69475
461 -69475 -26664 75689 57082 -112011 387 -131984 -87486 -21524 -121845 -198464 -140967
450 -140967 144939 158398 -89168 -90267 16452 -188379 -218928 -182649 -263556 20354 -97878
439 -97878 -199647 -61933 -54103 -87349 -93041 -64540 -46521 -16090 51339 57241 23331 -147455
427 -147455 -42239 -125625 -257256 -254362 12700 68759 56105 148644 -192807 -161125 -103041
416 -103041 -205558 -194476 -10454 -242992 -126842 10702 -31245 53041 -62918 -154796 -58438
405 -58438 -166812 -73800 -164360 -16976 -99014 56090 68578 20477 -87747 -39891 79527
394 79527 -13569 37862 186498 239687 266003 -3116 -159977 -38760 -101663 -233805 -138465
383 -138465 29830 3186 54244 57310 51660 126254 -225259 -287094 -29671 -148342 -28814
372 -28814 45574 -110441 -8507 -17908 -136829 -56558 33882 54762 112415 73227 76620 -1217
360 -1217 -162778 14706 -73746 -148051 -46766 -15009 32711 72091 -2570 -33966 -132478 -156424
348 -156424 -210393 -139632 -52134 99168 -24163 16087 -59893 48751 25976 -40498 -134502
337 -134502 -133858 -27246 148761 56208 -34484 66138 -149049 -253565 -89640 -181225 -123671
326 -123671 72985 55372 178316 289276 38655 -76794 -85467 -165889 -53456 -108556 -2263
315 -2263 -93599 -140692 191984 97455 -73786 -19227 -196737 -16074 127964 -92536 -97132
304 -97132 -13593 -94943 9495 -149477 -255927 -15406 92991 43253 11366 -70253 20904
293 20904 114056 13479 -157742 -130052 112846 -95764 -268382 18637 -12884 -166957 -9930
282 -9930 -57700 17849 72822 -148972 -35423 -2179 -26424 -175090 -224672 -173867 12517
271 12517 60104 90907 54562 -14043 -183042 -129249 -170578 -185813 27668 9408 -59010 -10491
259 -10491 -15995 -271838 -146905 -102888 -274188 -270446 -44644 -62357 -33894 -13795 -297428
248 -297428 -119420 55979 -166306 -222256 -147705 -80682 96582 144541 -4744 -96498 -39344
237 -39344 -6280 -211790 -355708 -37859 -40576 25769 150262 25575 97307 30838 9767
226 9767 -70492 -214337 -330208 -148953 -271044 15215 203286 68543 183842 170009 -74980
215 -74980 -101638 -166876 -84504 -89083 -114284 -134553 -9452 40334 32989 -140904 -351373 -154553
203 -154553 -63727 -6592 27613 185940 79020 -53561 -2537 -111901 -286694 -198169 -144269
192 -144269 -115370 88835 154810 16010 137427 224346 99326 -186940 -271041 -231008 -32149
181 -32149 94405 25907 -21868 -111056 37250 217164 40037 -91640 -85271 -160771 -33082
170 -33082 165844 -65368 -154606 -107059 -131447 -198440 -102515 -122160 -159055 -161724 -82751 -114711
158 -114711 -104521 -42739 -58935 -99046 -62112 -91250 -79536 -225179 -3213 3101 -105511
147 -105511 110488 -46493 -157102 1432 -33687 -175459 -100123 -41553 -249473 -160322 61640
136 61640 130588 110161 -76172 -113555 -135271 -37260 -193197 -220690 -168997 -82166 -118459 -219237
124 -219237 -279340 -62562 -89196 -102911 -105679 -85027 -135143 -66229 -33210 -28991 29278 -87157
112 -87157 -319480 -249835 -119585 -95099 -126800 -21994 -6806 82573 89076 -27929 -134743
101 -134743 -67336 -155575 -393148 -304770 -128394 -124943 -61721 -120864 -84036 36691 2804
90 2804 14634 -91356 -97606 -8337 -36751 -132331 -76409 -178340 -90544 -113083 -139050 -38794
78 -38794 -57062 -61622 -68233 19217 56615 -18745 -85798 -126677 -139136 -137871 -25714 -156528
66 -156528 -221826 -84455 28455 -57387 -169533 -121220 -37492 20242 -90687 -295544 -254116
55 -254116 -71629 -145320 -120681 -38661 -69754 85192 -6047 -104321 -94229 1787 -44654 41152
43 41152 -2392 -202578 -123787 -37322 -46594 -141536 -169796 -212428 -246943 -137875 -51725 4502
31 4502 -49296 -83597 -30230 -15291 -167589 -287314 -160412 -22557 -95846 -8696 -73918 -69575
19 -69575 -43195 -131405 -292156 -137366 -154924 -206947 -27696 -142103 -229476 -73734 -43157
8 -43157 -131433 -188251 -146228 3575 25153 -49540 -94597 -93761
0 -93761
$$ Imaginary data points
##PAGE= N=2
##DATA TABLE= (X++(I..I)), XYDATA
16383 -2857534 -2733211 -2600562 -2541346 -2619874 -2581055 -2415978 -2413755 -2392632 -2422866 -2277925 -2115156
16372 -2115156 -2150021 -2108370 -2060945 -2011035 -1939981 -1962951 -1988698 -1729287 -1526668 -1501060 -1378538
16361 -1378538 -1513817 -1671125 -1577610 -1457545 -1396837 -1326981 -1317142 -1080066 -1034294 -1035001 -1013172
16350 -1013172 -886167 -844328 -794168 -821003 -706312 -563412 -557234 -638376 -593540 -509363 -385993
16339 -385993 -524079 -402148 -184891 -198171 -126546 -36858 -81405 -87883 -43120 -178598 -133433
16328 -133433 76007 279355 333658 427968 307762 370785 489822 486648 414609 647536 815977
16317 815977 754334 816748 867453 845941 877275 763742 707946 928681 1123930 1113260 1210638
16306 1210638 1345901 1362127 1175892 1069773 1167538 1303649 1341057 1448753 1496381 1692778
16296 1692778 1766825 1765007 1606252 1740624 1808960 1738477 1559694 1815594 2003293 1998504 2041501
16285 2041501 2082867 1914844 2214445 2347106 2112324 2105699 2284178 2365470 2217819 2226932
16275 2226932 2365640 2485220 2530668 2571462 2522585 2675495 2718194 2655916 2706715 2862871
16265 2862871 2910012 2856740 2804327 2861516 2808663 2821803 2897260 2959533 2966804 3238227 3410198
16254 3410198 3326166 3362419 3499629 3407274 3441052 3413841 3236161 3389918 3592420 3464307
16244 3464307 3456533 3583825 3684797 3700448 3766065 3628731 3639511 3712572 3803214 3802743 3702687
16233 3702687 3646755 3650695 3815757 3972225 3956657 3807590 3907271 3957514 4083259 4175086 4236214
16222 4236214 4028510 3965660 4065926 3949349 3890867 3975047 4198164 4300324 4439334 4321729
16212 4321729 4437001 4458109 4452578 4499575 4394199 4401358 4568420 4349025 4378275 4528549 4488508
16201 4488508 4497378 4423098 4642470 4932083 4965120 4560041 4503761 4611395 4829404 4663054
16191 4663054 4508714 4646431 4884740 5013035 4890535 4814267 4778812 5015231 4979151 4926804
16181 4926804 4726258 4787110 5096040 4943011 4861945 4894482 4904292 4904368 4925997 4908061 5089140
16170 5089140 5332188 5248524 4982146 5152678 5376647 5103912 4867122 4779708 4969570 5340621
16160 5340621 5293585 5068541 5299546 5512977 5511830 5279243 4960907 5114196 5175983 5049749
16150 5049749 4930030 5010088 5293811 5404953 5297840 5284791 5347753 5411151 5301886 5269362
16140 5269362 5500505 5451648 5408631 5387518 5309782 5444174 5488061 5190778 5288061 5674263
16130 5674263 5744617 5616132 5519626 5646537 5737542 5563653 5393755 5321513 5542274 5494335
16120 5494335 5452874 5594151 5562269 5596031 5572204 5387749 5409305 5728167 5550649 5340159
16110 5340159 5660722 5596659 5566735 5689092 5659141 5670581 5697485 5613723 5661878 5770406 5656185
16099 5656185 5744297 5714685 5675940 5541638 5550038 5625499 5707042 5641060 5819921 5939148 5672161
16088 5672161 5610009 5643067 5756868 5821384 5677713 5550108 5525487 5748265 5761970 5440889
16078 5440889 5497760 5788622 5801097 5750322 5767425 5647802 5606787 5610102 5565050 5555357 5674539
16067 5674539 5812978 5762427 5788319 5997914 6058599 5779840 5813936 5853030 5753053 5744339 5646779
16056 5646779 5586661 5818575 6069880 5704660 5626219 5919169 5933836 5876536 6032370 5844713
16046 5844713 5664469 5780981 5780687 5576398 5937551 5927169 5871673 5935275 5883092 5699172 5528504
16035 5528504 5477516 5723795 5894783 5672238 5826260 5925608 6018436 5890160 5561418 5483779
16025 5483779 5493569 5612460 5893667 5950311 5980921 5867924 5777580 5637178 5520742 5384168
16015 5384168 5513340 5620927 5747456 5941676 6014643 5896095 5944252 5866394 5683303 5439754
16005 5439754 5355694 5580857 5893838 6030666 6109413 5943265 5778472 5717291 5647313 5528885
15995 5528885 5660359 5759294 5882579 6070129 5986613 5802965 5598250 5729782 5792316 5697424
15985 5697424 5663337 5706337 5994508 6051136 6091464 5968363 5829722 5669548 5665261 5788153
15975 5788153 5842490 5766976 5688612 5814337 5889640 5862677 5803356 5830909 5837494 5988856 5926157
15964 5926157 5853577 5871205 5884964 5846099 5852978 5716479 5777803 5865353 5932183 5965900 6000417
15953 6000417 5744932 5937316 5971899 5894408 5831814 5916011 5974176 5916244 5780512 5811586 5711401
15942 5711401 5621677 5862312 5943076 5846309 5933529 5724058 5717878 5941795 5781003 5635496
15932 5635496 5669402 5809195 5968374 5922692 5879096 5878858 5859115 5828221 5806634 5624864 5691419
15921 5691419 5779874 5942587 5878906 5756615 5779642 5844084 5739463 5805181 6041146 5979785
15911 5979785 5818572 5783239 5835713 5743307 5719331 5850427 5905801 5970788 5899507 5861327 5958511
15900 5958511 6064835 6069781 5749917 5747175 5845801 5971104 5808380 5899767 5765178 5864786 5864754
15889 5864754 5720221 5811707 5907362 5823701 5957240 5927222 5928814 5924716 5845188 5742970 5860480
15878 5860480 5861063 5879827 5873176 5911679 5886985 5920107 5859294 5831920 5798974 5846443 5797591 5782880
15866 5782880 5769316 5850480 5939968 5886697 5894395 5892745 5989963 6192738 6054792 5901211 5785433
15855 5785433 5912102 6037555 5881377 5627940 5693572 5887130 6024280 5863553 5740064 5928684
15845 5928684 6048189 5887696 5782479 5873710 5995002 5857568 5865081 5973830 5911108 5932836
15835 5932836 5694794 5867045 5915854 5819013 5718587 5758800 5814997 6049204 5913643 5893278
15825 5893278 5831406 5798073 5734547 5868643 5743240 5858731 5978510 5897506 6073075 6049378
15815 6049378 5873064 5866886 5644771 5753692 5951932 5941202 5893727 6063626 6138401 6073711
15805 6073711 5942829 6022688 5937306 5916584 5809511 5833422 5924203 5899190 5985061 5968974 5812331
15794 5812331 5863949 5888651 5676644 5746173 5956455 6098538 6153927 5946002 5837521 5776960
15784 5776960 5761009 5822825 5930090 5911309 5921710 6074106 6146261 6236516 6044400 5949775 5583349
15773 5583349 5448566 5629588 5620277 5657511 5929133 6001712 6064919 6050445 5915447 5682050
15763 5682050 5790935 5987682 5989019 5950980 6057234 5915870 6155523 6233782 5952483 5785551
15753 5785551 5838063 6006293 6278109 6079378 5987920 5981762 5952580 5933769 5929769 5703521 5814936
15742 5814936 5860475 5917922 6150809 6042169 5933058 5939758 6005846 5923897 5717573 5616700
15732 5616700 5641824 5737738 5946215 6082816 5823835 5591525 5707049 5970498 5952292 5731513
15722 5731513 5597910 5893118 6126037 6034627 5816531 5850900 6048245 5973767 5928188 5947613
15712 5947613 6088573 5912966 5954725 6144147 6072346 5800700 5739072 5713491 6018764 6075822
15702 6075822 5886653 5851918 6161163 6301052 6223113 6010559 6016747 5999924 6031466 5971073 5863617
15691 5863617 5787701 5959881 5927474 5961783 5802666 5674793 5727723 5958949 5928994 5909369
15681 5909369 5958928 6054251 6069463 5794290 5766927 5851159 5704003 5761514 6052879 6116880 5984119
15670 5984119 5988797 6008558 5956836 6001646 5886585 5818902 5756871 5671358 6033725 6159117 6062186
15659 6062186 5913845 5934197 6162473 5893479 5681804 5941759 6268132 6146192 6077638 5977130
15649 5977130 6164800 6109554 5917730 5746903 5810319 6076089 6298049 6047557 6078300 6246130
15639 6246130 6257812 6003157 5945091 5898314 5909939 5871193 5991038 5987458 6077655 6225917 6028985
15628 6028985 5862806 6018945 5943262 5916472 5968885 5919720 6193080 6206033 5880782 5916975
15618 5916975 5871201 5937812 5962032 5908073 6018803 6052776 6050320 6012141 5944404 5860983 6028168
15607 6028168 5979028 5924092 5896051 5891882 6036182 6197655 6114209 6024232 5879469 5825918 5908488
15596 5908488 5863633 5629253 5665195 5858920 5919223 5876715 6033236 6135829 6119970 6018285
15586 6018285 5980925 5878448 6021438 6079590 5883796 5832262 6227730 6064781 5847159 5894168
15576 5894168 5795128 5927137 6018992 5933750 6003634 6112873 6033683 6109870 6074650 6065463 6044984
15565 6044984 5767359 5701590 5987397 6056946 5938675 5851360 5950227 5949689 6056301 6181781 6057446
15554 6057446 6095425 6159428 6028304 5966093 5925022 5843490 6012426 6025914 5988382 5897396 5889056
15543 5889056 6077610 6148449 6040290 5890010 5997266 6062102 6071341 5975264 5813154 5886863
15533 5886863 6063903 6011199 5863967 6036864 6035990 5797476 5881427 6006697 6090121 6001349 5914980
15522 5914980 5826986 5905194 6088776 5821898 5808155 6092310 6102146 5995501 5997053 5844371 5979160
15511 5979160 6192696 6005399 5972185 6000908 5749172 5886079 6061588 5961666 5933964 5851073
15501 5851073 6022161 6059852 6008330 6036120 6139880 6092920 6027932 5985148 5975411 6063537 6060575
15490 6060575 6155429 6068388 5963575 5994633 5952217 6053409 6267440 6097078 6046653 6184796
15480 6184796 5937773 5836159 5933183 6012386 5905556 5871032 5999223 6021871 5905865 6069505
15470 6069505 6046959 5909638 6029796 6002047 6000472 6102902 6196758 5988284 5866231 5999073
15460 5999073 5914595 5914975 6012095 5952068 5887969 6104710 6144556 6089781 5906625 5841373 6081700
15449 6081700 6034732 5780926 5551568 5717583 6180428 6233138 5942887 5970361 6055804 6113810
15439 6113810 6073137 5916603 6082409 6183598 6042264 6011144 5962793 6124461 6080681 5886023
15429 5886023 5926624 6078972 6087201 6166347 6199227 6217397 6456480 6322319 6126525 6075517 6097727
15418 6097727 6140777 6009343 6067656 6028633 6020394 6099015 6004231 5934958 6064721 5973696 5989133
15407 5989133 5934914 5942758 6142365 6036755 5973075 6115070 6098645 6034515 5915902 5889519 6033355
15396 6033355 6240439 6156963 6219813 6259141 6145028 6047805 5985162 5855909 5781039 5902462
15386 5902462 6008072 6101457 6145473 6236432 6200837 5986916 5921573 5966017 6005716 6188653 6100707
15375 6100707 6219367 6323811 6063962 6047787 6176057 6063443 6155549 6134326 6074017 6146866
15365 6146866 6122661 6149364 6059161 5959985 6099262 5936112 5972683 6075191 6029107 5857444
15355 5857444 5998728 6138490 6129385 5986860 5977845 5913742 6084873 6062906 6041164 6016373 6164847
15344 6164847 6153918 6090388 5879045 5837822 6030027 6107176 5904017 5900150 6087255 6087298 6134105
15333 6134105 6021848 5932296 6013952 6039141 6099426 6193238 6269592 6449809 6235292 5877593
15323 5877593 6084648 6388118 6400668 6250465 6006206 6265250 6253225 6050258 6065311 6124273
15313 6124273 6180626 6231971 6021220 6141064 6268777 6320758 6328900 6217335 5970939 6264903
15303 6264903 6241033 6166706 6072864 6042749 6124236 6245214 6005675 6020016 5890684 5985990 6176178
15292 6176178 6150887 5974230 6052862 5889227 6052602 6214462 6179389 6163527 6097323 6043562
15282 6043562 6001154 5963185 6041387 6016988 5971021 6193752 6053467 6108008 6314355 6322440 6116665
15271 6116665 6135426 6056234 6142808 6216075 6136761 6182597 6142168 6114031 6206522 6099244 6139284
15260 6139284 6018647 6124932 6172066 6085460 6126242 6219650 6232982 6124710 6136457 6386921
15250 6386921 6298420 6039609 5904254 6050173 6190946 6217129 5933717 6033917 6100723 6291101
15240 6291101 6074699 5825041 6063650 6268136 6127317 6006538 5995143 6234277 6217091 6021223
15230 6021223 6029887 6017125 6039926 6231699 6019628 6104816 6397945 6331264 6230689 6016770
15220 6016770 5941994 6213701 6172128 6001428 6135949 6281288 6445873 6264182 6227274 6383204
15210 6383204 6108226 5997665 6026458 5868718 6084672 6245261 6186474 6151566 6139069 5972188
15200 5972188 6179301 6105123 5874006 5760077 5906332 6149211 6039591 5942427 5956034 6095759
15190 6095759 6097579 5927308 6016595 6215443 6254022 6154244 6192669 6123993 6240226 6099596 5898399
15179 5898399 5906596 6121119 6178431 6183164 6222826 6207666 6126781 6187323 6066651 5912446 6188633
15168 6188633 6303205 6111402 6099684 6153478 6181172 6089006 6053403 6083778 6239054 6306741 6265596
15157 6265596 6126632 6446262 6446785 6238308 6026346 5899180 6068329 6155310 6127818 6252297
15147 6252297 6253547 6141722 6232092 6101406 6065088 6041767 6023857 6306321 6432092 6194802
15137 6194802 6063266 6137794 6086558 5939467 5937251 6031599 6142592 6343938 6551034 6337501
15127 6337501 6271913 6240257 6133726 6013809 6056092 6037113 6089128 6073164 6185377 6372921
15117 6372921 6211835 6309550 6371075 6186420 6208198 6215536 6161163 6043974 6215240 6356639
15107 6356639 6378222 6172773 6152259 5925907 6113612 6350910 6346427 6183192 6115917 6154010
15097 6154010 6376148 6291821 6043444 6069146 6147827 6254150 6058191 6046559 6235342 6343297
15087 6343297 6248270 6201274 6195971 5995050 6066743 6010455 6037819 6109662 6192715 6101641 6032170
15076 6032170 6179711 6139289 6058311 6141695 6218197 6228737 6249899 6248157 6342388 6390625 6279738
15065 6279738 6286862 6274411 6192567 6412533 6376420 6259091 6261336 6268574 6286950 6237476 6266176
15054 6266176 6278900 6221406 6253812 6167754 6079489 6203550 6084483 5894767 6136272 6260085
15044 6260085 6272046 6222708 6170487 6250790 6436257 6147875 5968212 5987270 6068667 6005012 6153215
15033 6153215 6024487 6016657 6139268 6133616 5898947 6042291 6093711 6105530 6167589 6095958 6259212
15022 6259212 6465901 6311102 6190181 6143514 6279068 6247678 6041715 6105041 6392646 6522586
15012 6522586 6578890 6351675 6270525 6394912 6202055 6072709 6156691 6132349 6146582 6293518
15002 6293518 6337086 6505547 6313433 6321520 6190823 6087872 6051815 6088453 6035324 6139490
14992 6139490 6281352 6391756 6418908 6130975 5889221 5852343 5982876 6248292 6219514 6093848
14982 6093848 6413776 6493149 6263580 6164104 5923189 5907611 6113706 6224504 6146886 6345886
14972 6345886 6565387 6358876 6233061 6226976 6134713 6012362 6115835 6041875 6061059 6276779
14962 6276779 6325986 6244892 6182014 6377618 6244437 6030280 5929707 6112230 6408800 6598403
14952 6598403 6444332 6357968 6307945 6256705 6147885 6101563 6211832 6321136 6319954 6485861
14942 6485861 6522934 6369801 6442640 6389404 6211608 6053528 6019051 6264760 6305891 6385054
14932 6385054 6399675 6271151 6203653 6125063 6113771 6198090 6243593 6119124 6393571 6503383
14922 6503383 6445869 6212535 6089123 6219861 6235678 6195580 6225079 6248286 6344443 6535919
14912 6535919 6483740 6429297 6385596 6473046 6558975 6320901 6195680 6190020 6326193 6626445 6407405
14901 6407405 6169742 6338606 6377116 6259231 6178740 6353099 6459341 6387481 6315369 6346892
14891 6346892 6160741 6217326 6136731 5922075 6094237 6218740 6213086 6379749 6562897 6518882
14881 6518882 6386344 6169627 6069741 5997789 6138268 6424935 6288042 6211074 6294789 6425977
14871 6425977 6402739 6293303 6268960 6323392 6385696 6300499 6288768 6277404 6377171 6314722 6231208
14860 6231208 6178385 6339970 6294536 6162788 6456487 6512128 6470243 6587320 6404378 6263727
14850 6263727 6245655 6161269 6193565 6197388 6152868 6294151 6286629 6250661 6194059 6167470 6306094
14839 6306094 6159007 6005992 6140308 6324421 6383981 6262507 6157133 6237650 6201779 6111932
14829 6111932 6234822 6102868 6105517 6353561 6463434 6496845 6229168 6117328 6256562 6266160
14819 6266160 6183741 6165880 6030055 6339310 6419595 6317755 6505441 6613355 6374574 6372647
14809 6372647 6281800 6195329 6249437 6304011 6350997 6396231 6422738 6341278 6204252 6265527 6384169
14798 6384169 6451044 6515359 6394631 6191348 6288683 6491846 6505562 6249996 6139779 6367275
14788 6367275 6321792 6249280 6297680 6368007 6379036 6457918 6401590 6250491 6437967 6410705 6121614
14777 6121614 6263179 6245912 6250723 6338428 6388012 6221933 6247466 6512497 6506917 6206757 6242864
14766 6242864 6458062 6445001 6323106 6292963 6345316 6462198 6377596 6290363 6330013 6406362 6439667
14755 6439667 6397689 6344881 6517759 6560893 6278541 6471470 6601008 6296641 6273667 6415745
$$ [...]
##END NTUPLES=NMR SPECTRUM
##END=
