##TITLE=1H_CG-1191-b1
 CDCl3
 8 sc, 
 15.3.2024
##JCAMPDX= 6.0         $$ Bruker NMR JCAMP-DX V2.0
##DATA TYPE= NMR SPECTRUM
##DATA CLASS= NTUPLES
##ORIGIN= UXNMR, Bruker Analytische Messtechnik GmbH
##OWNER= root
$$ XWIN-NMR		Version 3.5
$$ Fri Mar 15 13:56:21 2024 Russian Standard Time (UT+4h)  she@DPX200
##.OBSERVE FREQUENCY= 200.1313
##.OBSERVE NUCLEUS= ^1H
##.ACQUISITION MODE= SIMULTANEOUS
##.ACQUISITION SCHEME= undefined
##.AVERAGES= 8
##.DIGITISER RES= 18
##SPECTROMETER/DATA SYSTEM= spect
##.PULSE SEQUENCE= zg30
##.SOLVENT NAME= CDCl3
##.SHIFT REFERENCE= (INTERNAL, CDCl3, 0, 15.4703)
##AUDIT TRAIL= $$ (NUMBER, WHEN, WHO, WHERE, WHAT)
$$ ##TITLE= Audit trail, XWIN-NMR		Version 3.5
$$ ##JCAMPDX= 5.01
$$ ##ORIGIN= Bruker BioSpin GmbH
$$ ##OWNER= she
$$ F:/spectra/data/she/nmr/H-F/1/pdata/1/auditp.txt
$$ ##AUDIT TRAIL=  $$ (NUMBER, WHEN, WHO, WHERE, WHAT)
(   1,<2024-03-15 13:52:06.20 +0400>,<she>,<DPX200>,
      <created by zg, POWCHK disabled, PULCHK disabled
       configuration hash MD5:
       00 E9 B6 7A A2 85 ED C7 34 08 36 98 17 FE 4E 26
       data hash MD5: 16K
       44 7D 8B F2 3B 99 D6 02 1C 2D DA 2E B5 A0 BF EF>)
(   2,<2024-03-15 13:53:07.48 +0400>,<she>,<DPX200>,
      <Start of raw data processing
       efp BC_mod = 2 LB = 0.24 FT_mod = 6 PKNL = 1 PHC0 = -25298.81 PHC1 = 5.18731 SI = 16K 
       data hash MD5: 16K
       3F 03 37 66 30 CB 0D 3D CC FD 66 AF AF ED 2C 76>)
(   3,<2024-03-15 13:53:37.10 +0400>,<she>,<DPX200>,
      <pk PHC0 = -3.94441 PHC1 = 5.2 
       data hash MD5: 16K
       C6 29 14 4B 76 D3 3C 5B B6 D4 D3 5A 7F F9 A0 E1>)
(   4,<2024-03-15 13:53:40.54 +0400>,<she>,<DPX200>,
      <abs ABSG = 5 
       data hash MD5: 16K
       F4 20 F9 AD 9B 79 D6 A4 82 5D DB 7E 20 26 AA 94>)
$$ ##END=
$$ 
$$ hash MD5
$$ 7E 8F 0D 7B 0D FB 94 EF 20 47 5E A7 99 CA 56 5F
##$RELAX= 
##$RELAX= 
##$RELAX= 
##$RELAX= 
##$RELAX= 
##$RELAX= 
$$ Bruker specific parameters
$$ --------------------------
##$DU= <F:/spectra>
##$EXPNO= 1
##$NAME= <H-F>
##$PROCNO= 1
##$TYPE= <nmr>
##$USER= <she>
##$AMP= (0..31)
100 100 100 100 100 100 100 100 100 100 100 100 100 100 100 100 100 100 
100 100 100 100 100 100 100 100 100 100 100 100 100 100 
##$AQSEQ= 0
##$AQ_mod= 1
##$AUNM= <au_zg>
##$AUTOPOS= <>
##$BF1= 200.13
##$BF2= 200.13
##$BF3= 200.13
##$BF4= 200.13
##$BF5= 200.13
##$BF6= 200.13
##$BF7= 200.13
##$BF8= 200.13
##$BYTORDA= 1
##$CFDGTYP= 0
##$CFRGTYP= 5
##$CHEMSTR= <none>
##$CNST= (0..31)
1 1 145 1 1 1 1 1 1 1 1 1 1 1 1 1 1 1 1 1 1 1 1 1 1 1 1 1 1 1 1 1 
##$CPDPRG= <>
##$CPDPRG1= <>
##$CPDPRG2= <>
##$CPDPRG3= <>
##$CPDPRG4= <mlev>
##$CPDPRG5= <mlev>
##$CPDPRG6= <mlev>
##$CPDPRG7= <mlev>
##$CPDPRG8= <mlev>
##$CPDPRGB= <>
##$CPDPRGT= <>
##$D= (0..31)
0 1.2 0 0 0 0 0 0 0 0.06 0 0.03 0 0 0 0 0.0002 0 0 0 0 0 0 0 0 0 0 0 0 
0 0 0 
##$DATE= 1710496325
##$DBL= (0..7)
120 120 120 120 120 120 120 120 
##$DBP= (0..7)
150 150 150 150 150 150 150 150 
##$DBP07= 0
##$DBPNAM0= <>
##$DBPNAM1= <>
##$DBPNAM2= <>
##$DBPNAM3= <>
##$DBPNAM4= <>
$$ [...]
##$SUBNAM3= <"">
##$SUBNAM4= <"">
##$SUBNAM5= <"">
##$SUBNAM6= <"">
##$SUBNAM7= <"">
##$SUBNAM8= <"">
##$SUBNAM9= <"">
##$SW= 18.0517328524113
##$SWIBOX= (0..15)
0 0 2 0 0 0 0 0 0 0 0 0 0 0 0 0 
##$SW_h= 3612.71676300578
##$TD= 16384
##$TD0= 1
##$TE= 0
##$TE2= 300
##$TE3= 300
##$TEG= 300
##$TL= (0..7)
0 120 120 120 120 120 120 120 
##$TP= (0..7)
150 150 150 150 150 150 150 150 
##$TP07= 0
##$TPNAME0= <>
##$TPNAME1= <>
##$TPNAME2= <>
##$TPNAME3= <>
##$TPNAME4= <>
##$TPNAME5= <>
##$TPNAME6= <>
##$TPNAME7= <>
##$TPOAL= (0..7)
0.5 0.5 0.5 0.5 0.5 0.5 0.5 0.5 
##$TPOFFS= (0..7)
0 0 0 0 0 0 0 0 
##$TUNHIN= 0
##$TUNHOUT= 0
##$TUNXOUT= 0
##$USERA1= <user>
##$USERA2= <user>
##$USERA3= <user>
##$USERA4= <user>
##$USERA5= <user>
##$V9= 5
##$VALIST= <valist>
##$VCLIST= <CCCCCCCCCCCCCCC>
##$VD= 0
##$VDLIST= <DDDDDDDDDDDDDDD>
##$VPLIST= <PPPPPPPPPPPPPPP>
##$VTLIST= <TTTTTTTTTTTTTTT>
##$WBST= 1024
##$WBSW= 4
##$XGAIN= (0..3)
0 0 0 0 
##$XL= 0
##$YL= 0
##$YMAX_a= 860190
##$YMIN_a= -1016087
##$ZGOPTNS= <>
##$ZL1= 120
##$ZL2= 120
##$ZL3= 120
##$ZL4= 120
##$ABSF1= 15.53204
##$ABSF2= -2.51981
##$ABSG= 5
##$ABSL= 3
##$ALPHA= 0
##$AQORDER= 0
##$ASSFAC= 0
##$ASSFACI= 0
##$ASSFACX= 0
##$ASSWID= 0
##$AUNMP= <proc_1d>
##$AZFE= 0.1
##$AZFW= 0.1
##$BCFW= 0
##$BC_mod= 2
##$BYTORDP= 0
##$COROFFS= 0
##$CY= -3
##$DATMOD= 1
##$DC= 0
##$DFILT= <>
##$DTYPP= 0
##$F1P= 0
##$F2P= 0
##$FCOR= 1
##$FTSIZE= 16384
##$FT_mod= 6
##$GAMMA= 0
##$GB= 0
##$INTBC= 1
##$INTSCL= 3.70164e-10
##$ISEN= 128
##$LB= 0.24
##$LEV0= 0
##$LPBIN= 0
##$MAXI= 10000
##$MC2= 0
##$MEAN= 0
##$ME_mod= 0
##$MI= 1.114404
##$NCOEF= 0
##$NC_proc= -5
##$NLEV= 6
##$NOISF1= 3.799351
##$NOISF2= 2.8
##$NSP= 0
##$NTH_PI= 0
##$NZP= 0
##$OFFSET= 15.47034
##$PC= 1
##$PHC0= -25302.76
##$PHC1= 10.38731
##$PH_mod= 1
##$PKNL= yes
##$PPARMOD= 0
##$PSCAL= 0
##$PSIGN= 0
##$REVERSE= no
##$SF= 200.130010279208
##$SI= 16384
##$SIGF1= 3
##$SIGF2= 2
##$SINO= 5.538805
##$SIOLD= 16384
##$SREGLST= <1H.CDCl3>
##$SSB= 0
##$STSI= 16384
##$STSR= 0
##$SW_p= 3612.71676300578
##$SYMM= 0
##$S_DEV= 0
##$TDeff= 16384
##$TDoff= 0
##$TI= <>
##$TILT= no
##$TM1= 0
##$TM2= 0
##$TOPLEV= 0
##$USERP1= <user>
##$USERP2= <user>
##$USERP3= <user>
##$USERP4= <user>
##$USERP5= <user>
##$WDW= 1
##$XDIM= 16384
##$YMAX_p= 333647970
##$YMIN_p= -196381
$$ End of Bruker specific parameters
$$ ---------------------------------
##NTUPLES= NMR SPECTRUM
##VAR_NAME=  FREQUENCY,     SPECTRUM/REAL,   SPECTRUM/IMAG
##SYMBOL=    X,             R,               I
##VAR_TYPE=  INDEPENDENT,   DEPENDENT,       DEPENDENT
##VAR_FORM=  AFFN,          ASDF,            ASDF
##VAR_DIM=   16384,         16384,           16384
##UNITS=     HZ,            ARBITRARY UNITS, ARBITRARY UNITS
##FACTOR=    0.220516191357247, 1,           1
##FIRST=     3096.07925821069, 0,            0
##LAST=      -516.637504795089, 0,           0
##MIN=       -516.637504795089, -196381,     0
##MAX=       3096.07925821069, 333647970,    0
$$ Real data points
##PAGE= N=1
##DATA TABLE= (X++(R..R)), XYDATA
$$ [...]
8254C02734n05O7387K2220O326M2848O772J3202k0197j7829k5255j5076J2243
8242C94870k5875n5519K6678m1840p964l6237m3524M3822L3830l9323l5873J7155
8230B30200J3604N0104k7055k6855J8798j066K4855j1592j0457J727L4345k3829
8218B72779J3112K372L3106L0727j2161l8812J0918O6635N8957L7753k7848k1128
8206D26410K2167k0909n4383N476K7460o47j4572N1614q817q0481m633R7573j8605
8193D27653J48931j91535k34421J14366J0936M2305n606K7889N9748L3202k1516
8182D11952M7614l0236k3427j4804R669J8913l9583p270L2700k2994k9282l825
8170C49427N0495l7066m4192L5014L957N7482m8428K8495J2566J1837L7650L3057
$$ plain form
8254 302734 302229 369616 391836 398162 441010 447782 460984 440787 422958 397703 382627 394870
8242 394870 368995 313476 340154 298314 290350 254113 210589 254411 288241 248918 213045 230200
8230 230200 243804 293908 266853 239998 258796 257730 282585 270993 260536 262263 296608 272779
8218 272779 285891 288263 321369 352096 339935 301123 312041 378676 437633 475386 447538 426410
8206 426410 448577 427668 373285 378761 406221 405574 391002 442616 433799 353318 348685 446258 427653
8193 427653 576584 385049 150628 264994 275930 318235 312629 340518 400266 433468 411952
8182 411952 459566 429330 405903 391099 400768 419681 380098 372828 405528 382534 353252 349427
8170 349427 399922 362856 318664 353678 357635 415117 366689 395184 407750 419587 457237 490294
8158D90294K199J0834J3891M93l226N5671J5695Q657K6711N2523o672l8496r43
8145F27631l1537l7741j6098n8260j5154K1270j9250L5509p1481K498J6872m1600
8133D12659k6257K4892l0042k7574k1932M6950L4278m9428m0170M3239K1701K829
8121C91145K8654J9184L3923J4157M0187j9702j26786l2518r642m6739m2005K131
8109B51989o020l5542l68l2894K3288o390J1470q411j7219L2035j9358n3367L0811
8096A70024L2862j0711J536k5142J1662M5027k924j7919J8080K364Q065O606J6681
8083B56211J0938j7816m2321k0037k638P930j8559k6796K0718m3052m2813l1468
8071E0297M4273M752j3244J0098P120k3776l3931k2461J6734O9418l920j0390
$$ plain form
8158 490294 492493 503327 517218 517711 514485 570156 585851 594508 621219 673742 667070 628574 627631
8145 627631 596094 558353 542255 483995 468841 490111 470861 506370 434889 437387 454259 412659
8133 412659 386402 411294 381252 353678 331746 378696 412974 363546 323376 366615 388316 391145
8121 391145 419799 438983 472906 487063 527250 507548 380762 348244 338602 291863 249858 251989
8109 251989 245969 210427 210059 177165 200453 194063 205533 197122 179903 211938 192580 139213 170024
8096 170024 202886 192175 193711 168569 180231 225258 222334 204415 222495 224859 232924 239530 256211
8083 256211 267149 249333 207012 186975 184337 192267 173708 146912 167630 124578 81765 50297
8071 50297 94570 99322 86078 96176 103296 79520 45589 23128 39862 109280 105360 94970
8059I4970J4792J0039K0729L8300j8521k2171O8557l7636Q186o8584j4074o852
8047H7735K4722p3778m0569O3914j346n5861k7539K0774J898K3467Q680N4413
8035H6510o9701l5825j7125j0033L3126r632l3942l9695P613N0569j1339N0632
8023A158K6496l451l9508k8372J9069K6544j3234k4771m8321K8795J1903j8086
8011f1778k738L5914k9298k0799K0189n0046Q281J6098l0951O572J909J3065j8877
7998a12459J7150j4122r962N1523J2752m7527J2107j3668N4938l478j2550k9982
7986i5278j3788K77l0233P2667J9149o803j62k9198j9869L8906l9730L1015q324
7973h1371N721M110m512j4398k4226J8949J2128l3943K9455OJ0832j4253j3303
$$ plain form
8059 94970 109762 119801 140530 178830 160309 138138 206695 169059 177245 108661 94587 87735
8047 87735 112457 38679 -1890 62024 60678 4817 -22722 -1948 -50 23417 32097 86510
8035 86510 16809 -19016 -36141 -46174 -13048 -22680 -56622 -96317 -88704 -38135 -49474 1158
8023 1158 27654 24203 -15305 -43677 -24608 1936 -11298 -36069 -84390 -55595 -43692 -61778
8011 -61778 -64516 -28602 -57900 -78699 -58510 -108556 -100275 -84177 -115128 -108556 -106647 -93582 -112459
7998 -112459 -95309 -109431 -119393 -67870 -55118 -102645 -90538 -104206 -49268 -52746 -65296 -95278
7986 -95278 -109066 -108789 -139022 -66355 -47206 -54009 -54171 -83369 -103238 -64332 -104062 -73047 -81371
7973 -81371 -75650 -71540 -76052 -90450 -114676 -95727 -83599 -117542 -88087 -88081 -77249 -91502 -104805
7960a04805l8331p790L0656N6564j3703J4667J1553o640Q358o881k7398q983j457
7947i4190J8262j1695j1297j730k241P115J4054J0184l3836N5912p178k1478N9451
7934a8667l7294j8402j1135m4933N4332j1750K8794K1022p208o863j1987L5369
7922b8722K5519k3458j1623n2811J7728K0498K0017p0637J6834J9457M864J5803
7910d6531m2074L5856k998r097l6633J320L2432p87J172l8378n2590l8073M9294
7897a47087M1146L5944j6629O164L9691l1915l5592L0546M0154p1245O0393L0343
7885a8087l5956R366Q856K7017J4725K4687k6693K2141p866k6032k0234M4327
7873A6251J4582m5066p175k5583J6886K0602P40J7231r850n420r548P257L7290
$$ plain form
7960 -104805 -143136 -150926 -120270 -63706 -77409 -62742 -51189 -57829 -49471 -56352 -83750 -92733 -94190
7947 -94190 -75928 -87623 -98920 -100650 -102891 -95776 -81722 -71538 -105374 -49462 -56640 -78118 -18667
7934 -18667 -55961 -74363 -85498 -130431 -76099 -87849 -59055 -38033 -45241 -52104 -64091 -28722
7922 -28722 -3203 -26661 -38284 -91095 -73367 -52869 -32852 -103489 -86655 -67198 -62334 -46531
7910 -46531 -88605 -52749 -55747 -64844 -101477 -100157 -67725 -68512 -67340 -105718 -158308 -196381 -147087
7897 -147087 -105941 -69997 -86626 -80462 -40771 -72686 -108278 -77732 -37578 -108823 -48430 -18087
7885 -18087 -54043 -44677 -35821 -8804 5921 30608 3915 26056 18190 -7842 -28076 16251
7873 16251 30833 -14233 -21408 -46991 -30105 -9503 -8763 8468 -1382 -6802 -16350 -9093 28197
7860B8197L9419l2953m9593L0906O190l1925K4092o2587j6119K9674p864L454
7848c9109n1699P3647Q388j9177j9750J4524k0623M359j5952K7070N0342j4197
7836b177k2830K6166p8755J332J7963k552M3658o885O7668k4109m2477J7431j7880
7823b3447K5452Q654k61j5480J2527M8550k4303O565n148j5738l8975K0490K7466
7810B6352l932L4176j2974q32P0505l5607m3517k8158Q683k113m3930q859p809
7797d8015l5797J7207j5613n4121M7873K4579J4043J4427k4493K1198L2624n0835
7785e6923k919M80J6519k6497N651M8665l2753l0565O4211K5137m3725k5424K4874
7772c3269j5091m4006N0302O7295k6585n192K5370j3830o1662O431L2297K864
$$ plain form
7860 28197 67616 34663 -14930 15976 22166 -9759 14333 -48254 -64373 -34699 -42563 -39109
7848 -39109 -90808 -17161 -8773 -27950 -47700 -33176 -53799 -49440 -65392 -38322 12020 -2177
7836 -2177 -25007 1159 -77596 -76264 -58301 -60853 -17195 -24080 43588 19479 -22998 -5567 -23447
7823 -23447 2005 10659 10398 -5082 7445 55995 31692 38257 33109 17371 -21604 -1114 26352
7810 26352 22420 56596 43622 42790 113295 77688 34171 6013 14696 12583 -31347 -40206 -48015
7797 -48015 -83812 -66605 -82218 -136339 -88466 -63887 -49844 -35417 -59910 -38712 -6088 -56923
7785 -56923 -59842 -59362 -42843 -69340 -63689 -15024 -47777 -78342 -14131 11006 -32719 -58143 -33269
7772 -33269 -48360 -92366 -42064 25231 -1354 -6546 18824 4994 -56668 -50237 -17940 -15076
7760a5076o2726K1869L1428j4002J6272O1k3321j2375J865K7395m5747L391M1725
7747b9241m6145L0541k2549M2981m7375n369K0395K5602M4182J4684l6571Q465
7735d00l693j1496J9082J8792l1694o4031J3754M7541j5090j206J3131j4432j3829
7722d3571L7534J5404l0505l5951K8063j5728L772j2232L0891O297O601m740j6115
7709c0280k7392J598K2036J1627m048k9587L5815L5953l5341o4685M7033J325
7697c5946l4519o971K4903r522N5809M3451O241j9437P893m1467L8553K5960k7087
7684B7861k7197l3862j0012k888J5803k325K9568j1963Q600l616j4774O604L135
7671a5066j0722L0241J5742j0895k9296J625k2501K396J3028k0315L517j5767
$$ plain form
7760 -15076 -77802 -55933 -24505 -38507 -22235 -22174 -45495 -57870 -56005 -28610 -74357 -70966 -29241
7747 -29241 -75386 -44845 -67394 -24413 -71788 -77157 -56762 -31160 13022 27706 -8865 -400
7735 -400 -4093 -15589 3493 22285 -9409 -73440 -59686 -12145 -27235 -28441 -15310 -29742 -43571
7722 -43571 -6037 9367 -21138 -57089 -29026 -44754 -40982 -53214 -22323 -16026 -9425 -14165 -30280
7709 -30280 -57672 -56074 -34038 -22411 -26459 -56046 -20231 15722 -19619 -84304 -37271 -35946
7697 -35946 -70465 -77436 -52533 -62055 -6246 37205 43446 24009 31902 -9565 28988 54948 27861
7684 27861 664 -33198 -43210 -46098 -30295 -32620 -3052 -15015 -6415 -10031 -24805 -18201 -15066
7671 -15066 -25788 4453 20195 9300 -19996 -18371 -40872 -38476 -25448 -45763 -42246 -58013
7659e8013k6708Q112J749k206J4425q890q546m576N9696J2998k6813l6256J8349
7646e6679K9347J1230o963R75k4549m2570O4879k3850k3445J5523L099L26L7058
7633a5619L5893n3213J1949k972k6656R894J1588p288N4309J9096N398p3542o6094
7620i7257M161M2877m5461j1263L6699q759K0859J3493l485n3739n6332P0928
7608h7279J2008l5441j0029N5685L6329l1314l3365L2868J9181j8570j2202L9531
7596c2598J6475M3314k298l0591k7102n049m1362o8200M179M8319M1679K7971
7584b5263l0841n8502j2751k1238P8655k7026P655n101K5295P831j3208M0913
7572c3581Q985j2594k2293j1642k0040P201k913p94J1248k0440L783J6899l4691
$$ plain form
7659 -58013 -84721 -76609 -74860 -77066 -62641 -71531 -80077 -84653 -24957 -11959 -38772 -75028 -56679
7646 -56679 -27332 -16102 -23065 -22090 -46639 -89209 -24330 -48180 -71625 -56102 -53003 -52677 -15619
7633 -15619 20274 -32939 -20990 -23962 -50618 -40724 -29136 -36424 17885 36981 42379 -31163 -97257
7620 -97257 -93096 -50219 -95680 -106943 -70244 -79003 -58144 -44651 -48136 -101875 -158207 -87279
7608 -87279 -75271 -110712 -120741 -65056 -28727 -60041 -93406 -60538 -41357 -59927 -72129 -32598
7596 -32598 -16123 27191 24893 -5698 -32800 -37849 -79211 -147411 -143232 -94913 -53234 -25263
7584 -25263 -56104 -114606 -127357 -148595 -69940 -96966 -89311 -94412 -69117 -61286 -74494 -33581
7572 -33581 -24596 -37190 -59483 -71125 -91165 -83964 -86877 -87671 -76423 -96863 -93080 -76181 -110872
7559a10872j2515N2550L3841l5734j7713k015j5692K5470k788j5440N9396m682
7547d6194m0832k1559n1699K6734J5405P7547k7068n2787J9816L1807M93K3519
7535d4818j7293l2949L008J7991l3369K9297k8577J6578l2940L4619K34m002L7493
7522e4728m181K6158l5911k2098J0961J5838l6300O27j645K2811P43O2808L3391
7509A8474l9905k7759m7626J5491l2987j7381P1965j9108o719L7465O102l4862
7497g6850N0495j8760k5247j8575k5919O4279k6748j9505L6408j666L2254K0037
7485i797k5226J5714r010k5318J0607P830j5613k748l229R920Q045M1153k9552
7472b7224j3079L4147M000J8725l7590l6988L8288N741k8884R473m3963K4638
$$ plain form
7559 -110872 -123387 -70837 -36996 -72730 -90443 -92458 -108150 -82680 -85468 -100908 -41512 -46194
7547 -46194 -87026 -108585 -160284 -133550 -118145 -40598 -67666 -120453 -100637 -68830 -68337 -44818
7535 -44818 -62111 -95060 -92052 -74061 -107430 -78133 -106710 -90132 -123072 -88453 -88219 -92221 -54728
7522 -54728 -58909 -32751 -68662 -90760 -79799 -63961 -100261 -99634 -101279 -78468 -77725 -14917 18474
7509 18474 -21431 -49190 -96816 -81325 -114312 -131693 -59728 -78836 -85555 -48090 -41988 -76850
7497 -76850 -26355 -45115 -70362 -88937 -114856 -50577 -77325 -96830 -60422 -62088 -29834 -9797
7485 -9797 -35023 -19309 -28319 -53637 -43030 -35200 -50813 -53561 -56790 -46870 -38825 2328 -27224
7472 -27224 -40303 -6156 -2156 16569 -21021 -58009 -19721 -13980 -42864 -33391 -77354 -52716
7460e2716N818l5481N3294J5534k4459J2035P894L8634l3762N954q719k1262M4267
7447G031L6628O562m1978l4406K2360L1466R678k931J5665K3098m3504k0020Q2336
7434I1985o2422K796L627k2720N9290L8729K11j9201n2107J5409M1424l176l5101
7421E8744L1449j1012J1185M2177k4596j1293J3104N2014r0745m499N2258j1153
7409A07633j6859k4824m626M3373J6482j6428j9733m8976N2437L2412l607k2296
7397I4988M8014J2139J3451k9499L3796p405o5467m4280J4480J0338J1404M9100
7385A41059j8705N690j0132j6691n047J7071p0314J750k4554k7265j7380L6270
7373A1752P3486l1904J4934M8832q1420M048K5505R093j2920r575J8917n8912
$$ plain form
7460 -52716 -46898 -82379 -29085 -13551 -38010 -25975 -18081 20553 -13209 -7255 -15974 -37236 7031
7447 7031 43659 50221 8243 -26163 -3803 27663 37341 34410 50075 73173 29669 9649 91985
7434 91985 29563 32359 35986 13266 72556 111285 111496 92295 40188 55597 97021 93845 58744
7421 58744 90193 79181 90366 132543 107947 96654 109758 161772 71027 66528 118786 107633
7409 107633 90774 65950 61324 104697 121179 104751 85018 36042 88479 120891 117284 94988
7397 94988 143002 155141 168592 139093 172889 165484 100017 55737 70217 80555 91959 141059
7385 141059 122354 128044 117912 101221 96174 113245 42931 44681 20127 -7138 -24518 11752
7373 11752 85238 53334 68268 117100 35680 39728 65233 74326 61406 51831 70748 11836
7361A1836L334m952J4345L5079p3933J1065N5858l401r0557Q34j0705M7764K7668
7348B4235k384J1682n8676J1168L1093o125m838k7620K7777o8229k8012L3865
7336e6064j0872k7400L4878M695j8318P0744k9914L5335N934m3532J0907j4597
7324c8204J8158l878l0974j537J7859l2504K0033P3685p163M5586l6146n9907
7312c4992J6582O3325n883m9448N258m8515K2479k4246M9874j7723K8012k5205
7300b0482r9400k1528M5451N6190O547j8467l8797L2520J5440n2693m2247M3671
7288i3795l522o333o0081O1910j3641K5934L3565k5082J7171j7560K1378k9769
7276h9825l0667K1046l7977J0698J6305K3497q319J0121L8211l715m6135l2144
$$ plain form
7361 11836 15170 10218 24563 59642 -14291 -3226 52632 49231 -41326 -40492 -51197 -3433 24235
7348 24235 21851 33533 -25143 -13975 17118 10993 6155 -21465 6312 -61917 -89929 -56064
7336 -56064 -66936 -94336 -59458 -54763 -73081 -2337 -32251 3084 9018 -34514 -23607 -38204
7324 -38204 -20046 -23924 -54898 -56435 -38576 -71080 -51047 22638 15475 61061 24915 -34992
7312 -34992 -18410 44915 39032 -10416 -5158 -53673 -31194 -55440 -5566 -23289 4723 -20482
7300 -20482 -119882 -141410 -95959 -39769 -33222 -51689 -90486 -57966 -42526 -95219 -137466 -93795
7288 -93795 -97317 -103650 -163731 -101821 -115462 -89528 -55963 -81045 -63874 -81434 -60056 -89825
7276 -89825 -120492 -99446 -137423 -126725 -110420 -86923 -95242 -85121 -46910 -50625 -96760 -128904
7264a28904j6930j0519M0169J657j1000L6685J4728m6155K536L9310N552Q882
7252f3989K7344o361l9547M2841k9676j7772N427m2618j8696K8938M6750O839
7240f0520K385R020R855k2880l1599l7244R780q302L0940j4636M2154K7442p1605
7227a15210J3956K1824J4147m6354P133k3588J8752r423k4J3904j7840K009L0941
7214h9773j319k2500N2983L1838m3108l3829J2735l099l1090l7513j3354n517
7202a83546R536M1465P6983O935l1283j4133k4318k2404J6512J2133P71j2520
7190a23869j8428L0865O6512l869k1692l513J3824k1861k5280l0538K1526K8809
7178h7514M90K8296k8164K8002k278n4724K4215j5355l667L1671M6333l8198m8242
$$ plain form
7264 -128904 -145834 -156353 -116184 -114527 -125527 -88842 -74114 -120269 -117733 -78423 -72871 -63989
7252 -63989 -36645 -43006 -82553 -39712 -69388 -87160 -81733 -124351 -143047 -114109 -67359 -60520
7240 -60520 -58135 -49115 -39260 -62140 -93739 -130983 -121203 -129505 -98565 -113201 -71047 -43605 -115210
7227 -115210 -101254 -79430 -65283 -111637 -104504 -128092 -109340 -118763 -118787 -104883 -122723 -120714 -89773
7214 -89773 -91092 -113592 -60609 -28771 -71879 -105708 -92973 -96072 -127162 -164675 -178029 -183546
7202 -183546 -174010 -132545 -55562 -48627 -79910 -94043 -118361 -140765 -124253 -112120 -111349 -123869
7190 -123869 -142297 -111432 -44920 -48789 -70481 -73994 -60170 -82031 -107311 -137849 -116323 -87514
7178 -87514 -87024 -58728 -86892 -58890 -61168 -115892 -91677 -107032 -110699 -79028 -32695 -70893 -119135
7165a19135J7111J1539J7992l652K6658k71m8834O159j0472j3417n2239K6831
7153a41730J9918l679R829L6558Q981j5990L711l8121m4472R449M3421J8737K4039
7140f9349M845m7065l023N9359O569k790o4605K2673K0505O476P751j8063l918
7127h0635N03L2784k769o6852K2052K4977J8066k0540o8312K2309K8621K1608
7115f8188N6059j9373l2296m354l203J0740k1363r711P996Q6001l4140k5095m052
7102f0979M919L1260R602k274k6490l2709o738M1061k363k2575k6746K2288L4280
7089c7464k8939j1840L4099l3549J5653L4192k9172j3948m827j1059K2440N5229
7077i185J3159k5370l6810P778K0831m2414k7225J6875N716j5325j041L1187R084
$$ plain form
7165 -119135 -102024 -90485 -72493 -76145 -49487 -49758 -98592 -92433 -102905 -116322 -168561 -141730
7153 -141730 -121812 -125491 -115662 -79104 -70123 -86113 -82402 -120523 -164995 -155546 -112125 -93388 -69349
7140 -69349 -64504 -111569 -114592 -55233 -48664 -51454 -116059 -93386 -72881 -66405 -58654 -76717 -80635
7127 -80635 -80132 -47348 -50117 -116969 -94917 -69940 -51874 -72414 -140726 -118417 -89796 -68188
7115 -68188 -12129 -31502 -63798 -68152 -71355 -60615 -81978 -91689 -83693 2308 -31832 -56927 -60979
7102 -60979 -56060 -24800 -15198 -17472 -43962 -76671 -83409 -42348 -44711 -67286 -94032 -71744 -37464
7089 -37464 -66403 -78243 -44144 -77693 -62040 -27848 -57020 -70968 -75795 -86854 -64414 -9185
7077 -9185 3974 -21396 -58206 -50428 -29597 -72011 -99236 -82361 -76645 -91970 -93011 -61824 -52740
7064e2740o6434Q359M4036p857K4843j7605o367j6152O3294p331j1969L166j9192
7051f1949J4723N912L135J2969R361q862R753J1144k3268j9515M6073k3791J6642
7038g673J1443J3204m8397j5334j456J7370k930j705J0735J439M1891p9567J5874
7025d5106L4083J7776j0064k4319m069q781K2411K7620j7065o7981R247Q968O8414
7012A1134o0124o9457k0898J7583N3561J6362j0850j1547N5909J4677j0952L1530
7000A6928J1618N560L506L0180k88K3713m517l46k0735m9467m9242J7157L7545
6987B1612j8556m1733m3290M1716M2665k9137k7643k8460j1882J4193L2269o248
6975e4494o5575j2788m1208O3268Q553N8769l6765l0322J4162N921O251J1228
$$ plain form
7064 -52740 -119174 -110815 -66779 -74636 -49793 -67398 -73765 -89917 -26623 -33954 -45923 -42757 -61949
7051 -61949 -47226 -41314 -38179 -25210 -15849 -24711 -14958 -3814 -27082 -46597 -524 -24315 -7673
7038 -7673 3770 16974 -31423 -46757 -48213 -30843 -33773 -35478 -24743 -23304 18587 -60980 -45106
7025 -45106 -11023 6753 -3311 -27630 -31699 -40480 -18069 9551 -7514 -75495 -66248 -57280 11134
7012 11134 -48990 -118447 -139345 -121762 -68201 -51839 -62689 -74236 -18327 -3650 -14602 16928
7000 16928 28546 34106 37612 67792 67504 91217 86700 86354 65619 16152 -33090 -15933 21612
6987 21612 3056 -38677 -81967 -40251 2414 -26723 -54366 -82826 -94708 -80515 -48246 -54494
6975 -54494 -120069 -132857 -174065 -110797 -102244 -43475 -80240 -110562 -96400 -90479 -84228 -73000
6963g3000L5684j6991l0888N7340k9808r551l8100K3227K4266l9301m2814J1125
6951a28811N3052J7526k6026j3244L0600L5772q034p9960J010K774M7008m8N4044
6938a4337j7731m2686J0497j146p531K0971J6503K5560p1554j9676R078O609R03
6925h4540K7477j6434m8813J7214R786R10K2699P340K9783m396R592l7061M5116
6912b1327L5559q559m960n5021Q720J4188K5592M599l1467r13M4226n185K982
6899H434m1078k1404P330K9463j1717j290J7579Q341k3663M156j6501J7525N958
6886a6867n3650l0607J0900K4739j9131N316L9153r034L3309k3680L320j2455
6874d8687k5835j8647J3670n851P868J6276j3680K3814j9426J5694M9452L409
$$ plain form
6963 -73000 -37316 -54307 -85195 -27855 -57663 -67214 -105314 -82087 -57821 -97122 -139936 -128811
6951 -128811 -75759 -58233 -84259 -97503 -66903 -31131 -39165 -119125 -118115 -115341 -68333 -68381 -14337
6938 -14337 -32068 -74754 -64257 -65403 -72934 -51963 -35460 -9900 -81454 -101130 -92052 -85443 -84540
6925 -84540 -57063 -73497 -122310 -105096 -95310 -94400 -71701 -64361 -34578 -38974 -29382 -66443 -21327
6912 -21327 14232 5673 713 -54308 -45588 -31400 -5808 -1209 -32676 -33589 10637 5452 8434
6899 8434 -32644 -54048 -46718 -17255 -28972 -30262 -12683 -4342 -28005 -23849 -40350 -22825 -16867
6886 -16867 -70517 -101124 -90224 -65485 -84616 -79300 -40147 -49181 -15872 -39552 -36232 -48687
6874 -48687 -74522 -93169 -79499 -85350 -77482 -61206 -74886 -51072 -70498 -54804 -5352 -1943
6862a943j4328K5456l2450k5158n5333O6235K2869k2566L0062n1166k1897M2905
6850c7314J1629l9245j9141M519N318M7552n112j790n308K1456K9779r428K3177
6837B6092m3936o7009J1735K8718n6747M7878L9856k8974l4233L795L3637K5469
6825a3719N164L3391l8302m9796m89K1664L7771l656k5039K2118R764l7110o546
6812d4785L8466L1482J1719l5619J4250M502m3003n5460l483P9494l6113L7855
6800f95L786j1865q829j4887N033r441k5902R3264J0122j5941l0416j3876l2863
6787e2510j3394J2240O7303o947j099n902j4846N216J3260L4026L1134j8253o22
6774D9606J3959j5283K3498j7220J672o0343n3411k014Q8284j5653j9565j1457
$$ plain form
6862 -1943 -16271 9185 -23265 -48423 -103756 -37521 -14652 -37218 -7156 -58322 -80219 -37314
6850 -37314 -25685 -64930 -84071 -79552 -74234 -26682 -31794 -33584 -38892 -17436 12343 2915 26092
6837 26092 -17844 -84853 -73118 -44400 -101147 -53269 -13413 -42387 -76620 -72825 -39188 -13719
6825 -13719 -8555 24836 -13466 -63262 -63751 -42087 -4316 -7972 -33011 -10893 -1129 -38239 -44785
6812 -44785 -6319 25163 36882 1263 15513 20015 -22988 -78448 -81931 -2437 -38550 -695
6800 -695 3091 -8774 -17603 -32490 -27457 -36898 -62800 30464 40586 24645 -5771 -19647 -52510
6787 -52510 -65904 -53664 13639 6692 5593 -309 -15155 -9939 3321 37347 68481 50228 49606
6774 49606 63565 48282 71780 54560 56232 -4111 -57522 -59536 28748 13095 -6470 -17927
6762a7927l235K1914L0598l1578j6131K7353l512j9872n758L9109L3923j4765
6750D0119k6495K1044K1093k6866j1867j0637J6519M2152m9612l7945N5390K393
6738C5288L1001K7443L8110M6203n1802o3997l282m3516L3245n1436L038M2963
6726D3258m4282N8091K5206n0541j6876k0730J2911J5677J4576r932m17l7137
6714a0196j3309j0471L6536l0210M2792L8347k7080j4111k9558L7723k0279J0298
6702A0482j1243m737N78m207l0010K3189j8633K7073j9492k7901N9828P308p3960
6689f1725K0725N5283J4057n5436j0860n962M3713Q849o3817L531L2371j5020
6677c4291j7072J6058N782N3653n350j7211j6988J617j5890m418M758q03m296
$$ plain form
6762 -17927 -21162 752 31350 -228 -16359 10994 7482 -12390 -18148 20961 54884 40119
6750 40119 13624 34668 55761 28895 17028 6391 22910 65062 15450 -22495 32895 35288
6738 35288 66289 93732 131842 178045 126243 62246 58964 15448 48693 -2743 295 43258
6726 43258 -1024 57067 82273 31732 14856 -5874 7037 22714 37290 27358 26941 -10196
6714 -10196 -23505 -33976 2560 -27650 15142 53489 26409 12298 -17260 20463 184 10482
6702 10482 -761 -5498 -4920 -9127 -39137 -15948 -34581 -7508 -27000 -54901 4927 12235 -61725
6689 -61725 -41000 14283 28340 -27096 -37956 -43918 -205 8644 -55173 -51642 -19271 -34291
6677 -34291 -51363 -35305 -29523 24130 18780 1569 -15419 -13802 -29692 -34110 -29352 -30155 -34451
6664c4451l7387O3417N5334J2772l0836l987k8582p056J7693r380m9649N7008
6652D896K6923l1913j4691j9854N7190M6730J0620k6601l5441P346l2694l976
6640a1465N7546N965m2317j7211K5073P289m3951K8399k3494L1936L1933o4309
6628a4606l3394K8574K0939P129j2734k951N7685R537l5719P251q829k7550M3601
6615C8933k8433j2412J5720R744l6894M7545k6579k9717K8092M8167J1209n9956
6603E419p4003K6045O4217K8407j5386J1887K5682k2445m4202j179q716M2829
6591C8555j6704O441J1844k2131K6081J4254j0546L7684p438K8823k7472p5507
6579C884J8200k300n819M6032l7715K6392K2466n2531k1657l6264M8664Q278k2895
$$ plain form
6664 -34451 -71838 -8421 46913 59685 28849 24862 -3720 -10776 6917 -2463 -52112 4896
6652 4896 31819 -94 -14785 -34639 22551 69281 79901 53300 17859 25205 -7489 -11465
6640 -11465 46081 52046 9729 -7482 17591 24880 -19071 9328 -14166 17770 49703 -14606
6628 -14606 -48000 -19426 1513 8642 -4092 -7043 50642 60179 24460 31711 22882 -4668 38933
6615 38933 10500 -1912 13808 23552 -13342 34203 7624 -22093 5999 54166 65375 5419
6603 5419 -68584 -42539 21678 50085 34699 46586 72268 49823 5621 4442 -4274 38555
6591 38555 21851 28292 40136 18005 44086 58340 47794 85478 78040 106863 79391 3884
6579 3884 22084 19784 13965 59997 22282 48674 71140 18609 -3048 -39312 9352 17630 -5265
6566e265R820L0641k1839J3109j9253J0106J5019J0387j0577n9536j1365N8787
6554B0034o729O0877k279o7378O1003M4928j2838l9471J1706k7218N501L402n031
6541D6507Q077J0828R074j1389m4804N4329L3589n8391k5246M371L8498L1322
6529I6765j6922m6845K032m0538K0841J1580L5861N0302k8288L1786k0038k6631
6517F9905k9941J337O2515o272J4247n4406j865K5490J9492n6966L4114J8103
6505I5753q480j8207k0564o825l2099M1236O9335J9955p2419k6056J6994M0386
6493I9009j2019l1246M1618m159j2437q019K8080J8522Q650l5328J3887k1327
6481H5231R304l7906q240N3959k6844L3866j0903L1438K0873k9040j7788K0060
$$ plain form
6566 -5265 4555 35196 13357 26466 7213 17319 32338 42725 32148 -27388 -38753 20034
6554 20034 13305 74182 71903 4525 65528 110456 97618 58147 69853 42635 48136 51538 46507
6541 46507 54584 65412 74486 63097 18293 72622 106211 47820 22574 26945 65443 96765
6529 96765 79843 32998 35030 -5508 15333 26913 62774 113076 84788 116574 96536 69905
6517 69905 39964 41301 103816 97544 111791 57385 55520 81010 100502 43536 77650 95753
6505 95753 87273 69066 48502 41677 9578 50814 120149 140104 67685 41629 58623 99009
6493 99009 86990 55744 97362 93203 80766 72747 100827 119349 127999 92671 106558 85231
6481 85231 94535 56629 48389 102348 75504 109370 98467 129905 150778 121738 103950 124010
6469A24010K4860j6660j350j2528k9306N7893m2009r799m400k101J0833K7495
6457A26938J7353k1983j7029j4512q13k168K0179L2092N3783J4341o061k7437
6445A74683L4774O0026k2689k5775l2010J8012M1714k2566m8278l5169P1098k8618
6433A85202j5829J9607M5597k0118m9009J809p238L9945j9350j8076r568J8993
6421A71965R598j3943K1357L7952q8523J427N5781J2605k8236j5931o431j1159
6409A46462P5861L9104j9440q45l8063K9018K6380j5183k9108K9611J0406J0576
6397B64779j6182K9234K0408J8339q126j609J8777Q60p164J7107l0360K7333J2631
6384C46027l9002l9718n991N6755Q648P026o084m2518l291L5856L0212M4959m9225
$$ plain form
6469 124010 148870 132210 130860 118332 89026 146919 104910 95111 90711 88610 99443 126938
6457 126938 144291 122308 105279 90767 89954 87786 107965 140057 193840 208181 202120 174683
6445 174683 209457 269483 246794 221019 189009 207021 248735 226169 177891 142722 213820 185202
6433 185202 169373 188980 234577 214459 165450 167259 160021 199966 180616 162540 152972 171965
6421 171965 181563 167620 188977 226929 138406 139833 195614 208219 179983 164052 157621 146462
6409 146462 222323 261427 241987 241142 203079 232097 258477 243294 214186 243797 254203 264779
6397 264779 248597 277831 298239 316578 308452 306843 325620 326480 319316 336423 306063 333396 346027
6384 346027 307025 267307 261316 318071 326719 333745 327661 285143 281852 317708 347920 392879 343654
6371C43654l8735r100M6257j4173K2831p57j5823j778p264K2240J4154N7121k758
6358D15869o1117o464J7804J3015Q338P981J0654L2523k7591L061L3017L8780
6346D85870J91q107L6522J0876k4018L80J66K6505J1438M103n2243O0545M2997
6333E95225R742j9564j1102J9476J2012K932L8958J236j7448O2173k8768K9930
6321F94802O364k1091n432m8168r460O9203J9347N338J4460k995J836J1611k75
6308G35540L2535K1878M2023L0076j2229M6593K8521j9162J7771J7912n8652k3461
6296H59345K2355l907K1625l6820o1345L6934J5058l1504l007J2154J8605L1327
6284H80820K3745m6345M8605L6075J9348L4828K217O398J5791K093q156l503M658
$$ plain form
6371 343654 304919 295819 342076 327903 350734 349977 334154 332376 325112 347352 361506 418627 415869
6358 415869 354752 348288 366092 379107 387445 395426 406080 438603 411012 414073 447090 485870
6346 485870 486061 477954 514476 525352 501334 501714 501880 528385 539823 543926 491683 552228 595225
6333 595225 604967 585403 574301 593777 605789 608721 647679 648915 631467 693640 664872 694802
6321 694802 701166 680075 674643 626475 617015 686218 705565 710903 725363 722368 724204 735815 735540
6308 735540 768075 789953 831976 862052 849823 896416 924937 905775 923546 941458 882806 859345
6296 859345 881700 877793 899418 862598 801253 838187 853245 821741 818734 830888 849493 880820
6284 880820 904565 858220 906825 942900 962248 997076 999293 1005691 1021482 1023575 1015419 1011916 1016574
6271A016574j9619l9437M5293L6986l7102k268L514p40L3200k7347j4766j0069
6259I84219M1506j4874N005j3709M566O946N2642j1648P237P426M5891O4513l0213
6246A149507l5349L746J7129p200J0972n9570m533j022n986J8909K9881m6966
6234A069518O446l6842K9298j206Q216o590N5591K2918k3657M4365j9885L7433
6222A185605K7357J5205k376M1782k1231O7196Q0132J5653K4953M9952J2282l2900
6210A463610M3619J6025j1909k4159n2031N856J6625r7461N731L5295L3683L7756
6198A472640j533M0124L0400M5599K8787K2271O3068O2832O2053J10947J25518
6187B062706M7638Q8981P7570j3599J6939j1000n2515o2871k7830K2217n4377
$$ plain form
6271 1016574 996955 957518 1002811 1039797 1002695 1000427 1003941 1003201 1036401 1009054 994288 984219
6259 984219 1025725 1010851 1015856 1002147 1006713 1013659 1066301 1054653 1061890 1069316 1115207 1179720 1149507
6246 1149507 1114158 1117904 1135033 1127833 1138805 1079235 1074702 1073680 1067694 1086603 1116484 1069518
6234 1069518 1075964 1039122 1068420 1067214 1075430 1068840 1124431 1147349 1123692 1168057 1148172 1185605
6222 1185605 1212962 1228167 1225791 1267573 1246342 1313538 1393670 1409323 1434276 1484228 1496510 1463610
6210 1463610 1507229 1523254 1511345 1487186 1435155 1441011 1457636 1360175 1365906 1401201 1434884 1472640
6198 1472640 1471107 1511231 1541631 1587230 1616017 1638288 1701356 1764188 1826241 1937188 2062706
6187 2062706 2110344 2199325 2276895 2263296 2280235 2269235 2216720 2153849 2126019 2148236 2093859
6176B093859k9967p21J2891j2863K1571L673j1360L0155M5233P9963N8647N064
6164B296145O4186P5125P3653Q5926K0692R6323Q6282O7649J5773K8495N6469
6153B966718M8809O0083P0181K4631K5126o0757j7887R690J2440N6m6551K2650
6141C115189L4540K9641K4175M160P55P1168Q5883M8206R3338R3208j1243J15836
6129C704856J54936K02121J33077K07990J85722J57345J30444L9954j2449O1503
6119D965499J8770n9390n591O346O1234M9043N3287j7547K4947J7427l8530K0733
6107E096228J4061k1105N5114J23647J53653Q8079J33770J09835J70635J50362
6097F074279R2082J25135J3868K8534Q8400M5380L6715P3615J39551Q0659J11778
$$ plain form
6176 2093859 2063892 2063171 2076062 2063199 2084770 2088443 2077083 2107238 2152471 2232434 2291081 2296145
6164 2296145 2360331 2435456 2509109 2595035 2615727 2712050 2798332 2865981 2881754 2910249 2966718
6153 2966718 3015527 3075610 3145791 3170422 3195548 3134791 3116904 3126594 3139034 3139090 3092539 3115189
6141 3115189 3149729 3179370 3203545 3207705 3208460 3279628 3365511 3413717 3507055 3600263 3589020 3704856
6129 3704856 3859792 4061913 4194990 4402980 4588702 4746047 4876491 4916445 4903996 4965499
6119 4965499 4984269 4924879 4919288 4925634 4986868 5035911 5089198 5071651 5096598 5114025 5075495 5096228
6107 5096228 5110289 5089184 5144298 5267945 5421598 5509677 5643447 5753282 5923917 6074279
6097 6074279 6166361 6291496 6305364 6333898 6422298 6467678 6504393 6578008 6717559 6798218 6909996
6086F909996J48191J22795j4386l3494j17969j29188q5024r5063o3760L698K2976
6075F668772j9580L9717P3791J16665J37039J20903J42772J29567J13890J75985
6065G699521J21189K12326K02626J16655J69793K00202J68400J13434k314J3338
6055I015170N4259l9317L6815L4214Q7570O2251Q3743J66176K56451K30898J95648
6044A0183878K68020L07035L34401L59752M02038N34759N52211N20584N94624
6035A4057302O23534N45306O34940P38661Q35421R23624J071709J249297J206376
6026B1886170J154088Q81041O32095L78043K63840K11234L19677L38880M76311
6017B6541379N28531L99211K42761J2061j75668l85079m66575m00918j96744J07205
$$ plain form
6086 6909996 7058187 7180982 7166596 7133102 7015133 6885945 6800921 6705858 6642098 6645796 6668772
6075 6668772 6649192 6688909 6762700 6879365 7016404 7137307 7280079 7409646 7523536 7699521
6065 7699521 7820710 8033036 8235662 8352317 8522110 8722312 8890712 9004146 9001832 9015170
6055 9015170 9069429 9030112 9066927 9101141 9188711 9250962 9334705 9500881 9757332 9988230 10183878
6044 10183878 10451898 10758933 11093334 11453086 11855124 12389883 12942094 13462678 14057302
6035 14057302 14680836 15226142 15861082 16599743 17435164 18358788 19430497 20679794 21886170
6026 21886170 23040258 23921299 24553394 24931437 25195277 25406511 25726188 26065068 26541379
6017 26541379 27069910 27469121 27711882 27723943 27548275 27163196 26696621 26295703 26098959 26206164
6007B6206164L68334O82736J041054J379710J763041K111382K411899K526694
5999C8491014K284859J729356R35215J39223l94055m88070l13062q1063j5711
5990D2287706J09804Q3233k78335j014665j850006k508275k836687k661834k241522
5981B9089419j729464j245286p33408l15589J1480L10990N47301P50012P38988
5972B7424443N73742K92002j39005l38805n31848n40785n08448n05073l65951
5963B5360272l78741m93083p32445j142587j359957j684773j770577j587066j480407
5954A4730636j290362j068707j003220q65495o46361n85493o17795n12208m16955
5945G724040m09799l15435k95060k73509k86729k36651j81127j37484j61073j93143
$$ plain form
6007 26206164 26574498 27257234 28298288 29677998 31441039 33552421 35964320 38491014
5999 38491014 40775873 42505229 43440444 43579667 43185612 42697542 42384480 42303417 42287706
5990 42287706 42397510 42480743 42202408 41187743 39337737 36829462 33992775 31330941 29089419
5981 29089419 27359955 26114669 25381261 25065672 25077152 25388142 25935443 26685455 27424443
5972 27424443 27998185 28290187 28151182 27812377 27280529 26739744 26231296 25726223 25360272
5963 25360272 24981531 24488448 23756003 22613416 21253459 19568686 17798109 16211043 14730636
5954 14730636 13440274 12371567 11368347 10502852 9856491 9270998 8653203 8140995 7724040
5945 7724040 7314241 6998806 6703746 6430237 6143508 5906857 5725730 5588246 5427173 5234030
5935E234030j47098j58744j76562j28414j09447j07661j09139j15958j35096r1918
5925C953993p9360p7173j34556r3587j24272j31941p2812o4619j25650l9700o8877
5914B941446o8645j9466p9032k7784n3756n8766m2610n6671L0937m9357R053j7274
5902B508075o0630q099R7692l5891q2557N3342J585L6518J3749k4441j2492m9596
5890B437255l1096l8879o4337l7713m7058n28n6692j6255m3776p440j9883r603
5878B063995l4650K157K1794N0308K6706P3267M6777M7958J4401J01047N1277
5867B465037M8925L7036q3850n6296J107o0412n0703r1113r5685K5844M3599J4437
5855B197926o5109o6913m4449m7405r0294q882L9103L422L200j6292K8844K1133
$$ plain form
5935 5234030 5086932 4928188 4751626 4623212 4513765 4406104 4296965 4181007 4045911 3953993
5925 3953993 3874633 3797460 3662904 3569317 3445045 3313104 3240292 3175673 3050023 3010323 2941446
5914 2941446 2872801 2853335 2774303 2746519 2692763 2633997 2591387 2534716 2565653 2516296 2525349 2508075
5902 2508075 2447445 2439346 2537038 2501147 2418590 2471932 2473517 2510035 2523784 2499343 2486851 2437255
5890 2437255 2406159 2367280 2302943 2265230 2218172 2217644 2160952 2144697 2100921 2093481 2073598 2063995
5878 2063995 2029345 2031502 2053296 2103604 2130310 2203577 2250354 2298312 2312713 2413760 2465037
5867 2465037 2513962 2550998 2467148 2410852 2411959 2351547 2300844 2209731 2114046 2139890 2183489 2197926
5855 2197926 2132817 2065904 2021455 1974050 1883756 1874874 1913977 1917399 1920599 1904307 1933151 1954284
5843A954284l0882K3733J5308r951N6043j3669k9300L0714Q0724n170l1357K0589
5831B061066n8052q863n7723n4496l2996r9493J0577o5992n6945k316p1570m7845
5819A515352k0527N4345K1149m0856l7689M3599J5184j4467j1157L1507J3523
5808A569963K2035O759K5J2101k1378J6940m759k6175o5235R729l499j385N4617
5795A569738P972J9982o4775k41M088q121R980j2421j5460L5787J5435r869K2476
5782A574571O910m4591J182J5518L6354N995Q8013Q1940k2568q193J1234L1466
5770A777831J9720N074k1723m1649k0025J6566O7406j130K7848N822k7554K6824
5758A835010J784K6964K9517K3038J4181K189M4985M7979N1718k296L442K4628
$$ plain form
5843 1954284 1923402 1947135 1962443 1952492 2008535 1994866 1965566 1996280 2077004 2071834 2040477 2061066
5831 2061066 2003014 1994151 1936428 1881932 1848936 1749443 1760020 1694028 1637083 1634767 1563197 1515352
5819 1515352 1494825 1549170 1570319 1529463 1491774 1535373 1550557 1536090 1524933 1556440 1569963
5808 1569963 1591998 1598757 1598782 1610883 1589505 1606445 1601686 1575511 1510276 1520005 1516506 1515121 1569738
5795 1569738 1577710 1597692 1532917 1532676 1536764 1528643 1538623 1526202 1510742 1546529 1561964 1552095 1574571
5782 1574571 1581481 1536890 1538072 1553590 1589944 1595939 1683952 1765892 1743324 1735131 1746365 1777831
5770 1777831 1797551 1802625 1780902 1739253 1719228 1735794 1803200 1802070 1829918 1835740 1808186 1835010
5758 1835010 1836794 1863758 1893275 1916313 1930494 1932683 1977668 2025647 2077365 2075069 2078511 2103139
5746B103139K6368M0505M0191O7084N6344p617L4906L8788K0302L0961P7928Q2111
5734B611010L4968N6863N0175N0525M3738R6964M4774k3136K8231N1038N8209
5723C103359P4272J9911O5376J8046o9108k4331M3097J4610M1498J8283j391L5857
5711C339479J10296P8652M3610N3584M7517Q7255P1283M3698M6246J01666N6104
5700D079390O033O632K580N6860K6301l6914j8126M108n3185n2424J5409K4251
5688D060915R2589O3065R751Q3915L5241N4063P4005p1261k3027q34j8961L2091
5676D391552Q5803R3215P9194P2493P9835N1535N5108L9990l7322p2689r7681
5665D741033J5407o3922m8700M5720K16j4748L963J2779L5435M5454q592j6661
$$ plain form
5746 2103139 2129507 2170012 2210203 2277287 2333631 2326014 2360920 2399708 2420010 2450971 2528899 2611010
5734 2611010 2645978 2702841 2753016 2803541 2847279 2944243 2989017 2965881 2994112 3045150 3103359
5723 3103359 3177631 3197542 3262918 3280964 3211856 3187525 3230622 3245232 3286730 3305013 3303622 3339479
5711 3339479 3449775 3528427 3572037 3625621 3673138 3760393 3831676 3875374 3921620 4023286 4079390
5700 4079390 4085423 4092055 4094635 4151495 4177796 4140882 4122756 4126864 4073679 4021255 4036664 4060915
5688 4060915 4153504 4216569 4226320 4310235 4345476 4399539 4473544 4402283 4379256 4378422 4359461 4391552
5676 4391552 4477355 4570570 4649764 4722257 4802092 4853627 4908735 4948725 4911403 4838714 4741033
5665 4741033 4756440 4692518 4643818 4689538 4689754 4675006 4678969 4691748 4727183 4772637 4764045 4747384
5653D747384M4253K7006P3559Q2350O6792Q6429J80268J98037J72182J80945J72548
5642F031753N2647n220p1038j09499r4457k8711m4673J2261J3031M1612N9833
5631E857539J2385L6373k1032O704L7242R8192L9189J25008J87418J36878J28451
5620F644347J51048J38456K14752K70138K54754K39660J19664R2729K9921l433
5610H152036q1983n8802K8445l6892J4721L2186M7435P2507O0051Q5026J72953
5599H487683J74048J65960J60135J41753K76937L09564K88620K87329K81526K68183
5589A0841738L17062L36780L57905L19165J78989K12928K18296K87986L66917
5580A3437766M34458N47586P26379Q35406R86376J092244J253330J342627J312526
$$ plain form
5653 4747384 4791637 4818643 4892202 4974552 5041344 5127773 5308041 5506078 5678260 5859205 6031753
5642 6031753 6084400 6079180 6008142 5898643 5804186 5775475 5730802 5743063 5756094 5797706 5857539
5631 5857539 5869924 5906297 5885265 5891969 5929211 6027403 6066592 6191600 6379018 6515896 6644347
5620 6644347 6795395 6933851 7148603 7418741 7673495 7913155 8032819 8125548 8155469 8152036
5610 8152036 8070053 8011251 8039696 8002804 8017525 8049711 8097146 8169653 8229704 8314730 8487683
5599 8487683 8661731 8827691 8987826 9129579 9406516 9716080 10004700 10292029 10573555 10841738
5589 10841738 11158800 11495580 11853485 12172650 12351639 12564567 12782863 13070849 13437766
5580 13437766 13872224 14419810 15146189 15981595 16967971 18060215 19313545 20656172 21968698
5571B1968698J181897O92220o919m45193p63936q17962o98182m88327k90287j03785
5561B0228224J60848L60172N25304O39934P77326Q00942Q36638P70610Q60559
5552B5960557R19944J091795J385930J817212K356562K958138L307177L321791
5544D3119106K761937J321522l76017j920960k825123l165804k981550k503137
5536C3429974k054558j477647r23956m94906k7558K30881M67630M03970J16989
5527B9670819j69574l28749k60032L6706M58768R45828J337433J950250K320814
5518C5962263K618441K530415J754725K57229j575510k932375l565424l497425
5510C1552339l145017k511549k006922j584043j172816q65154o39998n18500n45107
$$ plain form
5571 21968698 23150595 23842815 23835896 23390703 22626767 21808805 21110623 20622296 20332009 20228224
5561 20228224 20389072 20749244 21274548 21914482 22691808 23492750 24329388 25099998 25960557
5552 25960557 26880501 27972296 29358226 31175438 33532000 36490138 39797315 43119106
5544 43119106 45881043 47202565 46826548 44905588 42080465 38914661 35933111 33429974
5536 33429974 31375416 29897769 28973813 28478907 28451349 28682230 29149860 29553830 29670819
5527 29670819 29501245 29172496 28912464 28949170 29407938 30353766 31691199 33641449 35962263
5518 35962263 38580704 41111119 42865844 43123073 41547563 38615188 35049764 31552339
5510 31552339 28407322 25895773 23888851 22304808 21131992 20266838 19626840 19108340 18563233
5501A8563233n42530o65695o01208n79896m17739k07735j01758P9604K51116L84720
5491A6162112M64053M68550K97079k376n23021r44004j180935j240198j166190
5482A2335070r51431p79585o88749m90070m25750l65970l39912k75496l17027
5473G701080k59638k69651k39866k34460j94526j48532j59272r1060j15865j4792
5463E973418l1195m0907o0135o5345j7686q833K604k7012R5391Q2652J8291P7743
5451E998986J39103J76806J78742K22710L02094L18905K82632K50276J49899o8251
5441G951902k72054l86345m60370m16540l43684m49197l65075l10718k55541k44093
5431D448285j82509j82241j38861j15675m3673l7438n1570l1318j36122k7014
$$ plain form
5501 18563233 18020703 17355008 16753800 16173904 15756165 15548430 15446672 15526276 15777392 16162112
5491 16162112 16626165 17094715 17391794 17389418 16866397 15922393 14741458 13501260 12335070
5482 12335070 11383639 10604054 9915305 9425235 8999485 8633515 8293603 8018107 7701080
5473 7701080 7441442 7171791 6931925 6697465 6502939 6354407 6195135 6104075 5988210 5973418
5463 5973418 5942223 5901316 5841181 5775836 5758150 5749317 5751921 5724909 5820300 5902952 5921243 5998986
5451 5998986 6138089 6314895 6493637 6716347 7018441 7337346 7619978 7870254 8020153 7951902
5441 7951902 7679848 7293503 6833133 6416593 6072909 5623712 5258637 4947919 4692378 4448285
5431 4448285 4265776 4083535 3944674 3828999 3785326 3747888 3696318 3665000 3528878 3501864
5421C501864q1538l2984r130m0255j7056L1574K9960k603N4490J19016J71510
5410C724848J45402Q5683J99603K09700K46190L33822L49228J70823p2375k83026
5400E109898m45627m26360l38588k65605j88926j42853j30893r7902j38323p0659
5390B864162k9779p5270k9526r0335o0789k1680j8850k9228R452l4791p9274j9025
5378B385067J3307J6272j9646n1619K6618M8238R7q019K3331J0885k2274m4512
5366B377745k0874j8708j7711r678j3786N2182j042R677n7831l843L2304j9854
5354B308581R486L5598Q907K8095M1043J07037n659Q7280J41347P7167Q1003Q5870
5342C005755p6359r5196p5208r7760j24243p9414p3042r697N431l1918o550k8192
$$ plain form
5421 3501864 3420326 3387342 3378212 3337957 3320901 3352475 3382435 3379832 3434322 3553338 3724848
5410 3724848 3870250 3955933 4155536 4365236 4611426 4945248 5294476 5465299 5392924 5109898
5400 5109898 4664271 4237911 3899323 3633718 3444792 3301939 3171046 3073144 2934821 2864162
5390 2864162 2834383 2759113 2729587 2639252 2578463 2556783 2537933 2508705 2518157 2483366 2404092 2385067
5378 2385067 2398374 2414646 2395000 2343381 2369999 2418237 2418334 2410315 2433646 2444531 2422257 2377745
5366 2377745 2356871 2338163 2320452 2310774 2296988 2349170 2348128 2357805 2299974 2296131 2328435 2308581
5354 2308581 2318067 2353665 2362572 2390667 2431710 2538747 2533088 2620368 2761715 2838882 2919885 3005755
5342 3005755 2929396 2834200 2758992 2661232 2536989 2457575 2384533 2374836 2380267 2348349 2341799 2313607
5330B313607j0919K2691M4906q780P3499J8062N8076N9128R5852P0030J19119
5319B855271J25748K01833K29318K56124K93287L32217L42647M22308J32840m0344
5309E151249j23195j96616j21498l9396L0639M730p0786j14075k19128k80551
5299D021373l26814k41600j43020q2215p9324r8433j2726M978k3765J510N0330
5288C070294Q4892L9646P5016J60249J48920K82802L17271L12999L32061J97177
5278E021327m2796k60575l13746m24194l72300j87538k25709j42103p0052o8484
5268B913830r6531l9960J8398l7224l60N5195r78K4269M1518J06140P4722N3806
5256C112825Q5695J31950K04294J50831K62810L19558L19021K21152J07995L8417
$$ plain form
5330 2313607 2302688 2325379 2370285 2361505 2435004 2453066 2511142 2570270 2666122 2736152 2855271
5319 2855271 2981019 3182852 3412170 3668294 3961581 4293798 4636445 5058753 5191593 5151249
5309 5151249 5028054 4831438 4709940 4670544 4701183 4705913 4635127 4521052 4301924 4021373
5299 4021373 3694559 3452959 3309939 3227724 3148400 3049967 3037241 3042219 3018454 3019964 3070294
5288 3070294 3155186 3194832 3269848 3430097 3579017 3861819 4179090 4492089 4824150 5021327
5278 5021327 4978531 4717956 4404210 3980016 3607716 3420178 3194469 3052366 2982314 2913830
5268 2913830 2817299 2777339 2795737 2758513 2758153 2813348 2812370 2836639 2878157 2984297 3059019 3112825
5256 3112825 3198520 3330470 3534764 3685595 3948405 4267963 4586984 4808136 4916131 4954548
5246D954548j12834k72712l55971l16116k82827j50733j22194o3567p0327m8748
5236C158519n8838j11079m7748m9271j16736J0918k3315k2595j6124k3398m7871
5225B652462M3175O6442J0064K801L3331j3687K4657O9112j6606N3166k4742j2156
5213B888019j9661M8707M5457o772M8134q411Q216K5638M4001Q0910K9179j4674
5201C168743j9772k0294L1789M342q874l6853L0622r823R935o0791k7983M2041
5189C103082J5892r656L371j5119L83P4604O5594K3692O0930L8984K0591k4473
5177C357875Q6238n4117L3477N6776K4910O1217L4939R7014J02176R1653r091
5166C883067J2346m1836L1895O9176O8434M0503L298M0814P4601j3472N392M687
$$ plain form
5246 4954548 4841714 4569002 4213031 3896915 3614088 3463355 3341161 3277594 3207267 3158519
5236 3158519 3099681 2988602 2940854 2891583 2774847 2785765 2762450 2739855 2723731 2700333 2652462
5225 2652462 2695637 2762079 2772143 2774944 2808275 2794588 2819245 2888357 2871751 2924917 2900175 2888019
5213 2888019 2868358 2917065 2962522 2955750 3003884 2995473 3003689 3029327 3073328 3154238 3183417 3168743
5201 3168743 3148971 3128677 3160466 3164808 3155934 3119081 3149703 3139880 3149815 3089024 3061041 3103082
5189 3103082 3118974 3109318 3112689 3097570 3097953 3172557 3238151 3261843 3322773 3361757 3382348 3357875
5177 3357875 3444113 3389996 3423473 3480249 3505159 3566376 3601315 3698329 3800505 3892158 3883067
5166 3883067 3895413 3853577 3885472 3954648 4023082 4063585 4066883 4107697 4182298 4168826 4174218 4178905
5154D178905n279J7776K0891l750O0082K4037L8359N2899o251j3818J5733j5221
5142D364363L1221l5627j2770R329K2716M6297Q9925L5830N3619Q5916O8928L4337
5130D794084L3402J2878N3264P6139O7166J9387Q317O0189L8331R3113O5729N3943
5118E375942J12912Q0880J47187J10018J56449Q0207J11637R4705K3495L7988
5108F331420O4181R8847J83103J70343K05854K09364J83772J60666K40631J50561
5098G998742J61962J58903O5638J95187J94505J32642J36878J27301J43644J25693
5088I441095J55699R1611P7047Q5661J19138J67809J65360J42517J71170J47402
5078A0764509K19970K12721J68960J92234J30516N5692J49314J49551J12767J49564
$$ plain form
5154 4178905 4173626 4191402 4212293 4208543 4268625 4292662 4331021 4383920 4377669 4363851 4379584 4364363
5142 4364363 4395584 4359957 4347187 4356516 4379232 4425529 4515454 4551284 4604903 4690819 4759747 4794084
5130 4794084 4827486 4840364 4893628 4969767 5036933 5056320 5064637 5124826 5163157 5256270 5321999 5375942
5118 5375942 5488854 5569734 5716921 5826939 5983388 6063595 6175232 6269937 6293432 6331420
5108 6331420 6395601 6494448 6677551 6847894 7053748 7263112 7446884 7607550 7848181 7998742
5098 7998742 8160704 8319607 8385245 8580432 8774937 8907579 9044457 9171758 9315402 9441095
5088 9441095 9596794 9688405 9765452 9851113 9970251 10138060 10303420 10445937 10617107 10764509
5078 10764509 10984479 11197200 11366160 11558394 11688910 11744602 11893916 12043467 12156234 12305798
5068A2305798J52893K03656J81179K26787K45191K98116K22594L15731K32817
5059A4384762K57421K39251K90807K97503L16156L30269L35745L43081L75581
5050A7170576L87610L99659M46158M03461L14821M31726N53378O47071O26469
5041B1380929O58688O25521P00800O52961P58619P28490P88372Q07389P61028
5032B7862797P51623P70866P91629Q32007Q71260Q77662R19332J051197J046740
5023C5775113J017741R06527Q20315Q24202Q84270R11303J012528J157770J324078
5014D4633847J402809J658767J776995J993229K189454K550921K984252L600919
5006F2791193M487054N795907P174801Q775596J0545595J2769836J5682703J9775201
$$ plain form
5068 12305798 12458691 12662347 12843526 13070313 13315504 13613620 13836214 14151945 14384762
5059 14384762 14642183 14881434 15172241 15469744 15785900 16116169 16451914 16794995 17170576
5050 17170576 17558186 17957845 18404003 18807464 19122285 19554011 20107389 20754460 21380929
5041 21380929 22039617 22665138 23365938 24018899 24777518 25506008 26294380 27101769 27862797
5032 27862797 28614420 29385286 30176915 31008922 31880182 32757844 33677176 34728373 35775113
5023 35775113 36792854 37699381 38519696 39343898 40228168 41139471 42151999 43309769 44633847
5014 44633847 46036656 47695423 49472418 51465647 53655101 56206022 59190274 62791193
5006 62791193 67278247 73074154 80248955 89024551 99570146 112339982 128022685 147797886
4998A47797886K5691878L2911420L8121865M1855872L4081531J3187518p630410
4991C26017560k9677560m3672564m4096852l7562536k9823566k1713124j5031324
4984A04440034j0822688q273778o504921n461956m630414m002274l512208k891688
4976E8340107k397214j868088j491237j143991q39949n98372n72089n10590m69787
4967D8448790m82138l95016k63790k32105j35648k2839J63940L32649N51531O91523
4957D8656897Q96472J069660J303390J514956J770366K096074K538442L248175
4949F3094432M310691N544469P002278Q910007J0994701J3624223J6948937K1521610
4941A51951348K8236798L6424790M1802723L7663581J9398124N87529j4049362
$$ plain form
4998 147797886 173489764 206401184 244523049 286378921 320460452 333647970 326017560
4991 326017560 296340000 252667436 208570584 171008048 141184482 119471358 104440034
4984 104440034 93617346 85343568 78838647 73376691 68746277 64744003 61231795 58340107
4976 58340107 55942893 54074805 52583568 51439577 50599628 50001256 49429167 48918577 48448790
4967 48448790 47966652 47571636 47307846 47075741 46940093 46917254 47081194 47413843 47965374 48656897
4957 48656897 49553369 50623029 51926419 53441375 55211741 57307815 59846257 63094432
4949 63094432 67405123 72949592 79951870 88861877 99856578 113480801 130429738 151951348
4941 151951348 180188146 216612936 258415659 296079240 315477364 316064893 302015531
4934C02015531l4733419m7272661m3649240l5102254k5793799j7824556j2795891
4927H4843711r759237p793327o371229n402889m669908m061168l563097l006973
4919D0215883k517652k142824j744114j486860j404990j265068j197810j223909
4911B7232656j170955j076977j110600r38038p45137o94361o43501n82447m84256
4902A9786384n47459m83448m74667l71371l71598l74884l18951l07990l11188
4893A6224828l02023l51226k93273j97870j06969R06J52722L28243N25295O13105
4883A6593738P66320P01762L2019p28496j120056j263907j118807q23500o56217
4874A2382856n25133l63980k86443k37276j57162o2076j45625m0518j5014q1627
$$ plain form
4934 302015531 267282112 220009451 176360211 141257957 115464158 97639602 84843711
4927 84843711 75084474 67291147 60919918 55517029 50847121 46785953 43222856 40215883
4919 40215883 37698231 35555407 33811293 32324433 30919443 29654375 28456565 27232656
4911 27232656 26061701 24984724 23874124 22936086 22190949 21496588 20853087 20270640 19786384
4902 19786384 19238925 18755477 18280810 17909439 17537841 17162957 16844006 16536016 16224828
4893 16224828 15922805 15571579 15278306 15080436 14973467 14974373 15127095 15455338 15980633 16593738
4883 16593738 17360058 18061820 18093839 17365343 16245287 14981380 13862573 13039073 12382856
4874 12382856 11857723 11493743 11207300 10970024 10812862 10750786 10605161 10564643 10549629 10468002
4864A0468002K606k0668r777N5319O4145L7999J4726J04365j8775j70984j00558
4853A0426400j02249j23184p9358k7388P652N2731K8828j778K4114J1607M9016
4842A0266391m0751J839L6449N6636M8374J9201Q4923J01624O0528N7831J59222
4831A0852267R3957L5301K1845R2757J12688P4815Q2838J49319Q4688J23617J73600
4820A1897692P2386O0807R2692J41415J45801J68742J78671J83965J80595J48433
4810A3271199J53132J98807K73950J61615J64000K16469J96250K14911K32882
4801A5083215K01961J79131K68581L04896K49675L29839L86799L06852L99830
4792A7710779L61403L25923M32186M12980M31307M89535N95709N75884N71630
$$ plain form
4864 10468002 10470608 10449940 10440163 10495482 10559627 10597626 10612352 10716717 10697942 10526958 10426400
4853 10426400 10324151 10200967 10121609 10094221 10101873 10154604 10183432 10181654 10205768 10217375 10266391
4842 10266391 10225640 10227479 10263928 10320564 10368938 10388139 10473062 10574686 10635214 10693045 10852267
4831 10852267 10946224 10981525 11003370 11096127 11208815 11283630 11366468 11515787 11600475 11724092 11897692
4820 11897692 11970078 12030885 12123577 12264992 12410793 12579535 12758206 12942171 13122766 13271199
4810 13271199 13424331 13623138 13897088 14058703 14222703 14439172 14635422 14850333 15083215
4801 15083215 15285176 15464307 15732888 16037784 16287459 16617298 17004097 17310949 17710779
4792 17710779 18072182 18398105 18830291 19243271 19674578 20164113 20759822 21335706 21907336
4783B1907336O10709N63620O23791O61158P02644O25652N33029N14720M80976
4774B7223635K58725K95822L04970K98529L51066L54850M58538N09162O20884
4765C0676181Q09109Q77822Q97427J093576J126645J214330J287534J367864J413700
4756D0764188J308123J211942J129563R64465Q43447N92524L12898J11791k52312
4747D6986629m13574m44603n01091m22732l34030k38972j29146p0983J32165K96077
4737D4859740M35353O38553Q03898R42588J004720J013852R95449J070846Q61113
4728E2626112O54488N07191K73997m2809l44986o29244q02381r46496r66071r62887
4718D9366914q78841q44675p21317m97244l57866k54027o0828K4678J31910J72380
$$ plain form
4783 21907336 22518045 23081665 23705456 24366614 25069258 25694910 26227939 26742659 27223635
4774 27223635 27482360 27778182 28083152 28381681 28732747 29087597 29546135 30055297 30676181
4765 30676181 31485290 32363112 33260539 34354115 35480760 36695090 37982624 39350488 40764188
4756 40764188 42072311 43284253 44413816 45378281 46221728 46814252 47127150 47238941 46986629
4747 46986629 46573055 46128452 45627361 45204629 44870599 44631627 44502481 44431498 44563663 44859740
4737 44859740 45295093 45933646 46737544 47680132 48684852 49698704 50694153 51764999 52626112
4728 52626112 53280600 53787791 54061788 54018979 53673993 53044749 52242368 51295872 50329801 49366914
4718 49366914 48488073 47643398 46922081 46424837 46066971 45812944 45752116 45776794 45908704 46081084
4708D6081084J96920K45244K09327K15592J94720J52561J49764J53025N9572o1718
4698D7596091j52365j78915k67907l20917l37537k99238k08233j45523o1504m6233
4688D5577719L0613J30358J55842K44805K15371L30313L31672K33743Q2738j74258
4678D7158916l11304m72563n30914n33726m91509l38178k87424k62313k74019
4669D3656966l63210m33662n20174o89151q19267q71212q84948r17102r82191
4660C7176049r19861q05337q50182q30751q20221p36862p21900p14910o51177
4651C0124848n76506n40291n27299m52433m12192m93098l76356m20327n20041
4642B5806305n55744n77154n99851o65786p26274p44754p55005p13925p50077
$$ plain form
4708 46081084 46278004 46523248 46732575 46948167 47142887 47295448 47445212 47598237 47657809 47596091
4698 47596091 47443726 47264811 46996904 46675987 46338450 46039212 45830979 45685456 45623952 45577719
4688 45577719 45608332 45738690 45894532 46139337 46354708 46685021 47016693 47250436 47333174 47158916
4678 47158916 46847612 46375049 45844135 45310409 44818900 44480722 44193298 43930985 43656966
4669 43656966 43293756 42860094 42339920 41650769 40831502 39960290 39075342 38158240 37176049
4660 37176049 36256188 35450851 34600669 33769918 32949697 32212835 31490935 30776025 30124848
4651 30124848 29548342 29008051 28480752 28028319 27616127 27123029 26746673 26326346 25806305
4642 25806305 25250561 24673407 24073556 23407770 22681496 21936742 21181737 20467812 19717735
4633A9717735p58163p83795p67187p07599o35487n24636m66727l36427k91239
4624A4446475k25809j15160j20486k46935k99120l60293m22636l83935l55101
4615A1917000k96299j69735j83604j51010l6544p8933n5613L1035k5478m952N0616
4604A0996483p5233n1592n9402o8370n2506k6600N0801L5127L0312J12695J12094
4593A1003809R6231K4484M4022O9397Q3905P4586J14283J48157J34825J08005
4583A1901704J31387K22656J70634J90220J85942K23634K60850L30636K37298
4574A3854961K60241L32910K72560L28541L63657M46900N71630N38683O88805
4565A7658888P74679Q77225R95763J257138J436507J699583J976399K446851K947670
$$ plain form
4633 19717735 18959572 18175777 17408590 16700991 16065504 15540868 15074141 14737714 14446475
4624 14446475 14220666 14105506 13985020 13738085 13438965 13078672 12656036 12272101 11917000
4615 11917000 11620701 11450966 11267362 11116352 11079808 11000875 10945262 10976297 10950819 10945867 10996483
4604 10996483 10921250 10869658 10810256 10741886 10689380 10662780 10713581 10748708 10779020 10891715 11003809
4593 11003809 11100040 11124524 11168546 11237943 11321848 11396434 11510717 11658874 11793699 11901704
4583 11901704 12033091 12255747 12426381 12616601 12802543 13026177 13287027 13617663 13854961
4574 13854961 14115202 14448112 14720672 15049213 15412870 15859770 16431400 16970083 17658888
4565 17658888 18433567 19310792 20306555 21563693 23000200 24699783 26676182 29123033 32070703
4556C2070703L612201M570071N747726P180063Q540950Q915038P785450N587926
4548H4010128K729927p26329m184505o887579q689837r258568q501008p017245
4540D1474984n435585m188203l281669k694303k286617j883087j751905j558695
4532A8394920j345345j234306j125225r51612p42482o13786o24346n87162m42955
4523A0727701m70514m67659l59221l34205l44304k89525k42171k84336k68750
4514G667016j95884j76612j71937j60116j94677j36589j30166j61602j68342j30547
4504F040544j61213o9956o5178j23544n5287q0743o9783m8141j23098j0325j14537
4493E118739q9164j16379r3596p0058j33052j04569o4225n7427n1353o1777m2035
$$ plain form
4556 32070703 35682904 40252975 46000701 53180764 61721714 70636752 78422202 84010128
4548 84010128 86740055 86013726 81829221 74941642 66251805 56993237 48492229 41474984
4540 41474984 36039399 31851196 28569527 25875224 23588607 21705520 19953615 18394920
4532 18394920 17049575 15815269 14690044 13738432 12995950 12382164 11757818 11170656 10727701
4523 10727701 10257187 9789528 9430307 9096102 8751798 8462273 8220102 7935766 7667016
4514 7667016 7471132 7294520 7122583 6962467 6767790 6631201 6501035 6339433 6171091 6040544
4504 6040544 5879331 5809375 5744197 5620653 5565366 5484623 5414840 5366699 5243601 5233276 5118739
4493 5118739 5029575 4913196 4819600 4749542 4616490 4511921 4447696 4390269 4338916 4277139 4235104
4482D235104o3222p9569p2893j24235l6087j1760l8645j3417k2953m1461J3810
4471C744672N353k5100j7606r771L0136j0897j0817L3383k5082K5507M8077q239
4459C779616k5950o0220p8876L9028l9322m4601p742n8020o9958K0480l2347l7755
4447C384333L1758n9737q1450j3343J5472m2322j4437M3209j534L9102L0911k7660
4435C304302n6434O7713k1830o4795k3803J9036K4080n5832n4285l795K3043K5437
4423C182837L2554p420p973j1814N4412R617K935M3944l7560m1915J7407O5299
4411C302323O3162O6245M4273J8018J2131L8563L897J8662O0905L0767L1101n9155
4399C630892p7292j19132j7287j3280n0004k4568j6213K1278L4476p298O072O3714
$$ plain form
4482 4235104 4171882 4092313 4019420 3895185 3859098 3847338 3808693 3795276 3772323 3730862 3744672
4471 3744672 3750025 3724925 3707319 3697548 3727684 3716787 3705970 3739353 3714271 3739778 3787855 3779616
4459 3779616 3753666 3693446 3614570 3653598 3614276 3569675 3561933 3503913 3433955 3454435 3422088 3384333
4447 3384333 3416091 3356354 3274904 3261561 3277033 3234711 3220274 3263483 3261949 3301051 3331962 3304302
4435 3304302 3247868 3315581 3293751 3228956 3205153 3224189 3248269 3192437 3138152 3134357 3157400 3182837
4423 3182837 3215391 3207971 3199998 3188184 3242596 3252213 3255148 3299092 3261532 3219617 3237024 3302323
4411 3302323 3365485 3431730 3476003 3494021 3506152 3544715 3548612 3567274 3628179 3658946 3690047 3630892
4399 3630892 3553600 3434468 3417181 3403901 3353897 3329329 3313116 3334394 3368870 3361572 3367644 3431358
4387C431358O0631K6578R6847P7381Q2208J01155K3126m678l9247q2117n7568
4376C715674j05939j55958j26790l3294r4224l3572k4303m5197J1283k1874n8685
4365C027121j409l2119j8900K0640l4009n771L0509l12J8719q332j5058L0822
4353C011901l670k303M790k512K9468O3966j1092l1992q16K5447l404M1118j0353
4340C110548K0184k8904J6979j3797L2178K7831M7464L5599Q993k6204J4322O5610
4328C310803L7535L9497R6161R0120Q2143P3549J17177J99975J89307J85531J89898
4317D611696L22301K47929J22804j01797k40244k77916k45829k37410j04572o0487
4307D036475j37706j0419J1981j5992p166o109K4877P2920J4447P981L9920O5150
$$ plain form
4387 3431358 3491989 3518567 3615414 3692795 3775003 3876158 3899284 3894606 3855359 3773242 3715674
4376 3715674 3609735 3453777 3326987 3293693 3199469 3165897 3141594 3096397 3107680 3085806 3027121
4365 3027121 3025712 2993593 2974693 2995333 2961324 2955553 2986062 2985750 3004469 2996137 2981079 3011901
4353 3011901 3008231 3005928 3010718 3008206 3037674 3101640 3090548 3058556 3057740 3083187 3079783 3120901 3110548
4340 3110548 3130732 3101828 3118807 3105010 3137188 3165019 3212483 3248082 3257075 3230871 3245193 3310803
4328 3310803 3348338 3387835 3483996 3574116 3656259 3729808 3846985 4046960 4236267 4421798 4611696
4317 4611696 4933997 5181926 5304730 5202933 4962689 4684773 4438944 4201534 4096962 4036475
4307 4036475 3898769 3888350 3900331 3884339 3877173 3871064 3895941 3968861 3983308 3991289 4031209 4096359
4295D096359K2190J2101r583K9474L4297k7194J2161K9917J02679l0410L3426
4284D305417M4383k9298J7282L3275j5208l7918N045r803J7400k5980m1297j9448
4272D243850k6728j1568l8079K8887M7272k3731L0514N4598O5281M8507l999k4573
4260D390231o5845m4781r9596k4035m0434j00074m4563m3251l1886j4261J3102
4249C894607r1329l9374J5030K0280l7374j9529L6047K5497K4251M7349M3881
4238C919336J7499M1070r16P3605L816Q361M2799j449M9350R034J6094p619k1985
4225D148995n2126m3802m7661K1904M439n361k9827J6907M1867L2477n2602Q205
4213D043415P3053J5929k8829j3686L1674L0071L8354K4543Q9507K3358O5471
$$ plain form
4295 4096359 4118549 4130650 4121067 4150541 4184838 4157644 4169805 4199722 4302401 4271991 4305417
4284 4305417 4349800 4320502 4337784 4371059 4355851 4317933 4322978 4313175 4330575 4304595 4263298 4243850
4272 4243850 4217122 4205554 4167475 4196362 4243634 4219903 4250417 4305015 4370296 4418803 4414804 4390231
4260 4390231 4324386 4279605 4180009 4155974 4115540 4015466 3970903 3927652 3895766 3881505 3894607
4249 3894607 3803278 3763904 3778934 3799214 3761840 3742311 3778358 3803855 3828106 3875455 3919336
4238 3919336 3936835 3977905 3976989 4050594 4054410 4062771 4105570 4104121 4153471 4162505 4178599 4170980 4148995
4225 4148995 4096869 4053067 4005406 4027310 4031749 4026388 3996561 4013468 4055335 4087812 4035210 4043415
4213 4043415 4116468 4132397 4103568 4089882 4121556 4151627 4189981 4214524 4304031 4327389 4392860
4202D392860j0565K5179J6689O1370Q6136O5660N289M938J6380J5366K489m870
4190D676921l801k6669L491K2457K451L1972J0435Q113Q174k7655R5578R189M4910
4177D855566Q4854J2539O9980O7591M3766K2379L6795R373P1836M9986l595O3277
4165E384347K1019L5349o808M9471K4222Q2597M5804R8366M0075K6699O8442P2727
4153E942310Q8956L6648R8946K6656P0340J04985M9636Q5355J43127M7905P9988
4142F774852Q6403R7577O5504O2659J31007R6966K2745J19032J29260J05723J45712
4131G837440R5493J04110N5089J02928J74906J38949J15179J92516J85524J71668
4121I173802J34632J72755K25250J89656J32966J53332K23361J46418K39946J70710
$$ plain form
4202 4392860 4382295 4407474 4424163 4485533 4571669 4637329 4642618 4647556 4663936 4679302 4681791 4676921
4190 4676921 4673120 4646451 4649942 4672399 4674850 4706822 4717257 4725370 4733544 4705889 4801467 4810656 4855566
4177 4855566 4940420 4952959 5022939 5090530 5134296 5156675 5193470 5202843 5274679 5324665 5321070 5384347
4165 5384347 5405366 5440715 5433907 5483378 5507600 5590197 5636001 5734367 5774442 5801141 5869583 5942310
4153 5942310 6031266 6067914 6166860 6193516 6263856 6368841 6418477 6503832 6646959 6694864 6774852
4142 6774852 6861255 6958832 7024336 7086995 7218002 7314968 7337713 7456745 7586005 7691728 7837440
4131 7837440 7932933 8037043 8092132 8195060 8369966 8508915 8624094 8816610 9002134 9173802
4121 9173802 9308434 9481189 9706439 9896095 10029061 10182393 10405754 10552172 10792118 10962828
4111A0962828J71778K23779K40325J70004K15018K78853K19658K84303K86931
4102A3053477L38248K61674K91300L48088L01345L86351L18611L01736L47192
4093A5948022L97565L63220L16210K67897L37497L67174M02543L90651M32123
4084A9222902M28980L58639L90565M13322M44143L09583L96419L38272L69727
4075B2672552M32015M48824N05827N54384N05660N06948M54076M13565M22312
4066B6916163M75340L89701M10062N00584M25431M96807N24673N66457O00809
4057C1306027O37304P00310P14837P40577O52527N45618N23084M98266M81220
4048C6799770N65101O58159O65188P50055P87039P46905O23975M96523M49029
$$ plain form
4111 10962828 11134606 11358385 11598710 11768714 11983732 12262585 12482243 12766546 13053477
4102 13053477 13391725 13653399 13944699 14292787 14594132 14980483 15299094 15600830 15948022
4093 15948022 16345587 16708807 17025017 17292914 17630411 17997585 18400128 18790779 19222902
4084 19222902 19651882 20010521 20401086 20814408 21258551 21568134 21964553 22302825 22672552
4075 22672552 23104567 23553391 24059218 24613602 25119262 25626210 26080286 26493851 26916163
4066 26916163 27391503 27781204 28191266 28691850 29117281 29614088 30138761 30705218 31306027
4057 31306027 31943331 32643641 33358478 34099055 34751582 35297200 35820284 36318550 36799770
4048 36799770 37364871 38023030 38688218 39438273 40225312 40972217 41596192 42092715 42541744
4039D2541744L68568L87147M25823M54030N05584M96490O00473O50609P66971
4030D7197439Q82902R39414J077527J152229J190721J069613R14936P19436P58510
4021E5902727R07497R34828R70469J116587J208355J166977J035011P59332M89059
4012F4490842K97787J98538J50188J04339J03550j09566k45212l55724m92776
4003F4141966n20049m90069l17118j48478j01368O250K0628r1573k26409k97782
3993F1975998l28458l14916k30222k52286l12863m86680o38020q63134r97665
3984E7551754j019960j089161j166718j164254j181072j277533j447995j501188
3976D7703873j491498j464150j322040j137022j002908q71684q33101o25203n95894
$$ plain form
4039 42541744 42910312 43297459 43723282 44177312 44682896 45179386 45779859 46430468 47197439
4030 47197439 48080341 49019755 50097282 51249511 52440232 53509845 54424781 55144217 55902727
4021 55902727 56810224 57745052 58715521 59832108 61040463 62207440 63242451 64001783 64490842
4012 64490842 64788629 64987167 65137355 65241694 65345244 65235678 64990466 64634742 64141966
4003 64141966 63621917 63131848 62814730 62666252 62564884 62571134 62591762 62500189 62273780 61975998
3993 61975998 61647540 61332624 61102402 60850116 60537253 60050573 59412553 58549419 57551754
3984 57551754 56531794 55442633 54275915 53111661 51930589 50653056 49205061 47703873
3976 47703873 46212375 44748225 43426185 42289163 41286255 40414571 39581470 38956267 38360373
3967C8360373o00602o18321m80911m78330m74599l81609m59250n26427o21228
3958C3719096p00593p38602o06999n36772m88410m22709m38303m66496n83100
3949B8737112o90992p82140p04668o92683o70590n62762m84872m59503m52450
3940B3236452m18432m23093l63622l36823m24191l27512l32130l04827l45527
3931A9960295l84780k92619l05558k97421k41981j70598k53662k54304l11303
3922A7448069k70245l01988l23023k97234k80724l04022k09466k85709k78053
3913A4897605k26992k57264k24628k14745k04091j77366j46195j63947k04199
3904A3078178j74529j67399j65471k19585j80213j43229j62481j47237j39620
$$ plain form
3967 38360373 37759771 37141450 36660539 36182209 35707610 35326001 34866751 34340324 33719096
3958 33719096 33018503 32279901 31672902 31136130 30647720 30225011 29786708 29320212 28737112
3949 28737112 28046120 27263980 26559312 25866629 25196039 24633277 24148405 23688902 23236452
3940 23236452 22818020 22394927 22031305 21694482 21270291 20942779 20610649 20305822 19960295
3931 19960295 19575515 19282896 18977338 18679917 18437936 18267338 18013676 17759372 17448069
3922 17448069 17177824 16875836 16552813 16255579 15974855 15670833 15461367 15175658 14897605
3913 14897605 14670613 14413349 14188721 13973976 13769885 13592519 13446324 13282377 13078178
3904 13078178 12903649 12736250 12570779 12351194 12170981 12027752 11865271 11718034 11578414
3895A1578414j44359j03983j11493j05268j60877j31210o6160j18784j35712r7444
3885A0403124m8220p4410p1374j08556p7966m4278j9813r374r8092m9430l7016
3874I764595o3389o6376j8355p1147j7826m8436m5429r883m6865m710l4610j154
3862I336415j7806K3936n125M232n7151k9864j3447j8627J854K0009l1596p1786
3850I141044j1040l8383p5408m9595N5311k1797p3055l5961m2993j3540O089k5830
3838H814842o6477K964j3604p913k7882k4519l5407k5743p8949m9599K7299l0624
3826H484388P677O061l8965L7134K5679m1379o7042j7647k7736j8407N2121K7534
3814H429418n8681J2145n6850R601J3153J4753M7407L7226K7314o506j9061J8233
$$ plain form
3895 11578414 11434055 11330072 11218579 11113311 10952434 10821224 10755064 10636280 10500568 10403124
3885 10403124 10354904 10280494 10209120 10100564 10022598 9978320 9958507 9949133 9851041 9801611 9764595
3874 9764595 9701206 9634830 9616475 9545328 9527502 9479066 9433637 9423754 9376889 9372179 9337569 9336415
3862 9336415 9318609 9342545 9337420 9341652 9284501 9254637 9241190 9222563 9224417 9244426 9212830 9141044
3850 9141044 9130004 9091621 9016213 8966618 9021929 9000132 8927077 8891116 8848123 8834583 8840672 8814842
3838 8814842 8748365 8751329 8737725 8729812 8701930 8677411 8642004 8616261 8537312 8487713 8515012 8484388
3826 8484388 8492065 8498126 8459161 8496295 8521974 8480595 8413553 8395906 8368170 8349763 8401884 8429418
3814 8429418 8370737 8382882 8326032 8335633 8348786 8363539 8410946 8448172 8475486 8468980 8449919 8468152
3802H468152K3267o966J03727l5157J4678k7541P6255Q6327J9404l7639N2290
3791H736797O5434m9692q402J02271M8709j3904M6847N251K0458K7100J379N4195
3779I036443Q8629K7310R717j5300L335O651M4896R6574L9374L9650P653N7050
3767I441982L4906J5071J02726J37423R3419K1817J23332J00651n931j5401O6998
3756A0116993l3494J8356N8360J4347M3163M7233k634K6172Q6830K2433o062o7062
3744A0324635M7506J1318L09J827K1206M9160k8232K1713O1798K3585P9709L6530
3732A0651064O841N0512P4553M7892N8293N7389J4135M9293M1962J886M1055J06165
3720A1201040K3849K5875M8491R923l0420P970k3594J2475K2582N3659j2591j8470
$$ plain form
3802 8468152 8491419 8484453 8588180 8553023 8567701 8540160 8616415 8702742 8722146 8684507 8736797
3791 8736797 8802231 8752539 8744137 8846408 8895117 8881213 8928060 8933311 8953769 8980869 8982248 9036443
3779 9036443 9125072 9152382 9162099 9146799 9150134 9156785 9201681 9298255 9337629 9377279 9384932 9441982
3767 9441982 9476888 9491959 9594685 9732108 9825527 9847344 9970676 10071327 10065396 10049995 10116993
3756 10116993 10083499 10101855 10160215 10174562 10217725 10264958 10262324 10288496 10375326 10397759 10391697 10324635
3744 10324635 10372141 10383459 10383768 10385595 10406801 10455961 10427729 10449442 10511240 10534825 10614534 10651064
3732 10651064 10657905 10708417 10782970 10830862 10889155 10946544 10960679 11009972 11051934 11053820 11094875 11201040
3720 11201040 11224889 11250764 11299255 11309178 11278758 11286728 11263134 11275609 11298191 11351850 11339259 11320789
3708A1320789l5135K8325K1992O0776K5524M5510J19836K5554Q88N1452P8616
3697A1744127M3205P2329Q2764J2945M0432J13083k022O6845n064m9P6468K9272
3685A2274335K2067k2660M3460L8038r319P427P3122K2734j9216R6552O6901Q0167
3673A2673608R1294P7576Q4847N5813N3398N2933O2444M3789J07602J40782P8786
3662A3522872P4917R5247Q8310P8171M1887Q3505R9212L1358P2457J07735K8952
3651A4324623R1753J40325J18399J56962N5109N0403P0492J18479O1863J15869
3641A5304277J52434J09076R2075J88911J47659J06895J22013R0055J23424J71199
3631A6608018J30555R7905J82655J36271J70027J74667J90934J78196J36639K04864
$$ plain form
3708 11320789 11285654 11313979 11335971 11396747 11422271 11467781 11587617 11613171 11614059 11665511 11744127
3697 11744127 11787332 11859661 11942425 11955370 11995802 12108885 12106863 12173708 12168644 12168595 12245063 12274335
3685 12274335 12296402 12273742 12317202 12355240 12345921 12353348 12426470 12449204 12429988 12526540 12593441 12673608
3673 12673608 12764902 12842478 12927325 12983138 13036536 13089469 13151913 13195702 13303304 13444086 13522872
3662 13522872 13597789 13693036 13781346 13859517 13901404 13984909 14084121 14115479 14187936 14295671 14324623
3651 14324623 14416376 14556701 14675100 14832062 14887171 14937574 15008066 15126545 15188408 15304277
3641 15304277 15456711 15565787 15657862 15846773 15994432 16101327 16223340 16313395 16436819 16608018
3631 16608018 16738573 16836478 17019133 17155404 17325431 17500098 17691032 17869228 18005867 18210731
3621A8210731J93853J21333J87754J89637J80568J17845K08087K11011J79597
3612A9800416K67334J87048J97834K40926K41212K45055K61382K39012K39753
3603B1919972K94974K67656K31155K51241K35802K56720K54710K88069L29757
3594B4330056L59247L64956L19640K73405L37949L37480L36998L02775K62875
3585B7225381L00354L15354L47653L48997L32531L25242L36144L97816L62618
3576C0292090L99329M01358M18331M06122L80135M93534M47993M34107M25877
3567C4098876M20096M72644M65388M67782M40151M87282M89803M83888N22453
3558C8348363N30638N10725N52058N82436N87661N61161O66166O62389N98211
$$ plain form
3621 18210731 18404584 18525917 18713671 18903308 19083876 19201721 19409808 19620819 19800416
3612 19800416 20067750 20254798 20452632 20693558 20934770 21179825 21441207 21680219 21919972
3603 21919972 22214946 22482602 22713757 22964998 23200800 23457520 23712230 24000299 24330056
3594 24330056 24689303 25054259 25373899 25647304 25985253 26322733 26659731 26962506 27225381
3585 27225381 27525735 27841089 28188742 28537739 28870270 29195512 29531656 29929472 30292090
3576 30292090 30691419 31092777 31511108 31917230 32297365 32790899 33238892 33672999 34098876
3567 34098876 34518972 34991616 35457004 35924786 36364937 36852219 37342022 37825910 38348363
3558 38348363 38879001 39389726 39941784 40524220 41111881 41673042 42339208 43001597 43599808
3549D3599808O33695P85348P37044P66406Q50735Q16937Q82096Q60459R51296
3540E0883824R46866R57285J003514J067392J082658J058525J056537J092502
3532E9149103J051956J084393J091587J117836J062742J163431J180845J177359
3524F8079252J224015J253841J260545J297630J372311J416472J452426J490775
3516G8847267J570626J687399J665032J785019J854301J927240K104986K221954
3508I3663824K231267K368938K539711K793001L044145L405122L737393M080179
3500A17863580M516077M992221N483605O050591O811704P516008Q220933R024244
3492A70478963R714058J0381021J1005066J1215052J1201439J0591140R207368
$$ plain form
3549 43599808 44233503 45018851 45755895 46522301 47373036 48189973 49072069 49932528 50883824
3540 50883824 51830690 52787975 53791489 54858881 55941539 57000064 58056601 59149103
3532 59149103 60201059 61285452 62377039 63494875 64557617 65721048 66901893 68079252
3524 68079252 69303267 70557108 71817653 73115283 74487594 75904066 77356492 78847267
3516 78847267 80417893 82105292 83770324 85555343 87409644 89336884 91441870 93663824
3508 93663824 95895091 98264029 100803740 103596741 106640886 110046008 113783401 117863580
3500 117863580 122379657 127371878 132855483 138906074 145717778 153233786 161454719 170478963
3492 170478963 180193021 190574042 201579108 212794160 223995599 234586739 243794107
3485B43794107O852922L472284q36219n523984r659528j2364377j3222139j2661114
3477A99851952j1381860r952703q673691p590909o785965o003408n294696m769554
3469A39399166m264728m011864l571099l244923k903952k560440k251264j938577
3461A14652319j828935j753769j889531k077999k234108k236239k186713k117818
3453I8327207k103550k076083k156636k083284k114804k079488k152100k057719
3445H1503543k097521j969487j965288j901884j772452j737344j637160j506312
3437F6916095j415329j385198j263269j061577r64961q36696o31335m01082k17139
3428E8739509k80793n88820j153196j575591j683299j569072j445744j339526
$$ plain form
3485 243794107 250647029 254119313 253283094 247759110 238099582 225735205 212513066 199851952
3477 199851952 188470092 178517389 169843698 162252789 155466824 149463416 144168720 139399166
3469 139399166 135134438 131122574 127551475 124306552 121402600 118842160 116590896 114652319
3461 114652319 112823384 111069615 109180084 107102085 104867977 102631738 100445025 98327207
3453 98327207 96223657 94147574 91990938 89907654 87792850 85713362 83561262 81503543
3445 81503543 79406022 77436535 75471247 73569363 71796911 70059567 68422407 66916095
3437 66916095 65500766 64115568 62852299 61790722 60825761 59989065 59357730 58956648 58739509
3428 58739509 58458716 57869896 56716700 55141109 53457810 51888738 50442994 49103468
3420D9103468j149670j007827r85737q20854p85849p82247p08469n85996o40526
3411D1636293n66227n05644n99651m83412m66288m17060m06654m42399l50157
3402C7398801k44129j70660k23324j55173r5790n9034J3237n9114l36636n55404
3392C5512774o75050o92058o40872n81949n28295m75584l63095l43901k74089
3383C0937881k86213m09883l20826l38370k93365k97115k89917k56917k85027
3374B8160248l05332k04633k28188k42504k07137k67845k42222j96620k10772
3365B6054995j79552j32650j52398k11677k04976j55185j59192j14958j24944
3356B4619463j71675j61140j35184j38105j48643j64977j18941j52938p3766j28163
$$ plain form
3420 49103468 47953798 46945971 45960234 45139380 44353531 43571284 42862815 42276819 41636293
3411 41636293 41070066 40564422 39964771 39481359 39015071 38598011 38191357 37748958 37398801
3402 37398801 37154672 36984012 36760688 36605515 36509725 36450691 36463928 36404814 36068178 35512774
3392 35512774 34837724 34145666 33504794 32922845 32394550 31918966 31555871 31211970 30937881
3383 30937881 30651668 30241785 29920959 29582589 29289224 28992109 28702192 28445275 28160248
3374 28160248 27854916 27650283 27422095 27179591 26972454 26704609 26462387 26265767 26054995
3365 26054995 25875443 25742793 25590395 25378718 25173742 25018557 24859365 24744407 24619463
3356 24619463 24447788 24286648 24151464 24013359 23864716 23699739 23580798 23427860 23354094 23225931
3346B3225931j66251j32899r2581o7944j62783n8047q0272r3034j25189q2217
3336B2164714q7603j11699q3696p5675j05226o4679q7776p8469j04327n3798q041
3325B1303725j07694p2852n8162m0325j28382j36435m7483l9775j32958j71793
3315B0367866r5268j68562r5576q2253j39232j23996j19124j63240j55503r8083
3305A9127029j60606o8209j21944j57622j30881j15025j04744m9426m0053q3022
3295A8095497o9899r5701n7079q3808j10914m0815k0156r8904r0820r5519r4694
3284A7237188j72335j88327j38036j72867j10446j70487j33177j14802j25144
3275A5911567j20790j23555q5699r3217p8723q9848r5525l6975o9137Q617l0091
$$ plain form
3346 23225931 23059680 22926781 22834200 22766256 22603473 22545426 22465154 22372120 22246931 22164714
3336 22164714 22077111 21965412 21881716 21806041 21700815 21636136 21548360 21469891 21365564 21311766 21303725
3325 21303725 21196031 21123179 21065017 21024692 20896310 20759875 20712392 20672617 20539659 20367866
3315 20367866 20272598 20104036 20008460 19926207 19786975 19662979 19543855 19380615 19225112 19127029
3305 19127029 18966423 18898214 18776270 18618648 18487767 18372742 18267998 18218572 18178519 18095497
3295 18095497 18025598 17929897 17872818 17789010 17678096 17637281 17617125 17518221 17427401 17331882 17237188
3284 17237188 17064853 16876526 16738490 16565623 16455177 16284690 16151513 16036711 15911567
3275 15911567 15790777 15667222 15581523 15488306 15409583 15319735 15224210 15187235 15118098 15126715 15096624
3264A5096624k0794K5653m7946l328K2178l1885K4283J6166M8043M1819J8343
3253A5189156L0241M9400m5179N587M5686N2781J9575J922J1533k6738L0107M1092
3241A5405163J02770R7444J12059Q0065R4231O5979J47068J33443J50696J57255
3231A6546173R7398R2083K04266K13244J38957J54642J44744J66848J87126K20655
3221A8166136K07636J87791J71796J73286K36347K51350J95919K14057J45910
3212A9950228K11747J46181R7936J41801J67227J42366K12541K83326J98846K50907
3202B1803106K84274J86037K49345L32825L39643L83840L75835L77086M54596
3193B4786587M91537N04243N70202N49759N69814M67956N13795N55744O14582
$$ plain form
3264 15096624 15075830 15101483 15053537 15050209 15072387 15040502 15064785 15080951 15128994 15170813 15189156
3253 15189156 15219397 15268797 15223618 15229205 15274891 15327672 15347247 15349169 15360702 15333964 15364071 15405163
3241 15405163 15507933 15605377 15717436 15797501 15891732 15957711 16104779 16238222 16388918 16546173
3231 16546173 16643571 16735654 16939920 17153164 17292121 17446763 17591507 17758355 17945481 18166136
3221 18166136 18373772 18561563 18733359 18906645 19142992 19394342 19590261 19804318 19950228
3212 19950228 20161975 20308156 20406092 20547893 20715120 20857486 21070027 21353353 21552199 21803106
3202 21803106 22087380 22273417 22522762 22855587 23195230 23579070 23954905 24331991 24786587
3193 24786587 25278124 25782367 26352569 26902328 27472142 27940098 28453893 29009637 29624219
3184B9624219O88535P07677Q34537Q91582R45011R58242J041505J019384R95359
3175C7706051J035548J009804J029226R62018Q66643P88360O71347M73764M19649
3166D4962410L16881L75592L83682M13205M79178N74772O18961P12632Q67310
3157D9704623R53199J113500J298559J540827J685106J906525K089837K213346
3149F2505522K392960K579256K776766K881089K919264K746387K307207J516988
3141H2625439N49083o41091j781972k753556l177513k897630k308652j618245
3133F7995863j018584m25630m143L12721O64046R66535J173072J408569J559866
3124G2632315J697807J778950J765247J828516J784540J689868J585621J133359
$$ plain form
3184 29624219 30312754 31020431 31854968 32746550 33691561 34649803 35691308 36710692 37706051
3175 37706051 38741599 39751403 40780629 41742647 42609290 43397650 44068997 44542761 44962410
3166 44962410 45279291 45654883 46038565 46451770 46930948 47505720 48124681 48837313 49704623
3157 49704623 50657822 51771322 53069881 54610708 56295814 58202339 60292176 62505522
3149 62505522 64898482 67477738 70254504 73135593 76054857 78801244 81108451 82625439
3141 82625439 83174522 82533431 80751459 77997903 74820390 71922760 69614108 67995863
3133 67995863 66977279 66551649 66547506 66860227 67524273 68490808 69663880 71072449 72632315
3124 72632315 74330122 76109072 77874319 79702835 81487375 83177243 84762864 85896223
3116H5896223O56569j39160r32481j575916j946127k055959k137426k478845k903965
3107G2382913l068766k858975k312966j838342j360812j011655p28806l96967
3099E8805624j33262J26100K14333K17198J92030L0625k85869n53684p25038j024767
3089E6863290j179573j432110j844515k296314k550520k592078k497151k213455
3081D0257574j960256j792742j637228j453901j342773j225654j168280j059576
3073B8617164r19222q30385p40432o43045o15872n96109m29227n06590m65476
3064B2870806m42274o08585n43829o48047p06380o06953n92770o25571n73443
3055A7522954n30783m84411m90662m15819m16486m15292l43805l03107l14502
$$ plain form
3116 85896223 86552792 86413632 85481151 83905235 81959108 79903149 77765723 75286878 72382913
3107 72382913 69314147 66455172 64142206 62303864 60943052 59931397 59202591 58805624
3099 58805624 58672362 58798462 59012795 59229993 59422023 59452648 59166779 58613095 57888057 56863290
3089 56863290 55683717 54251607 52407092 50110778 47560258 44968180 42471029 40257574
3081 40257574 38297318 36504576 34867348 33413447 32070674 30845020 29676740 28617164
3073 28617164 27697942 26867557 26127125 25484080 24868208 24272099 23842872 23336282 22870806
3064 22870806 22428532 21819947 21276118 20628071 19921691 19314738 18721968 18096397 17522954
3055 17522954 16992171 16507760 16017098 15601279 15184793 14769501 14425696 14122589 13808087
3046A3808087l76554l21135m18727l32630k71155k89352l18672k41092j57155
3037A1081615j56366j86063j47184q6173j11503r2340o2130j54159j87391j37929
3027I760377j01281j81261j62876j22419j49550j86373k18897j62458j40019j87625
3017H147618k00667j83327k52186j67023j43514j56684j48017j12973j26941j10143
3007F546143j00829m5671n5176n8925l9852j02269k8405q4722k7009k9333j09324
2996E864628j54850j12275o9124j28162j39528j80982r0422n2862j23665j37476
2986D675282q8631l7622p4713j18305l4409j18123j10452j18401j01522j7396
2976C855708l9841n6000l6958p1028p1414n2638l1091n4079k6995m2945o1095
$$ plain form
3046 13808087 13431533 13110398 12691671 12359041 12087886 11798534 11479862 11238770 11081615
3037 11081615 10925249 10739186 10592002 10505829 10394326 10301986 10239856 10085697 9898306 9760377
3027 9760377 9659096 9477835 9314959 9192540 9042990 8856617 8637720 8475262 8335243 8147618
3017 8147618 7946951 7763624 7511438 7344415 7200901 7044217 6896200 6783227 6656286 6546143
3007 6546143 6445314 6399643 6344467 6285542 6245690 6143421 6115016 6030294 6003285 5973952 5864628
2996 5864628 5709778 5597503 5528379 5400217 5260689 5079707 4989285 4936423 4812758 4675282
2986 4675282 4586651 4549029 4474316 4356011 4321602 4203479 4093027 3974626 3873104 3855708
2976 3855708 3815867 3759867 3722909 3651881 3580467 3527829 3496738 3442659 3415664 3372719 3311624
2965C311624o6256p8801l1567n1454j1767n3874o5015m1547l7703o7456J1646
2954B817830j5335l3003m4027p0789m5807k7523K117J4810l7161k1674l8925j8154
2942B482359n2239n039j3503l1252j2844j6327L6778k3563l8498k9110m129j1014
2930B281619Q324m1018j0183j2527k3840k5239l1826J5343L3316n1130k2013j3872
2918B106954j2931n0149j8344l2394l4131n236m556k1705J9510j1116Q883j4180
2906A930605j8431j9715o3702M2670J7757o3865J996j1487J3816q813j8755M7238
2894A849314m8662O650l4305N2506J6946j4257k8916n4533n8415J5081J346K317
2882A705072K246R244o4320l860K5506o939k2429m4556p35M3077m2712k7996O4138
$$ plain form
2965 3311624 3245368 3166567 3135000 3083546 3071779 3017905 2952890 2911343 2873640 2806184 2817830
2954 2817830 2802495 2769492 2725465 2654676 2608869 2581346 2583463 2598273 2561112 2539438 2500513 2482359
2942 2482359 2430120 2425081 2411578 2380326 2367482 2351155 2387933 2364370 2325872 2296762 2292633 2281619
2930 2281619 2289943 2248925 2238742 2226215 2202375 2177136 2145310 2160653 2193969 2142839 2120826 2106954
2918 2106954 2094023 2043874 2025530 1993136 1959005 1953769 1949213 1927508 1947018 1935902 1944785 1930605
2906 1930605 1912174 1892459 1828757 1871427 1889184 1825319 1827315 1815828 1829644 1820831 1802076 1849314
2894 1849314 1800652 1807302 1772997 1825503 1842449 1828192 1799276 1744743 1686328 1701409 1702755 1705072
2882 1705072 1707318 1716562 1652242 1648382 1673888 1666949 1644520 1599964 1599229 1642306 1599594 1571598 1635736
2869A635736k237k4353n357l823q885J4916J3291L0775l208K1384J1014l3530
2857A645723J1841j9854n7971o294L927j5990o4424k4129j4166k5447q488K2600
2845A447328k9161J1289q939Q768j3570K9385l2399k3221L4606j495M1937l022
2833A461506J0246l1126l282m0359k2087l188m990L772m9584m2249J653j5347
2821A264965K872J9805o131o8049n0844L5943L8300k9793m7694j5398m945J1148
2809A150179P039l6366K8739J2114n0774k9628k878k8896k3639k786K7818O4097
2797A115019m5614n6983q5680j4955M4817N546o4632K3398l4988j4220M4553k6460
2785H89801n4976m234k4041K6176J0244k9695K8744k9698j0829L5293L967j7419
$$ plain form
2869 1635736 1633499 1609146 1603789 1599966 1591081 1605997 1619288 1650063 1646855 1668239 1679253 1645723
2857 1645723 1657564 1637710 1579739 1573445 1577372 1561382 1496958 1472829 1458663 1433216 1424728 1447328
2845 1447328 1418167 1429456 1420517 1429285 1415715 1445100 1412701 1389480 1424086 1422591 1464528 1461506
2833 1461506 1471752 1440626 1437344 1396985 1374898 1371710 1366720 1370492 1320908 1278659 1280312 1264965
2821 1264965 1267837 1287642 1281511 1213462 1162618 1198561 1236861 1207068 1159374 1143976 1139031 1150179
2809 1150179 1157218 1120852 1149591 1161705 1110931 1081303 1078425 1049529 1025890 1023104 1050922 1115019
2797 1115019 1069405 1012422 926742 911787 956604 962150 897518 920916 885928 871708 916261 889801
2785 889801 834825 830591 806550 832726 842970 813275 842019 812321 801492 836785 840752 823333
2773H23333k4178n486M1141K2437j5191l2323j0311l0370k0042J3202L9268M724
2761H06204o5308n5786L6933J4429m4742k3101q209O587J3860q190J0438M3543
2749G26658n3021l2691L3725j6597Q315l9760j0426Q209J3850J7095j9936o2183
2737E73238j0306J0899p30k405K6498l4572j4357J8334j3886N2761k8998l5021
2725E41455J2964l950j8277k1569K9931L9607q016k2836n4889M296K3310K0831
2713E42857P988j8830k4300o726j2563l8588k1496l6705M900K4881L4789l816
2701D52391r974L7777k7250n9600J0566J8066j3019l9312J9291R326k8357j8497
2689C51408j5595q219K3884j5614p0779L9352j505N941K7041J0718j7614m3990
$$ plain form
2773 823333 799155 793669 834810 857247 842056 809733 799422 769052 749010 762212 801480 806204
2761 806204 740896 685110 722043 736472 691730 668629 660420 667007 680867 672677 683115 726658
2749 726658 673637 640946 674671 658074 666389 626629 616203 624412 638262 655357 635421 573238
2737 573238 562932 573831 573101 570696 597194 562622 548265 566599 552713 605474 576476 541455
2725 541455 554419 550469 532192 510623 540554 580161 572145 549309 494420 498716 522026 542857
2713 542857 550845 532015 507715 500989 488426 449838 428342 391637 396537 421418 456207 452391
2701 452391 442417 480194 452944 393344 403910 421976 408957 369645 388936 398262 369905 351408
2689 351408 335813 327594 351478 335864 265085 304437 302932 308873 335914 346632 329018 285028
2677B85028N8582k2880k4949k3412N242K1384k3317j7830m03k4360M4413L6385
2665C13883k7124L224k8524j1148J185l4740q158P9757R930q5838m5787K2724
2653A89384J1095J0135P33N1574j0921M0537j0922n2065j7993M689l308l6136
2641A76802N8492L039J6115p489p1398J0142J8799l1841k613j3668j4188L9095
2629A81287K5410M779r401n6203n33K2707l5354l1248K5533m714n548m684N5373
2616A67404K4072p1298Q407L8821J1568J3820j793o531N776n1102J1795r579k0954
2603A20406j1376m8427J3123j2222Q3469J5960k756k2038m3119N759j1701q993
2591G8085m0006J6378L6089J5542k2757r849l5982l5043N5604j6283K566j571
$$ plain form
2677 285028 343610 320730 295781 272369 277611 298995 275678 257848 257445 233085 277498 313883
2665 313883 286759 289983 261459 250311 251496 216756 208598 288355 298285 212447 166660 189384
2653 189384 200479 210614 211347 262921 252000 292537 281615 229550 211557 216246 212938 176802
2641 176802 235294 238333 254448 246959 175561 185703 204502 172661 170048 156380 142192 181287
2629 181287 206697 211476 202075 145872 145339 168046 132692 101444 126977 122263 116715 112031 167404
2616 167404 191476 120178 128585 167406 178974 192794 191001 184470 190246 139144 150939 141360 120406
2603 120406 109030 60603 73726 61504 144973 160933 158177 136139 93020 98779 87078 78085
2591 78085 38079 54457 90546 106088 83331 73482 37500 2457 58061 41778 44344 42773
2579D2773L6241M761L4478M4558r3523k5293j8875J2488J9573O8808o8703k0062
2567C7224L4706l5577m85J2188M589M052k0469O045j8924K2780r075l5327k3843
2554b2116J0663K5619N2715R181j4564p268j5597R389j9073l4951L659N2564k1220
2541B9001r547j5550j1402J203j7672N2973m930j4750j0073j3350M665M2856K7670
2528F1094j1076O302m1569Q546M8885n3956J3361K4390p6386N9084J4204K6923
2516G9802k0020J1261K3070K763l4763k4487k2042J8467K4311n1865k0957M226
2504a0234K0327M391q1244J4640K1532M6599J4787l2195Q761j5691M9216J3976
2492E4865n0977J7291O1759k2831K2322k9363n2463M075k8709R636m1191l3804
$$ plain form
2579 42773 79014 83775 118253 162811 69288 43995 25120 37608 57181 125989 57286 37224
2567 37224 71930 36353 35868 48056 52645 56697 36228 42273 23349 46129 37054 1727 -22116
2554 -22116 -11453 14166 66881 76062 61498 54230 38633 48022 28949 -6002 -2343 50221 29001
2541 29001 19454 3904 -7498 -6295 -23967 29006 24076 9326 -747 -14097 -9432 33424 61094
2528 61094 50018 56320 14751 23297 72182 18226 31587 55977 -20409 38675 52879 79802
2516 79802 59782 71043 94113 96876 62113 37626 15584 34051 58362 6497 -14460 -10234
2504 -10234 10093 14484 -66760 -52120 -30588 16011 30798 -1397 7364 -8327 40889 54865
2492 54865 3888 21179 82938 60107 82429 53066 603 4678 -24031 -14395 -55586 -89390
2480h9390P0899K8514J871J4051K130p995p529L5330J7725N290j73j5652k764
2467E2307j0160l1574N3538j6155m957J1549k7586J1385K1132J0820n6749K3475
2455C7025L3616P940K4010j2239o057K872k9966Q060j2563O4323l1452K2906P0896
2442A79371k9057J4001j8339K2031l54l3121k2273n003J3566k8217J7638J7283
2430A27526K707K0934k094N3636k8715j9597J7951K8772k1870O152O160m653r014
2417A77895J4296L8026l4038l582j5443j98M6553j5475k6380L0991Q26L0651L077
2404B47199Q521O645r875J1539J9359J2882N5742Q675q098n5361J626L7015L1776
2391C67645K7305J6829J0347q783j2632O1613J8819j4232j5500K8635M3294Q328
$$ plain form
2480 -89390 -18491 10023 11894 25945 28075 20080 12551 47881 65606 70896 70723 55071 52307
2467 52307 42147 10573 64111 47956 42999 54548 26962 38347 59479 70299 13550 37025
2455 37025 70641 78581 102591 90352 84295 87167 57201 65261 52698 117021 85569 108475 179371
2442 179371 150314 164315 145976 168007 167653 134532 112259 107256 120822 92605 110243 127526
2430 127526 130233 151167 149073 202709 173994 154397 172348 201120 179250 185402 191562 186909 177895
2417 177895 192191 230217 196179 192597 177154 176956 223509 208034 181654 212645 213471 244122 247199
2404 247199 255720 262365 252490 264029 283388 296270 352012 360687 352589 297228 298854 335869 367645
2391 367645 394950 411779 422126 413343 400711 462324 481143 466911 451411 480046 523340 531668
2379E31668j9132J3350M0502L0477O387N9728Q4144j4236K4794O7134n291m1056
2367G78469P6780N0351K5997N9254M3791L3917J13268J38747J13329R8403L3401
2356A565707N6585N3233J56023K20146K39734K81693M28205N88103O70806P88036
2346E048271J106981J555707K431428J869336r14946k542781k362587j468181
2338D723228r40163o86544n25156l23718j88531k12613j89628j24470j04880l0133
2328A397392p5950r6987j15552j46406j40375n015k6934q8580o5890k3052n0228
2317E62423o8294l0189p466l1362m4625J8679l9346r930l9324j2440J0698j7424
2305B91400J157p1563J65J5881l8466K076j974r651J3869k4235p4761k2446o748
$$ plain form
2379 531668 512536 525886 566388 596865 603252 662980 747124 732888 757682 824816 819525 778469
2367 778469 855249 905600 931597 990851 1034642 1068559 1181827 1320574 1433903 1532306 1565707
2356 1565707 1622292 1675525 1831548 2051694 2291428 2573121 3001326 3589429 4260235 5048271
2346 5048271 6155252 7710959 10142387 12011723 11096777 8553996 6191409 4723228
2338 4723228 3783065 3096521 2571365 2247647 2059116 1846503 1656875 1532405 1427525 1397392
2328 1397392 1321442 1224455 1108903 962497 822122 817107 790173 701593 635703 612651 562423
2317 562423 494129 463940 456474 425112 380487 399166 359820 349890 310566 298126 308824 291400
2305 291400 292557 220994 221159 237040 198574 200650 198676 189025 202894 178659 103898 81452 74704
2292G4704l225j58L3877K182L537J5964K259l2312k0443j3291j0980l6163P3652
2279H9603K0869j2973n5713Q1612k0642l0632P842k8890K2263n0551l8401l14
2267a5927M0658k0003p880K7491J572j8822P751m1755O1163M051J7499m557l0095
2254B1146j2402m3181M0622P432R149K1019K140l5611k5125k5077O64J1394J9013
2241h817m848m0038L0629k497j26m2183K3050J3617l6343J0066l0261p852O8650
2228b6953K1158j393L7920j0466r918p944n1567k832q661J762o7927j8819J36596
2215i044p311l3780j8600K8405N96K8700J2710m625j2875K5883j8386J0065K6554
2202B8292m0003J2681R533l6353J4589J7335j7025m4989P168j302l7080j8719
$$ plain form
2292 74704 71479 71321 105198 107380 110917 126881 129140 96828 76385 63094 52114 15951 89603
2279 89603 110472 97499 41786 123398 102756 72124 79966 51076 73339 22788 -15613 -15927
2267 -15927 24731 4728 -3152 24339 25911 7089 14840 -26915 34248 38299 55798 51241 21146
2254 21146 8744 -34437 6185 13617 22766 43785 45925 10314 -14811 -39888 -39224 -27830 -8817
2241 -8817 -13665 -53703 -23074 -25571 -25697 -67880 -44830 -31213 -67556 -57490 -87751 -95603 -26953
2228 -26953 -5795 -7188 30732 20266 10348 2404 -49163 -51995 -60656 -58894 -126821 -145640 -9044
2215 -9044 -16355 -50135 -68735 -40330 -39734 -11034 1676 -2949 -15824 10059 -8327 1738 28292
2202 28292 -11711 970 10503 -25850 -11261 6074 -10951 -55940 -48772 -50074 -87154 -105873
2190a05873J5863M7584j5080J5525K6703K5712o2255m240l1614N2738l497l686
2178d2120R717k7300K896K1685N021j4666l387K4398l593L3877K5624l957k9181
2165i86l4641l9879j730k0095K9159K2765j2416K1888k6633K4283J2941p985k4277
2152e7606k0751P095L761q186Q533J7711K4001m9440l4457O376M5753l0374N2191
2139c5393J0645k0226j3162j2741l8048N6651J1415r228K1295k6427p688O674
2127e6233m327k0370L5941M6262L3495m5093n4613O2525J6626j7107k8650n7486
2115h9030N80p861J2100m978J1245K8349o971o782l5309N794L9219J1804l8529
2102h0369P914L4776J2721k9694l0817N9546k7764o0480J3691M0555J0810K4005
$$ plain form
2190 -105873 -90010 -42426 -57506 -41981 -15278 10434 -51821 -56061 -87675 -34937 -38434 -42120
2178 -42120 -32403 -59703 -56807 -35122 -30101 -44767 -48154 -23756 -27349 6528 32152 28195 -986
2165 -986 -35627 -75506 -77236 -97331 -68172 -45407 -57823 -35935 -62568 -38285 -25344 -33329 -57606
2152 -57606 -78357 -71262 -67501 -75687 -67154 -49443 -25442 -74882 -109339 -102963 -57210 -87584 -35393
2139 -35393 -24748 -44974 -58136 -70877 -108925 -52274 -40859 -50087 -28792 -55219 -62907 -56233
2127 -56233 -60560 -80930 -44989 1273 34768 -10325 -64938 -2413 14213 -2894 -31544 -89030
2115 -89030 -88450 -96311 -84211 -89189 -77944 -49595 -56566 -63348 -98657 -92863 -53644 -41840 -80369
2102 -80369 -72455 -37679 -24958 -54652 -85469 -25923 -53687 -114167 -100476 -59921 -49111 -25106
2090b5106J4368R312n3696m5874j191O9387j1664K5651l7573K3348J11587m5976
2078C2573j0309J0531m356k8087K4286m3513L0992M6253q7602J1N8353K333q8112
2065e6647J1317l3085K933K8806j0669p0851Q0197N3640j1081m0447m2496Q0147
$$ plain form
2090 -25106 -10738 -1426 -55122 -100996 -102187 -32800 -44464 -18813 -56386 -33038 78549 32573
2078 32573 22264 32795 28439 352 24638 -18875 12117 58370 -29232 -29221 29132 31465 -56647
2065 -56647 -45330 -78415 -75482 -46676 -57345 -128196 -47999 5641 -5440 -45887 -88383 -8236
$$ [...]
##END NTUPLES=NMR SPECTRUM
##END=
