##TITLE=1H_CG-1191-b
 CDCl3
 8 sc, 
 15.3.2024
##JCAMPDX= 6.0         $$ Bruker NMR JCAMP-DX V2.0
##DATA TYPE= NMR SPECTRUM
##DATA CLASS= NTUPLES
##ORIGIN= UXNMR, Bruker Analytische Messtechnik GmbH
##OWNER= root
$$ XWIN-NMR		Version 3.5
$$ Fri Mar 15 14:03:08 2024 Russian Standard Time (UT+4h)  she@DPX200
##.OBSERVE FREQUENCY= 200.1313
##.OBSERVE NUCLEUS= ^1H
##.ACQUISITION MODE= SIMULTANEOUS
##.ACQUISITION SCHEME= undefined
##.AVERAGES= 8
##.DIGITISER RES= 18
##SPECTROMETER/DATA SYSTEM= spect
##.PULSE SEQUENCE= zg30
##.SOLVENT NAME= CDCl3
##.SHIFT REFERENCE= (INTERNAL, CDCl3, 0, 15.4296)
##AUDIT TRAIL= $$ (NUMBER, WHEN, WHO, WHERE, WHAT)
$$ ##TITLE= Audit trail, XWIN-NMR		Version 3.5
$$ ##JCAMPDX= 5.01
$$ ##ORIGIN= Bruker BioSpin GmbH
$$ ##OWNER= she
$$ F:/spectra/data/she/nmr/H-F/1/pdata/1/auditp.txt
$$ ##AUDIT TRAIL=  $$ (NUMBER, WHEN, WHO, WHERE, WHAT)
(   1,<2024-03-15 14:01:48.46 +0400>,<she>,<DPX200>,
      <created by zg, POWCHK disabled, PULCHK disabled
       configuration hash MD5:
       00 E9 B6 7A A2 85 ED C7 34 08 36 98 17 FE 4E 26
       data hash MD5: 16K
       72 45 23 EC 5D F0 3D 13 7B F0 08 A2 9F B6 D4 F5>)
(   2,<2024-03-15 14:01:50.56 +0400>,<she>,<DPX200>,
      <Start of raw data processing
       efp BC_mod = 2 LB = 0.24 FT_mod = 6 PKNL = 1 PHC0 = -25302.76 PHC1 = 10.38731 SI = 16K 
       data hash MD5: 16K
       D6 68 A6 90 31 66 5E 0D 37 02 6D 0C D5 6E 9E DE>)
(   3,<2024-03-15 14:02:18.67 +0400>,<she>,<DPX200>,
      <pk PHC0 = 0.1685136 PHC1 = -1.490116e-08 
       data hash MD5: 16K
       22 6D A3 9C 58 78 62 DB DF EC 5C FB 03 1B 72 7B>)
(   4,<2024-03-15 14:02:22.09 +0400>,<she>,<DPX200>,
      <abs ABSG = 5 
       data hash MD5: 16K
       3E 30 9E 7C DD CE A1 B5 02 36 ED 88 9E 04 32 07>)
$$ ##END=
$$ 
$$ hash MD5
$$ CB F3 98 ED 9E 11 23 B2 DA 18 C4 2E 3A C0 09 6A
##$RELAX= 
##$RELAX= 
##$RELAX= 
##$RELAX= 
##$RELAX= 
##$RELAX= 
$$ Bruker specific parameters
$$ --------------------------
##$DU= <F:/spectra>
##$EXPNO= 1
##$NAME= <H-F>
##$PROCNO= 1
##$TYPE= <nmr>
##$USER= <she>
##$AMP= (0..31)
100 100 100 100 100 100 100 100 100 100 100 100 100 100 100 100 100 100 
100 100 100 100 100 100 100 100 100 100 100 100 100 100 
##$AQSEQ= 0
##$AQ_mod= 1
##$AUNM= <au_zg>
##$AUTOPOS= <>
##$BF1= 200.13
##$BF2= 200.13
##$BF3= 200.13
##$BF4= 200.13
##$BF5= 200.13
##$BF6= 200.13
##$BF7= 200.13
##$BF8= 200.13
##$BYTORDA= 1
##$CFDGTYP= 0
##$CFRGTYP= 5
##$CHEMSTR= <none>
##$CNST= (0..31)
1 1 145 1 1 1 1 1 1 1 1 1 1 1 1 1 1 1 1 1 1 1 1 1 1 1 1 1 1 1 1 1 
##$CPDPRG= <>
##$CPDPRG1= <>
##$CPDPRG2= <>
##$CPDPRG3= <>
##$CPDPRG4= <mlev>
##$CPDPRG5= <mlev>
##$CPDPRG6= <mlev>
##$CPDPRG7= <mlev>
##$CPDPRG8= <mlev>
##$CPDPRGB= <>
##$CPDPRGT= <>
##$D= (0..31)
0 1.2 0 0 0 0 0 0 0 0.06 0 0.03 0 0 0 0 0.0002 0 0 0 0 0 0 0 0 0 0 0 0 
0 0 0 
##$DATE= 1710496907
##$DBL= (0..7)
120 120 120 120 120 120 120 120 
##$DBP= (0..7)
150 150 150 150 150 150 150 150 
##$DBP07= 0
##$DBPNAM0= <>
##$DBPNAM1= <>
##$DBPNAM2= <>
##$DBPNAM3= <>
##$DBPNAM4= <>
$$ [...]
##$SUBNAM3= <"">
##$SUBNAM4= <"">
##$SUBNAM5= <"">
##$SUBNAM6= <"">
##$SUBNAM7= <"">
##$SUBNAM8= <"">
##$SUBNAM9= <"">
##$SW= 18.0517328524113
##$SWIBOX= (0..15)
0 0 2 0 0 0 0 0 0 0 0 0 0 0 0 0 
##$SW_h= 3612.71676300578
##$TD= 16384
##$TD0= 1
##$TE= 0
##$TE2= 300
##$TE3= 300
##$TEG= 300
##$TL= (0..7)
0 120 120 120 120 120 120 120 
##$TP= (0..7)
150 150 150 150 150 150 150 150 
##$TP07= 0
##$TPNAME0= <>
##$TPNAME1= <>
##$TPNAME2= <>
##$TPNAME3= <>
##$TPNAME4= <>
##$TPNAME5= <>
##$TPNAME6= <>
##$TPNAME7= <>
##$TPOAL= (0..7)
0.5 0.5 0.5 0.5 0.5 0.5 0.5 0.5 
##$TPOFFS= (0..7)
0 0 0 0 0 0 0 0 
##$TUNHIN= 0
##$TUNHOUT= 0
##$TUNXOUT= 0
##$USERA1= <user>
##$USERA2= <user>
##$USERA3= <user>
##$USERA4= <user>
##$USERA5= <user>
##$V9= 5
##$VALIST= <valist>
##$VCLIST= <CCCCCCCCCCCCCCC>
##$VD= 0
##$VDLIST= <DDDDDDDDDDDDDDD>
##$VPLIST= <PPPPPPPPPPPPPPP>
##$VTLIST= <TTTTTTTTTTTTTTT>
##$WBST= 1024
##$WBSW= 4
##$XGAIN= (0..3)
0 0 0 0 
##$XL= 0
##$YL= 0
##$YMAX_a= 548641
##$YMIN_a= -716229
##$ZGOPTNS= <>
##$ZL1= 120
##$ZL2= 120
##$ZL3= 120
##$ZL4= 120
##$ABSF1= 15.47034
##$ABSF2= -2.58151
##$ABSG= 5
##$ABSL= 3
##$ALPHA= 0
##$AQORDER= 0
##$ASSFAC= 0
##$ASSFACI= 0
##$ASSFACX= 0
##$ASSWID= 0
##$AUNMP= <proc_1d>
##$AZFE= 0.1
##$AZFW= 0.1
##$BCFW= 0
##$BC_mod= 2
##$BYTORDP= 0
##$COROFFS= 0
##$CY= -3
##$DATMOD= 1
##$DC= 0
##$DFILT= <>
##$DTYPP= 0
##$F1P= 0
##$F2P= 0
##$FCOR= 1
##$FTSIZE= 16384
##$FT_mod= 6
##$GAMMA= 0
##$GB= 0
##$INTBC= 1
##$INTSCL= 3.70164e-10
##$ISEN= 128
##$LB= 0.24
##$LEV0= 0
##$LPBIN= 0
##$MAXI= 10000
##$MC2= 0
##$MEAN= 0
##$ME_mod= 0
##$MI= 1.114404
##$NCOEF= 0
##$NC_proc= -6
##$NLEV= 6
##$NOISF1= 3.799351
##$NOISF2= 2.8
##$NSP= 0
##$NTH_PI= 0
##$NZP= 0
##$OFFSET= 15.42957
##$PC= 1
##$PHC0= -25302.59
##$PHC1= 10.38731
##$PH_mod= 1
##$PKNL= yes
##$PPARMOD= 0
##$PSCAL= 0
##$PSIGN= 0
##$REVERSE= no
##$SF= 200.130018438206
##$SI= 16384
##$SIGF1= 3
##$SIGF2= 2
##$SINO= 5.538805
##$SIOLD= 16384
##$SREGLST= <1H.CDCl3>
##$SSB= 0
##$STSI= 16384
##$STSR= 0
##$SW_p= 3612.71676300578
##$SYMM= 0
##$S_DEV= 0
##$TDeff= 16384
##$TDoff= 0
##$TI= <>
##$TILT= no
##$TM1= 0
##$TM2= 0
##$TOPLEV= 0
##$USERP1= <user>
##$USERP2= <user>
##$USERP3= <user>
##$USERP4= <user>
##$USERP5= <user>
##$WDW= 1
##$XDIM= 16384
##$YMAX_p= 370820596
##$YMIN_p= -293294
$$ End of Bruker specific parameters
$$ ---------------------------------
##NTUPLES= NMR SPECTRUM
##VAR_NAME=  FREQUENCY,     SPECTRUM/REAL,   SPECTRUM/IMAG
##SYMBOL=    X,             R,               I
##VAR_TYPE=  INDEPENDENT,   DEPENDENT,       DEPENDENT
##VAR_FORM=  AFFN,          ASDF,            ASDF
##VAR_DIM=   16384,         16384,           16384
##UNITS=     HZ,            ARBITRARY UNITS, ARBITRARY UNITS
##FACTOR=    0.220516191357247, 1,           1
##FIRST=     3087.92016823116, 0,            0
##LAST=      -524.796594774622, 0,           0
##MIN=       -524.796594774622, -293294,     0
##MAX=       3087.92016823116, 370820596,    0
$$ Real data points
##PAGE= N=1
##DATA TABLE= (X++(R..R)), XYDATA
$$ [...]
10387 32253 100 -19425 -68519 -57507 -43991 -133596 -156204 -238766 -108800 -119749 -95179
10376 -95179 35822 -55918 -100404 -6285 7522 67976 30787 53326 67059 -57236 -121461
10365 -121461 -81491 14007 57525 -16392 -42799 -83567 -10227 -32229 -56486 30770 571
10354 571 -27209 -89290 -138195 -67113 12496 3513 8738 -62063 -6349 -52884 -60656 -42636 -103788
10341 -103788 -110032 -120439 -20152 -16733 39725 28843 -58943 -41594 -49539 -96267 -64579 -42688
10329 -42688 -18468 97957 13987 -166130 -161268 -42794 -745 -3593 -117612 -167129 -208697
10318 -208697 -147743 -88613 -46831 11217 -4786 -75834 -34761 -2889 -36281 -41039 -11912 69975
10306 69975 43311 29105 -83045 -77955 -31792 56320 27007 -69583 -86415 -61573 -83407 -131621
10294 -131621 -109248 -126588 -102931 -11004 -4117 -37153 -38606 -29989 -8267 39709 -93084 -77793
10282 -77793 -111637 -56823 -83846 -137411 -82663 -31981 -56667 -96219 -1766 -80705 -122950 -43840
10270 -43840 28126 -12786 -58314 -104050 -155130 -106257 -57985 -211016 -234096 -164409 -163817 -101912
10258 -101912 -37478 -92445 5280 -38506 -135051 -92562 -138068 -69033 33474 -28399 -171051
10247 -171051 -103888 -106523 -13478 -14754 -50133 -4687 24114 33650 -795 42574 115341 4332
10235 4332 5537 54280 -86250 -67052 -30817 -60278 28365 -114301 -211947 -79688 -37091
10224 -37091 -43030 -40937 -15943 -73835 91569 65826 -845 26456 35094 103696 150303 113008
10212 113008 19861 4632 85345 28034 -105195 -204789 -145447 -108761 -54115 -9222 -43649
10201 -43649 -67576 -27499 -22251 -189 -70987 -148546 -145857 -102169 -58145 -31820 36215 -11453
10189 -11453 7145 -14352 -9691 -19613 -3765 -85258 -64922 -41085 7982 -81091 -143643 -65626
10177 -65626 -52950 27878 -62385 -64140 -88737 -94521 25916 -13086 4320 112223 92972 27058
10165 27058 -12505 26104 -59655 -26339 -7293 -30514 4725 -43761 -12398 29466 -13778 12760
10153 12760 43842 87685 47966 83237 21831 -50339 11266 -934 -74225 -75556 22838 -63710
10141 -63710 -79859 -18004 58463 31752 -4918 92465 165291 83193 94860 118668 23396 -49129
10129 -49129 -3038 34532 34868 -5050 -64642 -29076 -112254 -40027 25311 62574 114261 103364
10117 103364 106287 146318 109179 28679 115100 66774 21566 92184 22013 33661 129875 116304
10105 116304 72354 -34679 14937 111839 130392 185779 161418 114410 81512 155741 207965
10094 207965 203718 74736 87712 132231 61362 103328 98991 39274 27812 70230 140402 173259
10082 173259 190609 161370 258042 157118 48733 78989 88321 118064 84445 98063 79522
10071 79522 130039 143360 102047 95599 107421 109257 161538 140854 94211 107400 250604 255559
10059 255559 289842 238079 213038 162495 307851 280032 236542 323680 271074 279813 314912
10048 314912 266669 248512 204340 163671 262451 210730 159267 87639 58740 98149 100978 153679
10036 153679 241294 199168 110477 63254 51469 80947 154307 164271 65399 63285 20442 86342
10024 86342 136723 86577 136166 118943 57268 87580 70072 89166 59037 98803 52341 18689
10012 18689 70604 40013 132793 195552 164375 88713 15361 -31882 -53368 -50234 -43065 -57753
10000 -57753 46483 35336 115392 157357 38134 59917 181649 124235 176624 227488 127322
9989 127322 122824 122078 150952 198668 76646 82166 49655 108519 98673 22593 -941 -63499
9977 -63499 63235 168486 135861 154183 79595 48807 127578 109478 171039 118749 22017
9966 22017 47638 75283 73583 99284 128408 93397 158106 176985 117058 88380 94479 127597
9954 127597 275481 219256 171672 188837 172146 152452 123308 173486 247329 179103 242042
9943 242042 218256 114837 144187 97667 168988 200649 280995 315200 219820 104312 179050
9932 179050 212901 241346 245344 242950 189502 201164 209889 205065 221969 151231 66294 80356
9920 80356 117523 218233 197050 147144 175653 99373 208332 266556 174298 199565 112580
9909 112580 163949 179708 136833 115480 122825 125383 156972 153933 200745 258954 228244 183700
9897 183700 23545 185271 292873 391238 378389 412944 360772 388647 368537 303254 302383
9886 302383 371251 416515 458203 414956 442148 451824 383777 414728 335868 345115 406344 353107
9874 353107 264911 245486 279601 346610 391293 428181 441145 476040 409089 466758 392590 442237
9862 442237 578974 558099 434567 458474 536768 498078 413169 390562 478211 472398 421233
9851 421233 490288 434375 470076 544252 611479 648355 637043 756727 690630 550534 580207
9840 580207 605544 592368 588008 608277 552085 526567 547319 598792 659829 736103 855368 807239
9828 807239 811499 836120 862394 864904 907003 899386 861582 893981 854578 884344 920021 963608
9816 963608 1020807 1027630 927245 972387 1012938 1040919 1023213 1039820 1035511 1059607 1077309 1129797
9804 1129797 1210272 1241519 1339273 1373748 1377846 1503762 1606205 1674873 1810644 1852160 1870658
9793 1870658 1901598 1944556 2049014 2138461 2166008 2154798 2167794 2270086 2141638 1992472 1810360
9782 1810360 1828323 1753158 1659822 1621713 1627825 1681738 1569078 1438465 1355178 1341394 1405551
9771 1405551 1314279 1294423 1291652 1256396 1212661 1097403 1099581 1122752 1131201 1138997 1087165 1133052
9759 1133052 1137694 1138748 1230920 1371490 1328585 1285006 1225370 1260403 1291023 1305891 1225807 1278526
9747 1278526 1282986 1322821 1432929 1344042 1442717 1505873 1460999 1424949 1452704 1505576 1558704
9736 1558704 1591001 1643880 1615781 1673252 1708276 1690302 1744803 1878152 1925096 1897972 1840623
9725 1840623 1821567 1865314 1920102 1999120 2055295 2047296 2250310 2293623 2447495 2524182 2563192
9714 2563192 2581337 2648075 2693048 2767664 2890336 3070037 3086900 3173694 3237150 3291801 3336764
9703 3336764 3406515 3494873 3450499 3503443 3603657 3691280 3752846 3836900 3876300 3928239 3906028
9692 3906028 4019963 4016849 4077008 4130778 4144202 4243719 4386561 4424245 4391782 4541327 4764359
9681 4764359 4806069 4961027 5034859 5113154 5280072 5319409 5456139 5571603 5650914 5777400
9671 5777400 5869549 6109642 6398519 6577108 6784569 7057163 7342018 7506825 7785265 8011624
9661 8011624 8283385 8538162 8816524 9163850 9379034 9646208 9922638 10310673 10617235 10919582
9651 10919582 11290361 11610817 11941383 12270303 12689237 13053253 13599266 14164602 14685543
9642 14685543 15197897 15800861 16554715 17320981 18337438 19478480 20726778 22098948 23854803
9633 23854803 25805374 27968005 30414108 33350573 36591041 40151457 44058277 48335033
9625 48335033 52661864 56774545 60563394 63525787 65606262 66480485 66084905 64537308
9617 64537308 61629220 58057119 53859062 49363567 44719592 40336928 36367113 32758348
9609 32758348 29491595 26639253 24277409 22192448 20289924 18771108 17442304 16100037
9601 16100037 14954246 14003986 13091500 12213058 11504194 10881637 10426713 9837118 9285169
9592 9285169 8788737 8394783 7912569 7603804 7335811 7111728 6713308 6509840 6272002 5964019
9582 5964019 5683706 5411907 5266508 5076873 4830796 4624127 4556830 4316845 4058905 3909011
9572 3909011 3797169 3733808 3594812 3480700 3335225 3311008 3183594 3035190 2966048 2808133
9562 2808133 2766545 2711218 2600102 2469116 2497365 2397981 2296382 2254069 2182863 2110022 2038738
9551 2038738 1913619 1891981 1874157 1767640 1800413 1719702 1741143 1717982 1799566 1655640 1522583
9540 1522583 1588348 1553754 1497255 1451080 1477876 1430524 1412126 1395119 1360356 1395314 1427975
9529 1427975 1462997 1375231 1389541 1372130 1227177 1346793 1336082 1332559 1347569 1369443 1323793
9518 1323793 1336837 1362763 1344707 1327229 1306810 1270348 1215887 1206317 1240612 1231541 1242353 1217913
9506 1217913 1177753 1215073 1182684 1187374 1167515 1178936 1142061 1037901 1089749 1107321 1096983
9495 1096983 1055406 929409 974851 1037845 912129 831507 833841 943461 997779 926125 864177
9484 864177 758601 667703 570939 629503 674399 812147 873440 745105 752015 818689 691548
9473 691548 709393 693096 692332 556888 558320 700206 657808 550257 572419 681469 696314
9462 696314 711866 629689 642239 678558 661132 601095 638022 640065 656305 583083 617346 584950
9450 584950 635465 680442 649788 628168 685378 663550 671587 666634 675415 609581 611297 560492
9438 560492 461948 533669 641457 608512 602036 590863 578361 560400 544110 549905 554358 523149
9426 523149 498254 493315 558149 601266 612803 706492 651421 568517 496450 470322 413646 383358
9414 383358 483256 545837 502922 550032 682178 830002 709564 695097 754628 697094 667642
9403 667642 680662 746483 745169 771831 791865 752371 792636 941071 941852 838326 906703 923896
9391 923896 917996 936639 955038 932715 1013354 1044063 1177738 1139194 1128038 1194823 1320591
9380 1320591 1408955 1438055 1549953 1659169 1723491 1766784 1802277 1770869 1653974 1573072 1466295
9369 1466295 1199671 1137167 1029952 1039954 1119800 1001166 980112 1055614 907969 746171
9359 746171 792783 886562 910665 860568 907433 950462 863753 946650 1057981 920315 874528
9348 874528 944383 909768 976486 1119282 1173757 1225975 1323309 1442218 1614537 1715163 1684332
9337 1684332 1723359 1873779 1948896 1831802 1682632 1514028 1386334 1307444 1092327 1022605
9327 1022605 1017162 908059 921571 828825 765884 741322 747194 801567 748889 733006 734894 727017
9315 727017 631284 584048 658062 690375 531079 555842 638318 572887 596608 593210 646292 573632
9303 573632 664607 606095 630826 719059 585300 549942 596501 634408 711291 755210 751917 716987
9291 716987 659871 770929 866578 830058 849257 789643 808719 794296 737645 725006 795865
9280 795865 779008 835435 862506 765890 671300 573871 630309 673550 717675 667018 745853 629752
9268 629752 695742 647121 698636 639037 592664 630620 620513 593768 594054 595043 652912 696308
9256 696308 663560 576739 593049 640156 622780 630924 792930 850243 899787 890205 753665 773950
9244 773950 835293 863899 800333 825822 813597 837649 755859 811048 832493 802908 799054 805667
9232 805667 729735 771823 819454 858017 844609 865611 870730 821671 822102 807824 790198 734172
9220 734172 901144 854996 756016 799638 848204 850148 827576 809823 868422 925490 960506 1006381
9208 1006381 1051881 933075 950642 1059917 1035791 1092652 1228356 1251221 1256905 1269987 1221536
9197 1221536 1312089 1384427 1409626 1452732 1463928 1443273 1474733 1470023 1485893 1465440 1546421 1597173
9185 1597173 1650754 1659232 1587891 1594482 1660354 1693719 1709588 1721087 1646432 1662319 1694689 1628987
9173 1628987 1502423 1568377 1652571 1549455 1625357 1555177 1581880 1659629 1680988 1657754 1654986
9162 1654986 1632960 1653950 1687286 1799754 1821405 1825980 1867456 1767569 1728833 1642557 1733345
9151 1733345 1784800 1778996 1799202 1791017 1841776 1815556 1738189 1789472 1793512 1713464 1771241 1880874
9139 1880874 1873985 1918034 1915649 1931957 1970741 2024690 2070492 2106865 2090655 2060863 2078934 2080477
9127 2080477 2200127 2162549 2300296 2292878 2204665 2137160 2119244 2125566 2171386 2194692 2171114
9116 2171114 2141881 2036120 2106271 2192752 2267414 2252231 2163839 1988304 2041717 2015413 2005204
9105 2005204 2024455 2112941 2226057 2269391 2274099 2256361 2246225 2252596 2358267 2440664 2551318
9094 2551318 2569041 2470366 2554300 2595021 2614721 2590428 2629553 2673124 2587417 2527687 2478970
9083 2478970 2511880 2463440 2512855 2587949 2550443 2647560 2781235 2743056 2717591 2726464 2725197 2786126
9071 2786126 2922707 2875933 2909948 3030265 2966885 2953381 3036194 3178212 3317399 3334213 3401031
9060 3401031 3390935 3431769 3462280 3477089 3609737 3562613 3557945 3576333 3562845 3628000 3607972
9049 3607972 3698593 3849289 3952016 4163128 4242408 4277084 4346416 4486821 4598299 4632653
9039 4632653 4758685 4918903 4993324 5076840 5124362 5232199 5359164 5450001 5391461 5461115 5695857
9028 5695857 5899389 6019751 6138368 6286062 6520663 6639426 6657852 6857788 7010315 7212611
9018 7212611 7411759 7526967 7784163 8008979 8134820 8243408 8387793 8478087 8460847 8497921
9008 8497921 8437440 8359032 8278080 8162932 8045557 7951483 7858249 7795482 7766202 7756616 7741904
8997 7741904 7691057 7636182 7580328 7596545 7570954 7617949 7744715 7833000 7929372 7967690 8013023
8986 8013023 8232819 8361270 8467528 8680571 8746633 8923720 9018206 9103902 9362322 9566577
8976 9566577 9743505 9891056 10124932 10340605 10529806 10804966 11147335 11381020 11666095 11966781
8966 11966781 12172172 12553707 12962714 13356557 13862210 14333631 14795474 15412777 16005946
8957 16005946 16699925 17534178 18443197 19382176 20706299 22202923 23850175 25892599 28216382
8948 28216382 31001566 33933989 36996630 40210166 43273170 46363752 49045349 51308058
8940 51308058 53340124 54843420 55747705 56166044 56132511 55627833 54539889 53023151 51318106
8931 51318106 49570676 47797677 46385028 45701269 46607962 47838370 48144753 44865547 38831894
8922 38831894 33362143 28880622 25749182 23495961 21914070 20624167 19643469 18696220
8914 18696220 17927312 17252536 16713737 16193129 15715078 15221138 14866058 14468958 14240673
8905 14240673 13986671 13686482 13372081 13121057 12943620 12749043 12638343 12572969 12470286 12426216
8895 12426216 12439346 12440290 12528470 12514497 12628245 12770706 12905857 13083198 13283107 13478633
8885 13478633 13599541 13667614 13454848 13421096 13431201 13292805 13287164 13405873 13504468 13642029
8875 13642029 13809235 13984591 14062674 14020882 14053612 14004324 14109224 14226107 14381870 14683363
8865 14683363 14850314 14855760 14830402 14868579 14948616 14998841 15185021 15514047 15767463 16116502
8855 16116502 16448063 16786070 17165395 17329735 17469675 17777302 18182038 18581923 19053827
8846 19053827 19473939 19824247 20296316 20534723 20702401 21016121 21321327 21748505 22211014
8837 22211014 22925040 23534429 24103376 24707195 25274621 25887854 26551957 27283509 28141430
8828 28141430 28914325 29759479 30779949 32040501 33575301 35349819 37613598 40288190
8820 40288190 43224047 46369544 49338255 51702367 53391924 54281654 54654123 54715829 54942015
8811 54942015 55735723 57610038 60642302 64598130 68936615 72811399 75503979 76456908
8803 76456908 75415203 72928663 69265472 65310206 62093324 60004745 58961789 58595119
8795 58595119 58412451 57552663 55912697 53500927 50821523 48192437 45961945 44497053
8787 44497053 43637542 43369614 43645181 44202080 45137353 46739017 48878154 51901892 55982303
8778 55982303 61071539 67027174 73335509 79230511 83966426 87244299 88579338 89240651
8770 89240651 90060920 91280813 92845125 94266812 94869678 94327952 92540652 89575275 85741732
8761 85741732 81678657 77795998 74627533 72091194 70310479 68836198 67236698 64874317
8753 64874317 61270927 56812491 51619951 46792584 42532974 39099148 36494074 34721499
8745 34721499 33545914 32801812 32464600 32680977 33387133 34725964 36692210 39146789 41675606
8736 41675606 43949891 45302432 44875327 42747394 39671722 35730582 31800415 28542586
8728 28542586 25851454 23850925 22349299 21074946 20124282 19377624 18715732 18186985 17658176
8719 17658176 17281985 16888991 16544644 16196889 15877412 15662017 15537384 15330669 15186878
8710 15186878 15058897 15035774 14886290 14858518 14886301 14908735 15106236 15177216 15390595 15521585
8700 15521585 15597641 15822981 16192947 16357030 16527020 16841547 17067736 17380210 17885256 18563310
8690 18563310 19315709 20159364 21413973 22910821 24780551 26995674 29467216 32191470
8682 32191470 34805835 37031207 38654315 39673721 40244447 40419507 40267273 39936104 39429488
8673 39429488 38605547 37394162 35540985 33345631 30948148 28412730 26062713 23967775
8665 23967775 22266952 21018605 19976161 19142135 18476217 17902337 17537981 17269973 17143400
8656 17143400 17036070 17016110 17063156 17199096 17374815 17662852 18180089 18975183 19821919 20897855
8646 20897855 22254405 23665490 24907348 26012474 26869570 27216132 27315665 27451579 27340426
8637 27340426 27108460 26635556 26017815 25241310 24242587 22904972 21438835 20081435 18776128
8628 18776128 17749168 16996304 16320881 15897197 15628081 15346558 15211088 15066543 15024071
8619 15024071 15043037 15141583 15420037 15746644 16090664 16648640 17399711 18271202 19428288 20959471
8609 20959471 22669026 24584077 26398250 27671138 28082326 27626158 26561450 25174678
8601 25174678 24017723 23375100 23414954 23967966 25072049 26276760 27118956 27398443 26626543
8592 26626543 25343594 23601646 21645599 20115581 18792282 17858973 17380288 17026730 16760169
8583 16760169 16606306 16572174 16491053 16534041 16633039 16784561 17039165 17409212 17939488 18657308
8573 18657308 19564536 20739781 22061956 23800820 25996919 28564380 31407971 34041776
8565 34041776 36152875 37302630 37234530 36104173 34224983 32305800 30775020 30131603 30385394
8556 30385394 31288611 32465616 33380427 33525340 32746053 31149183 28673473 25712136 22839615
8547 22839615 20357857 18353557 16907850 15796806 14857311 14109146 13535486 13088511 12643792
8538 12643792 12319963 12174798 11933065 11845669 11798833 11952345 12192094 12386525 12815340 13381096
8528 13381096 14112309 15104117 16164231 17129211 17863652 18226284 18089888 17274560 16191206
8519 16191206 15161906 14299606 13858131 13986864 14383471 14910515 15352715 15418525 15162878
8510 15162878 14268988 13008207 11524466 10146955 9055645 8138359 7407090 6770992 6429677
8501 6429677 6210056 5736037 5399402 5141767 4916668 4810895 4651232 4515668 4350471 4185818
8491 4185818 3959822 3839698 3760415 3583288 3453073 3379115 3213709 3119159 3029339 2969020
8481 2969020 2896535 2715137 2678935 2557879 2580032 2568811 2489358 2420624 2469266 2376041 2337835
8470 2337835 2301139 2342410 2342136 2184941 2264096 2268761 2236384 2082278 2145316 2148713 2101630 2110972
8458 2110972 2154593 2132814 2038087 2015543 2038558 2016428 2090784 2156855 2157093 2134870 2029349 1860801
8446 1860801 1846472 1789334 1761155 1912463 1917642 1855081 1770305 1729207 1690112 1576148 1567067
8435 1567067 1541633 1542969 1564551 1598199 1466917 1318518 1437873 1499517 1415852 1439242 1391879
8424 1391879 1319685 1190282 1133832 1241933 1265341 1275694 1195646 1159342 1139750 1204906 1197944
8413 1197944 1152177 1183355 1227453 1243740 1213615 1176971 1184146 1249837 1325893 1341458 1312977 1239725
8401 1239725 1216539 1192697 1156764 1058256 1061418 1057747 1026083 986926 973523 962703 987062 997730
8389 997730 946384 921416 949244 956303 851746 838452 788355 812899 775058 583112 589653 675702
8377 675702 706772 670262 745752 777328 698033 782555 690947 704400 712409 740010 733546 693009
8365 693009 850965 743683 766107 742254 677402 649766 630463 722714 684663 668367 616485
8354 616485 607906 747547 847152 802205 740614 851963 886315 835402 866205 763944 710820
8343 710820 833073 931718 937682 917962 883425 925768 1010597 1023624 972526 1003803 1088372 1057935
8331 1057935 1033582 1130988 1297566 1313574 1266192 1460382 1626586 1757223 1747378 1745326 1737760
8320 1737760 1703249 1622460 1568700 1500400 1333392 1155602 1149068 1093986 1009443 1009026 920677 923972
8308 923972 851068 918593 953070 931224 952865 1025777 916677 932301 965047 961227 995362 966015
8296 966015 949361 982567 892470 813638 785457 854084 864855 797042 690802 755334 944686
8285 944686 840868 788791 881598 1050244 967254 1003811 1057982 1125947 1131509 1061466 1070046 971838
8273 971838 933711 910831 897694 872414 803661 739259 770825 746193 652422 646783 803475 765194
8261 765194 719067 789454 712949 651163 700966 788000 726152 788958 806349 788930 758643 765387
8249 765387 842597 811673 780439 770274 854572 973283 1029520 1133476 1150643 1213092 1275083
8238 1275083 1330514 1215478 1156914 1171932 1164309 1142554 1130945 1163659 1111509 1131485 1091203
8227 1091203 1028651 1115064 1196032 1255252 1213890 1205880 1245476 1211141 1226002 1234933 1234432 1222585
8215 1222585 1168128 1124672 1066647 1077380 1164231 1111358 1088834 1095088 1083420 1144478 1146078 1221682
8203 1221682 1284683 1251934 1201955 1167475 1135786 1361881 1291600 1238306 1203570 1305158 1052782
8192 1052782 248538 1131220 1440040 1480870 1629793 1545433 1610810 1715508 1755078 1675419
8182 1675419 1695921 1739751 1682814 1612141 1636653 1613980 1520597 1421097 1419958 1343013 1292709 1187653
8170 1187653 1247194 1222538 1236290 1228764 1225763 1146114 1104245 1267041 1225848 1138780 1165971 1174114
8158 1174114 1266507 1297414 1287123 1227694 1233700 1207198 1326641 1359397 1174305 1048320 1017708
8147 1017708 952995 902681 762934 734244 688174 628044 577394 586078 592088 605483 554336 442066
8135 442066 597326 632610 517595 538358 540168 529918 502752 495821 499212 537128 625088 711374
8123 711374 645980 582997 676929 727167 804206 748044 689121 687115 605858 639472 642277 508219
8111 508219 372844 356983 386294 424127 417750 275015 367004 355643 416794 444525 409198
8100 409198 407674 407170 373439 381084 319913 325311 384590 420657 416073 397521 397101 542421 555670
8087 555670 560059 666756 606813 503188 308882 288925 308790 276796 309570 302820 277086
8076 277086 159696 214182 260501 220454 122187 83751 57521 121040 215669 89325 36371
8065 36371 28580 75930 12522 38775 56339 49763 63426 86433 76199 14450 -1544 -25334
8053 -25334 -28913 -25381 -71803 64888 43522 -14516 -42797 -66404 -56567 -109432 -75349 -46633
8041 -46633 -65916 -139931 -123527 -22298 -39969 37065 -24541 -59315 -67319 -37092 64615 -6881
8029 -6881 -78239 -29022 108665 109297 -26237 -39858 76913 123852 56323 -36537 -7758 -64373
8017 -64373 -10170 -18587 -120721 -85849 -185492 -132240 -752 16097 33576 37665 43450 -140344
8005 -140344 -159223 -94661 -80044 -147846 -229431 -213527 -115061 -131462 -19374 5031 -69433
7994 -69433 -49335 -5390 -64729 -102182 -101453 -100627 -17965 -47342 -35333 -81123 48414 13541
7982 13541 -80890 -103312 -12634 -75769 -141771 -119912 -130531 -105787 -192575 -178480 -128624 -127179
7970 -127179 -170254 -60788 -6482 -39699 -76785 -125702 -89003 -53983 -143196 -145277 -85593 -77939
7958 -77939 -99510 -107859 -37901 -14919 -22962 -60383 -74111 -44473 -50691 -82512 -46647 -15747
7946 -15747 -114628 -188327 -129809 -166980 -93715 -16126 53474 -39917 31851 9692 6993 3647
7934 3647 -72643 -90232 -36228 17275 23959 -813 -50323 22646 58781 18974 -68732 -35067
7922 -35067 100340 134032 96533 122202 85358 -34541 -23947 12366 -43351 -11880 2073
7911 2073 73633 93470 89586 79011 40433 83017 61093 39063 83602 -38040 -24268 68792
7899 68792 112574 197917 157895 73212 107089 47604 137937 208224 196587 141606 86453 118342
7887 118342 147953 60147 108790 202789 89495 66618 109330 10504 27112 65385 83841
7876 83841 25669 128445 119456 118063 33958 63344 88258 54199 131056 267049 159465 63484
7864 63484 169946 79574 62946 169402 156693 104070 97134 123485 287567 313352 196345
7853 196345 96408 185832 234603 283493 202100 51803 913 85600 64588 93295 125038
7842 125038 109021 83834 110280 80247 9990 204992 141732 61395 153396 184737 161607
7831 161607 42644 -5654 2809 64016 -23673 26219 103183 33783 5772 -10972 43746 85113
7819 85113 19516 -6313 59947 133023 47294 61073 86182 36062 128876 114301 100270 169977
7807 169977 208395 -212771 -293294 11503 -3952 94548 80822 116887 93126 130090 124638
7796 124638 27683 41231 11733 -69811 -35249 -93307 10860 37050 50989 46636 20861 95225
7784 95225 70516 45334 69045 96762 113860 133867 181009 164792 144442 143280 81958 42798
7772 42798 69647 131851 32162 -9397 -57844 85953 94012 45860 70048 123425 162905 146561
7760 146561 125637 19544 13075 41736 91962 49507 87456 118641 131793 28715 35387 12847
7748 12847 98727 263866 191813 97618 72635 40086 43414 74149 101940 59258 -7970 36713
7736 36713 92181 101448 59697 80542 87321 3783 60596 178076 143171 171554 202932 90967
7724 90967 57721 97858 22117 51431 41 41653 47426 47259 62081 116730 -33448 -38824
7712 -38824 115735 148166 168826 143748 77009 96536 88967 171039 128345 93939 129862 106649
7700 106649 61912 141048 82139 29486 68234 -1096 41787 7199 39471 92599 165537 159283
7688 159283 126130 73892 63600 136719 198969 93361 120204 -4136 -32279 -5994 23586
7677 23586 75820 -31624 -69134 -41846 24005 35191 98866 61177 108800 148214 153859 97527
7665 97527 110715 75777 756 -10111 7763 -2339 -51110 -43665 20925 46798 10846 -110974
7653 -110974 -193965 -71566 -19723 -115421 -107881 -31297 37952 112282 81613 9405 41471 2338
7641 2338 -30250 11788 -20504 -31076 20220 36666 9125 3063 47609 60943 9259 -14244
7629 -14244 42087 4267 -26612 6271 20271 -40209 38581 14063 35821 99642 63680 66930
7617 66930 91651 126021 54277 -35278 -2434 62599 -12217 -25068 51979 149810 34967 39829
7605 39829 49383 -30200 -63848 36455 -22990 -135414 -133824 -44196 17197 22181 -4981 -43840
7593 -43840 -27940 -43983 -39104 -40387 -28003 35408 60495 -73259 -141008 -89263 -87655 -186573
7581 -186573 -225096 -101854 -174215 -154853 -50023 -54562 -44507 -93042 -189289 -147582 -138177 -85532
7569 -85532 -85610 5876 -120007 -79565 22409 35655 -30346 -49235 -7656 -3064 -2515 -37958 -91763
7556 -91763 -113267 11357 55280 -5172 27497 -20776 -50331 15680 51206 -9212 -83106 -20162
7544 -20162 -102284 -143763 -93818 -60869 31694 28146 50066 25449 3968 114171 14828 -118459
7532 -118459 -167024 -56773 -21861 -19472 -151866 -153101 -19879 -11269 14899 57967 48957 140676
7520 140676 99500 -37992 -40499 -130491 -69428 -56515 -146115 -105775 -56300 -29678 30128 -36941
7508 -36941 13783 51994 29932 18917 -54088 -26302 12778 99473 5992 30073 -15091 65504
7496 65504 74911 90033 -690 -90883 -47528 68322 151924 188742 166488 95199 52534 98959
7484 98959 115668 76977 122752 256421 267066 160222 60288 165483 88070 13054 145928
7473 145928 215724 181483 124757 151294 265404 278842 392049 346240 259803 239057 187224
7462 187224 230234 220666 236869 230366 328682 379482 352417 342877 348191 360093 418428 433855
7450 433855 501986 462773 467500 467719 443732 445556 556402 451589 385571 324385 444499 482800
7438 482800 393855 463906 403030 440121 434623 385574 324849 320286 383985 474158 491681 434291
7426 434291 446392 475447 456902 427486 304290 391547 354838 247157 326231 349518 339075
7415 339075 311541 316551 333469 272203 295883 364632 404315 354653 362120 229092 200595 224883
7403 224883 258432 360736 356734 293438 266947 299268 201682 332547 252497 127128 183823
7392 183823 133646 88986 145793 179177 246002 148305 154408 180708 157947 151962 161865 115494
7380 115494 168684 98910 114190 56915 140431 119589 168673 138757 5459 40268 145910
7369 145910 126565 71156 44752 63796 80915 4727 -8735 -27907 38700 22343 8645 -6526
7357 -6526 -70218 -44339 -102590 39954 17625 -38659 -25362 -18928 55029 53926 -43190 -18103
7345 -18103 44467 21902 6332 75186 157513 32325 -60087 -94161 -19184 -54276 -43310 5931
7333 5931 -30282 -65178 -115224 -164982 -86234 -54517 -57547 -22889 -14401 -11824 -573 -65318 -68252
7320 -68252 -113884 32780 51061 5194 -53266 -103386 -92626 -2666 -117902 -41333 -94404
7309 -94404 -121765 -132680 -90264 -120780 -86230 -129477 -139892 16301 -43253 -151200 -211130
7298 -211130 -182349 -105681 -121325 -78609 -56419 -75083 -153593 -115905 8882 -30735 42690
7287 42690 -16912 -59380 14345 55576 -31829 15555 28175 -39163 -125044 -188666 -80490 -35276
7275 -35276 -78767 -116191 -101954 -129384 -115597 -108974 -149639 -60242 58096 62207 14516 -34091
7263 -34091 -77197 -74649 -70443 -118961 -175514 -153263 -77966 -23809 -49044 -74533 -46617 32127
7251 32127 -28866 -102939 23766 -5288 -105508 -161974 -108064 -15528 -35413 -74165 -102711
7240 -102711 -151274 -29811 -59265 -73023 -23139 -125027 -91193 -131124 -8364 67536 -44919
7229 -44919 -78117 -10476 -124012 -23350 52249 -33497 -38565 -37324 -104352 -13462 40748 67283
7217 67283 -11620 -139081 -127823 -129719 -37644 -19255 -95002 -66750 -179175 -144403 -63820 19442
7205 19442 -56465 -76380 -46163 -135080 -83054 -139845 -109415 -141683 -159370 -134591 -107421 -58366
7193 -58366 -28871 -67293 -71640 59176 -21514 493 -18472 70688 -29826 -130693 -140882
7182 -140882 -144094 -139868 -182651 -60136 -85316 -131313 -180056 -69343 -76145 -151862 -178863 -117808
7170 -117808 -17648 -35276 -32758 -99668 -66489 -57940 -42666 -45562 28508 83423 35317 160850
7158 160850 26480 -95573 -88588 -73685 -30683 -17197 -17231 -89598 -82073 -125890 -133541 -47361
7146 -47361 -53739 -19910 -47666 -851 -4874 15934 61621 6526 213 3791 -16330 70558 77393
7133 77393 73892 46828 103774 22044 89754 150909 116003 30948 8624 -46011 -30758 102094
7121 102094 89166 101404 66866 28119 -18146 79707 -14182 -134196 -57022 -29876 -13183
7110 -13183 -33607 21630 19770 -4784 1263 -19627 -41906 -97620 -78004 -84856 -71450 -86441
7098 -86441 -8784 -9833 -77538 -110468 13895 -67109 -44536 -36571 -42780 12258 18868 33582
7086 33582 -53544 -26428 4047 -69622 -75320 73523 81300 12966 59220 184062 120485 84977
7074 84977 112237 145345 99587 111786 60852 65867 46104 5094 81877 62121 109205 146258
7062 146258 175249 204255 151703 82618 91837 118420 91697 9280 -14627 42012 70819 25955
7050 25955 22545 -46527 -89654 47269 17224 -7970 -41599 -194086 -110274 15807 55600
7039 55600 89940 47964 24354 -80928 -69270 -61740 39081 24434 -3016 60444 -37102 -61791
7027 -61791 70552 15225 -76326 -123459 -59702 32886 53890 25580 49656 112592 72236 122020
7015 122020 116419 175892 179891 177669 203299 120651 8116 38107 12547 24667 33842 45697
7003 45697 -38912 40600 -14542 -123505 -93255 -37689 27046 -25527 -3399 55933 -25394 -51478
6991 -51478 -146359 -84360 -24794 -21921 16346 -21722 -6608 -21943 -19755 189140 115599 43159
6979 43159 71242 93589 56624 44024 52143 -39004 -99196 -141090 -123811 -85427 -16748 100283
6967 100283 94382 225 -49835 -60995 39220 -6229 -32335 -115649 -96311 -123460 -174388 -79758
6955 -79758 4720 -67657 -2451 4571 3151 -53764 -96338 -73543 -54983 -98720 -10654 41600
6943 41600 -31542 -11415 53680 38242 -5330 -58717 57187 103900 49969 36187 72613 39562
6931 39562 -62258 -94210 43282 116535 39244 83224 23124 -13615 41195 99455 100179 -20106
6919 -20106 -21566 -105612 -180967 -167569 -83663 -60944 -78194 23165 -9088 -34836 -70633 -112430
6907 -112430 -85177 -55268 -128079 -94206 -12244 33568 -9249 -46907 -56870 -54179 77389 43021
6895 43021 -124966 -54432 -38477 -79030 15532 29799 31300 50271 49336 27222 87320 46440
6883 46440 -72555 15988 -62092 -62189 -23168 -13568 -29269 -11925 65505 12747 122474 48988
6871 48988 58107 129417 43952 19870 790 85856 42704 -16714 32923 89223 -37855 -18895
6859 -18895 -40699 116953 122524 79983 63550 5550 -53185 -79931 -34953 -38599 4590 -8935
6847 -8935 -8475 24106 -36022 64439 71166 120981 143891 126062 61331 108296 130285 181300
6835 181300 122188 32638 34529 -82741 30618 64546 207457 143238 55929 16134 40362
6824 40362 60265 59899 126386 130507 145684 231249 155712 100508 3869 72724 53364 91550
6812 91550 68732 39066 79105 192450 234378 162840 102097 225993 239180 149170 210311
6801 210311 172948 96109 148169 120188 105960 122343 153317 64260 73695 113889 77519 83197
6789 83197 -28454 -31772 -7164 62112 71431 153959 177173 99956 85787 79285 90100 139430
6777 139430 64762 137977 119871 88904 202580 124769 47359 36017 125366 169988 65054
6766 65054 127075 166719 181633 217013 169155 139105 218957 230756 280614 187070 160295 205711
6754 205711 231616 268490 83682 70338 41307 105933 112464 59223 20983 60450 122173 65041
6742 65041 37250 -48926 21778 139747 170651 138776 111761 64228 91803 50275 71338 139775
6730 139775 168360 69911 -21891 93946 143811 109329 82630 56240 110786 134155 183422
6719 183422 191364 198502 74807 -43496 25461 45630 39418 87683 135704 159930 127267 44929
6707 44929 95919 100495 104950 188117 196581 122634 91282 124731 175119 105518 29282 -30976
6695 -30976 76698 175384 115960 134937 116514 56641 -19605 24786 163013 158825 69658 127326
6683 127326 100437 41219 110078 42020 35110 20555 36899 39750 39977 39116 36091 113255 78415
6670 78415 115228 142958 86905 46030 50112 64737 138331 90386 64630 116452 69970 46856
6658 46856 12304 -44994 63797 36686 89749 132154 142268 203708 105205 89293 107626 92750
6646 92750 136004 125038 38547 -18084 -146371 -87460 57966 169333 40175 123036 236850
6635 236850 198581 134855 175408 233680 199968 215139 134077 63100 148960 120387 212399 243798
6623 243798 235005 153383 111369 114706 151568 212521 130018 107757 82603 100847 119881 86460
6611 86460 165921 256948 270206 231160 191036 153346 63693 107657 101229 154441 131965 121587
6599 121587 82427 185174 253912 260702 258021 142717 190162 228190 250282 269549 271306 287256
6587 287256 209374 204979 284646 250766 249737 280711 148485 206630 276994 206924 205446 248971
6575 248971 196692 239890 206057 158400 219433 239314 214645 249887 174345 187715 170454 121686
6563 121686 106325 171876 238117 246010 266006 285698 231201 245569 265542 229292 166037 132405
6551 132405 155708 182585 175548 101753 184545 182144 189901 198903 144758 120230 175229 183477 160870
6538 160870 153646 246165 291476 215020 188729 292776 297217 212879 189271 175676 180721 157025
6526 157025 188880 217519 142291 259138 340014 358553 238487 227651 335099 336555 427037
6515 427037 471584 357625 312523 226509 196445 321276 294326 337853 379692 326402 353587
6504 353587 294365 344322 234182 333661 500604 495899 429067 393033 401631 319877 373703 391067
6492 391067 319943 316668 325457 306867 265370 317860 290776 363132 351748 285038 327564 335890
6480 335890 293051 324486 351573 301027 267524 282570 416292 457536 358625 354675 399809 455587
6468 455587 430110 388584 458449 451796 425659 376296 406807 381737 441069 547005 571429 582682
6456 582682 545670 560915 571385 423962 403185 438493 548210 518516 592056 627359 674765
6445 674765 616585 547044 543254 616604 705560 690986 747060 711115 623408 684862 622695 710965
6433 710965 665796 635044 674044 645333 714982 776936 769925 629414 575718 602610 659899 638442
6421 638442 647468 695881 779049 646592 710083 723138 547784 619755 639453 589141 656638
6410 656638 657344 700162 651260 736859 831607 804656 776167 831202 802904 802971 766362 634516
6398 634516 654646 743605 761063 701862 769151 733394 765644 791192 716486 768186 880785
6387 880785 896120 885951 899114 920507 889676 874200 890667 877297 871661 892411 1037086 1024374
6375 1024374 1071440 1211607 1158704 1098340 1004212 1135210 1135331 1255466 1288728 1298621 1278148
6364 1278148 1321437 1351308 1328730 1257015 1285151 1375298 1325796 1377931 1430415 1454120 1391098
6353 1391098 1458016 1496490 1505191 1586635 1627998 1537743 1553568 1526036 1582359 1661347 1623681 1614040
6341 1614040 1595279 1670438 1690489 1759829 1748002 1773167 1760235 1805155 1888792 1796697 1713534
6330 1713534 1830370 1912204 1920881 1968644 1946608 2069897 2064556 2007295 1965596 1998987 1937308
6319 1937308 1869641 1905918 1879649 1792869 1952752 1897386 1849863 1855596 1954805 1931756 2041635
6308 2041635 2109465 2079924 2069285 2131001 2127369 2053414 2110520 2245852 2288616 2229053 2161239
6297 2161239 2092193 2179205 2206978 2171912 2150546 2155247 2191012 2207431 2124465 2111914 2115059 2104199
6285 2104199 2138745 2113338 2149058 2208671 2356607 2440706 2437072 2426154 2461905 2479719 2429681
6274 2429681 2594077 2635672 2457494 2459729 2525646 2436215 2431147 2376678 2312416 2370114 2317086
6263 2317086 2401688 2445937 2376643 2377718 2407070 2435651 2451678 2487431 2440629 2533461 2603982 2645259
6251 2645259 2758966 2779755 2706405 2821893 2911874 2960872 2972163 2951446 2984789 3086604 3062104
6240 3062104 3061480 3189952 3275535 3312163 3443302 3379583 3444046 3436600 3326796 3316998 3297393 3276553
6228 3276553 3280271 3292997 3359539 3412009 3385036 3409831 3526265 3556689 3600806 3730462 3793998
6217 3793998 3918468 3993145 4167731 4423995 4570246 4796710 4937347 5046317 5059625 5050134
6207 5050134 4959891 4773242 4642404 4531389 4448848 4432225 4474266 4546113 4583540 4511492 4509050
6196 4509050 4552940 4617038 4652449 4776425 4842170 4916097 5046513 5252258 5378842 5570179
6186 5570179 5770154 5818008 6139711 6426640 6422955 6476460 6583885 6640571 6625537 6627827 6703031
6175 6703031 6780888 6686401 6694921 6873831 6810666 6845144 6846662 6849018 6850072 6931680 7053984 7324210
6163 7324210 7450643 7617556 7814245 8037959 8190504 8280222 8565588 8786910 9134785 9490546
6153 9490546 9887297 10265822 10748358 11226667 11528846 11688421 11697771 11805197 11790065 11802850
6143 11802850 11804691 11824470 11716077 11661123 11755700 11695930 11664885 11711078 11760929 11790610 12049947
6132 12049947 12226524 12444405 12528037 12776544 13115782 13443808 13797198 14144515 14586672 14972976
6122 14972976 15252908 15503237 15645523 15870093 16176685 16600879 16858868 17029273 17003056 16886186
6112 16886186 16642551 16512511 16495211 16374990 16246721 16350779 16368272 16314916 16459936 16694866
6102 16694866 16854755 17122476 17337665 17604579 17989604 18397588 18822879 19323179 19781965
6093 19781965 20165152 20531538 20796188 21033740 21299328 21747119 22014825 22137664 22193924 22271135
6083 22271135 22434211 22636497 22865964 23103200 23518058 23896709 24215157 24757505 25391517
6074 25391517 25988832 26616635 27382569 28314073 29287173 30496430 31758906 33116967 34414508
6065 34414508 35640095 36899088 38232694 39843627 41659078 43917754 46529920 49578855
6057 49578855 52864318 56032863 58736599 60551842 61469180 61652515 61350820 61355518 61875333
6048 61875333 63072628 64943131 67168904 69555895 71881213 73676525 74840203 74965158
6040 74965158 74238476 72953915 71838222 71230103 71414869 72502029 74726909 78009931 82394003
6031 82394003 87773195 93939224 100245118 105642159 108739951 108920877 106687907 103623534
6023 103623534 101119304 100024374 100731437 102785336 105603041 108562690 111137705 112779530
6015 112779530 112270619 108951853 102728373 94821257 87100270 80325743 75081834 71488008
6007 71488008 69397850 68497244 68599921 69598117 71212547 72781833 73665516 73458156 72033173
5998 72033173 69806898 67426964 65550776 64514473 64113738 64087052 64320162 64601408 64558193
5989 64558193 63805566 61715209 58267521 53769292 48786498 43957031 39729898 36057189
5981 36057189 32883972 30164863 27805486 25873792 24170420 22652332 21364545 20181947
5973 20181947 19290941 18512862 17738428 16904144 16227752 15611193 15041841 14511478 13938420
5964 13938420 13349074 12830932 12451049 12102294 11756482 11596992 11282110 10895306 10566732
5955 10566732 10229240 9913140 9545108 9136608 9106089 8800862 8487616 8265325 8012650 7835725
5945 7835725 7702732 7494686 7277030 7101226 7022466 6867551 6670305 6731818 6635607 6576055
5935 6576055 6400814 6262177 6162081 6130107 6003915 6045179 6001432 6046391 6106912 6024974 5931555
5924 5931555 6064707 6108176 6136941 6212928 6119993 6030676 5957296 5903014 5736676 5671928 5644210
5913 5644210 5479616 5326431 5351455 5227937 5066888 5045291 5101883 5107343 5115341 5213429 5247404
5902 5247404 5244879 5256872 5325202 5516561 5623287 5893238 6067416 6243095 6349310 6275406
5892 6275406 6111195 5968628 5752747 5675140 5577598 5439721 5352213 5133995 5045935 5006017
5882 5006017 4939173 4842322 4716723 4641905 4526634 4545749 4646789 4586398 4689601 4676790 4681345
5871 4681345 4783805 4880154 4861597 4797559 4779992 4658245 4676684 4705074 4683185 4674838 4666498
5860 4666498 4566345 4481745 4417181 4262794 4146433 4057616 3936014 3811769 3778729 3652262
5850 3652262 3614851 3627469 3706773 3725634 3775860 3623874 3676809 3646741 3501115 3518784 3468253
5839 3468253 3532435 3527823 3495108 3545263 3490251 3483856 3555569 3511574 3430225 3435849 3445295 3344263
5827 3344263 3292492 3294037 3327273 3399678 3326881 3287951 3375855 3294842 3202421 3134005 3205019 3234521
5815 3234521 3285645 3312015 3310304 3263620 3282214 3396358 3368025 3368775 3380676 3468307 3451964 3571604
5803 3571604 3559128 3602972 3724926 3765112 3774265 3747637 3695310 3620957 3724983 3735360 3677505
5792 3677505 3701062 3688445 3626878 3696595 3780805 3821649 3833417 3821774 3915479 4000645 3980723
5781 3980723 4125019 4242074 4195735 4206294 4341020 4385556 4540019 4646209 4618673 4705606
5771 4705606 4808602 4748752 4695032 4776668 4844930 4899833 5021556 5069690 4980269 5092030 5326379
5760 5326379 5564771 5749045 5923319 6017776 6070329 6150585 6218118 6293808 6331678 6417948 6609073
5749 6609073 6591974 6602574 6652333 6570000 6737718 6702882 6741501 6754738 6856791 7032531 7179775
5738 7179775 7227846 7402122 7558425 7688424 7800115 7991352 8177622 8279276 8325106 8412460
5728 8412460 8561589 8441954 8461206 8489282 8589785 8670615 8749047 8751119 8632894 8598116 8702018
5717 8702018 8771690 8943444 9083978 9126059 9144407 9278887 9496954 9660925 9692496 9689856 9861847
5706 9861847 9992564 10112786 10274674 10394703 10710103 10896830 10952443 11022185 10969538 10822432
5696 10822432 10646897 10526403 10365820 10197428 10179048 10169630 10183285 10227418 10311559 10390795 10458201
5685 10458201 10644128 10827349 11027001 11281393 11396005 11515687 11647995 11882018 12254303
5676 12254303 12649453 13029826 13399918 13700496 13799824 13719697 13439689 13139046 12865935 12686241
5666 12686241 12608870 12529300 12592649 12723017 12848095 13033941 13316833 13551584 13739775 13951548
5656 13951548 14099292 14296550 14521421 14766088 15043174 15356188 15759345 16201169 16623530
5647 16623530 17088778 17656064 18110802 18409914 18632534 18760014 18905030 18978235 19002365 19083134
5637 19083134 19104491 19123473 19329808 19484359 19676349 19822737 20113640 20404675 20836794 21226187
5627 21226187 21508875 22035346 22558208 23060637 23753527 24534794 25298537 26123838 27028340
5618 27028340 28044357 28850911 29344116 29780703 30209763 30705300 31362616 32109999 33005590
5609 33005590 34206090 35652177 37355298 39394279 41869641 44745970 48088234 51692169
5601 51692169 55458743 58969517 61375130 62068380 61160278 59065447 56430658 54141808
5593 54141808 52329556 51056080 50410265 50252204 50513608 51189202 52219957 53816577 55826360
5584 55826360 58404917 61350608 64648084 67964904 71301457 74798100 78843090 84048618
5576 84048618 90757332 99128317 108361307 116810135 122161591 123309107 120630441 114845710
5568 114845710 107065318 98669109 90891480 84233871 78652922 74274535 71358988 69602398
5560 69602398 68972849 69409900 70865891 72997801 75184360 76871088 77420309 77405908 77457581
5551 77457581 78214856 80160699 83516610 88314347 94352556 101408825 108405235 113356053
5543 113356053 114268733 110217721 102303471 92565365 82583721 73972070 66801707 61068295
5535 61068295 56668154 53342618 50851685 48986662 47672466 46651986 45720302 44646772
5527 44646772 43458770 42110732 40874632 40059364 39728796 39763543 40256662 41259267 42659574
5518 42659574 44135714 45307356 45465207 44536998 42122221 38913618 35509145 32224013
5510 32224013 29365997 27118766 25169905 23661672 22461701 21445030 20673269 19872237
5502 19872237 19227568 18684596 18131148 17586861 17172141 16732474 16311559 15978070 15601186
5493 15601186 15159919 14906955 14697279 14508527 14347138 14444103 14569436 14684823 14898079 15285688
5483 15285688 15805846 16506468 17125704 17809990 18561714 19251097 19638652 19680309 19402717 18739229
5473 18739229 17685335 16564356 15442190 14474044 13516393 12613199 11878388 11256768 10645801
5464 10645801 10300965 9931064 9669374 9585952 9259807 9121146 8965176 8733472 8590421 8432802
5454 8432802 8188450 7996805 7784286 7751410 7752013 7599022 7519119 7573628 7577510 7690662 7792087
5443 7792087 7959607 8215470 8450963 8707653 9099106 9543251 9974893 10641561 11647978
5434 11647978 12280990 12487782 11995730 11276690 10311560 9243767 8508352 7921645 7387977
5425 7387977 7083033 6784745 6550202 6367435 6096330 5887921 5736974 5637416 5518125 5440722
5415 5440722 5357643 5152873 5073529 5017453 4916692 4880055 4861590 4938566 4855278 4775493 4738779
5404 4738779 4744225 4760753 4801035 4720412 4649467 4711294 4652964 4647778 4435159 4324106 4341611
5393 4341611 4337110 4397744 4279514 4249784 4163037 4212921 4226271 4207418 4158504 4116636 4174279
5382 4174279 4186469 4091938 4238979 4291111 4282682 4424925 4589081 4754322 4946250 4964427 4939550
5371 4939550 4786949 4595634 4422232 4240777 4086832 4043819 3976940 3880440 3887212 3814774 3832770
5360 3832770 3770836 3738679 3824606 3856319 3897223 3823512 3738483 3861130 4087496 4260050 4319076
5349 4319076 4438239 4577813 4825032 5241699 5616329 5971358 6605012 7190703 7525880 7438140
5339 7438140 7075127 6492571 5998800 5581913 5217656 5101850 5057003 5126401 5246024 5404964
5329 5404964 5470648 5760418 5770138 5577337 5327415 4997323 4703611 4584392 4560542 4554038 4547723
5318 4547723 4635021 4761190 4859678 4944332 5241569 5625142 6044256 6554701 7166119 7775335
5308 7775335 7867915 7469711 6836049 6270787 5715647 5200790 4823175 4559741 4351703 4354042
5298 4354042 4269972 4193248 4110908 4175282 4073710 4152611 4137610 3988280 3868388 3936436 4083795
5287 4083795 4175450 4364502 4452505 4620021 4993499 5273288 5578120 5947199 6221400 6457985
5277 6457985 6475534 6426668 6061285 5780897 5502104 5274871 5013575 4766070 4627770 4528278
5267 4528278 4439437 4306402 4227007 4163569 4186600 4115153 4032094 4024031 4125081 4023752 3982513
5256 3982513 4039052 3988390 4049890 4080156 4072888 4124208 4082197 4037685 4023846 4070415 4057125 4000400
5244 4000400 3911794 3955630 4047411 4055965 4053426 4147766 4213113 4375688 4468308 4444335 4463713 4475334
5232 4475334 4416559 4316282 4324924 4301476 4376683 4442506 4404639 4498263 4604485 4552219 4647345
5221 4647345 4771018 4723144 4691610 4678890 4595156 4575592 4448879 4451195 4350565 4369567 4344019
5210 4344019 4246276 4249695 4269487 4249645 4292966 4311084 4399386 4457678 4474807 4467867 4432916 4519732
5198 4519732 4512697 4554246 4585336 4536815 4416874 4482062 4443648 4373102 4378419 4368341 4409461 4376824
5186 4376824 4403362 4378418 4363085 4377913 4400272 4409146 4385030 4419355 4524250 4630819 4657214
5175 4657214 4675525 4772628 4916298 5048239 5134477 5200829 5291482 5351973 5340476 5470888 5498601
5164 5498601 5550073 5607324 5600954 5620366 5660389 5715979 5694821 5633464 5585737 5644320 5742907 5673561
5152 5673561 5712696 5858596 5838677 5981014 5995900 6005956 6054171 6016350 5951759 6032278 6229772
5141 6229772 6306441 6364400 6452686 6493589 6599939 6657525 6757879 6837256 6923241 7076290 7222729
5130 7222729 7395379 7561586 7739468 7819917 7998886 8259687 8549698 8656797 8848950 8981362
5120 8981362 9073901 9282736 9556701 9763742 9776902 9998231 10295232 10418223 10674147 10807843
5110 10807843 10956804 11158116 11395411 11622724 11860032 12065168 12318364 12610775 12849755
5101 12849755 13141103 13328876 13609225 13934297 14249965 14280542 14494047 14721874 14892486 15030522
5091 15030522 15396190 15630377 15757197 16095517 16341213 16525567 16842480 17277413 17590384
5082 17590384 17879868 18341180 18781379 19324006 19722994 20030173 20426224 21009378 21501673
5073 21501673 21950865 22420801 23024953 23629131 24205407 24744743 25470888 26204014 26971546
5064 26971546 27698655 28491079 29392486 30217318 31073226 31949451 32855217 33714016 34620962
5055 34620962 35470626 36509026 37637943 38672963 39720521 40687302 41618684 42507671 43377092
5046 43377092 44170319 45082182 46105812 47150356 48247461 49554143 50974210 52322145
5038 52322145 53935705 55733473 57787529 60195465 62943825 66160848 70022653 74616597
5030 74616597 80205919 86889781 94986894 104540505 115854860 129706735 146846403 168592876
5022 168592876 196741470 233585628 278902571 326238293 361792976 370820596 350874182
5015 350874182 306780174 253649220 206326340 170074499 144414762 126309858 113204757
5008 113204757 103311666 95584382 89391063 84450345 80329968 76986934 74261098 72014381
5000 72014381 70107389 68522002 66991062 65540599 64303208 63186693 62244337 61617931
4992 61617931 61234352 60955427 60760105 60797995 61120831 61777878 62659635 63958311 65695812
4983 65695812 67802149 70557694 74118816 78313926 83476893 89931985 97848469 107565383
4975 107565383 119771904 135238604 155111939 181416386 215795069 257305763 299861287
4968 299861287 330130508 340363951 333967211 307219509 263404135 217476209 177236571
4961 177236571 145573724 122405339 105481572 92602371 82608736 74640919 68253016
4954 68253016 62988075 58606261 54773744 51549087 48695850 46072354 43644894 41472367
4946 41472367 39475265 37679372 36129432 34776900 33470121 32222298 31028430 29956808
4938 29956808 28913253 28025973 27247070 26626756 25925911 25394073 24917262 24398006 23927187
4929 23927187 23519871 23126977 22809720 22443885 22268223 22075291 21933198 21796442 21657209
4920 21657209 21608473 21480607 21386676 21498382 21738620 22055576 22428171 23079076 24119776 25802936
4910 25802936 27618514 28551594 27634957 25527016 23418703 21658676 20420099 19670487 19211414
4901 19211414 18748223 18546736 18445819 18387126 18286847 18278459 18220114 18119982 18227520 18288505
4891 18288505 18165215 18203015 18207666 18333451 18589158 18721295 18941829 19365370 19719288 19859653
4881 19859653 19771569 19652229 19652003 19691696 19831212 20037792 20179522 20367051 20471900 20777096
4871 20777096 21026128 21286359 21656315 21960534 22224102 22613436 22782776 22839742 22887269 23090921
4861 23090921 23370317 23568708 23843925 24181735 24508396 24804427 25168780 25482244 25747819
4852 25747819 26137259 26582266 26827237 27021440 27553565 28094491 28586856 28991853 29407169
4843 29407169 29927391 30493651 31141260 31833077 32401386 32967868 33697350 34343592 34951209
4834 34951209 35775319 36490577 37211325 38095788 38974470 39911585 40976379 42063967 43166831
4825 43166831 44327323 45536721 46880475 48357903 49746793 51256633 52701123 54112173
4817 54112173 55757378 57387460 59001851 60565315 62116872 63620173 65000876 66111672
4809 66111672 67163938 68087344 68936303 69820091 70754296 71912232 73057448 74437185 75990711
4800 75990711 77691093 79832752 82160580 84838944 87765112 90901350 94277252 97793508
4792 97793508 101291656 104743705 108119767 111207577 113878065 116190378 118018492 119036243
4784 119036243 119389792 119157952 118375706 117278263 115992655 114748904 113594027 112601602 111852167
4775 111852167 111541747 111308623 111498329 112264942 113482582 115066235 117028177 119298981 121638800
4766 121638800 124221384 126791008 129197573 131374424 133095978 134228419 134803570 134587012
4758 134587012 133677869 132098954 129887992 127399272 124902702 122293287 119814342 117630361
4750 117630361 115656051 114059045 112868915 111854612 111448703 111400393 111700344 112256834 112894505
4741 112894505 113622300 114469228 115408490 116189912 116762987 117319795 117651972 117710416 117804258 117548766
4731 117548766 116971715 116434495 115872298 115122460 114425797 113817183 113265976 112722269 112506087
4722 112506087 112333020 112430391 112581787 113067210 113673955 114337815 115089956 115918705 116705160
4713 116705160 117372741 117957411 118153602 117958228 117652280 117198670 116721240 116328982 115912391
4704 115912391 115458661 114917148 114197968 113237449 112000452 110431690 108749378 106900457 104867504
4695 104867504 102741877 100395795 98136698 95827559 93379874 91183135 89014075 86951839
4687 86951839 85001117 83124923 81334269 79650827 77909315 76332919 74843873 73468973
4679 73468973 72237655 71025232 69972580 68950937 67720385 66290522 64831602 63237146
4671 63237146 61445251 59521142 57544077 55530084 53462005 51446592 49429844 47345939
4663 47345939 45566680 43759387 42037548 40465693 38970650 37559286 36367749 35361750
4655 35361750 34446735 33734023 33160801 32564323 32012159 31373111 30730241 30102367 29598858
4646 29598858 29204136 28832861 28544498 28325164 28212406 28059158 27898495 27805479 27864753 27972351
4636 27972351 28081960 28078974 28175903 28242493 28347940 28478266 28556650 28592390 28728804 28930414
4626 28930414 29192446 29392039 29653280 29744635 30065566 30415387 30805394 31143680 31595790 31976332
4616 31976332 32432001 32885785 33566184 34089251 34558987 35114460 35794827 36593724 37408810
4607 37408810 38318947 39293217 40369050 41654272 43246658 45175158 47471682 50014064
4599 50014064 53071644 56546157 60780813 65695096 71456765 78852841 87979685 99655807
4591 99655807 114130407 130687902 148629014 166493591 182812522 196107306 204537949
4584 204537949 206560404 202381672 192733309 178509404 161449668 143714398 126303067
4577 126303067 110104610 96327712 85208051 76038443 68599327 62311315 56918038 52228274
4569 52228274 48214020 44491988 41238868 38308246 35759310 33509790 31532163 29709055
4561 29709055 28070178 26718905 25487251 24265674 23196072 22273193 21403203 20658420 19914069
4552 19914069 19232704 18519724 17837929 17245268 16796603 16246707 15779680 15406886 14946832
4543 14946832 14497414 14115073 13850196 13463007 13132929 12796284 12561932 12378590 12117741
4534 12117741 11844561 11635802 11461652 11188602 10875447 10721671 10574342 10283186 10135603
4525 10135603 10011614 9796041 9642305 9512624 9295708 9219012 9057614 8869656 8718156 8595485
4515 8595485 8386629 8293348 8221629 8106165 7964937 7879626 7806477 7667584 7613594 7535406 7459076
4504 7459076 7400564 7355379 7280007 7192991 7091717 7087866 7202045 7191007 7188118 7174225 7052330
4493 7052330 7027408 7113812 6989945 7003254 6936206 6874318 6725377 6734283 6701247 6608319 6633535
4482 6633535 6553224 6524661 6479350 6553326 6525151 6700286 6711337 6608239 6611479 6722643 6658646
4471 6658646 6639583 6607253 6623526 6579910 6486385 6551614 6631955 6593384 6626044 6512706 6671172
4460 6671172 6686390 6513513 6526343 6612585 6518910 6579368 6639640 6614314 6719736 6819683 6867210
4449 6867210 6912413 7106513 7124607 7190995 7373906 7464197 7514881 7632455 7689985 7711683 7697125
4438 7697125 7746524 7762330 7753318 7580369 7497222 7324014 7138851 7102872 7089140 6987493 7007174
4427 7007174 7055449 7132719 7265092 7382679 7424482 7379209 7481712 7690750 7861354 8231353
4417 8231353 8564735 8729015 8809621 8697714 8513220 8563824 8382091 8178963 7888437 7662779
4407 7662779 7482960 7266209 7030915 6916318 6812135 6633519 6499505 6508056 6486591 6331304
4397 6331304 6385115 6358083 6303706 6252373 6175932 6276423 6273447 6348257 6352053 6355527 6441260 6507824
4385 6507824 6456402 6474430 6478979 6364352 6454200 6597464 6619855 6579358 6631601 6771517 6854383
4374 6854383 6783484 6838765 6845264 6868416 6874284 6888877 7015170 7095493 7196406 7273989 7372302
4363 7372302 7502490 7497540 7749194 7897716 8096407 8357476 8663814 8970327 9435828 9916726
4353 9916726 10476384 11218203 11929137 12511212 12908257 13134368 13005124 12609854 12096191 11393353
4343 11393353 10713906 10200195 9800046 9593693 9377860 9240572 9194073 9205150 9223857 9122179
4333 9122179 9053776 9112939 9095929 9184232 9329836 9307917 9405533 9545030 9609895 9677133 9723490
4322 9723490 9680645 9689635 9748045 9809038 9799608 9907931 9810030 9749054 9650259 9580645 9628015 9396525
4310 9396525 9116349 9044898 8974054 8958890 8839151 8836776 8887623 8909316 9005482 9030724 8999260
4299 8999260 8934857 9018277 9074515 9036837 8999285 8919667 8667935 8494450 8367262 8319384 8320707
4288 8320707 8307135 8167459 8094212 8132289 8185540 8187030 8158448 8059723 7981027 7928967 7847211
4277 7847211 7884037 7876969 7913873 7966618 7968052 7980673 7910639 7868549 7864991 7968616 8036222 8095031
4265 8095031 7929919 7908437 8000464 8019619 7986078 8078340 8109185 8137374 8246940 8201945 8165569
4254 8165569 8210923 8300815 8352472 8415050 8470633 8342812 8318254 8319623 8388465 8501052 8430083
4243 8430083 8467852 8503788 8482900 8400667 8381311 8432513 8362770 8409454 8550527 8645015 8685678
4232 8685678 8728572 8745397 8741755 8899692 8911020 8870176 8984029 8975024 9065689 9055516 9058066 9140015
4220 9140015 9186383 9335906 9373746 9427061 9371774 9468748 9559899 9536583 9528381 9659048 9673538
4209 9673538 9742342 9808196 9834687 9873029 10058837 10198568 10276650 10274975 10223812 10233675 10386541
4198 10386541 10575270 10541745 10607154 10693889 10850475 10945676 10998190 11143911 11341392 11530708
4188 11530708 11480203 11632013 11846015 12080676 12108355 12199579 12426295 12697056 12906212 13079388
4178 13079388 13149887 13287590 13552734 13705337 13990449 14225217 14419057 14529456 14775576 15049073
4168 15049073 15334337 15626679 15823691 16070292 16356266 16783169 17116702 17283041 17688706
4159 17688706 17996012 18335927 18718536 18983737 19404065 19781119 20157744 20616003 21039160
4150 21039160 21443224 21858381 22354016 22839372 23310114 23695631 24288084 24737751 25308115
4141 25308115 25889822 26505957 27135393 27627634 28265417 29135757 29876013 30738595 31491912
4132 31491912 32395152 33309240 34187993 35121361 35951633 36797873 37706637 38617816 39554031
4123 39554031 40407620 41355958 42299934 43348409 44440676 45366468 46382121 47479279 48605678
4114 48605678 49633328 50572370 51573874 52543449 53509561 54502281 55551973 56700709 57955346
4105 57955346 59284358 60534526 61798240 63012446 64132275 65192019 66335412 67367825
4097 67367825 68526990 69837891 71087665 72309888 73700406 75181886 76815483 78569595
4089 78569595 80401311 82178381 84020916 85572341 87107332 88359572 89785043 91251257
4081 91251257 92867934 94708664 96378610 98140893 99977467 101683596 103134440 104421043
4073 104421043 105548152 106609880 107635496 108800381 110013828 111198243 112587722 114219513
4065 114219513 116070703 118259808 120774872 123438262 126249376 129207968 132088662 134880875
4057 134880875 137422749 139905685 142366235 144909537 147742151 150566268 153609943 156491853
4049 156491853 159068751 161149209 162827306 164057377 164869058 165328551 165494251 165468785 165205760
4040 165205760 164739078 163932508 162839615 161582631 160471965 159725037 159275150 159042829 158863200
4031 158863200 158830665 158665362 158309139 157892129 157225590 156443817 155800739 155031372 154039534
4022 154039534 152845548 151276410 149263488 146871927 144254936 141342384 138310574 134998661
4014 134998661 131466885 127787435 124102108 120310650 116435367 112622905 109187071 106138208
4006 106138208 103245483 100755138 98527641 96503148 94724133 93059436 91583629 90158621
3998 90158621 88881587 87663217 86456912 85106246 83712883 82075450 80353849 78683107
3990 78683107 76967860 75384375 73932407 72689213 71266472 69712347 68087339 66293388
3982 66293388 64479768 62641945 60769903 59084316 57554779 56078922 54781864 53518105
3974 53518105 52407378 51148342 50014843 48901877 47948124 46906464 45867100 45010435
3966 45010435 44165164 43302526 42399425 41504514 40763126 40046787 39222973 38478635 37852088
3957 37852088 37037624 36177728 35272798 34311090 33514739 32711091 31846591 31171770 30624379
3948 30624379 29874362 29164045 28402722 27829893 27164096 26554070 26049601 25452602 24813744
3939 24813744 24223296 23668909 23208975 22639225 22153588 21622185 21103718 20659274 20186114
3930 20186114 19827752 19414507 19049348 18641276 18106462 17819996 17660931 17285752 16999888
3921 16999888 16707226 16390908 16177546 15925800 15764721 15552226 15317410 15130872 14968775
3912 14968775 14842180 14507235 14335182 14217596 14070833 13926337 13866652 13769854 13708948 13659575
3902 13659575 13409343 13117394 12946822 12907935 12875577 12854634 12733092 12684426 12612512 12457341
3892 12457341 12321382 12239915 12204167 12148143 12024427 11827775 11803596 11677787 11567032 11577909
3882 11577909 11499936 11434979 11395367 11316756 11232992 11218379 11176172 10999792 10887411 10882911 10831544
3871 10831544 10824105 10714315 10594690 10448481 10491533 10484353 10274542 10200183 10134465 10030507 10046610
3860 10046610 10080041 10084935 9934025 9893163 9857122 9787866 9805680 9830915 9734877 9672785 9725092
3849 9725092 9604146 9572464 9591780 9509794 9433180 9468814 9403465 9313009 9361883 9248332 9131801
3838 9131801 9107220 9071237 9092483 9136754 9117188 9131674 9245160 9149150 9146816 9227735 9257745
3827 9257745 9223238 9175767 9242060 9303535 9353287 9341519 9369435 9416822 9463209 9421576 9306923
3816 9306923 9288941 9362706 9282633 9342351 9253375 9304825 9385327 9325908 9334968 9286108 9357253 9538870
3804 9538870 9568814 9691261 9651662 9701244 9802866 9831758 9969995 10039848 10079444 10084350 10125854
3793 10125854 10102057 10069264 10064677 10171943 10062237 9961539 10000030 9942011 9970731 9978166 10116638
3782 10116638 10070014 9985195 9997640 9929377 9902471 9935289 9903804 9853119 10007602 9889738 9922532
3771 9922532 9917292 10039813 10087029 10128964 10110941 10091938 10091454 10064371 10032153 10032746 10080035 10104023
3759 10104023 10066223 10174901 10215968 10225696 10178088 10201593 10228580 10183351 10246970 10175043 10182148
3748 10182148 10150921 10214775 10165628 10040095 10053673 9981845 10071902 10081418 10086495 10076703 10032862 10023488
3736 10023488 10061044 10116898 10238178 10232613 10229043 10272393 10271217 10301445 10318793 10372817 10457067 10397146
3724 10397146 10441361 10404658 10329678 10463027 10472444 10513084 10390821 10400882 10414465 10345407 10215461
3713 10215461 10316740 10370722 10415503 10456358 10361367 10464200 10584969 10536756 10484221 10592949
3703 10592949 10609183 10566182 10610479 10653948 10590395 10522093 10621339 10691417 10727092 10658423 10683329
3692 10683329 10672826 10703690 10730387 10767638 10814452 10891369 10873835 10839814 10811971 10908829 10934225
3681 10934225 10999867 10986329 11060041 11120518 11158621 11253613 11266409 11465231 11547139 11583847 11725457
3670 11725457 11848572 11934100 11994567 12080622 12197894 12213357 12307646 12505219 12648730 12668902
3660 12668902 12697326 12890921 13032792 13021891 13153993 13141216 13260666 13432673 13439446 13534257
3650 13534257 13703350 13851471 13995829 14149020 14271828 14383107 14565524 14752309 14877166
3641 14877166 14994579 15193507 15263282 15423354 15627783 15765688 15958552 16128133 16243687 16348188
3631 16348188 16443461 16519225 16641601 16819874 17014376 17224185 17411418 17640575 17902945 18108966
3621 18108966 18254081 18493315 18664310 18918095 19073520 19156422 19395463 19762915 20000944 20289328
3611 20289328 20520266 20683762 20933534 21200681 21583437 21903471 22256902 22536189 22771992
3602 22771992 23026015 23361878 23763760 23977322 24220406 24521481 24806269 25257173 25665136
3593 25665136 25850342 26093530 26485490 26793644 27104025 27395428 27778905 28134103 28494232
3584 28494232 28818338 29298106 29693168 30090099 30591078 31207874 31751030 32374171 33045000
3575 33045000 33595298 34227955 34853290 35538081 36191821 36712862 37441181 37992546 38578137
3566 38578137 39251709 39808617 40462347 41074567 41854344 42590506 43094329 43831611 44687259
3557 44687259 45431116 46091872 46778954 47559012 48445465 49228317 50004500 50951800 51893091
3548 51893091 53029193 54111111 55247407 56469011 57776442 59243117 60652684 62168629
3540 62168629 63933231 65632391 67307667 69203060 71282034 73626024 76258491 79169816
3532 79169816 82389724 85920268 89672022 93725578 98225637 103077928 108301162 113801570
3524 113801570 119354514 124861796 130029496 134440147 137946204 139924466 140431323 139507275
3516 139507275 137349002 133923090 129490272 124414204 118981865 113279940 108076398 103366403
3508 103366403 99066215 95249108 91849174 88848420 86028274 83623904 81286821 79140919
3500 79140919 77161399 75475152 73828891 72438464 71230453 70200207 69375223 68666721
3492 68666721 68125378 67338987 66311383 65048449 63562643 61915641 60296730 58755549
3484 58755549 57317107 55909128 54536431 53214191 51935668 50635685 49272918 48154583
3476 48154583 47158864 46056892 44951400 43972376 43150151 42337017 41636907 41055455 40447156
3467 40447156 39937138 39624689 39339501 39175909 39000106 39351898 39970211 40655144 41159525
3458 41159525 40995489 40242436 38859178 37239034 35659880 34394203 33141035 32204392 31390589
3449 31390589 30581007 30005807 29372998 28867666 28448378 27922627 27486363 27157510 26890477
3440 26890477 26566182 26293094 26051733 25736917 25585050 25540468 25375892 25259800 25387602 25417594
3430 25417594 25474458 25679053 25980450 26298710 26292732 26118829 25545242 24837639 24104671 23401252
3420 23401252 22823204 22323578 21955969 21607207 21335423 21096306 20786965 20556586 20167399
3411 20167399 19831008 19698129 19557004 19405842 19262085 19071237 18906333 18771133 18565500
3402 18565500 18382677 18234846 18066088 17869949 17782896 17638147 17523180 17321769 17226017 17099414
3392 17099414 16936948 16824140 16640839 16558525 16417938 16390702 16441466 16336818 16250545 16003564
3382 16003564 15896734 15885177 15783435 15785844 15701532 15606631 15500005 15460005 15385263 15250231 15064707
3371 15064707 15068961 14952935 14852230 14987768 15025541 14936092 14877129 14789249 14717922 14624182 14542978
3360 14542978 14445191 14428408 14527595 14405469 14319465 14281197 14299024 14176463 13926468 13927893 13933846
3349 13933846 13816487 13730000 13669879 13522401 13520243 13511460 13419968 13422450 13379747 13251806 13081950
3338 13081950 12897528 12751675 12607083 12582262 12541993 12522238 12448509 12337954 12302280 12230468
3328 12230468 12214357 12153458 12034199 11972491 11917763 11815169 11770894 11744950 11670827 11572191 11758762
3317 11758762 11594081 11470620 11374906 11272807 11182583 11178318 11095859 11106119 11042064 10892665 10801939
3306 10801939 10737050 10676454 10658065 10681852 10694854 10677384 10650764 10700534 10674474 10720790 10676509
3295 10676509 10722258 10729990 10802820 10814477 10857537 10779186 10829989 10814378 10897737 11004665 11026551
3284 11026551 11156573 11173967 11248877 11289390 11309697 11420931 11477214 11493698 11615162 11679516 11634906
3273 11634906 11749330 11850877 11846659 11970652 12125771 12228947 12366033 12452883 12565831 12754221
3263 12754221 12926637 13100583 13180597 13325222 13540023 13701408 13987588 14162786 14214134 14421191
3253 14421191 14513341 14671604 14736949 14887974 15118187 15245318 15432759 15632993 15719081 15874929
3243 15874929 15960390 16118414 16194839 16214923 16329893 16516172 16787848 16984100 17108129 17237204
3233 17237204 17389170 17650860 18087158 18395052 18715518 19040597 19367282 19940961 20418425
3224 20418425 20925379 21248088 21535393 21898104 22352002 22728873 23110767 23673869 24179950
3215 24179950 24756660 25340623 26082743 26862743 27529674 28167981 28767276 29340491 29927604
3206 29927604 30282490 30772996 31230845 31536374 31830933 32113835 32407761 32651453 33053134
3197 33053134 33552557 33850152 34269130 34879260 35519413 36089454 36901133 37772568 38732251
3188 38732251 39761989 40855418 42133817 43558645 45070459 46744957 48316607 50033256
3180 50033256 51616421 53034838 54100012 54757873 54919418 54618227 53936741 52886401 51771470
3171 51771470 50540879 49242957 48138456 47352468 46832717 46591718 46626117 46926178 47311300
3162 47311300 47904530 48681338 49500779 50329846 51302433 52347357 53341701 54314285 55202624
3153 55202624 55880460 56232753 56486025 56502509 56119448 55534248 54595798 53403211 51864006
3144 51864006 50325104 48832080 47306684 45848104 44411818 43101418 42027044 41210045
3136 41210045 40560273 40135221 39913516 39663404 39607349 39607118 39490816 39218945 38997001 38646266
3126 38646266 38198981 37581943 36724348 35801061 34726928 33627075 32270102 30899337 29605418
3117 29605418 28246975 26954698 25725049 24637740 23669949 22768290 21841950 21188667 20600514
3108 20600514 19920306 19389687 18828871 18354317 17915458 17514751 17152081 16742408 16324145
3099 16324145 15920167 15640873 15294395 14889770 14517099 14173211 13780278 13318951 12932483
3090 12932483 12582495 12262723 11963065 11633852 11412304 11105894 10801421 10479571 10309726
3081 10309726 10009368 9740182 9570991 9352851 9090135 8947131 8813278 8595124 8401738
3072 8401738 8354314 8257656 8125923 8105259 7910045 7761117 7680103 7579002 7475141 7376151
3062 7376151 7199998 7072230 7016591 6992775 6899690 6761868 6445953 6287188 6283780 6160338
3052 6160338 6025848 5935193 5789757 5665250 5567666 5416862 5200143 5132549 5171972 5009804
3042 5009804 5005138 5033279 5006332 4847924 4835178 4813787 4675884 4554728 4596080 4618135 4496935
3031 4496935 4458994 4341697 4333503 4191628 4042522 3990757 3948490 3918223 3892508 3782285 3749035
3020 3749035 3674136 3631776 3583207 3427957 3470381 3481117 3338853 3220164 3146912 3124191 3127785
3009 3127785 3052150 2926044 2872247 2864660 2886758 2819593 2746404 2738385 2612494 2538859 2613492
2998 2613492 2625640 2624330 2563447 2560302 2470502 2379636 2381540 2506958 2366224 2174458 2198035
2987 2198035 2251314 2295300 2295972 2252155 2137242 2105002 2155477 2140833 2107548 2086039 2096410 2014812
2975 2014812 2037016 1983297 1925974 1849674 1888237 1977839 2061921 2044201 1986628 1911380 1857041
2964 1857041 1918501 1908671 1910922 1904700 1821184 1835449 1767536 1698305 1727178 1638636 1702350 1798294
2952 1798294 1800260 1653196 1637706 1603359 1558093 1561037 1534643 1529849 1642551 1504428 1433982
2941 1433982 1422750 1472357 1498955 1559911 1641831 1521357 1507023 1518556 1453420 1451974 1484875
2930 1484875 1474391 1578489 1552668 1558068 1563910 1547154 1437828 1286878 1273188 1339170 1325228
2919 1325228 1340876 1414340 1383509 1377914 1289984 1406350 1347983 1307582 1294208 1277614 1325051
2908 1325051 1369625 1319216 1317748 1293556 1239863 1212762 1216245 1269189 1240020 1203986 1148062 1140601
2896 1140601 1153526 1190666 1186687 1230194 1298364 1233411 1187860 1116302 1119214 1122761 1218825 1169447
2884 1169447 1110301 1029594 1024967 1076064 1106818 1055811 1112570 1179971 1091447 1134308 1177780 1150021
2872 1150021 1140918 1217479 1124237 1018483 979493 1118182 1217514 1150261 1140042 1165827 1070279
2861 1070279 1120749 1106981 1052842 1018447 1034326 1069439 945764 1065705 1009357 964745 958982
2850 958982 927528 939250 926708 891212 838378 909805 938288 930599 888216 850917 842189 867975
2838 867975 802244 810654 795188 816230 826849 772140 791260 835075 862444 787520 632388 745581
2826 745581 841325 798731 666360 647929 756911 746953 558410 580701 718609 748944 634302
2815 634302 684278 700691 634769 584216 699855 667241 569100 545217 635097 672241 616299
2804 616299 590666 635931 617075 590433 580748 521472 580528 522222 520336 568772 629717 602879
2792 602879 587573 534269 513496 600050 651494 565206 532306 554000 562011 504301 536780 607675
2780 607675 653459 605632 502256 569461 570976 603386 571596 500758 425881 418849 348660 279392
2768 279392 410828 478036 449519 398470 390534 445268 549971 372798 326259 401602 414129
2757 414129 330181 347327 393366 381424 454300 448007 441717 434525 390774 341727 425143 449665
2745 449665 445130 519053 456088 459592 429805 438660 434050 378921 355756 375514 376112 317002 269955
2732 269955 265779 309859 261287 218803 309187 325591 361850 259138 255750 286324 245847 263148
2720 263148 308516 299105 334833 353396 375035 239552 158176 191878 171756 212670 256776 174363
2708 174363 171627 306965 293784 267745 149697 180411 203398 181767 163295 184987 113900
2697 113900 151660 267617 179638 134245 187414 213124 266437 249047 160760 117758 80684
2686 80684 149865 226343 111105 87888 105009 159899 192194 140054 90599 57862 102340 98079
2674 98079 107980 115095 160037 163561 71580 73412 127446 107714 81924 65922 100142 252211
2662 252211 240988 256236 215810 265736 286434 186449 178054 109862 48801 112358 144747 119268
2650 119268 77137 75341 208066 243162 217927 237374 161043 127331 118934 20766 28431 26521
2638 26521 589 65475 172767 184275 91328 120754 150676 94096 119845 81232 89492 133574
2626 133574 117640 46160 59597 105753 42767 85063 163373 -17 -45221 -4687 13269
2615 13269 35296 77373 54488 141107 122388 61152 120412 27446 -27363 62650 75479 12200
2603 12200 46042 10775 -17898 122279 21208 -5852 67624 67721 99827 125337 135032 119935
2591 119935 121940 63790 135886 43395 16877 20175 -35180 -88638 -5056 115634 124627 131955
2579 131955 209666 126172 143397 189039 200369 188476 96703 -6738 22104 37453 18439
2568 18439 65489 31348 22591 78043 59673 -1033 22968 56444 70295 103751 135443 36711
2556 36711 100251 74544 60737 -3902 -62390 46219 75293 70640 27544 -27276 -96718 -63545
2544 -63545 -18443 44017 27467 979 -50722 42765 126882 196048 183278 77701 69059 115103
2532 115103 119340 121484 143990 114365 94714 41873 9154 -30610 6050 -4850 52558 40541
2520 40541 70180 160825 115164 67807 88481 94846 152825 63526 -40618 -21337 33945 133167
2508 133167 -8194 37581 142710 198789 122323 204915 194711 103468 207989 169508 63568
2497 63568 22747 136486 187002 174789 119354 99044 66241 152304 50006 95846 103611 156164
2485 156164 147938 138182 176948 213332 195405 218077 231066 185606 288111 274513 228574 296907
2473 296907 242133 230701 239921 235546 267888 189390 219295 320201 310546 348033 385005 381967
2461 381967 312309 250445 322297 337055 352610 403084 421692 450217 452813 350782 402191 366492
2449 366492 369431 414035 454088 395383 410836 357425 312473 456359 497770 431280 531494
2438 531494 534652 505991 641353 666630 720668 725506 705759 692783 775349 788012 769434 849277
2426 849277 941744 947089 933020 763581 891649 998484 1002038 1023181 1063554 1166047 1155886
2415 1155886 1219828 1320429 1323995 1284686 1315254 1283345 1336312 1398544 1538235 1587473 1654014
2404 1654014 1752599 1784128 1800133 1921440 1952082 2003045 2114777 2212982 2360550 2628356 2824019
2393 2824019 2998670 3252963 3578059 3825817 4235029 4594489 5189712 5886967 7000957
2384 7000957 8594178 10977228 13148680 14825461 16020999 16083185 15397281 15522781 15687127
2375 15687127 13587482 10793419 8563380 7182500 5989761 5016852 4373501 3883670 3502584
2366 3502584 3312832 2999420 2821718 2571996 2326308 2195349 2063189 1874212 1796048 1694501
2356 1694501 1579944 1451950 1290472 1259297 1143183 1038185 1046611 984875 874315 811192
2346 811192 752204 755026 680813 674035 695686 651028 493064 476901 502239 464643 522954 546409
2334 546409 538056 421243 505703 534766 481326 416251 430661 481909 465087 372177 287275 383291
2322 383291 303658 303591 326872 246163 219004 178209 197820 196454 196943 207159 163713 129059 190379
2309 190379 173337 46937 151338 142276 95909 83353 153692 179164 220423 109940 25508
2298 25508 89807 26742 -938 75563 127315 -17887 69216 77165 147211 71109 -25770 31631
2286 31631 65075 75715 41669 11307 62494 34749 -30822 35271 2382 52858 -37317 43201
2274 43201 14858 -30197 27137 -12007 28536 1799 -105094 -66872 18519 -43269 -22429 -70111
2262 -70111 22271 20147 36046 115959 52233 -37090 -37244 -16489 49458 34919 -23780 60928
2250 60928 31669 30137 42267 -1068 -51480 62310 1283 19617 84937 82641 -47207 -26316
2238 -26316 24323 -31138 -84607 -201772 -217490 -97996 -72362 -135919 -49234 -5126 28462
2227 28462 -40597 54004 30280 -117585 -94310 1326 -41729 -38035 -27947 -1744 -48997 2336
2215 2336 -97131 -116407 -91160 -51496 -38338 -66739 -11056 -60763 -122896 -128840 55560 -33207
2203 -33207 -36237 -16747 -87024 -35265 -43084 -142835 -56632 -37303 25305 58750 18328 11332
2191 11332 -21752 -60949 -71781 -50106 -87337 -194016 -150434 -133233 -116639 -71584 -51864 -63700
2179 -63700 -21450 81138 -48152 -166017 -42459 -35660 -92102 -122553 -48454 41258 -57242
2168 -57242 31859 53816 6618 62260 -81454 -209395 -193533 -144300 -127108 -127936 -103039 -91973
2156 -91973 -83775 -80864 -8313 6095 -47306 74576 108585 -37263 4314 -31940 -35602 -69815
2144 -69815 -19902 28893 78094 42317 -106347 -244314 -177967 -69609 -88166 -146780 -28811
2133 -28811 -6774 -109174 -149472 -176200 -72155 -75929 -85931 -97318 -405 -64352 -125597 -46527
2121 -46527 -3860 -54548 -145960 -94663 12449 48034 -9579 58939 57668 26573 41880 35297
2109 35297 98941 159481 215974 148339 150245 65565 7133 -48333 -70859 -187839 -75850 -84291
2097 -84291 -125567 -154738 -121708 -49031 -52686 -41953 -75937 -143356 -97737 13081 -56734 -79208
2085 -79208 -82597 -63611 -8064 -34821 -126971 -88433 -38829 -107304 -158055 -63289 -73439 -55122
2073 -55122 -51519 -53542 -73678 -25047 -78722 -18110 -24244 -113426 -141257 -164934 -90118 48532
2061 48532 -20627 -86639 -95607 -52505 -190088 -195697 -53107 -52549 5489 64132 18008 -3187
2049 -3187 8759 -48119 1166 18391 -16098 -12166 -51973 -98578 -124242 -144441 -88292 -82952
2037 -82952 -20800 -22288 25328 16784 2985 -65943 -131395 -50776 19576 21097 -131749 -25242
2025 -25242 -71517 -163321 -141687 -147281 -189768 -229909 -161886 -151890 -83270 -39887 -96139 -90754
2013 -90754 -112790 -1881 -74229 -119147 -34086 -35109 54424 33756 -6654 -62718 -116158 -28419
2001 -28419 -63205 -35383 -78995 -225741 -156747 -101498 -10620 -62863 19221 52329 56089 -68948
1989 -68948 -157711 -102447 -35514 -65105 -145587 -103637 -22294 10366 -16195 38631 -13634 -46132
1977 -46132 -25349 1891 48718 -55814 -106055 -50228 -33111 69241 124028 61310 80170
1966 80170 33020 71432 29348 28249 -65947 -59611 -45397 24455 44073 -71442 -110028 -91719
1954 -91719 -51716 -33285 -70129 -18124 48969 42425 -55475 -152021 -95285 -69629 -96756 -85355
1942 -85355 -62192 -10420 -105933 -49981 -27630 -31002 -27899 -76627 -58357 -126333 8234 -81930
1930 -81930 -128260 -164388 -37941 -8425 -12896 -64543 -49144 15934 -33288 -121791 -87989 -67423
1918 -67423 -135263 -206118 -187712 -103328 -86126 -106048 -100878 -37502 -2207 -62402 -97237 -66134
1906 -66134 33947 57566 -9663 -148956 -174093 -101215 -2525 -64340 -59428 71309 -18627
1895 -18627 -153834 -185612 -78349 -187841 -117645 -30443 -53005 52863 39742 31625 13165
1884 13165 -57840 -49752 1899 6797 34232 31780 -53557 21168 -45503 -125270 -104628 -101710 -42769
1871 -42769 -63244 -107 56474 107741 27306 -131012 -57313 -59923 -148163 -109443 -48085 -120631
1859 -120631 -142066 -74552 -77945 -93150 4881 -27220 -73616 -51484 -97130 -54729 -8674 -4565
1847 -4565 8818 19296 11912 107593 -81904 -124539 -135187 -142011 -142268 -184855 -122091 -53029 -40787
1834 -40787 -104246 -45244 -89334 -80489 -102732 44692 22612 -12444 -91743 -51489 -19683 -44524
1822 -44524 -42888 -93154 -70328 -29526 -52754 -104179 -93984 -189289 -257603 -217090 -159998 -145552
1810 -145552 -81737 -52151 29504 27033 -91891 -117690 -159075 -66821 -31405 -125549 -136820 -69550
1798 -69550 -34937 -91895 -56879 24711 -19451 -39339 18470 53486 8306 -71119 -129820 -134405
1786 -134405 -154027 -122861 -38138 -66113 -73914 -106831 -192002 -183910 -105331 -40613 77382 -42316
1774 -42316 -48771 -139565 -134170 -113231 -124207 -105837 -115720 -86740 -90861 -159272 -115143 -141564 -133894
1761 -133894 34302 -16202 21789 102055 19344 -27522 79600 21502 68245 85116 -23590
1750 -23590 -88636 -56650 -85151 -48440 8101 25651 -54656 -114628 -82087 -64821 -127549 -139990
1738 -139990 -49883 -52922 1881 53493 75465 9066 -82325 -74348 -68563 -111185 -130415 -76470
1726 -76470 -3224 21133 -55771 -13995 -38850 44849 144023 114296 81355 42180 98713 -46375
1714 -46375 -103486 -29641 4046 -76991 -75952 -25577 82752 21865 -46338 -38924 -60232 -81800
1702 -81800 -83307 -44681 -66255 -81218 -45291 2571 -74678 -10676 33124 -122042 -135076 -47426
1690 -47426 9767 -49780 -30111 -32511 -62117 -121010 -108975 -62585 -100315 -57093 -72427 -72135
1678 -72135 -63351 -1936 23686 70856 55794 45811 -94267 -93136 -78355 -108623 -101212 -8668
1666 -8668 -46491 -66533 -101911 -134202 -74035 -84482 10840 -84433 -92705 -25735 -75089 36529
1654 36529 50092 21312 -19905 2914 30607 -57169 24184 35536 -296 -16181 55430 -26156
1642 -26156 -42063 -155306 -275390 -144593 -104131 -50215 -68972 -116422 -119123 -76355 -52877
1631 -52877 -82814 56034 8467 22361 52385 57810 46331 29905 15047 -22125 -25026 -72649
1619 -72649 -60492 5112 69505 118464 110251 65867 13758 89471 85844 -123207 -142522 -117040
1607 -117040 -152314 -157253 -92214 -36374 -64984 -108146 -81827 -70406 35792 -6892 -35950 -14514
1595 -14514 112874 134696 33230 41436 40406 27440 97275 57346 -90123 -18346 -37136 28752
1583 28752 50119 -100291 -84059 -54569 -27599 32277 59515 24458 -3747 -38001 26705 120688
1571 120688 5321 -90919 -88066 -51694 -9507 9013 -14446 40296 -18317 -147358 -143921 -53849
1559 -53849 -59189 -13512 45237 -18247 -1342 45319 -16570 -68418 -37457 14011 -32710 -18840
1547 -18840 -67347 -71627 -79538 -43469 -22372 29598 112830 -25904 -150155 -81378 -14288 11323
1535 11323 39905 -51410 -13548 -10483 30605 43076 -58636 1198 61632 55254 97246 -14914
1523 -14914 -86043 -40993 -76968 -50535 17206 44871 15555 -50366 -5826 -13135 64450 -7145
1511 -7145 16405 -81104 -81654 -59737 -27779 -5353 7300 -61022 -96616 -90874 -6309 -23929 -18611
1498 -18611 60429 23250 63395 38355 -7582 97737 13245 -112526 -102164 -159420 -30556
1487 -30556 20777 -24589 -104219 -70767 -82550 -5313 -17898 -87527 -117752 -67829 -87604 -10536
1475 -10536 -34968 -69359 -17761 61961 63495 17963 -22117 23951 -18196 -56685 -66290 -75223
1463 -75223 -77269 -95752 -89962 -106776 -147836 -19925 49955 -33853 -85915 -4535 44301 -42532
1451 -42532 -95662 -70802 -141732 -100205 19251 8049 -31867 -95327 -127109 -48978 -37367 11551
1439 11551 14724 27201 60746 95084 63483 -26061 -72988 -81645 -24042 -80951 -25103 -54231
1427 -54231 -38641 47055 -127745 -129552 13994 -101095 -59204 61515 26786 -12333 9744
1416 9744 -99299 -133234 -522 36286 79220 187081 133533 21291 -90033 -64973 -121376
1405 -121376 -92289 24341 46395 -28769 -33082 25705 -26496 -54986 52836 -12654 23844
1394 23844 60983 49081 -72999 -69125 -70907 -149399 -35257 -6862 -121079 -24766 26032 1593
1382 1593 15009 11881 10848 49242 93018 -7716 -57703 -89700 -74489 -56757 28305 -34802
1370 -34802 -41826 -52138 25512 19204 -71377 -19581 -52785 -23992 -90236 -69939 22411 -11398
1358 -11398 -51625 -57258 -108248 -52153 -67165 -81482 -180117 -156050 -136633 -109631 -13818 -11374
1346 -11374 21716 -63316 -22158 -38095 -116256 -70693 -51054 -17062 -11486 31870 19954 2800
1334 2800 43506 1377 80468 -24349 -35194 -19080 9992 -1738 -121646 -84041 -96934 44777
1322 44777 64926 13236 74898 85769 81685 -73900 -69023 11952 -35184 -37686 63553 20103
1310 20103 103761 40252 -24774 -45151 -6536 -62574 -75999 -42660 -1382 8616 1563 -58122
1298 -58122 -26255 -72151 -54987 -70035 -87082 55982 47788 -36380 33499 60543 27687 13624
1286 13624 27800 -15460 -18288 -34456 43569 72787 37342 101521 87690 -13699 -44604 -32978
1274 -32978 -13044 20953 -39857 40626 13813 -22635 -20302 -44324 44917 126892 82720 -44376
1262 -44376 29603 105997 -20067 83877 66117 38051 -51225 -4666 -28306 -24760 -128740
1251 -128740 -127699 -67213 -68062 -136828 -64767 -105564 -142504 -74018 -86329 1457 -80062 -45105
1239 -45105 -27144 12142 61025 -61888 -32905 -40989 79212 212714 108734 97403 23027
1228 23027 -17334 29272 11338 14106 -24361 25861 25142 49996 -26800 26554 -8730 -134797
1216 -134797 -37252 4275 -44006 -156349 -22889 -29437 -150783 -119666 -100411 -100322 -119580 45589
1204 45589 154074 50255 -15530 80051 32128 296 9847 -9292 18350 -28246 4412 49847
1192 49847 54411 115475 17539 46590 80143 137114 90176 20601 3860 -65203 -3981 -7010
1180 -7010 74257 100816 101374 141269 114904 148671 87633 277 -24670 -82932 -14039 107993
1168 107993 49575 30938 101159 47042 102611 53288 45619 43773 96036 62935 106604 45185
1156 45185 -18779 42554 4514 -97798 -81274 -122508 -57129 -55252 -52680 -39242 -2547 3104
1144 3104 -9008 -15689 -72031 -900 64805 82856 28095 -3486 31873 85755 23379 47153
1132 47153 29784 45376 74046 32030 -36095 -22740 -12769 -34496 -42743 -47320 17775 -51028
1120 -51028 -2475 23436 80069 8718 43191 27765 19848 12125 63072 97640 17819 -58972
1108 -58972 -118 36603 -26076 22051 48435 -23839 -76135 -95281 -58235 28025 -46998 -70510
1096 -70510 31811 36415 187346 60903 -70421 -23055 48901 28904 64371 106459 40258
1085 40258 29709 -6214 96678 25410 12722 -111468 -31910 2737 65673 126989 109967
1074 109967 55712 -52282 -62205 -98935 -192681 -100892 -38512 -66198 -123169 19407 15326 3627
1062 3627 -26231 51345 -42592 -40289 -35686 -61940 -27077 -44262 -33269 8407 35687 4400
1050 4400 -37615 -26053 132665 123412 61309 90851 83130 80568 3104 51113 -45780 -48603 24853
1037 24853 -20511 -46754 -10621 83020 86499 102872 53331 81886 9495 57079 57198 82277
1025 82277 81221 -6705 854 76210 44655 -44358 -50722 15387 11350 -5135 -33184 -78089 -89403
1012 -89403 -55902 56596 3062 14673 38877 50199 46250 68260 34422 -70585 4785 24713
1000 24713 97385 67891 -40753 -32009 -20370 6537 -21548 -104494 -60920 -7099 21515 -69613
988 -69613 -84061 -48542 -84146 -130560 -170848 -16161 15260 -65457 -67198 -110267 -73374 58735
976 58735 133654 27088 -14503 27140 30319 26286 -4705 -10533 45210 4221 82476 -2890
964 -2890 -77910 -47130 29063 -54647 -35052 -61606 -85895 -47424 -19422 84257 18146 8765
952 8765 -12212 -24796 -30762 -76866 -7459 14119 22486 29025 -39196 -53357 1377 8052 -38786
939 -38786 -116286 -43590 10502 -56763 -73913 29107 -8913 -69181 -77049 -83259 -70101 54384
927 54384 110130 8779 70710 63466 68883 47020 60489 58896 53952 29324 36018 7739 30533
914 30533 102487 -12035 -97499 -101141 -70375 12370 -4853 94566 145479 109242 32960 77152
902 77152 120504 44350 51258 149889 28076 -33970 -56111 -43099 -8615 8945 -33138 -23543
890 -23543 -8421 24786 26445 29626 60464 37241 114676 123003 -12494 14445 70322 31020
878 31020 66670 -5205 -61896 -112589 10797 134327 11178 -117927 -109709 -111368 8229
867 8229 139158 47723 -95762 -85687 -25446 -132195 -104286 -95667 -122329 -72986 100329 37938
855 37938 -113724 -91755 -81055 30993 36105 -5687 -9259 7276 -5427 14743 38065 116109
843 116109 113709 -37107 13303 -19880 -91366 -31389 40954 56250 9977 47764 61399 26508
831 26508 30607 59219 129 40116 -46084 -95905 -12684 92856 69364 20489 -80897 14280
819 14280 19597 -23267 -32294 -44629 -3635 -102332 -137401 -90824 -52799 -55978 11939 89350 49937
806 49937 -3687 16506 8492 30963 -27181 94693 129881 34899 -82262 -29579 76616 36921
794 36921 24821 57226 81094 52615 56494 38398 44717 23266 82809 67315 59764 56147 87346
781 87346 120545 65506 92289 57379 142316 169916 79614 25922 69326 30134 17370 41939
769 41939 39241 14822 -51870 2302 71235 138543 198342 148305 100309 15818 -235 19058
757 19058 -23290 -23514 37958 86027 125812 54341 -5497 -71670 -114798 -12299 55672 4099
745 4099 -75717 -28497 -39538 -54161 -93225 -41493 59084 81374 60850 55617 65469 73363 28752
732 28752 118944 68269 16000 106948 75947 96357 128128 62726 29850 9911 -6211 35028
720 35028 19292 -70956 13593 61390 17349 -23974 -64044 -32023 -17830 59851 144198 30750
708 30750 25672 64300 -38129 26509 57092 122982 129713 47574 23926 -24644 37957 40738
696 40738 67126 4587 -2429 -35229 -53727 -26193 -54601 14662 -2908 124872 198087 114908
684 114908 175867 85937 -13639 -22003 -34642 5934 25276 34769 72173 105312 54405 134538
672 134538 14666 -107780 5695 34426 18125 -39512 -94167 -65416 -26956 -70810 22477
661 22477 34775 4006 -20219 -1129 24871 -93573 -50075 12889 99144 86556 -16575 27623
649 27623 97559 50877 34747 11419 49192 4511 64547 42498 109156 105619 55746 53534
637 53534 5510 -73450 -118131 -74168 -30388 12021 129953 142651 265576 132403 9243
626 9243 80863 50051 43984 37481 75782 4991 92980 145972 83522 54119 58644 42548 3553
613 3553 86803 47883 73016 108579 59119 7897 -51803 -66438 -21511 1962 -15287 37468
601 37468 -10811 -709 -69898 37680 38584 -24572 25830 52578 -5677 -28713 19453 57939
589 57939 33759 62506 -69194 -57008 -84932 2155 98659 121515 35898 37224 24422 -87738
577 -87738 -33558 -338 -74674 -78280 -17964 -21469 42140 5285 -40525 -107497 -20452 50469
565 50469 11915 -35615 -18985 128250 139765 19499 -44442 -44735 10042 -15266 89641 56918
553 56918 -10360 -4958 -61143 15851 5887 -49493 -10593 6604 -33445 44023 58198 39129
541 39129 87024 95490 191035 66691 -94777 -44197 -59778 98018 118799 96474 35603 64894
529 64894 177592 99065 113909 126169 142347 168388 97874 12593 -37467 3809 17495 5243
517 5243 76252 69972 22507 14373 -11626 -7653 17288 -1175 31880 -2423 -52125 -49405 31036
504 31036 27559 17436 85216 52414 106322 189032 65884 88588 66546 108886 28487 88039
492 88039 169272 102304 83618 103130 28798 65713 27799 49749 155745 91682 25391 14251
480 14251 -37621 -20193 56429 31367 1542 -32326 -43114 481 69739 10450 74556 72457
468 72457 75940 90676 -1543 68961 123856 140461 165520 109651 123389 66883 73122 124956
456 124956 24215 42484 54443 76686 86714 -54708 -63144 -43500 14073 1582 -15571 -43796
444 -43796 16217 -38317 20030 60500 59334 -32612 -13871 5737 -19118 16261 26660 31336
432 31336 42125 123804 15593 -17746 20271 53301 31509 64660 61270 652 -5005 100497
420 100497 97810 58883 150606 94316 -50496 -105557 -45105 26663 67439 -24910 -56818 -29104
408 -29104 -41580 -52256 31996 1180 21925 74225 72258 81498 68321 135200 145539 136351 81150
395 81150 127876 160950 92954 -75885 21918 46379 72897 87236 49283 -18064 -40054 -3016
383 -3016 414 26001 -12739 1731 -57015 -161173 -181720 -104911 38330 108202 125451 188679
371 188679 125142 249886 138778 110079 135846 71313 73660 1275 13577 44976 98313 92846
359 92846 36683 -31028 -57313 -76630 19217 -52950 -28222 -33960 -79849 -107140 -98074 11222
347 11222 53847 -36442 5328 81303 46181 35271 24429 79369 96969 73266 90220 114147
335 114147 81863 68593 21320 73874 123761 95792 67607 162093 86055 20935 50796 22776
323 22776 61638 119208 65732 131323 37349 64308 75089 33799 27697 23875 -35372 -163818
311 -163818 -41011 38685 191223 165399 126781 51420 -15347 41245 148259 135950 80937
300 80937 106829 98116 0 54254 52449 41682 -1210 9514 31510 52809 74122 25557
288 25557 22183 9458 11994 -23630 -12705 41082 4566 -62837 32154 -42191 62679 72794
276 72794 81878 11796 42469 156444 162508 6570 -43399 5549 -2618 28043 -4999 99591
264 99591 65277 97512 109625 58186 -11402 -24001 59131 112507 14843 7484 -7745 -18695
252 -18695 -9834 72955 27391 9934 93796 120604 73938 33455 7989 103812 148715 153086
240 153086 86476 -95583 4381 44144 4313 -92494 -80055 -8735 -33942 -13463 87942
229 87942 29577 -71359 -40793 55915 112483 195707 127639 76349 43393 87435 98753 93224
217 93224 46254 51903 49161 -13714 21531 41156 67226 95209 34333 30779 68175 31393 24540
204 24540 -41891 15501 44160 63096 56600 76030 62977 57108 42190 56343 119526 145823
192 145823 130698 59283 27909 20512 -35490 34704 45434 99708 210053 211193 162323 63453
180 63453 -3647 -17698 24345 -41249 -45945 -6469 -11230 17498 50174 61437 63011 2950 -47872
167 -47872 47592 47048 67882 62455 -6682 -71682 -135091 -117149 3349 95802 126775 103321
155 103321 162910 185989 127637 120914 114121 135999 136881 84113 110297 118390 111352 -15428 -74182
142 -74182 -49245 30285 53728 -35611 18651 -42093 46216 121657 102377 58810 116739 42189
130 42189 -32088 48773 39905 71417 104405 56532 48328 48232 44205 -12285 -49906 59867 58188
117 58188 109946 155494 119504 34877 23780 112500 36047 -34816 -23730 4996 93359 127843
105 127843 72629 79208 81668 81564 60293 36652 12099 19265 -9317 21778 154345 148163 103244
92 103244 71174 34066 82283 1239 -62648 -26036 -3444 -206 31709 51713 31058 32554
80 32554 63380 26657 41213 104095 85417 54325 98389 60125 59929 10960 9232 21051 -19924
67 -19924 22392 -23054 8719 67412 80034 41956 5615 20708 59511 76200 81299 18402
55 18402 4189 2482 42401 43527 35087 58930 99233 88158 19104 -10689 -671 89439 113831
42 113831 58761 79795 156176 132115 85840 101963 68454 34945 96836 112800 50131 65424
30 65424 59265 18431 81540 73544 66293 88533 72674 62053 47510 -6464 54769 70234 20089
17 20089 15510 33511 12269 -13631 -1844 49936 52167 28257 15634 5423 -14517 58726 92207
4 92207 55129 122526 131947 67724
0 67724
$$ Imaginary data points
##PAGE= N=2
##DATA TABLE= (X++(I..I)), XYDATA
16383 -2089214 -2059386 -2039153 -1985581 -1995482 -2049115 -1937175 -1883654 -1905681 -1833129 -1742946 -1710817
16372 -1710817 -1627860 -1582108 -1576129 -1559359 -1532327 -1446608 -1356374 -1349084 -1363245 -1319428 -1228448 -1150657
16360 -1150657 -1233794 -1229120 -1151886 -1046099 -1064345 -1067414 -1005836 -951308 -993362 -984823 -902658 -807711
16348 -807711 -783362 -690419 -697567 -693526 -601635 -569201 -603757 -581991 -539810 -462530 -470073 -440077
16336 -440077 -361161 -352734 -255281 -307446 -282563 -206524 -135225 -121934 -134521 -59440 874 10734
16324 10734 32862 105787 113108 121981 149256 208952 243398 309324 293101 259792 294437 370511
16312 370511 345440 427165 469825 479566 549212 624182 607304 575168 583634 717885 811332 851569
16300 851569 825192 825080 922147 905278 866388 947266 975832 1038073 976293 974596 1028752 1066047
16288 1066047 1104406 1127182 1205104 1104284 1090447 1145831 1206624 1200313 1180423 1255272 1383399
16277 1383399 1390221 1477234 1558439 1571412 1580420 1529609 1525656 1575781 1588227 1630755 1693513 1757514
16265 1757514 1789540 1777765 1756707 1846482 1891250 1858555 1886155 1949966 2030684 2024182 2018935 2014613
16253 2014613 2009653 2033823 2037289 2068466 1998532 2133850 2135346 2165361 2243689 2216069 2244588 2317624
16241 2317624 2360677 2301892 2306592 2298533 2325549 2376493 2426358 2516492 2451168 2431260 2490343 2478063
16229 2478063 2493900 2539145 2603693 2611063 2602625 2595007 2515669 2640599 2695017 2649212 2668805 2710272
16217 2710272 2720580 2753483 2711289 2778513 2819953 2809378 2799755 2882937 2946764 2911941 2894926
16206 2894926 2942124 2877971 2900122 2903991 2935214 2974716 3022424 3143645 3056512 3123096 3093136
16195 3093136 3016056 3036283 3183970 3146342 3053469 3029669 3136203 3089501 3071501 3093397 3110032
16184 3110032 3057383 3013366 3051997 3093570 3152063 3144476 3226746 3245587 3230816 3288290 3311409
16173 3311409 3347471 3302680 3304526 3334171 3262319 3298739 3296706 3308043 3299114 3210766 3360538 3445138
16161 3445138 3384468 3359506 3314118 3390327 3478008 3512076 3520985 3400126 3448318 3449896 3361619
16150 3361619 3368782 3358896 3421786 3431739 3414449 3434454 3440758 3425606 3478645 3492019 3519597 3431739
16138 3431739 3512748 3562711 3670146 3652189 3550248 3559205 3552644 3559990 3605862 3681927 3632654
16127 3632654 3552945 3614943 3585437 3553987 3646983 3536718 3637265 3608326 3646265 3640490 3586317
16116 3586317 3632539 3613345 3616838 3665365 3720836 3786791 3751161 3725266 3661976 3598581 3565591
16105 3565591 3523543 3657444 3752404 3670945 3682291 3650310 3612019 3673223 3681413 3690084 3673887
16094 3673887 3749433 3850748 3759037 3715965 3690683 3663111 3499722 3561393 3638591 3690952 3686437
16083 3686437 3722768 3787561 3779466 3826053 3758387 3735934 3684473 3709670 3736205 3729561 3764259 3769614
16071 3769614 3800372 3761497 3725271 3766271 3808015 3795858 3765161 3817984 3714339 3677738 3768010
$$ [...]
##END NTUPLES=NMR SPECTRUM
##END=
