##TITLE=1H_CG-1191-a13
 CDCl3
 8sc, 
 16.2.2024
##JCAMPDX= 6.0         $$ Bruker NMR JCAMP-DX V2.0
##DATA TYPE= NMR SPECTRUM
##DATA CLASS= NTUPLES
##ORIGIN= UXNMR, Bruker Analytische Messtechnik GmbH
##OWNER= root
$$ XWIN-NMR		Version 3.5
$$ Fri Feb 16 15:36:58 2024 Russian Standard Time (UT+4h)  she@DPX200
##.OBSERVE FREQUENCY= 200.1313
##.OBSERVE NUCLEUS= ^1H
##.ACQUISITION MODE= SIMULTANEOUS
##.ACQUISITION SCHEME= undefined
##.AVERAGES= 8
##.DIGITISER RES= 18
##SPECTROMETER/DATA SYSTEM= spect
##.PULSE SEQUENCE= zg30
##.SOLVENT NAME= DMSO
##.SHIFT REFERENCE= (INTERNAL, DMSO, 0, 15.4814)
##AUDIT TRAIL= $$ (NUMBER, WHEN, WHO, WHERE, WHAT)
$$ ##TITLE= Audit trail, XWIN-NMR		Version 3.5
$$ ##JCAMPDX= 5.01
$$ ##ORIGIN= Bruker BioSpin GmbH
$$ ##OWNER= she
$$ F:/spectra/data/she/nmr/H-F/1/pdata/1/auditp.txt
$$ ##AUDIT TRAIL=  $$ (NUMBER, WHEN, WHO, WHERE, WHAT)
(   1,<2024-02-16 15:35:43.35 +0400>,<she>,<DPX200>,
      <created by zg, POWCHK disabled, PULCHK disabled
       configuration hash MD5:
       00 E9 B6 7A A2 85 ED C7 34 08 36 98 17 FE 4E 26
       data hash MD5: 16K
       80 CC A6 46 93 63 8C 1C F4 04 97 38 B1 19 90 F3>)
(   2,<2024-02-16 15:35:46.51 +0400>,<she>,<DPX200>,
      <Start of raw data processing
       efp BC_mod = 2 LB = 0.24 FT_mod = 6 PKNL = 1 PHC0 = -24960.29 PHC1 = 13.05264 SI = 16K 
       data hash MD5: 16K
       BF 3D ED 71 01 34 13 D2 78 6A 26 CA 65 86 20 55>)
(   3,<2024-02-16 15:36:01.57 +0400>,<she>,<DPX200>,
      <pk PHC0 = -7.661949 PHC1 = 7.4 
       data hash MD5: 16K
       55 E9 B3 47 1E 85 B6 C8 7F 4C 69 E9 59 89 DF 32>)
(   4,<2024-02-16 15:36:04.62 +0400>,<she>,<DPX200>,
      <abs ABSG = 5 
       data hash MD5: 16K
       86 1B F1 96 F8 AB 73 51 8E BB 26 B5 74 77 E0 09>)
$$ ##END=
$$ 
$$ hash MD5
$$ 7E 2E BE FB B2 02 39 05 07 49 08 72 4E D6 74 56
##$RELAX= 
##$RELAX= 
##$RELAX= 
##$RELAX= 
##$RELAX= 
##$RELAX= 
$$ Bruker specific parameters
$$ --------------------------
##$DU= <F:/spectra>
##$EXPNO= 1
##$NAME= <H-F>
##$PROCNO= 1
##$TYPE= <nmr>
##$USER= <she>
##$AMP= (0..31)
100 100 100 100 100 100 100 100 100 100 100 100 100 100 100 100 100 100 
100 100 100 100 100 100 100 100 100 100 100 100 100 100 
##$AQSEQ= 0
##$AQ_mod= 1
##$AUNM= <au_zg>
##$AUTOPOS= <>
##$BF1= 200.13
##$BF2= 200.13
##$BF3= 200.13
##$BF4= 200.13
##$BF5= 200.13
##$BF6= 200.13
##$BF7= 200.13
##$BF8= 200.13
##$BYTORDA= 1
##$CFDGTYP= 0
##$CFRGTYP= 5
##$CHEMSTR= <none>
##$CNST= (0..31)
1 1 145 1 1 1 1 1 1 1 1 1 1 1 1 1 1 1 1 1 1 1 1 1 1 1 1 1 1 1 1 1 
##$CPDPRG= <>
##$CPDPRG1= <>
##$CPDPRG2= <>
##$CPDPRG3= <>
##$CPDPRG4= <mlev>
##$CPDPRG5= <mlev>
##$CPDPRG6= <mlev>
##$CPDPRG7= <mlev>
##$CPDPRG8= <mlev>
##$CPDPRGB= <>
##$CPDPRGT= <>
##$D= (0..31)
0 1.2 0 0 0 0 0 0 0 0.06 0 0.03 0 0 0 0 0.0002 0 0 0 0 0 0 0 0 0 0 0 0 
0 0 0 
##$DATE= 1708083342
##$DBL= (0..7)
120 120 120 120 120 120 120 120 
##$DBP= (0..7)
150 150 150 150 150 150 150 150 
##$DBP07= 0
##$DBPNAM0= <>
##$DBPNAM1= <>
##$DBPNAM2= <>
##$DBPNAM3= <>
##$DBPNAM4= <>
$$ [...]
##$SUBNAM3= <"">
##$SUBNAM4= <"">
##$SUBNAM5= <"">
##$SUBNAM6= <"">
##$SUBNAM7= <"">
##$SUBNAM8= <"">
##$SUBNAM9= <"">
##$SW= 18.0517328524113
##$SWIBOX= (0..15)
0 0 2 0 0 0 0 0 0 0 0 0 0 0 0 0 
##$SW_h= 3612.71676300578
##$TD= 16384
##$TD0= 1
##$TE= 0
##$TE2= 300
##$TE3= 300
##$TEG= 300
##$TL= (0..7)
0 120 120 120 120 120 120 120 
##$TP= (0..7)
150 150 150 150 150 150 150 150 
##$TP07= 0
##$TPNAME0= <>
##$TPNAME1= <>
##$TPNAME2= <>
##$TPNAME3= <>
##$TPNAME4= <>
##$TPNAME5= <>
##$TPNAME6= <>
##$TPNAME7= <>
##$TPOAL= (0..7)
0.5 0.5 0.5 0.5 0.5 0.5 0.5 0.5 
##$TPOFFS= (0..7)
0 0 0 0 0 0 0 0 
##$TUNHIN= 0
##$TUNHOUT= 0
##$TUNXOUT= 0
##$USERA1= <user>
##$USERA2= <user>
##$USERA3= <user>
##$USERA4= <user>
##$USERA5= <user>
##$V9= 5
##$VALIST= <valist>
##$VCLIST= <CCCCCCCCCCCCCCC>
##$VD= 0
##$VDLIST= <DDDDDDDDDDDDDDD>
##$VPLIST= <PPPPPPPPPPPPPPP>
##$VTLIST= <TTTTTTTTTTTTTTT>
##$WBST= 1024
##$WBSW= 4
##$XGAIN= (0..3)
0 0 0 0 
##$XL= 0
##$YL= 0
##$YMAX_a= 105213
##$YMIN_a= -169952
##$ZGOPTNS= <>
##$ZL1= 120
##$ZL2= 120
##$ZL3= 120
##$ZL4= 120
##$ABSF1= 15.47365
##$ABSF2= -2.578199
##$ABSG= 5
##$ABSL= 3
##$ALPHA= 0
##$AQORDER= 0
##$ASSFAC= 0
##$ASSFACI= 0
##$ASSFACX= 0
##$ASSWID= 0
##$AUNMP= <proc_1d>
##$AZFE= 0.1
##$AZFW= 0.1
##$BCFW= 0
##$BC_mod= 2
##$BYTORDP= 0
##$COROFFS= 0
##$CY= -3
##$DATMOD= 1
##$DC= 0
##$DFILT= <>
##$DTYPP= 0
##$F1P= 0
##$F2P= 0
##$FCOR= 1
##$FTSIZE= 16384
##$FT_mod= 6
##$GAMMA= 0
##$GB= 0
##$INTBC= 1
##$INTSCL= 3.70164e-10
##$ISEN= 128
##$LB= 0.24
##$LEV0= 0
##$LPBIN= 0
##$MAXI= 10000
##$MC2= 0
##$MEAN= 0
##$ME_mod= 0
##$MI= 1.114404
##$NCOEF= 0
##$NC_proc= -9
##$NLEV= 6
##$NOISF1= 3.799351
##$NOISF2= 2.8
##$NSP= 0
##$NTH_PI= 0
##$NZP= 0
##$OFFSET= 15.48136
##$PC= 1
##$PHC0= -24967.95
##$PHC1= 20.45264
##$PH_mod= 1
##$PKNL= yes
##$PPARMOD= 0
##$PSCAL= 0
##$PSIGN= 0
##$REVERSE= no
##$SF= 200.130008075284
##$SI= 16384
##$SIGF1= 3
##$SIGF2= 2
##$SINO= 5.538805
##$SIOLD= 16384
##$SREGLST= <1H.CDCl3>
##$SSB= 0
##$STSI= 16384
##$STSR= 0
##$SW_p= 3612.71676300578
##$SYMM= 0
##$S_DEV= 0
##$TDeff= 16384
##$TDoff= 0
##$TI= <>
##$TILT= no
##$TM1= 0
##$TM2= 0
##$TOPLEV= 0
##$USERP1= <user>
##$USERP2= <user>
##$USERP3= <user>
##$USERP4= <user>
##$USERP5= <user>
##$WDW= 1
##$XDIM= 16384
##$YMAX_p= 458134348
##$YMIN_p= -2225028
$$ End of Bruker specific parameters
$$ ---------------------------------
##NTUPLES= NMR SPECTRUM
##VAR_NAME=  FREQUENCY,     SPECTRUM/REAL,   SPECTRUM/IMAG
##SYMBOL=    X,             R,               I
##VAR_TYPE=  INDEPENDENT,   DEPENDENT,       DEPENDENT
##VAR_FORM=  AFFN,          ASDF,            ASDF
##VAR_DIM=   16384,         16384,           16384
##UNITS=     HZ,            ARBITRARY UNITS, ARBITRARY UNITS
##FACTOR=    0.220516191357247, 1,           1
##FIRST=     3098.28478897016, 0,            0
##LAST=      -514.431974035617, 0,           0
##MIN=       -514.431974035617, -2225028,    0
##MAX=       3098.28478897016, 458134348,    0
$$ Real data points
##PAGE= N=1
##DATA TABLE= (X++(R..R)), XYDATA
$$ [...]
$$ plain form
6145 23598140 22618956 21900856 21793323 21482749 21146732 21627779 21876790 21165755 21258273 21772792
6135 21772792 22082784 22030742 22566781 22795844 22291370 23304129 23461826 23879611 23882019 23078822
6125 23078822 23872214 23506275 23118554 22680920 22835493 22265596 22097459 21432077 21142365
6116 21142365 20973809 21692219 21307425 20970780 21003602 20451926 19714711 19702394 19456658 18707243
6106 18707243 19559032 19513887 20489833 20227919 20700894 19925207 20411460 20210805 19035112
6097 19035112 19288001 20074950 19336632 19391627 19826683 19572845 19264808 18943972 19560090 20143681
6087 20143681 19957654 19488100 20510699 20315916 20489272 19956425 20435973 20549671 20947495
6078 20947495 20502232 20479746 19877992 20587928 20803843 19859867 19829347 19879322 19819767 20135951
$$ packed form
6145B3598140r79184p18100j07533l10574l36017M81047K49011p11035R2518N14519
6135B1772792L09992n2042N36039K29063n04474J012759J57697M17785K408q03197
6125B3078822P93392l65939l87721m37634J54573n69897j68137o65382k89712
6116B1142365j68556P18410l84794l36645L2822n51676p37215j2317k45736p49415
6106A8707243Q51789m5145R75946k61914M72975p75687M86253k00655j175693
6097A9035112K52889P86949p38318N4995M35056k53838l08037l20836O16118N83591
6087B0143681j86027m69554J022599j94783J73356n32847M79548J13698L97824
6078B0947495m45263k2486o01754P09936K15915r43976l0520M9975n9555L16184
$$ plain form
6068 20135951 19542621 20386573 21147828 21885276 22758815 22490144 21968222 22656745 22346147
6059 22346147 22683733 23298407 22441502 23436878 23806719 24356675 25384742 25289504 25524716
6050 25524716 26160499 26897109 26584140 26581472 27449744 28078271 29873761 31474223 33435253
6041 33435253 37744118 42218746 47149677 54659919 62680698 66148317 64859113 57432676
6033 57432676 47938158 41575401 36313020 32548648 30245961 28765601 27436777 26640008
6025 26640008 25873359 25884647 25710548 26467711 25904067 25948461 24718492 24642904 24199272 24234648
6015 24234648 24117215 24956222 25490312 26674663 27614604 26344365 24341143 23045140 21506709
6006 21506709 20972995 20043774 19542641 19525556 18760883 17972545 17244655 17270921 17076468 17546308
$$ packed form
6068B0135951n93330Q43952P61255P37448Q73539k68671n21922O88523l10598
6059B2346147L37586O14674q56905R95376L69841N49956J028067r5238K35212
6050B5524716O35783P36610l12969k668Q68272O28527J795490J600462J961030
6041C3435253M308865M474628M930931P510242Q020779L467619j289204p426437
6033E7432676r494518o362757n262381l764372k302687j480360j328824p96769
6025B6640008p66649J1288j74099P57163n63644M4394j229969p5588m43632L5376
6015B4234648j17433Q39007N34090J184351R39941j270239k003222j296003j538431
6006B1506709n33714r29221n01133j7085p64673p88338p27890K6266j94453M69840
$$ plain form
5996 17546308 17245960 17058546 17198756 16936229 16883864 16395730 16751124 17443307 16858603 17310529
5986 17310529 18849899 18646304 17728425 17318257 17430818 17237217 17126387 16947901 17243388
5977 17243388 16956899 17009090 17664251 18400718 17805111 17677729 18496283 19390515 19643991 19067912
5967 19067912 19463648 19303520 18878220 18449982 18871344 18519140 18057318 18507683 19303319
5958 19303319 19677550 20136552 19728785 19566378 19940673 20757721 20748780 20210891 19920760 20688898
5948 20688898 21189556 21878055 21303503 20962175 20382138 20706990 21087034 21640368 21477903
5939 21477903 20603476 20290848 20824597 21133256 21536908 21941285 22377821 22934302 22773714
5930 22773714 22241549 23179878 23114278 22919259 23861352 23822021 22572976 22468147 22442221 22468430
$$ packed form
5996A7546308l00348j87414J40210k62527n2365m88134L55394O92183n84704M51926
5986A7310529J539370k03595r17879m10168J12561j93601j10830j78486K95487
5977A7243388k86489N2191O55161P36467n95607j27382Q18554Q94232K53476n76079
5967A9067912L95736j60128m25300m28238M21362l52204m61822M50365P95636
5958A9303319L74231M59002m07767j62407L74295Q17048q941n37889k90131P68138
5948B0688898N00658O88499n74552l41328n80037L24852L80044N53334j62465
5939B1477903q74427l12628N33749L08659M03652M04377M36536N56481j60588
5930B2773714n32165R38329o5600j95019R42093l9331j249045j04829k5926K6209
$$ plain form
5920 22468430 23745560 23990647 23368522 24080871 25034825 24966116 25690163 26118961 26793102
5911 26793102 27013722 27389359 27962446 28273007 28150978 28038124 27467568 28204373 28811920
5902 28811920 28790251 28992019 29273414 30139245 30165611 29215288 28376992 28172882 28619262 28785135
5892 28785135 28413819 29135315 28835481 28789413 29267354 29635353 30347314 30031565 29927529 30496893
5882 30496893 30104416 30045872 30876233 30312660 31052856 32604317 32061990 31962187 31639380 31892978
5872 31892978 32137621 31836075 32150716 31434400 31576516 31056429 31607689 32854151 31958629
5863 31958629 32271187 31949759 31473839 32637407 32292919 31375807 31972683 31739688 30879528
5854 30879528 30798752 31024052 30978692 31064661 30736610 30205753 30410558 30803248 30809732 31040979
$$ packed form
5920B2468430J277130K45087o22125P12349R53954o8709P24047M28798O74141
5911B6793102K20620L75637N73087L10561j22029j12854n70556P36805O07547
5902B8811920k1669K01768K81395Q65831K6366r50323q38296k04110M46380J65873
5892B8785135l71316P21496k99834m6068M77941L67999P11961l15749j04036N69364
5882C0496893l92477n8544Q30361n63573P40196J551461n42327r9803l22807K53598
5872C1892978K44643l01546L14641p16316J42116n20087N51260J246462q95522
5863C1958629L12558l21428m75920J163568l44488r17112N96876k32995q60160
5854C0879528q0776K25300m5360Q5969l28051n30857K04805L92690O484K31247
$$ plain form
5844 31040979 30769141 31122127 30677424 30882342 31691946 31632454 32093287 32276298 32895941 32810429
5834 32810429 32564311 32802594 33348982 32761655 32812923 32627077 33753290 33479515 32580122
5825 32580122 33013291 32663700 31680666 32964768 34090327 33856242 33630687 34444941 34580316
5816 34580316 34797423 35723282 35835064 36289304 36951370 36929843 37165783 37086463 37190023 37426954
5806 37426954 37515556 38004042 38774242 39425581 40670113 41837796 43308618 44612846 45765805
5797 45765805 46908196 49283900 52236818 55765826 60135335 67398735 77132531 88702662
5789 88702662 102755051 110685770 108162349 97098408 83500787 72527602 64670726 58718601
5781 58718601 54635076 52898975 51896724 50902252 51060351 51110023 50269402 49516962 48421660
$$ packed form
5844C1040979k71838L52986m44703K04918Q09604n9492M60833J83011O19643q5512
5834C2810429k46118K38283N46388n87327N1268j85846J126213k73775q99393
5825C2580122M33169l49591r83034J284102J125559k34085k25555Q14254J35375
5816C4580316K17107R25859J11782M54240O62066k1527K35940p9320J03560K36931
5806C7426954Q8602M88486P70200O51339J244532J167683J470822J304228J152959
5797D5765805J142391K375704K952918L529008M369509P263400R733796J1570131
5789H8702662J4052389P930719k523421j1063941j3597621j0973185p856876n952125
5781E8718601m083525j736101j002251r94472J58099M9672q40621p52440j095302
$$ plain form
5772 48421660 47034159 46948771 46694956 47577302 47864597 47656283 48443149 49172528 50596192
5763 50596192 53365197 56150269 58105540 61003920 65063224 67714127 68903083 66771571
5755 66771571 64741418 61726209 58731476 56845263 55326122 54732142 55400071 55387662 54891163
5746 54891163 54887371 55052118 55705641 56405386 56890900 58186878 59055352 59208510 59580654 60771677
5736 60771677 59787631 58560171 57691337 57461158 58730356 59636736 60084514 60066205 61149603
5727 61149603 62230666 63571737 66134980 69504149 71662089 71935462 70824630 70565224
5719 70565224 69777476 68863605 67796241 67356878 67275243 67635194 67421421 66864917 67105646
5710 67105646 66378257 66553042 66844390 65963726 64969459 64411718 65365019 65135342 64494022
$$ packed form
5772D8421660j387501q5388k53815Q82346K87295k08314P86866P29379J423664
5763E0596192K769005K785072J955271K898380M059304K650903J188956k131512
5755F6771571k030153l015209k994733j886213j519141n93980O67929j2409m96499
5746E4891163l792J64747O53523O99745M85514J295978Q68474J53158L72144J191023
5736F0771677r84046j227460q68834k30179J269198R06380M47778j8309J083398
5727F1149603J081063J341071K563243L369169K157940K73373j110832k59406
5719G0565224p87748r13871j067364m39363q1635L59951k13773n56504K40729
5710F7105646p27389J74785K91348q80664r94267n57741R53301k29677o41320
$$ plain form
5701 64494022 64942905 66111903 67074230 68120001 69144966 70189251 71399876 71477211 72334681
5692 72334681 73291453 73099725 71391527 69480337 66824847 65239475 64310426 63712905 63328665
5683 63328665 62294522 61928220 61437123 62020685 62286977 63327086 63727303 64164270 64040426
5674 64040426 63555320 64345284 64711955 64692960 64754162 65397888 64829406 64114853 64973840 66495483
5664 66495483 66970503 66367628 66690432 67128412 66840244 66852166 66714174 66467274 65647031 65187270
5654 65187270 64212577 62853859 61373451 60131695 59327469 59715743 58851149 57975816 58116252
5645 58116252 58491228 58967896 59543189 59212485 58622955 58967501 59470509 59093620 58631881
5636 58631881 58730012 58298742 58057550 56910693 55278974 54041927 53849133 52792858 52645052
$$ packed form
5701F4494022M48883J168998R62327J045771J024965J044285J210625P7335Q57470
5692G2334681R56772j91728j708198j911190k655490j585372r29049n97521l84240
5683F3328665j034143l66302m91097N83562K66292J040109M00217M36967j23844
5674F4040426m85106P89964L66671j8995O1202O43726n68482p14553Q58987J521643
5664F6495483M75020o02875L22804M37980k88168J1922j37992k46900q20243m59761
5654F5187270r74693j358718j480408j241756q04226L88274q64594q75333J40436
5645E8116252L74976M76668N75293l30704n89530L44546N03008l76889m61739
5636E8631881R8131m31270k41192j146857j631719j237047j92794j056275j47806
$$ plain form
5627 52645052 51881625 50711891 50283679 49766792 49002989 49092871 48010282 46899700 46975035
5618 46975035 49012003 49697992 49386262 49469232 49402717 49187030 48022296 47978326 47585148 47567069
5608 47567069 48091064 47320855 46681254 46145621 45686891 45690581 44379496 43821250 43110695 42148713
5598 42148713 42117151 42596958 42121826 41738742 41833351 41817581 41411835 40791157 39860361 39414429
5588 39414429 39639209 38691977 38301515 38249389 38172779 37263427 35795904 35225149 35343913 34355287
5578 34355287 34279880 34628513 34127855 33699090 32617904 31956114 32481930 31898198 32242194
5569 32242194 32129710 31135611 30481430 29418995 29761973 29754045 29302627 29587695 29085202 28186753
5559 28186753 27608682 27437410 27473682 27611516 27596725 27465641 27471033 27133694 26952068 26693848
$$ packed form
5627E2645052p63427j169734m28212n16887p63803Q9882j082589j110582P5335
5618D6975035K036968O85989l11730Q2970o6515k15687j164734m3970l93178j8079
5608D7567069N23995p70209o39601n35633m58730L690j311085n58246p10555r61982
5598D2148713l1562M79807m75132l83084R4609j5770m05746o20678r30796m45932
5588C9414429K24780r47232l90462n2126p6610r09352j467523n70755J18764r88626
5578C4355287p5407L48633n00658m28765j081186o61790N25816n83732L43996
5569C2242194j12484r94099o54181j062435L42978p928m51418K85068n02493q98449
5559B8186753n78071j71272L6272J37834j4791j31084N392l37339j81626k58220
$$ plain form
5549 26693848 26627567 26894472 26687330 26439655 25926480 25671598 26219151 25938708 25530478 25138666
5539 25138666 25752698 26468652 25792948 25575886 25486587 24879192 24175749 23763921 24462531 25091775
5529 25091775 25303699 25377940 25280015 25915341 25841378 25074178 25704549 24978568 24170255 24668019
5519 24668019 24730953 24387287 24174019 24433875 24449857 23852912 23848659 23426396 23292546 22322813
5509 22322813 23210986 24326612 24316280 24361394 23801061 23326982 23108404 23675449 23076685 23267920
5499 23267920 23972056 23234468 23428289 23906117 24411738 24114294 23620024 24165651 24737439
5490 24737439 23642667 24381171 25380054 25105751 24734166 25336365 25673365 25854803 26126186
5481 26126186 25564907 25354855 26300419 27578715 28614178 28481763 28494266 30026089 31267289
$$ packed form
5549B6693848o6281K66905k07142k47675n13175k54882N47553k80443m08230l91812
5539B5138666O14032P15954o75704k17062q9299o07395p03443m11828O98610O29244
5529B5091775K11924P4241r7925O35326p3963p67200O30371p25981q08313M97764
5519B4668019O2934l43666k13268K59856J5982n96945m253m22263j33850r69733
5509B2322813Q88173J115626j0332M5114n60333m74079k18578N67045n98764J91235
5499B3267920P04136p37588J93821M77828N05621k97444m94270N45627N71788
5490B4737439j094772P38504R98883k74303l71585O02199L37000J81438K71383
5481B6126186n61279k10052R45564J278296J035463j32415J2503J531823J241200
$$ plain form
5472 31267289 32098498 33959862 35998621 38797053 41442948 41498443 38821087 36701874 35374837
5463 35374837 33763987 31108836 31734656 32390767 32321678 32593898 31653729 32466366 33308185
5454 33308185 33097499 32310622 31940797 31308528 30827454 29629094 29632003 28926916 29103902 28538513
5444 28538513 28159392 27677263 27218056 27439872 27102739 27112909 27389678 26305725 26215790 25497411
5434 25497411 26000588 25368355 25262173 25629679 24457430 24383382 24659273 23841492 22939444
5425 22939444 22761977 22576367 21105172 20970514 21138755 20784533 20262868 20377697 20243510
5416 20243510 21616130 21692470 21352836 21162291 21216535 21943882 21111735 21079343 21623789 22023077
5406 22023077 22500499 22323927 22092877 21299144 20782892 21664788 22507900 22221657 21799447
$$ packed form
5472C1267289Q31209J861364K038759K798432K645895N5495k677356k119213j327037
5463C5374837j610850k655151O25820O56111o9089K72220r40169Q12637Q41819
5454C3308185k10686p86877l69825o32269m81074j198360K909p05087J76986n65389
5444B8538513l79121m82129m59207K21816l37133J0170K76769j083953q9935p18379
5434B5497411N03177o32233j06182L67506j172249p4048K75891q17781r02048
5425B2939444j77467j85610j471195j34658J68241l54222n21665J14829j34187
5416B0243510J372620P6340l39634j90545N4244P27347q32147l2392N44446L99288
5406B2023077M77422j76572k31050p93733n16252Q81896Q43112k86243m22210
$$ plain form
5397 21799447 21928603 21368283 21748945 22841693 23257019 22665487 22956825 23300388 23092867
5388 23092867 22383604 23004654 23804204 23480572 24480430 23945566 23176223 22426022 22346053 22545426
5378 22545426 21443507 20565334 19833434 20836574 21713996 22614615 22112246 21722422 20788864
5369 20788864 20738073 20511896 20559185 20799176 21095486 20779137 21196268 20356768 20617414 20896476
5359 20896476 20135190 19502176 19443109 19897332 20272830 18496798 17640907 19056649 18474082
5350 18474082 18420609 18328288 18052296 18627027 19505657 20246728 20144842 19775145 20130363 20372118
5340 20372118 19451428 19244011 18741353 18637741 18741013 19071250 18647360 18970639 19278886
5331 19278886 19319470 19216057 18794685 18784447 18204532 18850569 19695455 19676374 19255555 18718263
$$ packed form
5397B1799447J29156n60320L80662J092748M15326n91532K91338L43563k07521
5388B3092867p09263O21050P99550l23632R99858n34864p69343p50201p9969J99373
5378B2545426j101919q78173p31900J003140Q77422R00619n02369l89824r33558
5369B0788864n0791k26177M7289K39991K96310l16349M17131q39500K60646K79062
5359B0896476p61286o33014n9067M54223L75498j776032q55891J415742n82567
5350A8474082n3473r2321k75992N74731Q78630P41071j01886l69697L55218K41755
5340B0372118r20690k07417n02658j03612J03272L30237m23890L23279L08247
5331A9278886M0584j03413m21372j0238n79915O46037Q44886j9081m20819n37292
$$ plain form
5321 18718263 18657683 18744396 17945060 18033590 18634879 18441334 18528066 19385871 19164154 18092671
5311 18092671 18347011 18132662 17415386 17763423 17883452 17508144 17570931 16837047 17232823 17290056
5301 17290056 16513858 17061719 16960889 17364696 17170192 17899010 18027154 18079106 17432600 16936809
5291 16936809 17005865 17850395 16848136 16387169 16875881 17650383 18108961 17605541 17277124
5282 17277124 17177589 16935892 16660197 16723401 18365124 17629254 16690711 17125702 16968831 16532788
5272 16532788 17413997 17965189 17402707 17729164 17883715 17062623 17334936 17503849 17415258 18458876
5262 18458876 18141966 18181320 17323740 17136085 18003374 17230895 17338703 17845007 18065251 18993868
5252 18993868 19045249 19275769 17463144 16396656 17409289 18214966 17737075 17751166 17899576
$$ packed form
5321A8718263o0580Q6713p99336Q8530O01289j93545Q6732Q57805k21717j071483
5311A8092671K54340k14349p17276L48037J20029l75308O2787p33884L95776N7233
5301A7290056p76198N47861j00830M03807j94504P28818J28144N1952o46506m95791
5291A6936809O9056Q44530j002259m60967M88712P74502M58578n03420l28417
5282A7277124r9535k41697k75695O3204J641723p35870r38543M34991j56871m36043
5272A6532788Q81209N51192n62482L26457J54551q21092K72313J68913q8591J043618
5262A8458876l16910L9354q57580j87655Q67289p72479J07808N06304K20244R28617
5252A8993868N1381K30520j812625j066488J012633Q05677m77891J4091J48410
$$ plain form
5243 17899576 17736568 17584038 18771270 17900338 18422536 19308121 18628203 18370104 18496926
5234 18496926 19027669 18289752 18749233 19334156 19218907 19500072 20234131 19551271 19648295 19995960
5224 19995960 18871074 19114932 19072425 19702743 20337066 20292894 20038294 19684840 19494921 18978473
5214 18978473 20029275 20348498 20521829 20520030 20630640 21379781 21400389 21588748 21241686 20852552
5204 20852552 21017830 20557466 19929867 19899415 20280901 20550175 21099416 20781437 20718626 21974802
5194 21974802 21889402 22800207 22838413 22241684 21939844 21714323 22298662 21379883 21375802 22250225
5184 22250225 23178963 22786315 22969090 23596971 24277804 24672692 24633982 24383469 24489594 25056707
5174 25056707 24447297 24547399 25330054 24759109 24039429 24837648 25625285 25804373 25352363
$$ packed form
5243A7899576j63008j52530J187232q70932N22198Q85585o79918k58099J26822
5234A8496926N30743p37917M59481N84923j15249K81165P34059o82860R7024L47665
5224A9995960j124886K43858m2507O30318O34323m4172k54600l53454j89919n16448
5214A8978473J050802L19223J73331j799J10610P49141K0608J88359l47062l89134
5204B0852552J65278m60364o27599l0452L81486K69274N49241l17979o2811J256176
5194B1974802q5400R10805L8206n96729l01840k25521N84339r18779m081Q74423
5184B2250225R28738l92648J82775O27881O80833L94888l8710k50513J06125N67113
5174B5056707o09410J00102P82655n70945p19680P98219P87637J79088m52010
$$ plain form
5165 25352363 25144028 25907366 25544747 25674248 25246983 25364146 24776526 24565941 25393104
5156 25393104 25614412 25985358 26250587 26445709 25469701 26215137 26646793 26443712 26726249
5147 26726249 27100978 27200864 27603858 27520772 27063659 27625480 28324121 29227337 29649035 29623628
5137 29623628 29578982 30513085 30535617 30106942 29423052 29751765 30865317 30485373 30096174 30940572
5127 30940572 31470330 30958803 32160719 33002123 33811612 33260992 32947451 33650605 34256414
5118 34256414 33911334 33908035 33975781 33974301 34887601 35841631 37297175 37795882 38557670 38905727
5108 38905727 39360240 40035424 40613155 40563339 41289479 42559490 42636729 44638084 47837411
5099 47837411 49435812 50782608 51184436 49472200 48093426 47384885 47289785 47106030 47768654
$$ packed form
5165B5352363k08335P63338l62619J29501m27265J17163n87620k10585Q27163
5156B5393104K21308L70946K65229J95122r76008P45436M31656k03081K82537
5147B6726249L74729R9886M02994q3086m57113N61821O98641R03216M21698k5407
5137B9623628m4646R34103K2532m28675o83890L28713J113552l79944l89199Q44398
5127C0940572N29758n11527J201916Q41404Q09489n50620l13541P03154O05809
5118C4256414l45080l299O7746j480R13300R54030J455544M98707P61788L48057
5108C8905727M54513O75184N77731m9816P26140J270011P7239K001355L199327
5099D7837411J598401J346796M01828j712236j378774p08541r5100j83755O62624
$$ plain form
5090 47768654 48359594 49228798 50265814 51266317 52721099 54022551 54147450 54736648 56987469
5081 56987469 58063330 58840746 60766046 64108311 68432259 74541197 82215137 90694777
5073 90694777 100871755 107337891 106112588 98038057 89250616 81415966 75221485 70112245
5065 70112245 65754510 63302958 61304560 60562213 60147829 59986850 59265143 57455924 56907543
5056 56907543 56037639 56391648 55779067 54254555 54601322 54442867 53993661 52811883 52669225
5047 52669225 52735961 51344984 49966082 50115354 50378907 50195243 49613477 49288018 49435415
5038 49435415 50335327 49637776 49495308 49329217 49816097 49657922 49097083 50285945 50771048
5029 50771048 51425336 52541703 52844909 53184122 54579914 57117117 58579371 60990088 64815579
$$ packed form
5090D7768654N90940Q69204J037016J000503J454782J301452J24899N89198K250821
5081E6987469J075861P77416J925300L342265M323948O108938P673940Q479640
5073I0694777J0176978O466136j225303q074531q787441p834650o194481n109240
5065G0112245m357735k451552j998398p42347m14384j60979p21707j809219n48381
5056E6907543q69904L54009o12581j524512L46767j58455m49206j181778j42658
5047E2669225O6736j390977j378902J49272K63553j83664n81766l25459J47397
5038D9435415Q99912o97551j42468j66091M86880j58175n60839J188862M85103
5029E0771048O54288J116367L03206L39213J395792K537203J462254K410717L825491
$$ plain form
5020 64815579 67918893 71195710 73999698 75593879 74805666 72921050 72767940 72708038 72977674
5011 72977674 74367115 75662942 75015914 73767717 72097391 70675531 69419561 67635123
5003 67635123 66119773 64344833 63425884 62419015 62384014 61815710 60588991 60724498 60635437
4994 60635437 59676866 57991071 56968717 56301603 56156172 55966367 56086475 55631874 54204151
4985 54204151 53147174 53371053 53522072 52554211 51858119 51990683 53041584 52986083 53068753
4976 53068753 52981725 53086920 52860299 53064103 53387759 53147518 52885782 52599882 51930666 51713264
4966 51713264 51570030 50968838 50130348 50053174 48986975 49196040 48340684 46742302 46205514
4957 46205514 46591095 46356767 45843037 46104396 46297109 46247761 46268335 45867855 45860018 46563764
$$ packed form
5020F4815579L103314L276817K803988J594181p88213j884616j53110n9902K69636
5011G2977674J389441J295827o47028j248197j670326j421860j255970j784438
5003F7635123j515350j774940r18949j006869l5001n68304j226719J35507q9061
4994F0635437r58571j685795j022354o67114j45431j89805J20108m54601j427723
4985E4204151j056977K23879J51019r67861o96092J32564J050901n5501Q2670
4976E3068753q7028J05195k26621K03804L23656k40241k61736k85900o69216k17402
4966E1713264j43234o01192q38490p7174j066199K09065q55356j598382n36788
4957D6205514L85581k34328n13730K61359J92713m9348K0574m00480p837P03746
$$ plain form
4947 46563764 46693355 47162559 47803784 47353684 46680490 45757286 45158641 45188819 44771588 44787982
4937 44787982 45140116 45162457 45308073 44900103 44585777 45066631 44655400 43983095 43195156 43333364
4927 43333364 43090763 42115406 42541212 44064290 44068376 45070988 45270029 45339747 44040680
4918 44040680 43779879 43504821 43139266 43014958 42612418 42697167 42832273 43377079 44312346 44375956
4908 44375956 43542345 42846064 42838813 42568235 41461979 41562930 40885934 40957866 40790338 40205538
4898 40205538 39811600 39780340 39826115 38841936 39681805 39562193 40241252 40101126 39759055 39770883
4888 39770883 38849426 38696483 38972964 39614686 39050710 38293166 37509870 37185164 37917799
4879 37917799 38337142 37908441 38360962 38298691 37768456 37452587 38007739 38367460 37465135 37194551
$$ packed form
4947D6563764J29591M69204O41225m50100o73194r23204n98645L0178m17231J6394
4937D4787982L52134K2341J45616m07970l14326M80854m11231o72305p87939J38208
4927D3333364k42601r75357M25806J523078M086J002612J99041O9718j299067
4918D4040680k60801k75058l65555j24308m02540Q4749J35106N44806R35267O3610
4908D4375956q33611o96281p251k70578j106256J00951o76996P1932j67528n84800
4898D0205538l93938l1260M5775r84179Q39869j19612O79059j40126l42071J1828
4888C9770883r21457j52943K76481O41722n63976p57544p83296l24706P32635
4879C7917799M19343m28701M52521o2271n30235l15869N55152L59721r02325k70584
$$ plain form
4869 37194551 38187587 38097827 38529804 37893606 37491036 38110252 38733397 38848514 38557439 38754142
4859 38754142 38940761 39333397 38875011 38262700 39369865 40884125 39685673 39364166 38523108
4850 38523108 39696662 39739216 39321799 40071774 39540079 40419243 39440219 39524854 40138033 40188599
4840 40188599 40683086 40410584 40331814 40824602 41290950 40135014 39725035 40463591 40756444
4831 40756444 41550687 40836086 40433471 41236700 41447832 40982080 40742732 41235760 40918807
4822 40918807 41141187 41223272 41497149 43067951 42695449 42248858 41723476 42263631 42432821
4813 42432821 43303323 42859216 42983576 43421246 43656453 43597318 44967297 44615941 43977397
4804 43977397 44178855 44872807 44832180 44354990 44882208 44634922 45229459 45306948 44856994 45321747
$$ packed form
4869C7194551R93036q9760M31977o36198m02570O19216O23145J15117k91075J96703
4859C8754142J86619L92636m58386o12311J107165J514260j198452l21507q41058
4850C8523108J173554M2554m17417P49975n31695Q79164r79024Q4635O13179N0566
4840D0188599M94487k72502p8770M92788M66348j155936m09979P38556K92853
4831D0756444P94243p14601m02615Q03229K11132m65752k39348M93028l16953
4822D0918807K22380Q2085K73877J570802l72502m46591n25382N40155J69190
4813D2432821Q70502m44107J24360M37670K35207n9135J369979l51356o38544
4804D3977397K01458O93952m0627m77190N27218k47286N94537P7489m49954M64753
$$ plain form
4794 45321747 46429819 45808125 45710311 46730617 48243613 48128948 48069486 47290078 47738453
4785 47738453 48037902 47533709 47512745 48458490 48212129 48289564 47369963 47673060 49071812 48602624
4775 48602624 48817417 48887575 49757339 49656245 50422887 50707982 50311272 51098244 52319875
4766 52319875 52528990 52242371 52287466 52169467 52319777 53328270 53425436 53956812 54531968 54767984
4756 54767984 55709605 55489872 55138645 54404107 55330689 55959919 56091145 55588840 56045505
4747 56045505 55858980 55347168 56086220 57073605 56929837 56945421 58011379 57906171 57344064
4738 57344064 57483381 58042836 58749130 58676692 58598400 58219821 59077466 58565421 59097913 58698041
4728 58698041 58347096 59589199 59238516 60044670 60428324 60263281 60027837 61020699 61664288
$$ packed form
4794D5321747J108072o21694r7814J020306J512996j14665n9462p79408M48375
4785D7738453K99449n04193k0964R45745k46361P7435r19601L03097J398752m69188
4775D8602624K14793P0158Q69764j01094P66642K85095l96710P86972J221631
4766E2319875K09115k86619M5095j17999J50310J008493R7166N31376N75156K36016
4756E4767984R41621k19733l51227p34538R26582O29230J31226n02305M56665
4747E6045505j86525n11812P39052R87385j43768J5584J065958j05208n62107
4738E7344064J39317N59455P06294p2438p8292l78579Q57645n12045N32492l99872
4728E8698041l50945J242103l50683Q06154L83654j65043k35444R92862O43589
$$ plain form
4719 61664288 61366621 61520500 61350897 62403668 62827370 62270173 62455284 62691889 64460126
4710 64460126 63318513 62246835 62464418 63072360 63175228 64064401 63764586 62743398 62654359
4701 62654359 62886140 62948456 63473320 63622581 63697642 62530324 62241729 63138404 63465675 63514796
4691 63514796 63621935 64469058 63675292 64074319 63660846 63519731 63016331 62522379 62229656
4682 62229656 62296266 61674081 62163777 62158208 62336296 62063499 62507046 62764724 62767734 62333658
4672 62333658 62618784 62352281 62117630 61850297 61541389 62351459 62918295 62445980 62170303
4663 62170303 62540117 62944071 64001449 63595985 63663530 63894424 64192302 63674165 63519876
4654 63519876 64232528 64441157 63751243 64810421 63515105 63837525 64026345 63839439 64029926
$$ packed form
4719F1664288k97667J53879j69603J052771M23702n57197J85111K36605J768237
4710F4460126j141613j071678K17583O07942J02868Q89173k99815j021188q9039
4701F2654359K31781O2316N24864J49261P5061j167318k88595Q96675L27271M9121
4691F3514796J07139Q47123p93766L99027m13473j41115n03400m93952k92723
4682F2229656O6610o22185M89696n569J78088k72797M43547K57678L010m34076
4672F2333658K85126k66503k34651k67333l08908Q10070N66836m72315k75677
4663F2170303L69814M03954J057378m05464O7545K30894K97878n18137j54289
4654F3519876P12652K08629o89914J059178j295316L22420J88820j86906J90487
$$ plain form
4645 64029926 64548811 64028931 64601097 64973941 64530102 64357120 63699556 64052643 63987251 63615800
4635 63615800 64916255 64936313 65099443 65380882 65334988 65293127 65716184 67134006 68332510
4626 68332510 66948993 66642760 67304425 67784227 67816413 68464442 69356342 69413371 70096436 70291152
4616 70291152 70952539 70692745 70518111 70843929 71654417 72065260 73112776 73115326 73608917 74165667
4606 74165667 75077899 75775541 75750594 76749688 76349168 76984677 77734352 77403337 78680413
4597 78680413 78695152 79533427 80108246 80819340 80905710 81798159 83348828 84338739 84293759 84971923
4587 84971923 85698569 86280708 86815914 88173438 88339239 87711073 89138246 89494729 90874021
4578 90874021 91984778 92953660 93693351 93726207 94941783 96873974 98876917 99764839 100943464
$$ packed form
4645F4029926N18885n19880N72166L72844m43839j72982o57564L53087o5392l71451
4635F3615800J300455K0058J63130K81439m5894m1861M23057J417822J198504
4626F8332510j383517l06233O61665M79802L2186O48029Q91900N7029O83065J94716
4616G0291152O61387k59794j74634L25818Q10488M10843J047516K550M93591N56750
4606G4165667R12232O97642k4947R99094m00520O35509P49675l31015J277076
4597G8680413J4739Q38275N74819P11094Q6370Q92449J550669R89911m4980O78164
4587H4971923P26646N82139N35206J357524J65801o28166J427173L56483J379292
4578I0874021J110757R68882P39691L2856J215576J932191K002943Q87922J178625
$$ plain form
4569 100943464 102355536 104169060 105028731 105807816 106799109 107473242 109035227 109372828 110431203
4560 110431203 111738498 112708270 114753498 116073789 117571794 120205182 122674203 125831291
4552 125831291 129774492 132616226 136011087 139878462 141928579 143584362 144814618 144263694
4544 144263694 142952367 141774080 140338641 139842425 139746628 139032873 137951675 137628258 137272304
4535 137272304 136431073 133548025 131342773 129462152 127049724 124658749 123333470 121934649
4527 121934649 120333438 118646357 116516651 117209582 118626008 118229989 117308971 117350634 118562920
4518 118562920 119976853 119604064 118910362 120060969 121497871 120705229 120763088 119721787 119189182
4509 119189182 118497110 117974843 117569967 116440880 116353985 117146657 117862177 117920772 116697094
$$ packed form
4569A00943464J412072J813524Q59671P79085R91293O74133J561985L37601J058375
4560A10431203J307295R69772K045228J320291J498005K633388K469021L157088
4552A25831291L943201K841734L394861L867375K050117J655783J230256n50924
4544A44263694j311327j178287j435439m96216r5797p13755j081198l23417l55954
4535A37272304q41231k883048k205252j880621k412428k390975j325279j398821
4527A21934649j601211j687081k129706O92931J416426l96019r21018M1663J212286
4518A18562920J413933l72789o93702J150607J436902p92642N7859j041301n32605
4509A19189182o92072n22267m04876j129087q6895P92672P15520N8595j223678
$$ plain form
4500 116697094 116426015 116991365 117240268 118369337 119429498 120446563 120531734 120573236 120896769
4491 120896769 120696864 120667491 121292626 121275080 121235150 121273428 120631109 120974438 120531877 120268056
4481 120268056 120315327 119137529 118641166 118241831 118142579 118182564 118851810 117981691 117759997 119123174
4471 119123174 120211451 120272824 120298594 120173459 121387494 122564559 122874071 123655135 123566640
4462 123566640 122703640 122392740 122534612 121278926 119085308 117335958 116275978 115308234 114450249
4453 114450249 112988656 112444476 111125209 109815098 110318829 110356252 110405800 110129226 109591237
4444 109591237 109537018 109134872 109176507 109575921 109279777 110034904 110159699 109680856 109789554 109872166
4434 109872166 110018221 110059234 110848803 112126376 112818177 113339122 114305993 115036934 115057158
$$ packed form
4500A16697094k71079N65350K48903J129069J060161J017065Q5171M1502L23533
4491A20896769j99905k9373O25135j7546l9930L8278o42319L43329m42561k63821
4481A20268056M7271j177798m96363l99335r9252L9985O69246q70119k21694J363177
4471A19123174J088277O1373K5770j25135J214035J177065L09512P81064q8495
4462A23566640q63000l10900J41872j255686k193618j749350j059980r67744q57985
4453A14450249j461593n44180j319267j310111N03731L7423M9548k76574n37989
4444A09591237n4219m02146M1635L99414k96144P55127J24795m78843J08698Q2612
4434A09872166J46055M1013P89569J277573O91801N20945R66871P30941K0224
$$ plain form
4425 115057158 113438551 113928352 114988702 114402463 114538560 114982627 114621670 112291441 111449909
4416 111449909 111222415 110286583 108223775 106939061 106193347 104891523 103588879 102737603 103664804
4407 103664804 103079034 102660286 101371013 100535394 100077315 99533220 99962754 99250717 99345070
4398 99345070 99057270 97489154 96736604 96480852 95971024 95425342 94975386 94213391 93608321
4389 93608321 93054902 92064233 92189542 90697029 90231815 89660477 89119034 88539474 88108835
4380 88108835 87970833 87307930 87064329 86433639 86966961 87471346 87543534 87683926 87476859 87540913
4370 87540913 87237667 86074218 85921114 85062060 84306712 84631611 84873975 84511978 83852055
4361 83852055 83870806 83320479 82893416 82792661 82583051 82328206 83215282 83431911 82690726 82709554
$$ packed form
4425A15057158j618607M89801J060350n86239J36097M44067l60957k330229q41532
4416A11449909k27494r35832k062808j284714p45714j301824j302644q51276R27201
4407A03664804n85770m18748j289273q35619m58079n44095M29534p12037R4353
4398I9345070k87800j568116p52550k55752n09828n45682m49956p61995o05070
4389I3608321n53419r90669J25309j492513m65214n71338n41443n79560m30639
4380H8108835j38002o62903k43601o30690N33322N04385P2188J40392k07067O4054
4370H7540913l03246j163449j53104q59054p55348L24899K42364l61997o59923
4361H3852055J8751n50327m27063j00755k09610k54845Q87076K16629p41185J8828
$$ plain form
4351 82709554 82346195 81609204 81366857 81240775 80239519 79507949 78339931 76987762 77770356
4342 77770356 78054596 77578624 76468466 75482113 76108193 76185307 75552161 74450016 74081746
4333 74081746 73474330 73598855 72556350 72257429 71582933 71596019 71662685 71773207 71490083 71680986
4323 71680986 70590530 70042849 70467106 70025447 69718209 68671792 68850220 68392421 68072242
4314 68072242 67955891 67487183 68002304 67865335 68106639 68219115 67327283 66575315 66384307
4305 66384307 67460915 66610088 65962631 65693228 65630421 65422350 65778981 66607706 66863612
4296 66863612 66292604 65957104 65121624 65734396 64878221 65267909 65328768 64842375 64873479 63940519
4286 63940519 63680961 63898372 63298208 63033556 62913684 63202931 64303337 64668377 64997658
$$ packed form
4351H2709554l63359p36991k42347j26082j001256p31570j168018j352169P82594
4342G7770356K84240m75972j110158r86353O26080P7114o33146j102145l68270
4333G4081746o07416J24525j042505k98921o74496J3086O6666J10522k83124J90903
4323G1680986j090456n47681M24257m41659l07238j046417J78428m57799l20179
4314F8072242j16351m68708N15121j36969K41304J12476q91832p51968j91008
4305F6384307J076608q50827o47457k69403o2807k08071L56631Q28725K55906
4296F6863612n71008l35500q35480O12772q56175L89688O0859m86393L1104r32960
4286F3940519k59558K17411o00164k64652j19872K89247J100406L65040L29281
$$ plain form
4277 64997658 64777191 64326025 64304008 64269623 64201624 63808389 63025645 63431550 62601330 62626294
4267 62626294 63084323 63640903 63387315 62249944 61581451 61515436 61019823 62594794 61663722
4258 61663722 61434850 61009024 60386834 61591430 61510233 60993905 61243145 61268370 61698537 61366989
4248 61366989 60699105 61135566 61006534 61441099 60562779 60117801 60018948 59841097 60435772 60775096
4238 60775096 60406816 60723553 60954281 60903964 60901899 61561675 61953434 61361573 60969470 61070873
4228 61070873 60773777 60326266 61359285 61853924 61474257 60797589 60744052 61276496 60908517
4219 60908517 60905176 61585793 61950278 62476634 62505997 62125143 62506360 62594309 62838598 62279483
4209 62279483 62566144 62450017 62469378 62538733 63647441 64623940 63866010 63302434 63167309 63393578
$$ packed form
4277F4997658k20467m51166k2017l4385o7999l93235p82744M05905q30220K4964
4267F2626294M58029N56580k53588j137371o68493o6015m95613J574971r31072
4258F1663722k28872m25826o22190J204596q1197n16328K49240K5225M30167l31548
4248F1366989o67884M36461j29032M34565q78320m44978r8853j77851N94675L39324
4238F0775096l68280L16737K30728n0317k065O59776L91759n91861l92103J01403
4228F1070873k97096m47511J033019M94639l79667o76668n3537N32444l67979
4219F0908517l341O80617L64485N26356K9363l80854L81217Q7949K44289n59115
4209F2279483K86661j16127J9361O9355J108708R76499p57930n63576j35125K26269
$$ plain form
4199 63393578 63441184 63583286 64271884 63584292 63224649 63069903 63302943 64957291 64323740
4190 64323740 64170171 64486771 64039018 64326767 63664274 63209777 63807753 64559779 63416574
4181 63416574 63212785 63669352 64340657 64951018 64455199 65448486 64848655 64059008 63435438
4172 63435438 63000773 64065806 64312737 63960577 64463646 64998432 65410515 65618443 64941289
4163 64941289 64701138 64596104 65546650 65615651 65420872 65866030 65984510 65382274 63848081
4154 63848081 65330489 65566409 65645827 66318840 66306917 66291276 66166077 65913544 65681236 65286482
4144 65286482 66098343 66868878 66899598 66578191 66251361 66797151 67142486 67463901 66926534 67449423
4134 67449423 67201037 67559442 68113303 68005768 67611487 67334697 68132891 68795131 68986596
$$ packed form
4199F3393578M7606J42102O88598o87592l59643j54746K33040J654348o33551
4190F4323740j53569L16600m47753K87749o62493m54497N97976P52026j143205
4181F3416574k03789M56567O71305O10361m95819R93287n99831p89647o23570
4172F3435438m34665J065033K46931l52160N03069N34786M12083K07928o77154
4163F4941289k40151j05034R50546O9001j94779M45158J18480o02236j534193
4154F3848081J482408K35920P9418O73013j1923j5641j25199k52533k32308l94754
4144F5286482Q11861P70535L0720l21407l26830N45790L45335L21415n37367N22889
4134F7449423k48386L58405N53861j07535l94281k76790P98194O62240J91465
$$ plain form
4125 68986596 68086136 68264793 68462185 68703252 67397731 67871313 69474936 69345670 69972316
4116 69972316 70193205 69390720 67950929 68789413 69740465 70147939 70349750 69714940 69754665
4107 69754665 71186842 71478461 71344052 70849552 71244332 70869606 70683953 70674929 71281686 71312679
4097 71312679 70816323 71385083 72549842 71905602 71083254 71948362 72592201 73539961 73358184
4088 73358184 74591161 74303364 74550145 74257765 74234249 74932877 75273667 76092065 75524087
4079 75524087 76393727 76597182 76572974 77736030 78428165 78594720 79383834 80350993 79355921
4070 79355921 79324231 79433034 79479538 79674385 79985830 80035685 79447124 80115685 80417194 79825426
4060 79825426 80029745 81492728 82044140 82378925 84635765 85075803 85152987 85195600 85479483
$$ packed form
4125F8986596r00460J78657J97392K41067j305521M73582J603623j29266O26646
4116F9972316K20889q02485j439791Q38484R51052M07474K01811o34810L9725
4107F9754665J432177K91619j34409m94500L94780l74726j85653r024O06757L0993
4097G1312679m96356N68760J164759o44240q22348Q65108O43839R47760j81777
4088G3358184J232977k87797K46781k92380k3516O98628L40790Q18398n67978
4079G5524087Q69640K03455k4208J163056O92135J66555P89114R67159r95072
4070G9355921l1690J08803M6504J94847L11445M9855n88561O68561L01509n91768
4060G9825426K04319J462983N51412L34785K256840M40038P7184M2613K83883
$$ plain form
4051 85479483 86812125 87704011 88127126 87848481 87724413 88654859 89627925 89963114 88420142
4042 88420142 87857316 88467631 88024347 87118272 87064653 87806317 87082424 87184683 87301446 88114514
4032 88114514 88565555 88614465 88377391 88275411 89035778 89454457 89441290 89219290 88766049 89006433
4022 89006433 89801384 89178846 90824308 90775592 90426739 91154383 90705103 90438153 89888757
4013 89888757 89403732 89325892 87912798 87282246 87617628 87242458 86526836 87012466 86857603
4004 86857603 86514038 86580063 86609604 85948112 84966435 85293647 85346406 84308413 84770231 85513595
3994 85513595 84604266 85749757 86476714 86274015 85313409 85355708 86552805 85257632 84498861
3985 84498861 84660347 84137471 83528686 83389036 83460367 82395891 82510520 82053222 80671962
$$ packed form
4051H5479483J332642Q91886M23115k78645j24068R30446R73066L35189j542972
4042H8420142n62826O10315m43284r06075n3619P41664p23893J02259J16763Q13068
4032H8114514M51041M8910k37074j01980P60367M18679j3167k22000m53241K40384
4022H9006433P94951o22538J645462m8716l48853P27644m49280k66950n49396
4013H9888757m85025p7840j413094o30552L35382l75170p15622M85630j54863
4004H6857603l43565O6025K9541o61492r81677L27212N2759j037993M61818P43364
3994H5513595r09329J145491P26957k02699r60606M2299J197097j295173p58771
3985H4498861J61486n22876o08785j39650P1331j064476J14629m57298j381260
$$ plain form
3976 80671962 80177286 79954953 79144727 77399191 76882601 77166917 75829192 75249289 75480382
3967 75480382 75190166 73956145 74967328 75053569 74623487 73411456 72598939 73240874 73253512
3958 73253512 72758587 72519544 72671097 72210166 71862809 71611015 70951965 71058082 70766008
3949 70766008 70433625 69704074 68599697 67690438 67679223 66869133 66409270 65478027 65842244
3940 65842244 66498027 66103326 66169879 64678371 64606024 64499516 64139100 64995366 65264098 64581087
3930 64581087 64837164 64008676 63563679 63899414 62992301 62110181 61687549 61871312 62011355
3921 62011355 61383399 60862179 60589930 60566770 60693590 61146363 60795191 60730860 60129233 60049365
3911 60049365 60794966 60705516 59882079 59784127 59740997 59201007 58751143 59288863 59140323 58583925
$$ packed form
3976H0671962m94676k22333q10226j745536n16590K84316j337725n79903K31093
3967G5480382k90216j234021J011183Q6241m30082j212031q12517O41935J2638
3958G3253512m94925k39043J51553m60931l47357k51794o59050J06117k92074
3949G0766008l32383p29551j104377r09259j1215q10090m59863r31243L64217
3940F5842244O55783l94701O6553j491508p2347j06508l60416Q56266K68732o83011
3930F4581087K56077q28488m44997L35735r07113q82120m22632J83763J40043
3921F2011355o27956n21220k72249k3160J26820M52773l51172o4331o01627p9868
3911F0049365P45601q9450q23437r7952m3130n39990m49864N37720j48540n56398
$$ plain form
3901 58583925 59615322 59932706 59691617 60021721 59366124 58885190 58268729 58377866 59466103
3892 59466103 59235209 59205794 58728762 59045555 59439227 59135863 59030990 59281094 58323538 58709923
3882 58709923 58958236 58981620 59137695 59007145 59780980 60017089 60340062 59964889 59422076 59097861
3872 59097861 59538697 59493683 59679264 60538816 61335665 60210167 60801956 61748413 61227763
3863 61227763 60647173 60954202 61224849 61063730 61437665 61788085 61930762 61778803 61876307 62113782
3853 62113782 62233207 62880002 62008550 61843276 62339917 61586311 61621555 61570358 61573442 62340420
3843 62340420 63181201 62893310 62584089 62806052 62934487 63436550 63989918 63862545 63602525
3834 63602525 63958185 63546277 63295982 63550504 63083125 63642909 63980069 63800886 64193678
$$ packed form
3901E8583925J031397L17384k41089L30104o55597m80934o16461J09137J088237
3892E9466103k30894k9415m77032L16793L93672l03364j04873K50104r57556L86385
3882E8709923K48313K3384J56075j30550P73835K36109L22973l75173n42813l24215
3872E9097861M40836m5014J85581Q59552P96849j125498N91789R46457n20650
3863F1227763n80590L07029K70647j61119L73935L50420J42677j51959R7504K37475
3853F2113782J19425O46795q71452j65274M96641p53606L5244n1197L084P66978
3843F2340420Q40781k87891l09221K21963J28435N02063N53368j27373k60020
3834F3602525L55660m11908k50295K54522m67379N59784L37160j79183L92792
$$ plain form
3825 64193678 64250971 64315439 63475572 63241797 63511987 63412585 63752859 63471318 63145714 62077233
3815 62077233 62393120 63146007 62702733 62684997 63225112 62770325 63004490 62082216 61214897 61588995
3805 61588995 61184564 60389120 60374865 60495814 60687515 60391862 59865488 60246187 60452093 60672577
3795 60672577 60684882 61001498 61268615 60867929 60164264 60586449 60422362 60906333 60977680 61128409
3785 61128409 60780490 59942207 59899274 58674639 58585810 57988272 56483384 56777439 56495920
3776 56495920 56507220 55903697 55604546 55756393 55416637 55535943 55399195 55156442 54919607 55418120
3766 55418120 55778591 55336088 55174930 55617618 54977350 54458865 54378217 54217973 54378516 53423564
3756 53423564 52959792 52049824 51399108 51359882 51178301 50541943 50332408 50462339 51112850 51800871
$$ packed form
3825F4193678N7293O4468q39867k33775K70190r9402L40274k81541l25604j068481
3815F2077233L15887P52887m43274j7736N40115m54787K34165r22274q67319L74098
3805F1588995m04431p95444j4255J20949J91701k95653n26374L80699K05906K20484
3795F0672577J2305L16616K67117m00686p03665M22185j64087M83971P1347J50729
3785F1128409l47919q38283m2933j224635q8829n97538j504888K94055k81519
3776E6495920J1300o03523k99151J51847l39756J19306j36748k42753k36835M98513
3766E5418120L60471m42503j61158M42688o40268n18485q0648j60244J60543r54952
3756E3423564m63772r09968o50716l9226j81581o36358k09535J29931O50511O88021
$$ plain form
3746 51800871 50582850 50710109 50713807 51389301 51425825 51475984 50627988 49571804 49475265 49684412
3736 49684412 48066740 47804487 47892614 47704220 47456361 47496840 47293024 46893701 47450863 46235073
3726 46235073 45960459 45023278 45371458 45326539 45795013 46747484 46517792 46961928 46904764 46417770
3716 46417770 46335972 46674616 45496863 44996540 44506796 44467798 43810270 42948591 43713475 43238311
3706 43238311 42305170 42946905 42399451 41931553 41332401 41631961 42114226 41652072 42248521
3697 42248521 41541007 40374143 39976348 40776234 39943465 40052664 40848406 40444430 40014573
3688 40014573 39726006 39274499 39376729 39804542 39382433 39140402 38642793 38433634 38718493
3679 38718493 39028736 38267955 38095608 38157408 38524508 38519360 38192400 37092336 36632237 37090853
$$ packed form
3746E1800871j218021J27259L698O75494L6524N0159q47996j056184r6539K09147
3736D9684412j617672k62253Q8127j88394k47859M0479k03816l99323N57162j215790
3726D6235073k74614r37181L48180m4919M68474R52471k29692M44136n7164m86994
3716D6417770q1798L38644j177753n00323m89744l8998o57528q61679P64884m75164
3706D3238311r33141O41735n47454m67898n99152K99560M82265m62154N96449
3697D2248521p07514j166864l97795P99886q32769J09199P95742m03976m29857
3688D0014573k88567m51507J02230M27813m22109k42031m97609k09159K84859
3679C8718493L10243p60781j72347O1800L67100n148l26960j100064m60099M58616
$$ plain form
3669 37090853 37416962 37558505 37357004 37178305 37034914 37274649 37051145 36345230 36186704
3660 36186704 36584452 36161066 35763712 36195412 36230747 35665054 36465711 35620922 35715568 36126860
3650 36126860 35810177 35674307 36207288 35727027 34938213 35509141 35761339 35878495 36690164
3641 36690164 36771476 37005352 36848619 35937402 35855013 36495752 35678822 35973858 35859641 35428418
3631 35428418 36029845 36299737 36205065 36699932 36515611 37227221 37609190 37029380 37242500 37218162
3621 37218162 37449221 37354223 38229582 38969954 38892336 38093061 38061918 38470467 38564937 37683294
3611 37683294 37865827 37931656 38050833 38789081 38624923 39099528 39053822 38852382 39459448 39106553
3601 39106553 39903581 40417918 40388317 41187554 41721350 41875338 41993452 42885126 42675595 42912407
$$ packed form
3669C7090853L26109J41543k01501j78699j43391K39735k23504p05915j58526
3660C6186704L97748m23386l97354M31700L5335n65693Q00657q44789R4646M11292
3650C6126860l16683j35870N32981m80261p88814N70928K52198J17156Q11669
3641C6690164Q1312K33876j56733r11217q2389O40739q16930K95036j14217m31223
3631C5428418O01427K69892r4672M94867j84321P11610L81969n79810K13120k4338
3621C7218162K31059r4998Q75359P40372p7618p99275l1143M08549R4470q81643
3611C7683294J82533O5829J19177P38248j64158M74605m5706k01440O07066l52895
3601C9106553P97028N14337k9601P99237N33796J53988J18114Q91674k09531K36812
$$ plain form
3591 42912407 42317438 43545657 44693282 44238571 44346099 44364859 44876069 45661897 46134615
3582 46134615 46065319 46134973 45951936 46116120 46117713 47397442 47703143 48295946 48623159 50005157
3572 50005157 50999950 51335181 51072675 51548597 52630432 53555015 53477944 54304528 55540787
3563 55540787 55825937 55975840 56254070 57723026 58161881 58914758 60601955 61408132 61666629
3554 61666629 62541913 62735891 62959045 63944582 64373339 64725417 65134082 65952843 66239670
3545 66239670 67433652 68310889 69312397 70433976 71720264 72523393 72792048 73797118 75576166
3536 75576166 76909124 77507528 78419554 79423818 80381736 80506706 82348750 83240081 85279886
3527 85279886 86753012 88547273 91034462 93004647 94335938 95661941 96548668 97259330
$$ packed form
3591D2912407n94969J228219J147625m54711J07528J8760N11210P85828M72718
3582D6134615o9296O9654j83037J64184J593J279729L05701N92803L27213J381998
3572E0005157R94793L35231k62506M75922J081835R24583p7071Q26584J236259
3563E5540787K85150J49903K78230J468956M38855P52877J687197Q06177K58497
3554F1666629Q75284J93978K23154R85537M28757L52078M08665Q18761K86827
3545F6239670J193982Q77237J001508J121579J286288Q03129K68655J005070J779048
3536G5576166J332958N98404R12026J004264R57918J24970J842044Q91331K039805
3527H5279886J473126J794261K487189J970185J331291J326003Q86727P10662
$$ plain form
3519 97259330 96443654 98300975 99427845 100601075 102035768 103729895 105283439 107347479
3511 107347479 109305273 110964625 113849517 115370227 117527632 118823797 119937941 121886595
3503 121886595 123734624 125161612 127606196 129504687 131528572 133057552 134820289 136683829
3495 136683829 139168422 142570454 145836059 149609272 154815941 159991586 164310802 168108092
3487 168108092 171401199 175394314 181003737 186784297 193946622 202558915 212706916 225481156
3479 225481156 239937740 256433493 275190332 295502709 318688137 341737624 365826908
3472 365826908 387221421 402182436 408343755 403167430 384658190 355583530 321643994
3465 321643994 289229503 259547890 233942460 213013002 196472258 182852839 173534591
$$ packed form
3519I7259330q15676J857321J126870J173230J434693J694127J553544K064040
3511A07347479J957794J659352K884892J520710K157405J296165J114144J948654
3503A21886595J848029J426988K444584J898491K023885J528980J762737J863540
3495A36683829K484593L402032L265605L773213N206669N175645M319216L797290
3487A68108092L293107L993115N609423N780560P162325Q612293J0148001J2774240
3479B25481156J4456584J6495753J8756839K0312377K3185428K3049487K4089284
3472C65826908K1394513J4961015O161319n176325j8509240k9074660l3939536
3465C21643994l2414491k9681613k5605430k0929458j6540744j3619419r318248
$$ plain form
3458 173534591 167302019 159892944 151846158 142577870 133151564 123878585 115742117 109705990
3450 109705990 104096707 100078619 95973869 92359013 89563173 85735664 83266271 80249618
3442 80249618 77603819 75006132 73332080 71158709 69136070 66557614 63984879 62747459
3434 62747459 61890320 61348890 60990079 58908229 57646023 58133912 58830918 59496400 59585187
3425 59585187 59078390 58306826 56542200 53853836 51816603 50053245 48565965 48828854 48390772
3416 48390772 47361290 47794568 48076894 47827736 47679969 46089512 43490395 42370865 41096923
3407 41096923 39489660 38848250 37252888 36910947 36811604 35514248 34895759 35225315 34307572
3398 34307572 33360646 33284778 32439278 32278413 31493725 30774594 30903347 31230182 30808088 30098056
$$ packed form
3458A73534591o232572p409075q046786r268288r426306r272979q136468o036127
3450A09705990n609283m018088m104750l614856k795840l827509k469393l016653
3442H0249618k645799k597687j674052k173371k022639k578456k572735j237420
3434F2747459q57139n41430l58811k081850j262206M87889O97006O65482Q8787
3425E9585187n06797p71564j764626k688364k037233j763358j487280K62889m38082
3416D8390772j029482M33278K82326k49158j47767j590457k599117j119530j273942
3407D1096923j607263o41410j595362l41941r9343j297356o18489L29556r17743
3398C4307572r46926p5868q45500j60865p84688p19131J28753L26835m22094p10032
$$ plain form
3388 30098056 29638826 29247957 29202688 29468013 28650746 29307396 30167771 29709108 29385247 27528905
3378 27528905 26550857 26830237 25808219 25483176 24679148 24478981 24380212 24231086 24032008
3369 24032008 23186219 23186868 21694245 21845622 21825791 20914578 20422442 21717021 21558512 21402357
3359 21402357 21498658 20915116 20657661 19966541 18738036 19183597 19037332 18339569 19107338
3350 19107338 18681827 18682975 18372876 18433928 17568895 16732696 15819787 16579876 16599629 16614254
3340 16614254 17839604 17297960 17137090 16425830 16482034 16865523 16999881 16677072 15619273
3331 15619273 14468752 14249317 14697802 15155464 14981496 14276697 13938495 14700253 15394797
3322 15394797 15435373 14549202 14586598 15296889 14174029 12780909 12948287 13939003 14157927
$$ packed form
3388C0098056m59230l90869m5269K65325q17267O56650Q60375m58663l23861j856342
3378B7528905r78048K79380j022018l25043q04028k00167r8769j49126j99078
3369B4032008q45789O49j492623J51377j9831r11213m92136J294579j58509j56155
3359B1402357R6301n83542k57455o91120j228505M45561j46265o97763P67769
3350A9107338m25511J148l10099O1052q65033q36199r12909P60089J9753J4625
3340A6614254J225350n41644j60870p11260N6204L83489J34358l22809j057799
3331A5619273j150521k19435M48485M57662j73968p04799l38202P61758O94544
3322A5394797M0576q86171L7396P10291j122860j393120J67378R90716K18924
$$ plain form
3313 14157927 13710812 12587941 12443499 12914881 12665859 12856305 12992525 13245695 12777846
3304 12777846 12223409 13026408 12921212 12251457 12028938 13003332 12836944 12701394 12143704
3295 12143704 11262176 10767496 11443046 11093808 11675895 12036198 11589076 12050915 11854105
3286 11854105 12350467 12237897 12288916 11831582 11957741 12057457 11358198 11746192 11305369 10952698
3276 10952698 11790820 11942249 11132773 10211690 10430098 10934910 11415533 11036503 10297343
3267 10297343 10158050 9170909 9345213 9444200 9700546 9985613 9792616 9864380 10456475 10724161
3257 10724161 9637842 8950912 9913586 10141397 10386440 10817860 10930280 9821310 9934610
3248 9934610 10446694 10089114 10552507 10498761 10355417 10195554 10524758 10918996 10993224 10578317
$$ packed form
3313A4157927m47115j122871j44442M71382k49022J90446J36220K53170m67849
3304A2777846n54437Q02999j05196o69755k22519R74394j66388j35550n57690
3295A2143704q81528m94680O75550l49238N82087L60303m47122M61839j96810
3286A1854105M96362j12570N1019m57334J26159R9716o99259L87994m40823l52671
3276A0952698Q38122J51429q09476r21083K18408N04812M80623l79030p39160
3267A0297343j39293r87141J74304R8987K56346K85067j92997P1764N92095K67686
3257A0724161j086319o86930R62674K27811K45043M31420J12420j108970J13300
3248I934610N12084l57580M63393n3746j43344j59863L29204L94238P4228m14907
$$ plain form
3238 10578317 10121241 9831243 9912920 9535338 9224269 9991149 9970445 9776893 10027999 10330931
3228 10330931 10037427 9910188 10517695 10295864 10196628 10225920 9992801 10205463 10923157 11304322
3218 11304322 11720930 11762262 11100684 10987355 10732525 10847811 11573043 11256768 10842129 10684486
3208 10684486 10792998 10401091 10433331 11364414 10733250 11129180 11545313 11264677 11421471 11156549
3198 11156549 11006807 11055249 10378229 10224871 10622534 9509818 11123286 11168021 11259412 11811369
3188 11811369 11821392 12156533 12221964 12214989 12731267 12386844 12054178 12341759 13560801 14308034
3178 14308034 13785059 14305500 14887930 14947486 15172175 15321141 14875043 15326119 16295487 16444498
3168 16444498 16668831 17416174 18146212 18304704 18934688 19971509 21085483 21553238 22330786
$$ packed form
3238A0578317m57076k89998Q1677l77582l11069P66880k0704j93552K51106L02932
3228A0330931k93504j27239O07507k21831r9236K9292k33119K12662P17694L81165
3218A1304322M16608M1332o61578j13329k54830J15286P25232l16275m14639j57643
3208A0684486J08512l91907L2240R31083o31164L95930M16133k80636J56794k64922
3198A1156549j49742M8442o77020j53358L97663j112716J613468M4735R1391N51957
3188A1811369J0023L35141O5431o975N16278l44423l32666K87581J219042P47233
3178A4308034n22975N20441N82430N9556K24689J48966m46098M51076R69368J49011
3168A6444498K24333P47343P30038J58492O29984J036821J113974M67755P77548
$$ plain form
3159 22330786 23276580 23316676 23109657 23310694 23076053 22510792 22786314 22514722 22427632 23262423
3149 23262423 23574873 23415455 23534912 23645628 24327471 24274916 24320111 24981197 26334402 26977266
3139 26977266 27899285 28371918 28136405 28728403 30805846 32898727 34258272 37124772 40041353
3130 40041353 42503055 41429404 38175902 35509012 32414527 30022232 28216138 25671545
3122 25671545 25125021 23937837 22285857 21838770 20419155 20462034 20169542 20212916 19591204
3113 19591204 18912518 18131318 19161089 19785753 19056148 19312456 19702530 20179899 20114043
3104 20114043 20180703 21139950 21105111 20584701 21359318 21147279 20717825 20482689 18914810 17409064
3094 17409064 15893538 14919006 15327058 14934834 13642568 12206521 11333811 11517305 10692688
$$ packed form
3159B2330786R45794M0096k07019K01037k34641n65261K75522k71592q7090Q34791
3149B3262423L12450j59418J19457J10716O81843n2555M5195O61086J353205O42864
3139B6977266R22019M72633k35513N91998K077443K092881J359545K866500K916581
3130D0041353K461702j073651l253502k666890l094485k392295j806094k544593
3122B5671545n46524j187184j651980m47087j419615M2879k92492M3374o21712
3113A9591204o78686p81200J029771O24664p29605K56308L90074M77369o5856
3104B0114043O6660R59247l4839n20410P74617k12039m29454k35136j567879j505746
3094A7409064j515526r74532M08052l92224j292266j436047q72710J83494q24617
$$ plain form
3085 10692688 10346887 10561149 10767940 10799154 10135504 9256830 8686326 8968876 9473821 8842621
3075 8842621 8679144 8937242 8195648 7127986 7023618 6847995 6846127 6015845 6109028 6903829
3065 6903829 6737897 7052017 6055714 6097157 6150854 6139965 6568217 6569510 6182687 5475889
3055 5475889 4975766 4797121 4810853 5444513 4577524 4606851 4757918 4626805 3955732 4759581
3045 4759581 4437618 4038236 4606635 4332445 4132865 3694105 3564648 4322618 4295690 4293774
3035 4293774 4278087 3204103 3322033 3791517 4208693 4485519 4079818 2900808 3436292
3026 3436292 3709886 3305340 2517456 2872849 3366225 3769454 3746951 3202747 3375535 3136392
3016 3136392 2651486 3294081 3811447 3270075 1864404 1912779 3220350 3324078 2768228
$$ packed form
3085A0692688l45801K14262K06791L1214o63650q78674n70504K82550N04945o31200
3075H842621j63477K58098p41594j067662j04368j75623j868q30282R3183P94801
3065F903829j65932L14120r96303M1443N3697j0889M28252J293l86823p06798
3055E475889n00123j78645J3732O33660q66989K9327J51067j31113o71073Q03849
3045D759581l21963l99382N68399k74190j99580m38760j29457P57970k6928j916
3035D293774j5687j073984J17930M69484M17176K76826m05701j179010N35484
3026C436292K73594m04546p87884L55393M93376M03229k2503n44204J72788k39143
3016C136392m84906O42595N17366n41372j405671M8375J307571J03728n55850
$$ plain form
3007 2768228 3459272 2530323 2039873 3028225 3343478 3348527 2832705 2785724 3106486 2506487
2997 2506487 3143344 3025326 2641066 2410262 3405811 3470953 2720825 2516903 2061022 1773191
2987 1773191 2291163 2159855 1826041 2841799 3019895 2866207 2890120 3233407 2425553 1495076
2977 1495076 1002623 2817568 2413883 2687676 3334703 3175940 2879085 2167542 1766600
2968 1766600 2204569 2860289 2791070 2339840 2035571 1821687 2044912 2241148 2043567 1623573
2958 1623573 687278 842873 500296 1091362 1651598 729108 930878 1179491 1386255 2042913
2948 2042913 1481653 1670740 1866549 1432438 1489343 1181782 1723064 1700397 1961363 2868859
2938 2868859 2405191 1837390 2427254 2475686 2765998 2093342 2092386 1750045 1095949 1931641
$$ packed form
3007B768228O91044r28949m90450R88352L15253N049n15822m6981L20762n99999
2997B506487O36857j18018l84260k30804R95549O5142p50128k03922m55881k87831
2987A773191N17972j31308l33814J015758J78096j53688K3913L43287q07854r30477
2977A495076m92453J814945m03685K73793O47027j58763k96855p11543m00942
2968A766600M37969O55720o9219m51230l04269k13884K23225J96236j97581m19994
2958A623573r36295J55595l42577N91066N60236r22490K01770K48613K06764O56658
2948B042913n61260J89087J95809m34111N6905l07561N41282k2667K60966R07496
2938B868859m63668n67801N89864M8432K90312o72656r56l42341o54096Q35692
$$ plain form
2928 1931641 1677209 1749964 1382398 753999 1426060 1727580 1150693 1454613 925597 1513710
2918 1513710 2341773 1526782 1578879 1486954 1065206 1105453 1713126 805598 1236185 1681493
2908 1681493 1397624 1751286 1883262 1587126 1612920 1893291 1715146 1866045 1819678 1695888
2898 1695888 1547252 1571528 2110916 2327004 1938682 2519407 2372383 2603158 2177618 1434920
2888 1434920 1780070 1799588 1857410 1478044 1931682 2030866 2210650 1323238 1331886 2185036
2878 2185036 1986015 1981627 1598520 1249248 2004961 2745029 1885186 1717496 1095122 933671
2868 933671 1029211 886920 1168138 1268004 757374 1080996 2053979 959263 451712 825799
2858 825799 813229 839735 947870 1200194 578208 1634861 2016557 1240394 200012 418529
$$ packed form
2928A931641k54432P2755l67566o28399O72061L01520n76887L03920n29016N88113
2918A513710Q28063q14991N2097r1925m21748M0247O07673r07528M30587M45308
2908A681493k83869L53662J31976k96136K5794K80371j78145J50899m6367j23790
2898A695888j48636K4276N39388K16088l88322N80725j47024K30775m25540p42698
2888A434920L45150J9518N7822l79366M53638R9184J79784q87412Q648Q53150
2878B185036j99021m388l83107l49272P55713P40068q59843j67690o22374j61451
2868I33671R5540j42291K81218R9866n10630L23622R72983j094716n07551L74087
2858H25799j2570K6506J08135K52324o21986J056653L81696p76163j040382K18517
$$ plain form
2848 418529 1070127 1412637 398036 219238 1346265 1409143 938980 1504287 951970 1450178
2838 1450178 1519738 1381589 1511232 1035719 344907 765997 1200431 -240507 990286
2829 990286 1542948 1208349 619446 1109754 909565 439056 -9535 1178303 1584392 2294661
2819 2294661 1443605 1486650 1875803 862445 785118 1483509 1015586 169629 653576 306678
2809 306678 1056902 1552735 1136277 854636 21314 216791 550664 480930 891646 823294
2799 823294 1620387 1650685 1937989 1149663 1316956 1666420 544248 360698 443430 856818
2789 856818 1284598 376021 634049 393752 -128821 709540 1103883 567579 1080890 386796
2779 386796 767748 185668 413336 -127291 93154 615863 648176 720144 1453112 1497443
$$ packed form
2848D18529O51598L42510j014601j78798J127027O2878m70163N65307n52317M98208
2838A450178O9560j38149J29643m75513o90812M21090M34434j440938J230793
2829I90286N52662l34599n88903M90308k00189m70509m48591J187838M06089P10269
2819B294661q51056M3045L89153j013358p7327O98391m67923q45957M83947l46898
2809C06678P50224M95833m16458k81641q33322J95477L33873o9734M10716o8352
2799H23294P97093L0298K87304p88326J67293L49464j122172j83550Q2732M13388
2789H56818M27780r08577K58028k40297n22573Q38361L94343n36304N13311o94094
2779C86796L80952n82080K27668n40627K20445N22709L2313P1968P32968M4331
$$ plain form
2769 1497443 203210 295378 584045 757580 -434583 -381353 1120961 1176105 773049 1034781
2759 1034781 882605 191753 -198509 628179 889148 1355928 557010 313021 738600 1507114
2749 1507114 574667 -116991 273385 937278 1316649 1084538 -104875 -36746 -614590 -96053
2739 -96053 788942 1124992 1429999 845993 373176 353507 104121 670616 1275285 1321060
2729 1321060 864979 831119 779883 799445 154121 325633 70600 -597191 49988 71890
2719 71890 590714 1080491 1064416 606434 667709 953217 756884 638278 872241 208050
2709 208050 198965 383852 232700 177391 51714 -64014 158265 1010551 1196949 1192029 -157254
2698 -157254 -226081 -92420 -136304 -372404 -288689 271956 499338 -48285 -662639 -74892
$$ packed form
2769A497443j294233R2168K88667J73535j192163N3230J502314N5144m03056K61732
2759A034781j52176o90852l90262Q26688K60969M66780p98918k43989M25579P68514
2749A507114r32447o91658L90376O63893L79371k32111j189413O8129n77844N18537
2739i6053Q84995L36050L05007n84006m72817j9669k49386N66495O04669M5775
2729A321060m56081l3860n1236J9562o45324J71512k55033o67791O47179K1902
2719G1890N18824M89777j6075m57982O1275K85508j96333j18606K33963o64191
2709B08050r085J84887j51152n5309j25677j15728K22279Q52286J86398m920j349283
2698a57254o8827J33661m3884k36100Q3715N60645K27382n47623o14354N87747
$$ plain form
2688 -74892 442286 1419901 644125 415156 411981 -116932 600675 800445 1732171 875041
2678 875041 778480 1254441 1101911 478529 -155090 155495 200680 621849 743313 908838
2668 908838 1179884 1574716 381042 -504568 -1164277 -794564 409765 685986 -825769
2659 -825769 -593567 -359935 -36814 491325 79271 300438 -64908 -97656 885824 -434782
2649 -434782 264225 1543747 1622244 665599 26104 635852 395216 -180828 42960 -157552
2639 -157552 -78321 194859 1343645 1498213 1135305 1155723 450961 -184824 -664440 -321956
2629 -321956 -230186 178694 -514189 -940034 132681 1000770 89348 -564868 510378 780516
2619 780516 1202517 875812 321160 485347 1136965 1202745 472269 759281 860118 574467
$$ packed form
2688g4892N17178R77615p75776k28969l175n28913P17607J99770R31726q57130
2678H75041r6561M75961j52530o23382o33619L10585M5185M21169J21464J65525
2668I08838K71046L94832j193674q85610o59709L69713J204329K76221j511755
2659h25769K32202K33632L23121N28139m12054K21167l65346l2748R83480j320606
2649d34782O99007J279522P8497r56645o39495O09748k40636n76044K23788k00512
2639a57552P9231K73180J148786J54568l62908K0418p04762o35785m79616L42484
2629c21956R1770M08880o92883m25845J072715Q68089r11422o54216J075246K70138
2619G80516M22001l26705n54652J64187O51618O5780p30476K87012J00837k85651
$$ plain form
2609 574467 409844 664538 1613544 616484 383053 888292 1730896 2167900 1328746 706491
2599 706491 1540942 2127784 1300403 1535470 965546 661945 267829 458504 194780 930152
2589 930152 1362165 1076029 1767731 1157680 544595 1157428 1780181 2051719 1364010 936841
2579 936841 -144269 107729 679288 658383 -57763 -93801 433414 85262 679505 962986
2569 962986 622385 55101 -22790 -309988 35295 248755 -507052 435180 929789 648406
2559 648406 417733 743467 555947 905934 968115 1138926 957555 627033 869912 1285566
2549 1285566 467884 506466 883472 595826 702727 1343942 1788412 1506795 1161052 94576
2539 94576 607541 935523 166629 -356191 492467 1209111 1400932 1199076 1526794 1546629
$$ packed form
2609E74467j64623K54694R49006r97060k33431N05239Q42604M37004q39154o22255
2599G06491Q34451N86842q27381K35067n69924l03601l94116J90675k63724P35372
2589I30152M32013k86136O91702o10051o13085O12833O22753K71538o87709m27169
2579I36841j081110K51998N71559k0905p16146l6038N27215l48152N94243K83481
2569I62986l40601n67284p7891k87198L45283K13460p55807R42232M94609k81383
2559F48406k30673L25734j87520L49987O2181J70811j81371l30522K42879M15654
2549A285566q17682L8582L77006k87646J06901O41215M44470k81617l45743j066476
2539I4576N12965L27982p68894n22820Q48658P16644J91821k01856L27718J9835
$$ plain form
2529 1546629 1895819 1462888 409017 1198287 1665804 875944 367095 -19130 195811
2520 195811 -36200 -351500 211505 608639 530638 -280729 -86118 271159 404791 317152
2510 317152 463186 519681 340341 883785 1470872 941844 255080 -372735 -268160 288340
2500 288340 439145 890710 402971 534745 502151 553671 -189962 90935 401287 116573
2490 116573 273026 24938 -254444 -129515 289293 580592 1111392 771367 467644 558304
2480 558304 -113817 -60597 488496 1182533 1758134 2204297 2364804 1866178 1539211 2103622
2470 2103622 1587075 1461919 1568243 1203703 869293 733103 815629 1372911 1008111 625927
2460 625927 929451 -38357 489934 262705 437664 188238 91336 656995 636656 1091601
$$ packed form
2529A546629L49190m32931j053871P89270M67517p89860n08849l86225K14941
2520A95811k32011l15300N63005L97134p8001q11367J94611L57277J33632q7639
2510C17152J46034N6495j79340N43444N87087n29028o86764o27815J04575N56500
2500B88340J50805M51565m87739J31774l2594N1520p43633K80897L10352k84714
2490A16573J56453k48088k79382J24929M18808K91299N30800l40025l03723R0660
2480E58304o72121N3220N49093O94037N75601M46163J60507m98626l26967N64411
2470B103622n16547j25156J06324l64540l34410j36190Q2526N57282l64800l82184
2460F25927L03524r67808N28291k27229J74959k49426r6902N65659k0339M54945
$$ plain form
2450 1091601 2240839 1324238 1266034 2155609 1522576 1644805 1301412 915307 1028747 1377330
2440 1377330 1661561 1400338 1434679 1709184 1858459 1640764 1537831 908169 1198378 2435052
2430 2435052 2227700 2166812 1238309 1197261 1392505 1349846 1977300 2422645 2935051 3457788
2420 3457788 2306774 2017564 2853639 2892360 2555566 2174927 2621263 3517978 3664817 3579224
2410 3579224 2849072 2469239 3076094 2641531 2421912 3248701 3621502 3582362 3756995 3621832
2400 3621832 3690468 3620703 4552629 4130579 3598389 3379861 3841279 3462450 3389037 4021649
2390 4021649 4810916 4717135 5882988 6281958 6050760 5318100 5318934 5834269 5875609 6492652
2380 6492652 6661255 6227328 6029557 6317785 7552882 8324462 8915827 9680937 8519002
$$ packed form
2450A091601J149238r16601n8204Q89575o33033J22229l43393l86105J13440L48583
2440A377330K84231k61223L4341K74505J49275k17695j02933o29662K90209J236674
2430B435052k07352o0888r28503m1048J95244m2659O27454M45345N12406N22737
2420C457788j151014k89210Q36075L8721l36794l80639M46336Q96715J46839q5593
2410C579224p30152l79833O06855m34563k19619Q26789L72801l9140J74633j35163
2400C621832O8636o9765R31926m22050n32190k18528M61418l78829p3413O32612
2390D021649P89267r3781J165853L98970k31198p32660Q34N15335M1340O17043
2380F492652J68603m33927j97771K88228J235097P71580N91365P65110j161935
$$ plain form
2371 8519002 8515270 9094413 9918054 9614799 9830000 10405064 11361206 10602221 11769277 13133027
2361 13133027 12203298 13073364 13857300 13583083 14717867 15327684 16590305 17248110 17885813
2352 17885813 18523485 19398406 22462293 24592599 26803031 27112485 27926818 29604329 31940726
2343 31940726 35374612 40187709 46120186 52439037 61629788 75069728 93018366 117813919
2335 117813919 152834016 193185633 207616338 183138577 145594256 109187980 83364369
2328 83364369 66432025 55429349 46566001 39974591 34207001 31305964 29046652 26583579
2320 26583579 25847070 26185686 24646965 22863583 20620459 18170445 16819857 15927074 14412163
2311 14412163 13093256 12427348 12389606 12435088 11384445 10917799 10159901 9534504 8313183
$$ packed form
2371H519002l732N79143Q23641l03255K15201N75064R56142p58985J167056J363750
2361A3133027r29729Q70066P83936k74217J134784O09817J262621O57805O37703
2352A7885813O37672Q74921L063887K130306K210432L09454Q14333J677511K336397
2343C1940726L433886M813097N932477O318851R190751J3439940J7948638K4795553
2335A17813919L5020097M0351617J4430705k4477761l7544321l6406276k5823611
2328H3364369j6932344j1002676q863348o591410n767590k901037k259312k463073
2320B6583579p36509L38616j538721j783382k243124k450014j350588q92783j514911
2311A4412163j318907o65908l7742M5482j050643m66646p57898o25397j221321
$$ plain form
2302 8313183 7937386 8031613 8350608 8403841 8602103 7105139 6006168 5126528 5223199 5764290
2292 5764290 5289932 4741356 4054852 3640518 4147031 3923130 4816533 4361806 3966069 3264756
2282 3264756 2936716 3388146 3217148 2155981 2944100 3203518 3630612 4119904 3704090
2273 3704090 3202707 2590080 2098190 2057877 2330541 2363362 2021387 1546999 2171409 2158099
2263 2158099 1388304 1221353 1391660 1874967 2742958 2187784 1551600 2077977 1090896 332907
2253 332907 1489944 1255211 752630 1088776 1057873 1792357 1785492 1059663 940805 705556
2243 705556 120185 -5548 442600 396167 79097 332079 -124572 265739 342340 335043
2233 335043 1306602 1654476 1035970 1030682 1096406 373024 246832 192882 188961 177862 511499
$$ packed form
2302H313183l75797R4227L18995N3233J98262j496964j098971q79640R6671N41091
2292E764290m74358n48576o86504m14334N06513k23901Q93403m54727l95737p01313
2282C264756l28040M51430j70998j061167P88119K59418M27094M89292m15814
2273C704090n01383o12627m91890m0313K72664L2821l41975m74388O24410j3310
2263B158099p69795j66951J70307M83307Q67991n55174o36184N26377r87081p57989
2253C32907J157037k34733n02581L36146l0903P34484o865p25829j18858k35249
2243G05556n85371j25733M48148m6433l17070K52982m56651L90311P6601p297
2233C35043R71559L47874o18506n288O5724p23382j26192n3950l921j1099L33637
$$ plain form
2222 511499 345669 182836 -165753 475314 558094 862625 1259281 607865 282165 542868
2212 542868 1236597 662803 678050 647345 -241327 111394 177236 542650 829943 389687
2202 389687 456889 946053 1240688 674503 323404 484442 645004 692982 1041212 359599
2192 359599 150742 641865 500803 407771 -941413 -675811 208902 267699 930731 868147
2182 868147 318545 118971 -114548 -459594 -868276 -696567 -681966 -405508 153350 -177846
2172 -177846 -358192 138120 175561 559425 317998 234908 571614 791816 -209856 -939982
2162 -939982 -717488 385557 67189 129120 534697 39975 330725 532661 658359 326735
2152 326735 -110776 143335 101649 350638 399644 409905 124056 520518 16539 44672
$$ packed form
2222E11499j65830j62833l48589O41067Q2780L04531L96656o51416l25700K60703
2212E42868O93729n73794J5247l0705q88672L52721O5842L65414K87293m40256
2202C89687O7202M89164K94635n66185l51099J61038J60562M7978L48230o81613
2192C59599k08857M91123j41062r3032j349184K65602Q84713N8797O63032o2584
2182H68147n49602j99574k33519l45046m08682J71709J4601K76458N58858l31196
2172a77846j80346M96312L7441L83864k41427q3090L36706K20202j001672p30126
2162i39982K22494J103045l18368O1931M05577m94722K90750K01936J25698l31624
2152C26735m37511K54111m1686K48989M9006J0261k85849L96462n03979K8133
$$ plain form
2142 44672 586589 -222541 663760 1045418 540536 1076414 420266 -1034864 -1816194 -998160
2132 -998160 -1276929 -892060 -658368 -679004 -428620 -377482 631337 855935 186637 -640368
2122 -640368 -988562 255149 863513 733682 743418 -238158 -39886 -532957 -57459 -979489
2112 -979489 -270155 644 -1187562 -52778 273453 44705 -119324 -56701 -489975 -745990
2102 -745990 -15655 607985 -195792 -550401 -687333 -29321 380246 -411654 541763 401585
2092 401585 591797 235471 -514074 -1031195 -377845 44702 518494 276881 439793 456253
2082 456253 288829 -590512 35400 385616 -54568 -609680 -158256 120551 156421 157667
2072 157667 415241 249493 -14872 476193 -469498 -227900 357591 1123667 581353 -918788
$$ packed form
2142D4672N41917q09130Q86301L81658n04882N35878o56148j455130p81330Q18034
2132i98160k78769L84869K33692k0636K50384N1138J008819K24598o69298q27005
2122f40368l48194J243711O08364j29831R736r81576J98272m93071M75498r22030
2112i79489P09334K70799j188206J134784L26231k28748j64029O2623m33274k56015
2102g45990P30335O23640q03777l54609j36932O58012M09567p91900R53417j40178
2092D01585J90212l56326p49545n17121O53350M22547M73792k41613J62912J6460
2082D56253j67424q79341O25912L50216m40184n55112M51424K78807L5870J246
2072A57667K57574j65748k64365M91065r45691K41598N85491P66076n42314j500141
$$ plain form
2062 -918788 95082 1067341 141424 -204280 73706 6810 -1119426 -1033389 -1180650 -1327362
2052 -1327362 -664024 597160 249199 -183774 -1227178 -1125936 -704256 -1365165 -893786
2043 -893786 -844744 -156082 -685954 -1161609 -1321372 -1085549 694490 1647833 645679 -371775
2033 -371775 -956282 230766 473627 -532801 234933 520771 535693 918704 878014 -127554
2023 -127554 -795050 -359536 -590664 299295 73886 52711 1144777 1170858 647107 152657
2013 152657 -126339 -979986 -1199789 -388978 125513 -704153 197174 216652 -142917 73140
2003 73140 -172286 -457293 -535127 -265148 -1029393 -1831639 -1226700 -714275 -404409 -340254
1993 -340254 659301 -67533 -60232 -499356 -397229 -430881 -1385661 -1390620 -1140141 -1685261 -1316647
$$ packed form
2062i18788J013870R72259r25917l45704K77986o6896j126236Q6037j47261j46712
2052a327362O63338J261184l47961m32973j043404J01242M21680o60909M71379
2043h93786M9042O88662n29872m75655j59763K35823J780039R53343j002154j017454
2033c71775n84507J187048K42861j006428P67734K85838J4922L83011m0690j005568
2023a27554o67496M35514k31128Q89959k25409k1175J092066K6081n23751m94450
2013A52657k78996q53647k19803Q10811N14491q29666R01327J9478l59569K16057
2003G3140k45426k85007p7834K69979p64245q02246O04939N12425L09866O4155
1993c40254R99555p26834P301m39124J02127l3652r54780m959K50479n45120L68614
$$ plain form
1982 -1316647 -632315 -376428 -723398 -723650 -689142 -272139 226335 286436 392999 466559 77405
1971 77405 407857 12034 -1032704 -509175 -846919 -399182 -341882 -829835 -1017658 -237887
1961 -237887 590761 488268 -185371 663126 743629 610401 -92195 580922 1572682 999517
1951 999517 -666899 -532283 -253360 300499 834631 -298921 -453100 17290 477596
1942 477596 168851 63884 -721283 -844997 -691320 -607125 -134222 522263 487114 -1159542
1932 -1159542 -639846 -249154 -508256 -433449 284095 771966 231613 387046 298323 -303822
1922 -303822 -784284 -976926 -584313 348860 516530 2967 -9666 -803179 -849398 -362991
1912 -362991 -1241398 -317571 -398622 -816 749830 371176 -562289 -391422 -678101 -1168851
$$ packed form
1982a316647O84332K55887l46970k52L4508M17003M98474O0101J06563P3560l89154
1971G7405L30452l95823j044738N23529l37744M47737N7300m87953j87823P79771
1961b37887Q28648j02493o73639Q48497Q0503j33228p02596O73117R91760n73165
1951I99517j666416J34616K78923N53859N34132j133552j54179M70390M60306
1942D77596l08745j04967p85167j23714J53677Q4195M72903O56485l5149j646656
1932a159542N19696L90692k59102P4807P17544M87871n40353J55433q8723o02145
1922c03822m80462j92642L92613R33173J67670n13563j2633p93513m6219M86407
1912c62991q78407R23827q1051L97806P50646l78654r33465J70867k86679m90750
$$ plain form
1902 -1168851 -468826 -796955 -1491906 -1255671 -197728 566558 -184551 -871430 -76008
1893 -76008 -24687 -774487 -711716 -854912 -1336391 -543322 145027 973610 932437 857386 661264
1882 661264 295807 324266 138881 435935 653788 -496715 10335 603361 -621117 -302981
1872 -302981 184219 15498 127878 857623 838385 391469 -246168 -1189520 -1465540 -1386487
1862 -1386487 -449477 -424495 -713487 -645460 -1104552 -1007617 343592 345524 721548 1119144
1852 1119144 -71740 -472688 -906257 -979630 -570137 -739812 2778 228535 298957 523073
1842 523073 -297974 430561 1144299 795825 574515 371109 -80233 -111371 -264856 -1067310
1832 -1067310 113558 27070 -209820 -176208 141839 -553284 -812590 -564760 -408992 -901995
$$ packed form
1902a168851P00025l28129o94951K36235J057943P64286p51109o86879P95422
1893g6008N1321p49800O2771j43196m81479P93069O88349Q28583m1173p5051j96122
1882F61264l65457K8459j85385K97054K17853j150503N07050N93026j224478L18136
1872c02981M87200j68721J12380P29745j9238m46916o37637r43352k76020P9053
1862a386487R37010K4982k88992O8027m59092R6935J351209J932L76024L97596
1852A119144j190884m00948m33569p3373M09493j69675P42590K25757P0422K24116
1842E23073q21047P28535P13738l48474k21310k03406m51342l1138j53485q02454
1832a067310J180868q6488k36890L3612L18047o95123k59306K47830J55768m93003
$$ plain form
1822 -901995 -964456 -325021 -928093 425384 744920 1264126 314101 -450669 -192368 -413303
1812 -413303 -923096 -1161842 -962118 -804465 -719939 749987 260007 209457 1030526 516411
1802 516411 659886 191718 130281 465725 542549 264931 -377572 -654258 -556254 -877023
1792 -877023 -200598 452560 -126077 -186527 -148271 190604 882175 585564 -45677 -235592
1782 -235592 244994 477808 -180387 45424 269742 42471 809119 1012064 341594 -463593
1772 -463593 -938664 -1526501 -750197 -394099 -179221 -217703 -200059 -223393 -108147 -106301 -182042
1761 -182042 138328 -261634 -624729 -1181933 -480186 -375878 -104586 -362041 -300815 -789933
1751 -789933 -62507 223754 -143885 -513409 -308291 -170271 -227667 240213 240351 515061
$$ packed form
1822i01995o2461O39435o03072J353477L19536N19206r50025p64770K58301k20935
1812d13303n09793k38746J99724J57653Q4526J469926m89980n0550Q21069n14115
1802E16411J43475m68168o1437L35444P6824k77618o42503k76686R8004l20769
1792h77023O76425O53158n78637o0450L8256L38875O91571k96611o31241j89915
1782b35592M80586K32814o58195K25811K24318k27271P66648K02945o70470q05187
1772d63593m75071n87837P76304L56098K14878l8482J7644k3334J15246J846p5741
1761a82042L20370l99962l63095n57204P01747J04308K71292k57455O1226m89118
1751g89933P27426K86261l67639l69524K05118J38020n7396M67880J38K74710
$$ plain form
1741 515061 -380188 -251326 -564280 -495866 -887895 -763265 158772 -373147 -1197056 -1238035
1731 -1238035 -788109 -162587 -431268 -275651 182106 -109002 -730608 -234552 -154193 -679701
1721 -679701 -290681 -649030 116870 321264 158823 -36059 -109255 -581405 162805 -10616
1711 -10616 25735 -135807 258882 435218 550816 556571 153838 431586 34155 -40603 -493485
1700 -493485 -471783 -965076 -1045508 -633841 -236720 -643014 -386044 411933 480585 -120294
1690 -120294 -827898 -309367 -589018 -839720 -251671 -107401 -66936 -410947 -226265 -1580455
1680 -1580455 -831396 -428213 82872 -339111 -130964 -387979 -653270 -806359 -420663 -221408
1670 -221408 -1038401 -929010 -19396 -135115 -575641 -584811 110913 571940 570271 1307267
$$ packed form
1741E15061q95249J28862l12954O8414l92029J24630R22037n31919q23909m0979
1731a238035M49926O25522k68681J55617M57757k91108o21606M96056Q0359n25508
1721f79701L89020l58349P65900K04394j62441j94882p3196m72150P44210j73421
1711a0616L6351j61542L94689J76336J15598N755m02733K77748l97431p4758m52882
1700d93485K1702m93293q0432M11667L97121m06294K56970P97977O8652o00879
1690a20294p07604N18531k79651k50702N88049J44270M0465l44011J84682j354190
1680a580455P49059M03183N11085m21983K08147k57015k65291j53089L85696J99255
1670b21408q16993J09391R09614j15719m40526r170O95724M61027j669P36996
$$ plain form
1660 1307267 802971 438120 219440 81108 -20295 849927 223409 197334 412742 302688
1650 302688 -529353 -1461553 -1023750 168276 424203 509116 148653 -68106 275265 -651335
1640 -651335 -415575 -27232 151120 25499 -720782 -733878 -510520 -338170 239859 -412253
1630 -412253 -57498 -84674 -804349 -770836 -784420 -550153 490509 -101725 -1230418 -1164578
1620 -1164578 -995965 -231774 440 31326 -263840 450650 10990 391027 -167649 -409423
1610 -409423 -1000323 -1383905 -1228093 6836 -267752 -237365 -627969 -939479 -1029422 -1369148
1600 -1369148 -809263 -1211875 -1305748 -554324 -201461 391458 285484 473605 159842 -409243
1590 -409243 351245 310230 850864 718453 508244 544646 231470 -282060 -58290 178114
$$ packed form
1660A307267n04296l64851k18680j38332j01403Q70222o26518k6075K15408j10054
1650C02688q32041r32200M37803J192026K55927Q4913l60463k16759L43371r26600
1640f51335K35760L88343J78352j25621p46281j3096K23358J72350N78029o52112
1630d12253L54755k7176p19675L3513j3584K34267J040662n92234j128693O5840
1620a164578J68613P64191K32214L0886k95166P14490m39660L80037n58676k41774
1610d09423n90900l83582J55812J234929k74588L0387l90604l11510q9943l39726
1600a369148N59885m02612r3873P51424L52863N92919j05974J88121l13763n69085
1590d09243P60488m1015N40634j32411k10209L6402l13176n13530K23770K36404
$$ plain form
1580 178114 728889 717743 228563 -470366 -679151 -1341420 -1284592 -520969 -703121 -696552
1570 -696552 -46640 97003 -346539 -1027049 581890 462005 -723128 -241433 303715
1561 303715 449025 -23052 -70234 -238954 -88656 -110873 -763680 -414996 -853689 -690604
1551 -690604 -84804 -422027 -696796 -712308 -460574 -262299 282558 526361 -560134 -81303
1541 -81303 401525 817792 381292 303349 140719 -387181 858709 484138 73337 -663790
1531 -663790 215701 463800 769498 543395 545619 1408974 517220 582815 -148842 58528
1521 58528 283472 530284 366350 -170474 -631428 -761792 -260494 -220878 41949 390352
1511 390352 -386666 -621370 -158597 -538864 -382579 -492559 -203193 -368095 -225915 -834714
$$ packed form
1580A78114N50775j1146m89180o98929k08785o62269N6828P63623j82152O569
1570f96552O49912J43643m43542o80510J608939j19885j185133M81695N45148
1561C03715J45310m72077m7182j68720J50298k2217o52807L48684m38693J63085
1551f90604O05800l37223k74769j5512K51734J98275N44857K43803j086495M78831
1541h1303M82828M16267m36500p7943j62630n27900J245890l74571m10801p37127
1531f63790Q79491K48099L05698k26103K224Q63355q91754O5595p31657K07370
1521E8528K24944K46812j63934n36824m60954j30364N01298L9616K62827L48403
1511C90352p77018k34704M62773l80267J56285j09980K89366j64902J42180o08799
$$ plain form
1501 -834714 -973412 -415632 -371997 -1355458 -458796 504971 -201317 -370353 35673 -331189
1491 -331189 -797913 -93393 -773749 -46143 255466 661935 718667 -494420 -1457606 -1421821
1481 -1421821 405756 670065 -622220 -575919 -669140 -668357 -690683 -1675299 -1105914 -1402031
1471 -1402031 -1208863 -879281 -1344678 -1159779 -8268 616571 -381018 -116674 442435
1462 442435 572422 -212035 269362 -130684 -666031 -1047232 -1264186 -424293 -761819 -931114
1452 -931114 -1273659 -1386273 -777062 -290208 -204265 852325 671619 386019 -141740 -916003
1442 -916003 -391182 -315993 -390156 -481397 -1443256 -1197100 -925841 -225323 513326 585500
1432 585500 733356 813336 290445 213964 629007 109311 -32436 -20986 -715222 -767057
$$ packed form
1501h34714j38698N57780M3635r83461Q96662R63767p06288j69036M06026l66862
1491c31189m66724P04520o80356P27606L01609M06469N6732j213087r63186L5785
1481a421821J827577K64309j292285M6301r3221P83k2326r84616N69385k96117
1471a402031J93168L29582m65397J84899J151511O24839r97589K64344N59109
1462D42435J29987p84457M81397m00046n35347l81201k16954Q39893l37526j69295
1452i31114l42545j12614O09211M86854Q5943J056590j80706k85600n27759p74263
1442i16003N24821P5189p4163r1241r61859K46156K71259P00518P38649P2174
1432E85500J47856P9980n22891p6481M15043n19696j41747J1450o94236n1835
$$ plain form
1422 -767057 -825585 -959884 -409293 346148 919424 938096 685111 181647 -375938 -240967
1412 -240967 -147739 -226239 107646 200088 -638767 -709149 -414591 -933397 -110946 -20867 -141886
1401 -141886 -577033 -139078 314909 -330546 542236 756491 392453 1015739 491420 -80266
1391 -80266 -600214 108748 -174062 -350488 770280 393925 362538 401128 49206 104339
1381 104339 -533480 -634437 34689 102498 83300 -466760 -704172 -899299 -798005 -1218517
1371 -1218517 404779 507189 145478 -273963 -648563 -49048 412885 594802 435034
1362 435034 271266 -170924 -347083 -54299 347725 -496164 -885456 -240291 403442 -245985
1352 -245985 -105471 555137 1333745 -335019 -1047786 -1145485 190365 563273 -304120 -252820
$$ packed form
1422g67057n8528j34299N50591P55441N73276J8672k52985n03464n57585J34971
1412b40967R3228p8500L33885R2442q38855p0382K94558n18806Q22451R0079j21019
1401a41886m35147M37955M53987o45455Q72782K14255l64038O23286n24319n71686
1391h0266n19948P08962k82810j76426J120768l76355l1387L8590l51922N5133
1381A04339o37819j00957O69126O7809j9198n50060k37412j95127J01294m20512
1371a218517J623296J02410l61711m19441l74600N99515M61933J81917j59768
1362D35034j63768m42190j76159K92784M02024q43889l89292O45165O43733o49427
1352b45985J40514O60608P78608j668764p12767r7699J335850L72908q67393N1300
$$ plain form
1342 -252820 -368376 137906 180401 -962598 -276817 -141977 -711725 -238513 -1293 279628
1332 279628 -475914 -146846 -554545 -385919 -68487 -1135642 -356963 -717449 -970805 225272
1322 225272 1435222 1383569 853090 191592 141656 -682231 -308752 542074 -86835 -335062
1312 -335062 12770 518405 114840 -637826 -906544 -198736 -365216 -290637 -67766 -8073
1302 -8073 -553568 -638852 -796799 -537371 -339668 -566912 -197317 -208723 -337001 -965087
1292 -965087 -1162994 -433573 375854 666855 -102402 241827 188290 1291119 817811 765029
1282 765029 -266004 489677 633133 126040 -117471 423070 492276 691998 1016904 910277
1272 910277 517640 -264545 363256 305082 551755 469903 -20930 110340 -18232 5917
$$ packed form
1342b52820j15556N06282M2495j142999O85781J34840n69748M73212K37220K80921
1332B79628p55542L29068m07699J68626L17432j067155P78679l60486k53356J196077
1322B25272J209950n1653n30479o61498m9936q23887L73479Q50826o28909k48227
1312c35062L47832N05635m03565p52666k68718P07808j66480P4579K22871N9693
1302h073n45495q5284j57947K59428J97703k27244L69595j1406j28278o28086
1292i65087j97907P29421Q09427K91001p69257L44229n3537J102829m73308n2782
1282G65029j031033P55681J43456n07093k43511N40541O9206J99722L24906j06627
1272I10277l92637p82185O27801n8174K46673q1852m90833J31270j28572K4149
$$ plain form
1262 5917 -525441 400483 557170 -167702 551067 168126 229031 539540 1587659 1200348
1252 1200348 107869 -189502 348884 227596 -788523 -1007383 -554526 -719080 -946086
1243 -946086 -985131 -183268 -226536 851018 732133 -568406 -498224 554538 210233 83795
1233 83795 31355 327798 1094425 537621 36433 943915 356170 693151 584015 628252
1223 628252 573145 -397918 -398278 652245 788738 9965 313721 126519 45641 -576065
1213 -576065 -647781 239376 -138879 -652848 264156 24232 657669 16400 -624126 -577825
1203 -577825 -479348 91752 -15429 483886 157724 -436870 -577945 -596937 -777466 -863187
1193 -863187 -1503154 117518 667867 69330 603963 40711 426168 923628 643375 66161
$$ packed form
1262E917n31358R25924J56687p24872P18769l82941O0905L10509J048119l87311
1252A200348j092479k97371N38386j21288j016119k18860M52857j64554k27006
1243i46086l9045Q01863m3268J077554j18885j300539P0182J052762l44305j26438
1233H3795n2440K96443P66627n56804n01188R07482n87745L36981j09136M4237
1223F28252n5107r71063l60J050523J36493p78773L03756j87202q0878o21706
1213e76065p1716Q87157l78255n13969R17004k39924O33437o41269o40526M6301
1203e77825R8477N71100j07181M99315l26162n94594j41075j8992j80529q5721
1193h63187o39967J620672N50349n98537N34633n63252L85457M97460k80253n77214
$$ plain form
1183 66161 -90180 265639 -128690 -208993 -225709 178508 -220600 -600572 -361845 -272011
1173 -272011 1005838 754022 905136 854123 463853 1504686 1591170 1016384 242851 -975887
1163 -975887 -947188 406032 280630 -209611 89787 516248 336389 316762 345686 215570
1153 215570 351481 334919 1113206 358169 366625 1067814 545346 282714 498214 275774
1143 275774 478559 440674 -177813 568525 768691 -295376 175244 207062 216606 11462
1133 11462 91356 151747 -118385 883687 639722 -285407 -221825 -519273 63568 -577364
1123 -577364 -87228 32041 -428449 -750423 -763431 -380433 492504 -119348 -442462 -269733
1113 -269733 -429935 -191018 529799 39229 -967964 -319009 -1036432 -975242 -794547 -275515
$$ packed form
1183F6161j56341L55819l94329q0303j6716M04217l99108l79972K38727Q9834
1173b72011J277849k51816J51114n1013l90270J040833Q6484n74786p73533j218738
1163i75887K8699J353220j25402m90241K99398M26461j79859j9627K8924j30116
1153B15570J35911j6562P78287p55037Q456P01189n22468k62632K15500k22440
1143B75774K02785l7885o18487P46338K00166j064067M70620L1818R544k05144
1133A1462P9894O0391k70132J002072k43965r25129O3582k97448N82841o40932
1123e77364M90136J19269m60490l21974j3008L82998Q72937o11852l23114J72729
1113b69733j60202K38917P20817m90570j007193O48955p17423O1190J80695N19032
$$ plain form
1103 -275515 289908 517777 -125024 -200291 177221 1015355 497454 29852 114554 142871
1093 142871 -235115 -602328 -547282 65808 161186 -365085 192229 909584 201154 -1003
1083 -1003 -393762 -850373 -632314 -406898 -394853 577873 -75219 -988609 -827178 -208307
1073 -208307 -494881 -146053 225385 910546 476844 -586791 -620311 -372942 303553 318882
1063 318882 -593049 -843612 -564995 -119287 920583 628198 711962 -482521 725489
1054 725489 680022 280964 128941 910661 1113567 187992 1177409 601964 230242 621321
1044 621321 -3189 -104588 866147 1030845 569846 -163989 -376994 -615828 -356930 -51391
1034 -51391 658986 702269 486955 578714 641129 777326 -237708 -17203 -177480 -248702
$$ packed form
1103b75515N65423K27869o42801p5267L77512Q38134n17901m67602Q4702K8317
1093A42871l77986l67213N5046O13090R5378n26271N57314P17355p08430k02157
1083a003l92759m56611K18059K25416J2045R72726o53092r13390J61431O18871
1073b08307k86574L48828L71438O85161m33702j063635l3520K47369O76495J5329
1063C18882r11931k50563K78617M45708J039870k92385Q3764j194483J208010
1054G25489m5467l99058j52023P81720K02906r25575R89417n75445l71722L91079
1044F21321o24510j01399R70735J64698m60999p33835k13005k38834K58898L05539
1034e1391P10377M3283k15314R1759O2415J36197j015034K20505j60277p1222
$$ plain form
1024 -248702 -268964 63088 321749 524321 451496 589146 119006 215436 -25747 -538090
1014 -538090 -484832 248450 495804 550384 1807894 1857255 1089125 560288 618767 59156
1004 59156 540925 276828 629620 998173 1140066 1293539 342357 -105097 632885 -365892
994 -365892 -629227 43064 276720 481117 73342 -294805 -1293952 -1127480 -1137527 -956330
984 -956330 -631506 -1203597 -225451 425344 159938 85156 -21157 -357115 -538210 639604
974 639604 437854 337499 -364855 -220335 -430717 -166793 -275466 -369369 -389040 -430462
964 -430462 -186362 -151735 692696 -451655 -280106 -360458 -603361 -73359 132667 400274
954 400274 -138932 231323 295723 658656 224267 154233 592572 278124 646858 -366739
$$ packed form
1024b48702k0262L32052K58661K02572p2825J37650m70140R6430k41183n12343
1014e38090N3258P33282K47354N4580J257510M9361p68130n28837N8479n59611
1004E9156M81769k64097L52792L68553J41893J53473r51182m47454P37982r98777
994c65892k63335O72291K33656K04397m07775l68147r99147J66472j0047J81197
984i56330L24824n72091R78146O50795k65406p4782j06313l35958j81095J177814
974F39604k01750j00355p02354J44520k10382K63924j08673r3903j9671m1422
964d30462K44100L4627Q44431j144351J71549q0352k42903N30002K06026K67607
954D00274n39206L70255O4400L62933m34389p0034M38339l14448L68734j013597
$$ plain form
944 -366739 -320028 -342428 -902646 -759953 -1005986 -755850 -472928 -503597 -202199 -326176
934 -326176 423501 377578 599783 598208 577119 252141 122583 -408047 -53129 -497197 -494161
923 -494161 521480 928322 379355 629253 420923 513198 614039 -102207 -1319810 -1256667
913 -1256667 -304649 -321615 456843 338538 29694 141014 446314 -16358 235518 71704
903 71704 -661272 -164952 -133984 466814 554990 -301788 -2015935 -1057107 -304178 -43188
893 -43188 152223 -81186 489611 658167 694075 -91369 243168 277806 865063 151862
883 151862 -645143 -849932 -11787 -647421 -455791 -888793 27704 209429 614900 -149829
873 -149829 152594 -50446 -40942 414556 -305405 -1060636 -417233 601392 -352800 5422
$$ packed form
944c66739M6711k2400n60218J42693k46033K50136K82922l0669L01398j23977
934c26176P49677m5923K22205j575k1089l24978j29558n30630L54918m44068L036
923d94161J015641M06842n48967K49898k08330R2275J00841p16246j217603O3143
913a256667R52018j6966P78458j18305l08844J11320L05300m62672K51876j63814
903G1704p32976M96320L0968O00798Q8176q56778j714147R58828P52929K60990
893d3188J95411k33409N70797J68556L5908p85444L34537L4638N87257p13201
883A51862p97005k04789Q38145o35634J91630m33002R16497J81725M05471p64729
873a49829L02423k03040R504M55498p19961p55231O43403J018625r54192L58222
$$ plain form
863 5422 282642 -661276 -1194082 -322497 197746 -884574 -1166798 -567464 -698334 -1172086
853 -1172086 -756102 -74007 -263459 -913032 -827153 356943 119591 593858 -230244 298452
843 298452 431091 4179 -887812 -909723 -335945 -611661 -507708 857853 600150 -180936
833 -180936 -612794 -254914 201557 -117297 -755652 -576605 -815759 -1147655 -155572 278228
823 278228 283878 754925 649401 -374672 67940 336861 -152217 -158892 1160556 612011
813 612011 -424018 495346 155408 14586 680609 480762 272310 43920 598351 173144
803 173144 188183 68402 162453 609210 787025 439646 459474 345698 349322 50367 -573439
792 -573439 -870482 170182 699681 1038091 859367 335227 -318847 -367235 -735096 130826
$$ packed form
863E422K77220r43918n32806Q71585N20243j082320k82224N99334j30870m73752
853a172086M15984O82095j89452o49573Q5879J184096k37352M74267q24102N28696
843B98452J32639m26912q91991k1911N73778k75716J03953J365561k57703p81086
833a80936m31858L57880M56471l18854o38355J79047k39154l31896R92083M33800
823B78228N650M71047j05524j024073M42612K68921m89078o675J319448n48545
813F12011j036029R19364l39938j40822O66023j99847k08452k28390N54431m25207
803A73144J5039j19781R4051M46757J77815l47379J9828j13776L624k98955o23806
792e73439k97043J040664N29499L38410j78724n24140o54074m8388l67861Q65922
$$ plain form
782 130826 6975 -674093 -87749 -794225 -117451 -123536 -666173 -1331258 -556261 -612277
772 -612277 -877050 512613 1161265 675769 420336 209079 1037092 832399 -96948 -98346
762 -98346 358574 -773096 -233802 303508 800996 378049 -27985 471889 846839 868314
752 868314 781017 -93681 -527654 -267896 -245086 88768 -525643 -900667 -508651 -1093459
742 -1093459 -890160 -30342 -493602 -401849 -1116846 -953207 -251328 -744096 -563121 181981
732 181981 601088 340172 -157714 200745 221276 -23670 -51794 -166040 -403841 -703632
722 -703632 -204356 35634 376238 1245257 1551757 1712236 672445 350356 835615 -212146
712 -212146 -520851 -369289 -496047 -891213 -464738 -140799 -371880 -371885 350974 242492 497764
$$ packed form
782A30826j23851o81068N86344p06476O76774o085n42637o65085P74997n6016
772f12277k64773J389663O48652m85496k55433k11257Q28013k04693r29347j398
762i8346M56920j131670N39294N37310M97488m22947m06034M99874L74950K1475
752H68314q7297q74698m33973K59758K2810L33854o14411l75024L92016n84808
742a093459K03299Q59818m63260R1753p14997J63639P01879m92768J80975P45102
732A81981M19107k60916m97886L58459K0531k44946k8124j14246k37801k99791
722g03632M99276K39990L40604Q69019L06500J60479j039791l22089M85259j047761
712b12146l08705J51562j26758l95166M26475L23939k31081nP22859j08482K55272
$$ plain form
701 497764 494113 -255341 -597147 -926891 -156372 574816 1010595 1002354 213898 -459508 924326
690 924326 178131 -154290 -278147 -551715 -785052 243034 1327454 785289 1088135 425873
680 425873 519654 385224 -349484 -964479 -1102689 -381950 -674171 -453274 -590996 -278944
670 -278944 -545611 -302354 -354663 -1028527 -474276 -468662 -137372 -601229 -306638 -123296
660 -123296 -653169 -108313 -267104 245911 550320 -1046064 -847368 -487697 96695 -345842
650 -345842 37831 1050639 -452114 -249285 -300846 396250 66131 -344152 -261029 -342558
$$ packed form
701D97764l651p49454l41806l29744P70519P31188M35779q241p88456o73406J383834
690I24326p46195l32421j23857k73568k33337J028086J084420n42165L02846o62262
680D25873R3781j34430p34708o14995j38210P20739k92221K20897j37722L12052
670b78944k66667K43257n2309o73864N54251N614L31290m63857K94591J83342
660a23296n29873N44856j58791N13015L04409j596384J98696L59671N84392m42537
650c45842L83673J012808j502753K02829n1561O97096l30119m10283Q3123q1529
$$ [...]
##END NTUPLES=NMR SPECTRUM
##END=
