##TITLE=1H_CG-1191-a12
 CDCl3
 8sc, 
 16.2.2024
##JCAMPDX= 6.0         $$ Bruker NMR JCAMP-DX V2.0
##DATA TYPE= NMR SPECTRUM
##DATA CLASS= NTUPLES
##ORIGIN= UXNMR, Bruker Analytische Messtechnik GmbH
##OWNER= root
$$ XWIN-NMR		Version 3.5
$$ Fri Feb 16 15:47:47 2024 Russian Standard Time (UT+4h)  she@DPX200
##.OBSERVE FREQUENCY= 200.1313
##.OBSERVE NUCLEUS= ^1H
##.ACQUISITION MODE= SIMULTANEOUS
##.ACQUISITION SCHEME= undefined
##.AVERAGES= 8
##.DIGITISER RES= 18
##SPECTROMETER/DATA SYSTEM= spect
##.PULSE SEQUENCE= zg30
##.SOLVENT NAME= DMSO
##.SHIFT REFERENCE= (INTERNAL, DMSO, 0, 15.4814)
##AUDIT TRAIL= $$ (NUMBER, WHEN, WHO, WHERE, WHAT)
$$ ##TITLE= Audit trail, XWIN-NMR		Version 3.5
$$ ##JCAMPDX= 5.01
$$ ##ORIGIN= Bruker BioSpin GmbH
$$ ##OWNER= she
$$ F:/spectra/data/she/nmr/H-F/1/pdata/1/auditp.txt
$$ ##AUDIT TRAIL=  $$ (NUMBER, WHEN, WHO, WHERE, WHAT)
(   1,<2024-02-16 15:46:37.71 +0400>,<she>,<DPX200>,
      <created by zg, POWCHK disabled, PULCHK disabled
       configuration hash MD5:
       00 E9 B6 7A A2 85 ED C7 34 08 36 98 17 FE 4E 26
       data hash MD5: 16K
       0D CB 94 5B 77 1C A4 47 A6 CA 1E C9 8B 7D 10 B4>)
(   2,<2024-02-16 15:46:40.60 +0400>,<she>,<DPX200>,
      <Start of raw data processing
       efp BC_mod = 2 LB = 0.24 FT_mod = 6 PKNL = 1 PHC0 = -24957.52 PHC1 = 7.052645 SI = 16K 
       data hash MD5: 16K
       1C 82 6F B8 FF 0F 61 30 D1 EA 10 39 D8 25 81 D4>)
(   3,<2024-02-16 15:46:55.21 +0400>,<she>,<DPX200>,
      <pk PHC0 = 1.573191 PHC1 = 0 
       data hash MD5: 16K
       C4 1B 18 D2 06 C9 50 C9 29 9D DB 9B 0E D5 56 82>)
(   4,<2024-02-16 15:46:58.37 +0400>,<she>,<DPX200>,
      <abs ABSG = 5 
       data hash MD5: 16K
       B2 2E 90 FB AD F1 3E 0D 56 EF D2 57 8A B5 87 7D>)
(   5,<2024-02-16 15:47:22.09 +0400>,<she>,<DPX200>,
      <abs ABSG = 5 
       data hash MD5: 16K
       7C 6B F1 1A 2A A4 B1 B8 DA 96 01 FD 9D 88 BE F2>)
$$ ##END=
$$ 
$$ hash MD5
$$ 69 6A 45 EE 73 A0 53 18 DE 3E 89 25 A9 3A A4 E1
##$RELAX= 
##$RELAX= 
##$RELAX= 
##$RELAX= 
##$RELAX= 
##$RELAX= 
$$ Bruker specific parameters
$$ --------------------------
##$DU= <F:/spectra>
##$EXPNO= 1
##$NAME= <H-F>
##$PROCNO= 1
##$TYPE= <nmr>
##$USER= <she>
##$AMP= (0..31)
100 100 100 100 100 100 100 100 100 100 100 100 100 100 100 100 100 100 
100 100 100 100 100 100 100 100 100 100 100 100 100 100 
##$AQSEQ= 0
##$AQ_mod= 1
##$AUNM= <au_zg>
##$AUTOPOS= <>
##$BF1= 200.13
##$BF2= 200.13
##$BF3= 200.13
##$BF4= 200.13
##$BF5= 200.13
##$BF6= 200.13
##$BF7= 200.13
##$BF8= 200.13
##$BYTORDA= 1
##$CFDGTYP= 0
##$CFRGTYP= 5
##$CHEMSTR= <none>
##$CNST= (0..31)
1 1 145 1 1 1 1 1 1 1 1 1 1 1 1 1 1 1 1 1 1 1 1 1 1 1 1 1 1 1 1 1 
##$CPDPRG= <>
##$CPDPRG1= <>
##$CPDPRG2= <>
##$CPDPRG3= <>
##$CPDPRG4= <mlev>
##$CPDPRG5= <mlev>
##$CPDPRG6= <mlev>
##$CPDPRG7= <mlev>
##$CPDPRG8= <mlev>
##$CPDPRGB= <>
##$CPDPRGT= <>
##$D= (0..31)
0 1.2 0 0 0 0 0 0 0 0.06 0 0.03 0 0 0 0 0.0002 0 0 0 0 0 0 0 0 0 0 0 0 
0 0 0 
##$DATE= 1708083997
##$DBL= (0..7)
$$ [...]
##$SUBNAM3= <"">
##$SUBNAM4= <"">
##$SUBNAM5= <"">
##$SUBNAM6= <"">
##$SUBNAM7= <"">
##$SUBNAM8= <"">
##$SUBNAM9= <"">
##$SW= 18.0517328524113
##$SWIBOX= (0..15)
0 0 2 0 0 0 0 0 0 0 0 0 0 0 0 0 
##$SW_h= 3612.71676300578
##$TD= 16384
##$TD0= 1
##$TE= 0
##$TE2= 300
##$TE3= 300
##$TEG= 300
##$TL= (0..7)
0 120 120 120 120 120 120 120 
##$TP= (0..7)
150 150 150 150 150 150 150 150 
##$TP07= 0
##$TPNAME0= <>
##$TPNAME1= <>
##$TPNAME2= <>
##$TPNAME3= <>
##$TPNAME4= <>
##$TPNAME5= <>
##$TPNAME6= <>
##$TPNAME7= <>
##$TPOAL= (0..7)
0.5 0.5 0.5 0.5 0.5 0.5 0.5 0.5 
##$TPOFFS= (0..7)
0 0 0 0 0 0 0 0 
##$TUNHIN= 0
##$TUNHOUT= 0
##$TUNXOUT= 0
##$USERA1= <user>
##$USERA2= <user>
##$USERA3= <user>
##$USERA4= <user>
##$USERA5= <user>
##$V9= 5
##$VALIST= <valist>
##$VCLIST= <CCCCCCCCCCCCCCC>
##$VD= 0
##$VDLIST= <DDDDDDDDDDDDDDD>
##$VPLIST= <PPPPPPPPPPPPPPP>
##$VTLIST= <TTTTTTTTTTTTTTT>
##$WBST= 1024
##$WBSW= 4
##$XGAIN= (0..3)
0 0 0 0 
##$XL= 0
##$YL= 0
##$YMAX_a= 250200
##$YMIN_a= -417017
##$ZGOPTNS= <>
##$ZL1= 120
##$ZL2= 120
##$ZL3= 120
##$ZL4= 120
##$ABSF1= 15.48136
##$ABSF2= -2.570489
##$ABSG= 5
##$ABSL= 3
##$ALPHA= 0
##$AQORDER= 0
##$ASSFAC= 0
##$ASSFACI= 0
##$ASSFACX= 0
##$ASSWID= 0
##$AUNMP= <proc_1d>
##$AZFE= 0.1
##$AZFW= 0.1
##$BCFW= 0
##$BC_mod= 2
##$BYTORDP= 0
##$COROFFS= 0
##$CY= -3
##$DATMOD= 1
##$DC= 0
##$DFILT= <>
##$DTYPP= 0
##$F1P= 0
##$F2P= 0
##$FCOR= 1
##$FTSIZE= 16384
##$FT_mod= 6
##$GAMMA= 0
##$GB= 0
##$INTBC= 1
##$INTSCL= 3.70164e-10
##$ISEN= 128
##$LB= 0.24
##$LEV0= 0
##$LPBIN= 0
##$MAXI= 10000
##$MC2= 0
##$MEAN= 0
##$ME_mod= 0
##$MI= 1.114404
##$NCOEF= 0
##$NC_proc= -8
##$NLEV= 6
##$NOISF1= 3.799351
##$NOISF2= 2.8
##$NSP= 0
##$NTH_PI= 0
##$NZP= 0
##$OFFSET= 15.48136
##$PC= 1
##$PHC0= -24955.95
##$PHC1= 7.052645
##$PH_mod= 1
##$PKNL= yes
##$PPARMOD= 0
##$PSCAL= 0
##$PSIGN= 0
##$REVERSE= no
##$SF= 200.130008073805
##$SI= 16384
##$SIGF1= 3
##$SIGF2= 2
##$SINO= 5.538805
##$SIOLD= 16384
##$SREGLST= <1H.CDCl3>
##$SSB= 0
##$STSI= 16384
##$STSR= 0
##$SW_p= 3612.71676300578
##$SYMM= 0
##$S_DEV= 0
##$TDeff= 16384
##$TDoff= 0
##$TI= <>
##$TILT= no
##$TM1= 0
##$TM2= 0
##$TOPLEV= 0
##$USERP1= <user>
##$USERP2= <user>
##$USERP3= <user>
##$USERP4= <user>
##$USERP5= <user>
##$WDW= 1
##$XDIM= 16384
##$YMAX_p= 367934058
##$YMIN_p= -1737544
$$ End of Bruker specific parameters
$$ ---------------------------------
##NTUPLES= NMR SPECTRUM
##VAR_NAME=  FREQUENCY,     SPECTRUM/REAL,   SPECTRUM/IMAG
##SYMBOL=    X,             R,               I
##VAR_TYPE=  INDEPENDENT,   DEPENDENT,       DEPENDENT
##VAR_FORM=  AFFN,          ASDF,            ASDF
##VAR_DIM=   16384,         16384,           16384
##UNITS=     HZ,            ARBITRARY UNITS, ARBITRARY UNITS
##FACTOR=    0.220516191357247, 1,           1
##FIRST=     3098.28478894727, 0,            0
##LAST=      -514.431974058514, 0,           0
##MIN=       -514.431974058514, -1737544,    0
##MAX=       3098.28478894727, 367934058,    0
$$ Real data points
##PAGE= N=1
##DATA TABLE= (X++(R..R)), XYDATA
$$ [...]
11801A89431r5544l29848M01737j35417J77456K54478l08453L48370p1828m45295
11791a4913p59683J84524M20140l48416M05510J20687n9382J12373M8406M31355
11781E40601L23294o53461q87896k32148K43999K97998J76896M2902M44187K86729
11771E83101K85609n07495K4770m15443K50832N01416j72306k98573L18277j18373
11761D51815o31905J5047n3163K98476r68107j9261O41152k22188J71628L04624
11751a1882M1865K99838q26795K37214O71086r105m9405j26544n09210o2465Q3361
11740b62042J87914L81875n64060j50953K13924l83161l02422K29564N14127L27527
11730A92293n2360p35107K97444M13437N87928p74462k05664R9231M60778M88501
$$ y = [189431, 93887, -235961, 165776, 30359, 207815, 462293, 153840, 502210, 430382, -14913, -774596, -590072, -169932, -518348, -112838, 7849, -51533, 60840, 109246, 540601, 863895, 210434, -677462, -909610, -665611, -367613, -190717, -147815, 296372, 583101, 868710, 361215, 385985, -29458, 221374, 722790, 550484, 251911, 570188, 451815, -180090, -165043, -218206, 80270, -887837, -907098, -265946, -488134, -316506, -11882, 29983, 329821, -496974, -259760, 411326, 402221, 352816, 226272, -282938, -345403, -262042, -74128, 307747, -256313, -407266, -193342, -576503, -878925, -649361, -135234, 192293, 139933, -595174, -297730, 115707, 703635, -70827, -276491, -177260, 283518, 772019]
11720G72019k7774J27321j160658J27153N90052N64437L19274m02496j122953
11711b13625M44092Q00103k67520q31704k9013k58369K58960j71479j16198O93925
11701C09172K87828j23399L92304l49995l18006k84486j041N1715l47992Q1601
11691c02299L36987K76913m07130l94783L53026M48840r21107j06397R77070P9948
11681C41068o13809K68247O72698k10677n94709j26606Q7765K58265o32186M845
11671e45099M59694Q8011N51181j91102p53532K94026J65941O3853J29126n84741
11661c22642l36260l02925K16420Q37085L93143j28006o31430K59819L10594o2937
11651B32861R5367J55681r1734l94335L00973m36262p76513K08096M63305j45402
$$ y = [772019, 744245, 871566, -289092, -161939, 428113, 992550, 1311824, 909328, -213625, 230467, 1030570, 763050, -68654, -97667, -356036, -97076, -268555, -384753, 309172, 597000, 473601, 865905, 515910, 197904, -86582, -87623, -35908, -383900, -302299, 34688, 311601, -95529, -490312, -137286, 311554, -609553, -715950, 261120, 341068, -272741, -4494, 668204, 457527, -137182, -263788, -176023, 82242, -549944, -545099, -85405, 2606, 553787, 362685, -390847, -96821, 69120, 132973, 262099, -322642, -658902, -961827, -745407, 91678, 484821, 356815, -274615, -14796, 295798, 232861, 328228, 483909, 392175, -2160, 298813, -137449, -913962, -705866, -242561, -387963]
11641c87963N98715J54305n9548k41738K48910K90182K18052J81575p29785J46338
11631D19043k48392K64508K77053p96663K61306k00303m13694N64796M70977L9434
11621F38065k85855k83451J17937K47059o99887Q81629j26563m60642L59644K39366
11611F27302q40870M76705K72581m32725P1699P4884J3606K89871M10393j75200
11601G88246J15988j35374l29750l49882m65789O12974K55134l64019L42739p49361
11591b79094O0490M86411l87039l54440O63412K46420k25197q9502J21236R1975
11581C34672K77898m53645m41792k38261L61912l16528J39579O41445o71010j71308
11571e37038M71482K81556o4570K81328j10663m788j27747j53693J23285m51691
$$ y = [-387963, 210752, 365057, 305509, 63771, 312681, 602863, 820915, 1002490, 272705, 419043, 170651, 435159, 712212, -84451, 176855, -23448, -437142, 127654, 598631, 638065, 352210, 68759, 186696, 433755, -266132, 615497, 488934, 28292, 387936, 627302, -213568, 263137, 535718, 102993, 174692, 249576, 263182, 553053, 963446, 788246, 904234, 768860, 439110, 89228, -376561, 236413, 491547, 127528, 470267, -279094, -218604, 267807, -119232, -473672, 189740, 436160, 210963, 121461, 242697, 334672, 612570, 158925, -282867, -521128, -159216, -475744, -336165, 305280, -365730, -537038, -65556, 216000, 151430, 432758, 322095, 317307, 189560, 35867, 159152, -292539]
11561b92539M5229L53394l10834n26811N66603K0701o14371M46809L19904k44439
11551b36354k50113j31414P85471l52805k72306N66712K27768M6702q07893Q934
11541d15298O91851K54740l79711o07288k22032K65810N43719j64268m31716M95089
11531C0896J78509j14175O2769j83259M08980M8699l46505k81933M81466k1198
11521B64249k90105l44744L87548n1134k15108J98568j61826N20093k19967k21530
11511a33956K66073M13816J21268k79403l50320m86448l08207P24219K22139m02986
11501b13805M5518N99781k0564j52462K3168j63671o68873M19723j3471j68746
11491c13402J03417P84463k76044r3898N56662l76374l44884o00403M16924M88407
$$ y = [-292539, -247310, 106084, -204750, -731561, -164958, -144257, -758628, -311819, 8085, -236354, -486467, -617881, 167590, -185215, -457521, 109191, 336959, 383661, -424232, -415298, 276553, 531293, 151582, -455706, -677738, -411928, 131791, -32477, -464193, 30896, 209405, 95230, 157999, -25260, 383720, 432419, 85914, -196019, 285447, 264249, -25856, -370600, 16948, -34186, -249294, -50726, -212552, 307541, 87574, -133956, 132117, 545933, 667201, 387798, 37478, -448970, -757177, -32958, 189181, -213805, -168287, 431494, 410930, 258468, 281636, 117965, -550908, -131185, -144656, -313402, -209985, 574478, 298434, 204536, 761198, 384824, 39940, -560463, -143539, 344868]
11481C44868m48699k54844J21381P17983K8291k19689N31508m81322j26134k20297
11471f954k34618j38295L62659M16078o3196o35937M04364N83357n08883L8525
11461B17100N8447j86189q7331l07493L63987m38151J15503L3395K3397N849L21704
11450A20218L98812r5936m49410m99688O68059J34908M01742o40199j506k28003
11440a91003q0935j04831P77789l13858n77227L37354M37876l00287M1715M90192
11430E16785m31176O3656n55250J91913k07977j3472L37832J68043l04682k74471
11420e08799M07484j06445J24535K27111k24574p11217K40401K54766l0936m06972
11410g34646N13339q2234n86194J108510j22392k70734N93631l39666n84884L99547
$$ y = [344868, -103831, -358675, -237294, 480689, 508980, 289291, 820799, 339477, 213343, -6954, -241572, -379867, -17208, 398870, 335674, -300263, 104101, 687458, 178575, 217100, 275547, 89358, 2027, -305466, 58521, -379630, -264127, -230732, -207335, -201486, 120218, 519030, 423094, -26316, -526004, 142055, 276963, 678705, 38506, 37000, -191003, -271938, -376769, 401020, 87162, -490065, -152711, 285165, -15122, 26593, 516785, 85609, 149265, -405985, -214072, -422049, -435521, -97689, 70354, -234328, -508799, -101315, -207760, -83225, 143886, -80688, -791905, -551504, -296738, -327674, -734646, -221307, -303541, -889735, 218775, 96383, -174351, 419280, 79614, -505270, -105723]
11400a05723Q1129K55028o42659N54295j92050p7117o9802J47978o51781N98557
11390a02145R37060q39696k4977L09855k5249L8408l3962n00409j33456j72293
11380e46864O87019n73224O700p53090Q68830Q27898l14837j09666K7777K45483
11370C66026k60081l95237L01030K04035j77296Q2149l52942P26087l73937l8561
11360H1273L91438m53737K44836J45576j91761n7523j93462J47902o7112k01432
11350a54002M48708k52607j096509M86647N78710k46697J33271Q27986N44870
11341A270377n72849m94101P61345K65930k34563r290O6684m21654P394j17844
11331E21429n70629n89372L69412M04871K22024K09501j59406k69171K02114j99958
$$ y = [-105723, -24594, 230434, -412225, 142070, -49980, -127097, -196899, -48921, -700702, -102145, 834915, -4781, -29758, 280097, 254848, 293256, 259294, -241115, -374571, -546864, 140155, -433069, -426369, -1179459, -310629, 517269, 202432, 92766, 120543, 366026, 105945, -289292, 11738, 215773, 38477, 120626, -232316, 493771, 119834, 81273, 472711, 18974, 263810, 409386, 217625, 160102, -33360, 114542, 47430, -154002, 294706, 42099, -1054410, -567763, 10947, -235750, -102479, 725507, 1270377, 697528, 203427, 964772, 1230702, 996139, 986849, 1053533, 631879, 639273, 521429, -49200, -638572, -269160, 135711, 357735, 567236, 407830, 138659, 340773, 140815]
11321A40815j54522M08899m04723L49121N19371n42190L86625P13354m18899N5692
11311A053543J08879o14473K87408m754j99599q851k72894m5620J7532J041148
11301A362319p13077o50545M83666j68222q865J85593L0562j52683l99943J2135
11291a9060J01187O33013q9162l00512k3502O6629n18125K25031M07062j22953
11281C59608n50536l34231L14749M30810Q6866k65482k35328K69910K41703N726
11271C23795n45714j92593M40577n55377L00263P38496J0930n47368K39315Q38797
11261A051121o82721J5714p2321n15012q2769m16520K51240M79346K2771o2570
11251a1721r5736n09037L516N00769r2178P28542m72866O49563P12550j67645
$$ y = [140815, -13707, 395192, -9531, 339590, 858961, 316771, 703396, 1416750, 997851, 1053543, 1162422, 547949, 835357, 830603, 631004, 622153, 349259, 303639, 321171, 1362319, 649242, -1303, 482363, 314141, 305276, 490869, 521431, 368748, -31195, -19060, 82127, 715140, 625978, 325466, 301964, 368593, -149532, 75499, 482561, 359608, -190928, -525159, -210410, 220400, 307266, 41784, -193544, 76366, 318069, 323795, -221919, -414512, 26065, -529312, -229049, 509447, 520377, -26991, 212324, 1051121, 368400, 384114, 311793, -203219, -285988, -702508, -451268, 28078, 50849, -11721, -107457, -616494, -612978, -112209, -204387, 524155, 51289, 700852, 1413402, 1245757]
11241A245757q4773q28871m29828o5456L09807J23299K41804J2099Q9998r3391
11231E20445m0461j51188O4612P3414J48078L66427m27141m68268j7978j39011
11221g1071L936L0832j28497j0204M25282l75338K74641o547l9449L52921o9992
11210C86514j62627J04834m97405L08377m65258j2658M66751k6031o61089P31229
11200A72637Q48630p65879k64682K90816J47774J16533j60797L13853J00719K8418
11190H28022m58723m2605J41091K9275J58384n97448k45892O12901j71190o48433
11180c94618O43761K62143p4266n7005L19120Q1887q36410k89840R56705J98914
11170H10391r5004R5766j52515j47517P39500m39703p74897j9581M45453j42348
$$ y = [1245757, 1160984, 332113, -97715, -163171, 146636, 269935, 511739, 523838, 613836, 520445, 479984, 328796, 393408, 466822, 614900, 981327, 554186, 85918, 67940, -71071, -67135, -36303, -164800, -175004, 250278, -125060, 149581, 143034, 103585, 456506, 386514, 223887, 328721, -168684, 139693, -325565, -338223, 128528, 102497, -558592, 172637, 1021267, 255388, -9294, 281522, 429296, 545829, 385032, 698885, 799604, 828022, 369299, 326694, 467785, 497060, 655444, 57996, -187896, 425005, 253815, -394618, 249143, 511286, 437020, 380015, 699135, 781022, -55388, -345228, 611477, 810391, 715387, 811153, 658638, 511121, 1250621, 810918, 36021, 16440, 461893, 319545]
11160C19545j77378N1135o95119P1612Q25090L033J69014m5983J17562m60317
11150A78194m4806l19892k90964J36039L05405K24539O67941j30762k85275n1823
11140C88596j24016j98315k42758L37220J35757J82314R8468J81135r0890j96063
11130D71448j98980j77971k0722L54338K02385j75992j66560m33976N56707j58038
11120B52639n70751N13609J75581j1957L37410O52887m1977j89175l6881j31880
11110I49505l05497O0981n7003M36843m86843j31708p261K45096p3817N02525
11100A132821k59901j04115P63424M83362M16429J20705n92844j93302L78844
11091B145423N16139M96516m17058l41996p25392J2465K59167p59341r76218N12471
$$ y = [319545, 142167, 193302, -501817, -430205, 394885, 397918, 566932, 520949, 638511, 178194, 133388, -186504, -477468, -341429, -36024, 188515, 856456, 725694, 440419, 388596, 264580, 66265, -176493, 160727, 296484, 478798, 577266, 758401, 667511, 471448, 272468, 94497, 73775, 428113, 630498, 454506, 287946, -146030, 410677, 252639, -318112, 195497, 371078, 359121, 696531, 1349418, 1307441, 1118266, 1081385, 949505, 644008, 704989, 647986, 1084829, 597986, 466278, 459017, 704113, 630296, 1132821, 872920, 768805, 1532229, 2015591, 2432020, 2552725, 1959881, 1766579, 2145423, 2661562, 3158078, 2741020, 2399024, 1673632, 1686097, 1945264, 1185923, 209705, 722176]
11081G22176K50033o24440n2483J7021O10439L21537k95332k47110l69667k27633
11071A04541N50975q5748r0429L14060P79920l76667n92359N12657n2657m65726
11061E98567l21077j14730j28750K23583k63482l6216K33971k05488j57743L67823
11051A96458q44205K20367J09741M29456j37129l89680R66869j17180l38086J08196
11041B04807k20476L16600k62354J86237K88516P4365m08691M81628L49792p25254
11031B85170o05392J70866K2301K72234K22832r06297M0897l04650J90292J36626
11021d75121K2301M87721l88292N05916K09672l24510r4218M16836k94554m64659
11011c98908N45335j34562o47819K22570J55083q3872L33587K36790M4227p57073
$$ y = [722176, 972209, 347769, 295286, 312307, 922746, 1244283, 948951, 701841, 332174, 104541, 655516, 569768, 479339, 793399, 1573319, 1196652, 604293, 1116950, 1064293, 598567, 277490, 162760, 34010, 257593, -5889, -42105, 191866, -13622, -171365, 196458, -647747, -427380, -317639, 111817, -25312, -414992, 551877, 434697, 96611, 204807, -15669, 300931, 38577, 224814, 513330, 587695, 179004, 660632, 1010424, 285170, -320222, -149356, -127055, 145179, 368011, -538286, -497389, -802039, -611747, -475121, -452820, 34901, -353391, 152525, 362197, 37687, -56531, 360305, 65751, -398908, 146427, 11865, -635954, -413384, -258301, -342173, -8586, 228204, 272431, -484642]
11001d84642m1055K71767K69021k60730K12779L71685j46437k62212k21292l16150
10991f07266k09307K95643P57215k84899K8122K76770M18148o99490l90412J31074
10981b84402m51623N25057K93961k74734P2825j66067P58374l24347k28060j6840
10971i5856J71088o41296N00942P36279p8239k56564o07310J03719J09575J52699
10961I5037K85932K94385p7209j34440k46855J51546j63568J17954n14695K68349
10951G6436m71664k80174L13012L22829J54948k99836O7114R1406k00223K71252
10941D5100J71121j43245n07059K64304L76442n68396J71429j08696L76124J47259
10931B24383K04113k33657q10620K74448j29117n44729O9488P13889L60064L24363
$$ y = [-484642, -525697, -253930, 15091, -245639, -32860, 338825, 192388, -69824, -291116, -607266, -816573, -520930, 236285, -48614, -20492, 256278, 674426, -25064, -415476, -284402, -736025, -210968, 82993, -191741, -118916, -284983, 473391, 149044, -79016, -95856, 75232, -566064, -65122, 671157, 592918, 336354, -270956, -167237, -57662, 95037, 380969, 675354, 598145, 463705, 216850, 368396, 204828, 322782, -191913, 76436, -395228, -675402, -362390, -39561, 115387, -184449, -117335, -25929, -226152, 45100, 216221, 72976, -434083, -169779, 206663, -361733, -190304, -299000, 77124, 224383, 428496, 194839, -615781, -341333, -470450, -1015179, -945691, -231802, 128262, 452625]
10921D52625J85563o88719m76220M92664L5317n1729K96448J39327l70737m78703
10911d64164l00450R77392M40009R0359o3210o26843M08451m72561P07036k3928
10901F72091n36795J55307K1786k57136m07919L35567n50346m9071n6235M54814
10891b17937M50996L60632K31567k01108l90858n8796j84288j28826K80197N8523
10881B00102j15170J74382Q7995O1744R0164J78224m31665k95586J18568M50537
10871E19295J84170k04773k51202j38974k70666J09185J5077J98155L93024M59132
10861A012423o7475m84562N31128j079414r47208Q70011L83464k44742K35422
10852B09047J83606j56343J50735o09290l70054N02278Q9984J37152j026076M78797
$$ y = [452625, 638188, -50531, -526751, -34087, 1230, -50499, 245949, 385276, 14539, -464164, -764614, 212778, 652787, 743146, 679936, 53093, 461544, -11017, 696019, 672091, 135296, 290603, 312389, 55253, -352666, -17099, -567445, -616516, -672751, -217937, 233059, 593691, 825258, 624150, 233292, 174496, -9792, -138618, 141579, 200102, 84932, 259314, 347309, 409053, 499217, 677441, 245776, -49810, 68758, 519295, 703465, 498692, 247490, 108516, -162150, -52965, -37888, 160267, 553291, 1012423, 944948, 460386, 991514, -87900, -1035108, -165097, 218367, -26375, 209047, 392653, 236310, 387045, -222245, -592299, -90021, -37, 137115, -888961, -410164]
10842d10164L84352P46511j31390P9407K41039l06967L5582l26137J75211K20312
10832G07756m82871k23330J21154l04443P5041L3886j90572K37157L37720l15474
10822c976N56536k95590l27100m27084K9684J05097j66199N86703m76595L29109
10812h9415M07164l32979K24875k92645l90332O33495j88839l46384L99638k53107
10802b28529l73484K27403M49727K56418l61530N395k17216O89848n20284l34855
10792d07107k7790N13131k55985J357L71835r54128L26013K78179J37517l66141
10782c83119M82024L4652L3850K65595J33646l73167q2581Q7928l59914l66418
10772e27504K53812l55374K75056R22806J89103J9045k30610p81819K53409Q44320
$$ y = [-410164, -25812, 720699, 589309, 668716, 909755, 602788, 638370, 312233, 487444, 707756, 224885, 1555, 122709, -181734, -106693, -72807, -263379, -26222, 311498, -3976, 552560, 256970, -70130, -497214, -467530, -362433, -528632, 58071, -418524, -89415, 317749, -15230, 209645, -83000, -473332, 160163, -28676, -375060, 24578, -228529, -602013, -374610, 75117, 331535, -29995, -24600, -241816, 448032, -72252, -407107, -434897, 78234, -177751, -176394, 195441, -758687, -432674, -154495, -16978, -383119, 98905, 133557, 167407, 433002, 566648, 193481, 110900, 198828, -161086, -527504, -273692, -629066, -354010, 568796, 757899, 776944, 546334, -235485, 17924, 862244]
10762H62244n43032l44262k74741j12092R0755N03815N72491p73687k3427L71882
10752C29946k20703J66304m18146n93961j06043K98453n9130N9739K83003M91805
10742B31267k78214l43080Q34007J67670l44190o51740O7322J97485K43953K53672
10732C78152K26363k74430N7954J73845J27287k89227n63935l56191N23293k81889
10722b78778k05388O62481k79349N41887N50974k63713m32137r6354n07456L18203
10712A0370L2752M2492m7243n17264j45869L11688j47171O8950K57350k0315J26353
10701b7907o61887L54718R66077J36931K09217j09561n66848k23660O6861m97424
10691c53483J09019K9252J93871J91579L5645K13436N7219l78236j82360J85600
$$ y = [862244, 319212, -25050, -299791, -411883, -321128, 182687, 755178, -18509, -41936, 329946, 109243, 275547, -142599, -736560, -842603, -544150, -603280, -543541, -260538, 231267, -46947, -390027, 443980, 611650, 267460, -384280, -316958, -119473, 124480, 378152, 604515, 330085, 388039, 561884, 689171, 399944, -163991, -520182, 3111, -278778, -484166, 178315, -101034, 440853, 991827, 728114, 295977, 199623, -307833, 10370, 43122, 85614, 38371, -478893, -624762, -313074, -460245, -391295, -133945, -154260, -27907, -689794, -335076, 631001, 767932, 977149, 867588, 300740, 77080, 143941, -353483, -244464, -215212, -21341, 170238, 205883, 419319, 476538, 98302, -84058, 101542]
10681A01542m45715J78843J46319m64967m57350L61730J33358O9259M07438n67644
10671e37187J03892j484R5499j6297o46788L57094k44560p6504J103151L62619
10661D99435j276o79570L14138L27034p31705K32306k78813K75193Q17212K17507
10651I91461o59256l6770o78114J80314j25469M07432J20131K14811L57328l70338
10641D01530J1941L79597m48536j21012K02397j95390P97832m90424q45266J07047
10631b00284J02615K47504J95180n07305k4983L97958J2692M35037p04299k05758
10621b51643M02551K92540k0154l11048M13116l45379J39878n66867J82188M1518
10611b3300o82440J34706K51184j39492M14667j71526n9463J89311J13282j023186
$$ y = [101542, -344173, -165330, -19011, -483978, -941328, -579598, -446240, -376981, 30457, -537187, -433295, -434779, -339280, -355577, -1002365, -645271, -889831, -966335, 136816, 499435, 498159, -181411, 132727, 459761, -271944, -39638, -318451, -43258, 773954, 991461, 332205, 295435, -382679, -202365, -327834, 79598, 199729, 414540, 771868, 401530, 413471, 793068, 344532, 223520, 425917, 230527, 1028359, 537935, -307331, -200284, -97669, 149835, 345015, -162290, -187273, 210685, 223377, 658414, -45885, -251643, 150908, 443448, 423294, 112246, 525362, 179983, 319861, -247006, -64818, -23300, -705740, -571034, -319850, -459342, -44675, -216201, -275664, -86353, 26929, -996257]
10601i96257N91844L10201l04336N57148L96107J26194k11002o50512M59666P0443
10591C49496j54724L861k27175Q7453l52101K80048R164J74460l1313J77005O24551
10580I40725j038790r7036Q6559k02150J45371J05395K3584J0062M12132j01482
10570B84370K90471l97853n73464n30869J85569L98652N9280P56139k02875p6838
10560A92582M44245k48966k0306j63420J65283k1910l28356K71558J51368m11405
10550C0673L44558P99093n11582R8948M49663l75174o18388J09232K19342l65468
10540A80897K81397K13481o92757K85988k69914l94310L03179K62334J04498m69325
10530a94532r3413j37506N28260R6317J64850m58959L7015J88755L44116r8871
$$ y = [-996257, -404413, -94212, -398548, 158600, 554707, 680901, 469899, -180613, 279053, 349496, 194772, 198633, -28542, 58911, -293190, -13142, -3978, 170482, 139169, 316174, 940725, -98065, -195101, -108542, -310692, -165321, -59926, -36342, -26280, 385852, 284370, 574841, 176988, -396476, -927345, -741776, -343124, -283844, 472295, 269420, 192582, 636827, 387861, 367555, 204135, 369418, 347508, 19152, 290710, 442078, 30673, 375231, 1174324, 662742, 761690, 1211353, 836179, 217791, 327023, 546365, 180897, 462294, 675775, -16982, 269006, -908, -395218, -92039, 170295, 274793, -194532, -287945, -425451, 102809, 199126, 363976, -94983, -57968, 130787, 474903, 376032]
10520C76032k02970n8239J67199l45912r7452N27575O3845k71668L93649o36541
10510h4482L34313L37295m40563k84581M8360M93748j52843m43832M31765j22556
10500A16624J92035j16319L60265M94761n37670m20638M28879p3185p33099k44374
10490e32721P50392L68820q22373k22539O78450r5169m21372K33515L50962k55414
10480C2551R418M96938Q5006k53810l65174L68984j35319N6684Q8316m343k22089
10469A57162O2124j45897J01200L3300M01034l62421j70144l33090L45101O84408
10459G72777k48897l53550K32690m12993j98354J16634J2576n8155j54205m24191
10449g15668M91736K50737j45984j96047l65977k91627P85394l77215O74734J52986
$$ y = [376032, 173062, 114823, 282022, -63890, -161342, 366233, 430078, 158410, 552059, -84482, 249831, 587126, 146563, -138018, -89658, 404090, 251247, -192585, 239180, 116624, 308659, 192340, 552605, 1047366, 509696, 89058, 517937, 444752, -288347, -532721, 217671, 586491, -235882, -458421, 220029, 124860, -296512, -62997, 287965, 32551, 41969, 538907, 623913, 370103, 4929, 373913, 238594, 295278, 383594, 379251, 157162, 219286, 73389, 174589, 207889, 608923, 246502, 76358, -256732, 88369, 772777, 523880, 170330, 403020, -9973, -208327, -91693, -79117, -137272, -291477, -715668, -223932, 26805, -119179, -315226, -681203, -972830, -187436, -564651, 110083, 263069]
10439B63069k07530l4486K85097l63555M00070j72124M980J38164j79732R87786
10429A121739m82859l30526r80414P01296N28699q0983M96045j75048m44506j77965
10419A75478q7273N64673l49858l0698l97034K90680K68078l66677P1275r7023
10409D1621L82683m4449j43898k35174L69524l89841R9353J53830j65696m23999
10399c56046M79877J197835j36793l28273m25213l41421j69582j26833R13355
10390G06906N42873q26264J74345N612K40189k66075O1803m26831q65694r77P27877
10379G3764j47518L2695L20182O6471o23047M15900j25542k39473J169798M7361
10369I90591o09637o675J26354j15368P42793J66178n12093l629n6742k1527l88911
$$ y = [263069, 55539, 21053, 306150, -57405, 342665, 170541, 175521, 313685, 133953, 1121739, 638880, 308354, -672060, 29236, 557935, 476952, 972997, 797949, 353443, 175478, 88205, 652878, 303020, 272322, -124712, 165968, 434046, 67369, 138644, 41621, 424304, 379855, 235957, 783, 370307, -19534, 79819, 233649, 67953, -356046, 123831, 1321666, 1184873, 856600, 431387, 89966, -79616, -206449, 706906, 1249779, 423515, 597860, 603472, 843661, 577586, 639389, 212558, -653136, -654113, 73764, -73754, -41059, 279123, 345594, -277453, 138447, 12905, -226568, 943230, 990591, 380954, 374279, 500633, 385265, 1128058, 1294236, 782143, 778514, 721772, 700245, 311334]
10358C11334m32924l17653J8366J54592K44965O25350J60020n72088L86267Q455
10348E86684L46101R8224O34985K69979q37508k85021J09874J48457Q2019m57580
10338F96214J57736J81544j8792K84967k63138k66336j09454J37252j96472p9789
10328E23732N70702p9014n42p3581k96587J76001m96270j68336J1662O91981k39647
10317F20101k22555J74548N87935l17268N10087n87840j13489M6261q28347M70078
10307C39511K51247Q4177l28373j19368j17615n55255K44851J36561L74324J91072
10297E01132j14724N6645K9275L06928q65350L63885K31961j66784n8449J39792
10287D24311K24076N6711M79191j059838L1218L55350l40360N22892l24699l92063
$$ y = [311334, -121590, -439243, -420877, -266285, -21320, 604030, 764050, 191962, 578229, 586684, 932785, 1031009, 1665994, 1935973, 1098465, 813444, 923318, 1071775, 1153794, 696214, 853950, 1035494, 1016702, 1301669, 1038531, 772195, 662741, 799993, 603521, 523732, 1094434, 1015420, 1014878, 941297, 644710, 820711, 324441, 156105, 167767, 859748, 620101, 397546, 572094, 1160029, 842761, 1352848, 765008, 651519, 697780, -130567, 339511, 590758, 674935, 346562, 227194, 109579, -445676, -200825, -64264, 310060, 501132, 386408, 443053, 472328, 779256, -86094, 277791, 509752, 342968, 284519, 424311, 648387, 705098, 1184289, 124451, 155669, 511019, 170659, 693551, 368852, -23211]
10277b3211O39570J54834J09768k97468m89084N24611J81683p9097r2879j6044
10267F12683n96523R6510R95363p94264O8448L6776k91087L29464K22923o12269
10257F8024Q7636n7916j81735M42082j61732p56119M3713J78804K53730Q9126
10247E613J18303L69036k38899O76422j9376j089491k32152L91515L84752L20787
10237F86510n00588j27162k0431O2466L22421L0522j26868O10115j36904p77412
10227B2669p188M94198K14239k0382K7915M23460o43942m94552k04215M05036
10217B17238O12506m48789n07811j79641K1181L58521r7490p7703L24582N13296
10207G35890M7246L88913n40277l78339K40424k78423K12244M51124n20228j68235
$$ y = [-23211, 616359, 771193, 880961, 583493, 94409, 619020, 800703, 721606, 628727, 612683, 16160, 112670, 1108033, 313769, 382217, 418993, 127906, 457370, 680293, 68024, 155660, 97744, -83991, 358091, 196359, -559760, -516047, -337243, -83513, 5613, 123916, 492952, 254053, 930475, 911099, -178392, -410544, -19029, 365723, 686510, 185922, 58760, 38329, 100795, 423216, 453738, 326870, 936985, 800081, 22669, 15481, 509679, 723918, 703536, 731451, 1154911, 510969, 16417, -187798, 217238, 829744, 380955, -126856, -306497, -285316, 73205, -24285, -101988, 222594, 735890, 783136, 1172049, 631772, 253433, 493857, 215434, 427678, 878802, 358574, 190339]
10197A90339K52607m48141M72560O6714m35275k70445J76628M15835Q2864p7350
10187D26336M24013q2483q2196K32314n02808l9520P02023o9331K93124q28919
10177D72553m98641L52721j63276O1145O2927K02144k29607K13727k65148J79262
10167C87807P4281n74708L44909P91862J35763J29594k35121r66993o4195L98368
10157D21567k3916l7231L55828k15583j61272k70122P63252J22584n08771J78193
10147F24529r455j51236J94804J52778K38840J68177m97853j11116Q8808J97478
10137H95754M12834k16147l9578k01899L77090l56387p26580M15162K78175n17201
10127C21223o07882K65736L71214L03687Q4915M7457j63817K02361m38628L29069
$$ y = [190339, 442946, -5195, 467365, 534079, 98804, -171641, 4987, 420822, 503686, 426336, 850349, 767866, 685670, 917984, 415176, 375656, 1077679, 1008348, 1301472, 472553, -26088, 326633, 163357, 224502, 287429, 489573, 259966, 473693, 208545, 387807, 462088, -112620, 232289, 1024151, 1159914, 1289508, 1054387, 87394, 23199, 421567, 397651, 360420, 716248, 500665, 339393, 69271, 832523, 955107, 446336, 624529, 615074, 463838, 658642, 811420, 1050260, 1218437, 720584, 609468, 698276, 895754, 1308588, 1092441, 1052863, 850964, 1228054, 871667, 145087, 560249, 838424, 321223, -286659, -20923, 350291, 653978, 738893, 786350, 622533, 824894, 386266, 715335]
10117G15335N01663J43673m37904n46619R8082j56762J73009L60465M03027m6655
10107A207314n70526j61992n54589K33899J83938m206L93440l07228j44295p0207
10097B05548q2183J82385L43030k97499r4602K01187l6620l02295J72908J88100
10087D79959l53344J95659O61517p35797r6554M57420j52320l07467L10154L39339
10077G98566O37123n09568l85558M17053j3949J78937l34245m60760k29624K60813
10067C58788M18203N73154p86202l86218M09914J63850l12248n01372L42987K44748
10057E25604m43818J99695M79974n05488m45800N31840J43959M33329q792j28408
10047G82095M15623J9689O5502J44073m95541k62845j13054m1760k4985j53381
$$ y = [715335, 1216998, 1360671, 922767, 376148, 474230, 317468, 490477, 850942, 1253969, 1207314, 636788, 474796, -79793, 154106, 338044, 333838, 727278, 420050, 275755, 205548, 123365, 305750, 648780, 351281, 256679, 457866, 421246, 118951, 291859, 479959, 126615, 322274, 983791, 247994, 151440, 608860, 456540, 149073, 459227, 798566, 1435689, 926121, 540563, 957616, 943667, 1122604, 788359, 327599, 97975, 358788, 776991, 1350145, 563943, 177725, 587639, 751489, 439241, -62131, 280856, 525604, 81786, 281481, 761455, 255967, -189833, 342007, 485966, 919295, 910503, 782095, 1197718, 1217407, 1282909, 1426982, 931441, 668596, 555542, 513782, 488797, 335416]
10037C35416J50197M81638j48561p47890j71754N1655R08172K70839m17820J67803
10027H79695K73305l66260K42781q9283o44974J6734J90021L23081p07225J52718
10017B70593L62609M73945j35650o29109k58019l5054P80310J27755p51896O01225
10007H06709L86191L09320o19518q98537L20414K96748J16289L90447k69202K9310
9997H68171J23824J06277M22898l77303o30885j00740L46497L8955J04836l33520
9987E69010K88943r7708J00423j93011k52517K20773M73155o15313l32532N07151
9977F68374N36591p0755J2228m8033l33020k29663J51565j34172L55825J01795
9967A010735J23385N40769r28329k40981K58988P90559k87892k96962M85990p99626
$$ y = [335416, 485613, 967251, 818690, 70800, -100954, -49299, 858873, 1129712, 711892, 879695, 1153000, 786740, 1029521, 940238, 295264, 311998, 502019, 825100, 117875, 270593, 633202, 1107147, 971497, 342388, 84369, 49315, 829625, 957380, 205484, 806709, 1192900, 1502220, 882702, -15835, 304579, 601327, 717616, 1108063, 838861, 868171, 991995, 1098272, 1521170, 1143867, 512982, 412242, 758739, 797694, 902530, 569010, 857953, 760245, 860668, 667657, 415140, 635913, 1109068, 493755, 161223, 668374, 1204965, 1134210, 1146438, 1098405, 765385, 535722, 687287, 553115, 908940, 1010735, 1134120, 1674889, 746560, 505579, 764567, 1555126, 1267234, 970272, 1456262, 656636]
9957F56636P74372N4036o08263n1133j57139K12837N85016o61992n94074P13700
9947I23996m63953J50340J25979k65113N47636l51510j52886k2992m2969O4736
9937E13264M94181M54682L31757l57593K991l73914p09235q8371M89191O45421
9927A402374k24825j77267o6323P88841L24375o77224k52570k27699M99820M62044
9917A851546q9854K32232p4295l05122l34309k39990J38186O05409j38899r0799
9907A554105l29584N84698q3712q2698M1491m20889O07312j03682l27850m24507
9897A014684o792N12450m50432J23733K86131R8364N96162J63159n90559L22351
9887B069251l10186K56145J6591K11340J90776m64444K65130M29617j5271N7303
$$ y = [656636, 1431008, 1485044, 876781, 825648, 668509, 881346, 1466362, 804370, 210296, 923996, 460043, 610383, 736362, 471249, 1018885, 667375, 514489, 491497, 448528, 513264, 1007445, 1462127, 1793884, 1436291, 1439282, 1065368, 356133, 267762, 756953, 1402374, 1177549, 1000282, 933959, 1722800, 2047175, 1369951, 1117381, 889682, 1389502, 1851546, 1761692, 1993924, 1919629, 1614507, 1280198, 1040208, 1178394, 1783803, 1644904, 1554105, 1224521, 1809219, 1725507, 1642809, 1684300, 1263411, 1870723, 1767041, 1439191, 1014684, 1007892, 1520342, 1069910, 1193643, 1479774, 1578138, 2174300, 2337459, 1746900, 2069251, 1759065, 2015210, 2031801, 2243141, 2433917, 1969473, 2234603, 2664220, 2648949, 2706252]
9877B706252o36821k98858K74960k53051K20961M36866k66149Q11559J27856n31920
9867B591655N52038m00361j5869K66420J53473m81704K75431J71043n33121L80728
9857B959733M83457l60821m94213N58527l03949j77356K78507k30302m90441K2388
9847B245530L04625P68356k62228m78434Q21335O03055l43817n81537j41659P4177
9837C009403m86979L89500J87199J60662K25597l46249N52767j80963j61112o70022
9827B679803k63107p3921N09664R7080n7918K0510j90521n27972j43587L17892
9817B367923M36133J11918J8276l05789J95384O70874k21932J90359M10043o79495
9807C193694L01265p3752l83022n44300j1494M42877l3072M17483K39922o20833
$$ y = [2706252, 2069431, 1770573, 2045533, 1792482, 2013443, 2450309, 2184160, 2995719, 3123575, 2591655, 3143693, 2743332, 2727463, 2993883, 3147356, 2665652, 2941083, 3112126, 2579005, 2959733, 3443190, 3082369, 2588156, 3146683, 2842734, 2665378, 2943885, 2713583, 2223142, 2245530, 2550155, 3318511, 3056283, 2577849, 3399184, 4002239, 3658422, 3076885, 2935226, 3009403, 2522424, 2911924, 3099123, 3259785, 3485382, 3139133, 3691900, 3510937, 3349825, 2679803, 2416696, 2342775, 2852439, 2949519, 2891601, 2912111, 2721590, 2193618, 2050031, 2367923, 2804056, 2915974, 2934250, 2628461, 2823845, 3494719, 3272787, 3463146, 3873189, 3193694, 3494959, 3421207, 3038185, 2493885, 2482391, 2925268, 2892196, 3309679, 3549601, 2928768]
9797B928768m39795k29573M32306J70289P66137j89025r20488j00502k03538N62455
9787B777034K75586L53211K7723j81452k9544j79045l8557o7227j23649K58054
9777C072134p3323J13777J22451o71118r0591P93023L80112k21596m73366j09806
9767B841697j97877K91230M05179l4272p39268O10530O07476k25681q69471K68978
9757B958521N26332K29848j25376o45687M72768K9697J89542m1971o87023l2683
9747B873968J09820q8948l28679l95978M89794J40776O743O365p8260J16219K85481
9736C137301k21603l67704K46979Q8300J97757n0352l22839M67439K35820J41795
9726C552893K53763R1184l49880j20160o2683J43907o53K99642j653O0941J75118
$$ y = [2928768, 2488973, 2259400, 2691706, 2861995, 3628132, 3439107, 2518619, 2418117, 2214579, 2777034, 3052620, 3405831, 3433554, 3252102, 3222558, 3043513, 3004956, 2937729, 2814080, 3072134, 2998811, 3112588, 3235039, 2563921, 2473330, 3266353, 3646465, 3424869, 2951503, 2841697, 2643820, 2935050, 3340229, 3305957, 2566689, 3177219, 3784695, 3559014, 2689543, 2958521, 3484853, 3714701, 3589325, 2943638, 3416406, 3446103, 3635645, 3593674, 2906651, 2873968, 2983788, 2894840, 2566161, 2170183, 2659977, 2800753, 2807496, 2813861, 2735601, 2851820, 3137301, 2915698, 2547994, 2794973, 2883273, 3081030, 3030678, 2707839, 3175278, 3411098, 3552893, 3806656, 3897840, 3547960, 3427800, 3365117, 3509024, 3508371, 3808013, 3806360, 3867301, 4042419]
9715D042419j97361k10686l51002J52907n2549Q5703j95400k28689L17180k66737
9705C095785K28803r1654K15832P5455p53J02908j56595M40461K56470k39534
9695C927178m68088K75219p34031K73234j30520N75957K96282k29052k45107L21658
9685C862730K05590L69060K97671K47018k91535J22668k15401j77388k64844p28297
9675C427272K94682M94648n25195L08524L19029J39768l10649N6043R6029l54030
9665C946121K83613m86515K72687q3056J68730l4159J48221J90007j29932L06795
9655D582512K14170o63266k77249k72840K40199j28777P1009O21514o47234o13817
9645C126221O79494N48258r1567j69746K01309n8244j19162O3370K11445j41364
$$ y = [4042419, 3845058, 3634372, 3283370, 3436277, 3383728, 3469431, 3274031, 3045342, 3362522, 3095785, 3324588, 3232934, 3448766, 3524221, 3523468, 3626376, 3469781, 3910242, 4166712, 3927178, 3459090, 3734309, 3000278, 3273512, 3142992, 3718949, 4015231, 3786179, 3541072, 3862730, 4068320, 4437380, 4735051, 4982069, 4690534, 4813202, 4597801, 4420413, 4155569, 3427272, 3721954, 4216602, 3691407, 3999931, 4318960, 4458728, 4148079, 4204122, 4300151, 3946121, 4229734, 3743219, 4015906, 3932850, 4101580, 4067421, 4215642, 4405649, 4275717, 4582512, 4796682, 4133416, 3856167, 3583327, 3823526, 3694749, 3765758, 4387272, 3740038, 3126221, 3805715, 4353973, 4262406, 4092660, 4293969, 4235725, 4116563, 4179933, 4391378, 4250014]
9635D250014j10603K54723J42085l58782l53300n38215R05669M38298J73758l46534
9625D457113Q1427M1514l11710M24894k50641L1688R30106L8013M6570j26603
9615E362371J95762k61188m39778L42536K22027l13129M75050n246n9751k8499
9605E490155N78680m37217J0698Q24461k65218O96153J92107l8569L8094m8459
9595G040885j58414r7578J10302L92550K46929N59335r05756j45719m29196o45836
9585E967502j55294J33605o4021l7191j43709J57922K26555j599l51924L80798
9575F112644P4486k0925j3354j50370P1089l47817l7411N6941K42348j92631K04077
9564E999077L66266l8984k21099j78918L71454J24478J0454K42592M04329J86261
$$ y = [4250014, 4139411, 4394134, 4536219, 4177437, 3824137, 3285922, 4191591, 4629889, 4803647, 4457113, 4538540, 4580054, 4268344, 4693238, 4442597, 4474285, 5404391, 5442404, 5488974, 5362371, 5558133, 5296945, 4857167, 5199703, 5421730, 5108601, 5583651, 5578405, 5518654, 5490155, 6068835, 5631618, 5642316, 6466777, 6201559, 6897712, 7089819, 7051250, 7089344, 7040885, 6882471, 6784893, 6895195, 7287745, 7534674, 8094009, 7188253, 7042534, 6613338, 5967502, 5812208, 5945813, 5881792, 5844601, 5700892, 5858814, 6085369, 6083770, 5731846, 6112644, 6187130, 6166205, 6152851, 6002481, 6073570, 5725753, 5688342, 5745283, 5987631, 5795000, 5999077, 6365343, 6326359, 6105260, 5926342, 6297796, 6422274, 6432728, 6675320, 7079649, 7265910]
9554G265910O28529J87835L76629j82382o74016o54940j150664L97494P89203
9545F983598j53742L1448l24746m30224k83722K98933L74695K3813Q4572Q4728
9535F689353l90168l59483L74654L12969k36667J64051J27279p6305J4814o49276
9525E971221N79585K14305m57734R4422Q5601K39113l68671j92526K34011L22146
9515F721473m74106l34110k6203K78840j3720Q1210m3552J33265M4181j32758
9505F234520Q3295j17009j22321m42885M85387r6402q4174n0210K7284L72067
9495F289552K93778j58306k2896J24773j41426k00071L51677o583J80545M11749
9485G122792J50550J09470q7149l23277p2322M99973J0380m25576K40172j79630
$$ y = [7265910, 7894439, 8082274, 8458903, 8276521, 7602505, 6947565, 5796901, 6194395, 6983598, 6829856, 6861304, 6536558, 6106334, 5822612, 6121545, 6496240, 6520053, 6604625, 6689353, 6299185, 5939702, 6314356, 6627325, 6390658, 6554709, 6681988, 6605683, 6620497, 5971221, 6550806, 6765111, 6307377, 6401799, 6487400, 6726513, 6357842, 6165316, 6399327, 6721473, 6247367, 5913257, 5887054, 6165894, 6152174, 6233384, 6189832, 6323097, 6367278, 6234520, 6317815, 6200806, 6078485, 5635600, 6120987, 6024585, 5940411, 5890201, 5917485, 6289552, 6583330, 6425024, 6402128, 6526901, 6385475, 6185404, 6537081, 6530498, 6711043, 7122792, 7273342, 7382812, 7295663, 6972386, 6900064, 7400037, 7410417, 6984841, 7225013, 7045383]
9475G045383j92522N9407L27613p9054j84945K50067N945J05670n7167j36971
9465G143426l78122k76689J60035q0612J70842j66704J62361j53476n1206J29170
9455F659025K37242O27687l33383q62577P4049J14845L23887K14612j38678m61701
9445F455008m03020k57162L17151K59372M8707N04136k01331K68683l4654J3391
9435F970281N95646J72590l0038P6385O668j46069P00368j60793N9000K19421
9425H463459m9217j83343m09730j74105m99558K45737N56136j00742n71961j72616
9415G104060o2041J0800q4843J73893k00461M2436M9621l92789l07340K62563
9405F595899J51501J95042M96225J08278l15072l1758L8420P08051K37527l60517
$$ y = [7045383, 6852861, 6912268, 7239881, 7160827, 6975882, 7225949, 7231894, 7337564, 7280397, 7143426, 6765304, 6488615, 6648650, 6568038, 6738880, 6572176, 6734537, 6581061, 6529855, 6659025, 6896267, 7523954, 7190571, 6327994, 6402043, 6516888, 6840775, 7055387, 6916709, 6455008, 6051988, 5794826, 6111977, 6371349, 6420056, 6924192, 6722861, 6991544, 6956890, 6970281, 7565927, 7738517, 7708479, 7784864, 7791532, 7645463, 8345831, 8185038, 8244038, 8463459, 8414242, 8230899, 7821169, 7647064, 7147506, 7393243, 7949379, 7848637, 7276676, 7104060, 7042019, 7052819, 6967976, 7141869, 6941408, 6983844, 7033465, 6640676, 6333336, 6595899, 6747400, 6942442, 7438667, 7546945, 7231873, 7200115, 7238535, 7946586, 8184113, 7823596]
9395G823596k66077j329229J1231M32624n44956J93311J52795P2684o56915P00658
9385F589722j27356r7696K23403K71508k2903L83805K47586n10844k52185O27887
9375G332927o72244m4027M41282p321R87757n48826n87262l32408M80043N17399
9365G567320L98860K86377L19739k40204l42466M5113J09792M66691O56365r01681
9355H365906j25302k19095n06862m1026j93238J86949J78986m24209k37371M09677
9345G394415k33022j74478P6464k3990l86271K971j11265K04650M14016N41708
9335G705198k3038L92691k46954o61886L78911K47869P31514l49971Q78201K49007
9325I301542m67553j66495k53492j80970J72455j57007o8232p3490k10855N54444
$$ y = [7823596, 7557519, 6228290, 6239521, 6672145, 6127189, 6320500, 6473295, 6545979, 5889064, 6589722, 6462366, 6364670, 6588073, 6859581, 6836678, 7220483, 7468069, 6957225, 6705040, 7332927, 6660683, 6616656, 7057938, 7050617, 8038374, 7489548, 6902286, 6569878, 7049921, 7567320, 7966180, 8252557, 8572296, 8332092, 7989626, 8034739, 8144531, 8611222, 9267587, 8365906, 8240604, 8021509, 7514647, 7473621, 7280383, 7467332, 7646318, 7222109, 6984738, 7394415, 7161393, 6986915, 7063379, 7039389, 6653118, 6656089, 6544824, 6749474, 7163490, 7705198, 7682160, 8074851, 7827897, 7166011, 7544922, 7792791, 8524305, 8174334, 9052535, 9301542, 8833989, 8667494, 8414002, 8233032, 8405487, 8248480, 8180248, 8106758, 7895903, 8450347]
9315H450347q64411r0929J02562J50480J46865N060k4762O91376k25450J36081
9305H477219L61733m86439k2611N81058j76160M76392N95621m9431k83763k93253
9295I180366M50314k88436r4841L33803k1698j1981O39193L206m88239j77390
9285I524297P1970n24121P03259J80139L12440p8462P89293J21275J58930j24820
9275A1134200K2819L63079J05349l08895Q06470m12194m06851R43568J95655j91882
9265A2251318n34504M06877J33477L85750J47276j1243m37518L38742M86976k07407
9255A2959744K219O09517l82015l04177J340018J23692o43212M91138J14019M57914
9245A4768857N62724l10974J72973J28831m52101K82345J177966N26971q07539
$$ y = [8450347, 7585936, 7495007, 7597569, 7748049, 7894914, 7899974, 7875212, 8566588, 8341138, 8477219, 8838952, 8352513, 8329902, 8910960, 8734800, 9211192, 9806813, 9757382, 9473619, 9180366, 9630680, 9342244, 9247403, 9581206, 9559508, 9547527, 10186720, 10189926, 9701687, 9524297, 9596267, 9072146, 9775405, 9955544, 10267984, 10189522, 10978815, 11100090, 11259020, 11134200, 11157019, 11520098, 11625447, 11316552, 12123022, 11710828, 11303977, 12247545, 12443200, 12251318, 11716814, 12123691, 12257168, 12642918, 12790194, 12778951, 12341433, 12680175, 13167151, 12959744, 12961963, 13571480, 13189465, 12885288, 14225306, 14348998, 13705786, 14196924, 14310943, 14768857, 15331581, 15020607, 15193580, 15322411, 14870310, 15152655, 16330621, 16857592, 16050053]
9236A6050053n7469j54002P2505P80367M89423P12501L02230m19027q1868L87298
9226A8082011p3733P9864M21194J55742m69028j01313P62391L95948K35242j57191
9216A9331127m01461l42202J40066L63326N05761K48349L91388L71420N26506
9207B1134280L4724K90527N27626L71109R756R1837J705621J246807J49369N83330
9197B6144986R71003J414625J861504J661372K522389L113212L518199L361805
9189D4569095K605380L428972K903145J285702N70381J430405K85360n1388o15920
9180E6411132r94680j253109j431444k564335l093231k853421k412033k893433
9172C8915446k367097j676910j425232j368564r73501K11706O04859L23600P88231
$$ y = [16050053, 15992584, 15838582, 15911087, 16691454, 17180877, 17893378, 18195608, 17776581, 17694713, 18082011, 18008278, 18088142, 18509336, 18665078, 18196050, 18094737, 18857128, 19253076, 19488318, 19331127, 18929666, 18587464, 18727530, 19090856, 19596617, 19844966, 20236354, 20607774, 21134280, 21169004, 21459531, 21987157, 22358266, 22368022, 22459859, 24165480, 25412287, 25561656, 26144986, 27115989, 28530614, 30392118, 32053490, 34575879, 37689091, 41207290, 44569095, 47174475, 50603447, 53506592, 54792294, 55362675, 56793080, 57078440, 57027052, 56411132, 55416452, 54163343, 52731899, 50167564, 47074333, 44220912, 41808879, 38915446, 36548349, 34871439, 33446207, 32077643, 31104142, 31315848, 31920707, 32244307, 33032538]
9163C3032538K263402J967175K723440K460305K416015R29736j14085j712117
9155D3966409l115122k784472k621810l072307j955815j720046l71830r00896
9147B7424111n26106l26280m53990m07999k80635l26177J08891J34588P6432M6258
9137B5469093L54940Q36453K70749J035909J88527P05022Q10328J871955K202896
9128C3745872J630422K669692L996674M214202L493068L487727J447621j660911
9120E3024367k574937l619709m086796l520217l180158k341180j337669o13805
9112C1749896j348447o00873M9064q63942o34787L87398N7458l11399P57350P53024
9102B9994742k84228k15794P41713L48519Q43028N88265J222902m5711r7031N59626
$$ y = [33032538, 35295940, 37263115, 39986555, 42446860, 44862875, 45792611, 45678526, 43966409, 40851287, 38066815, 35445005, 32372698, 30416883, 28696837, 28325007, 27424111, 26898005, 26571725, 26117735, 25709736, 25429101, 25102924, 25211815, 25346403, 25422835, 25469093, 25824033, 26660486, 26931235, 27967144, 28155671, 28860693, 29671021, 31542976, 33745872, 35376294, 38045986, 42042660, 46256862, 49749930, 53237657, 54685278, 53024367, 50449430, 46829721, 42742925, 39222708, 36042550, 33701370, 32363701, 31749896, 30401449, 29800576, 29849640, 28985698, 28350911, 28738309, 28795767, 28484368, 29241718, 29994742, 29710514, 29494720, 30236433, 30584952, 31427980, 32016245, 33239147, 33193436, 33096405, 33656031]
9092C3656031L3871k87180N58378P78618m14377n64294j55059m2046L53111q5874
9082C3831179R92528K19174p24881K3097n83777q9024m31805m00596l72190j118879
9072C1344826n54824M25063m02431m560o6541o41412n10628m41342l2243J58972
9062B9274880K9929j93123j95041Q13723J259919K20035l7034R87371M11966N78703
9052C3151328M97001L78954Q20711j25625m70505n4251j00500N08006J32711L03946
9042C5041776K38918l38073k24576l91518J45506j59866K36794j11266j040647
9033C3397048p12557j011926k27412O8351P52553j77306l44956k20678J02412
9024C1625529l10726m2154p1772q49894Q34883J45734n46179o36972L5332N57187
$$ y = [33656031, 33689902, 33402722, 33961100, 34739718, 34325341, 33761047, 33605988, 33563942, 33917053, 33831179, 34823707, 35042881, 34318000, 34341097, 33757320, 33668296, 33236491, 32835895, 32463705, 31344826, 30790002, 31215065, 30812634, 30808074, 30741533, 30100121, 29589493, 29148151, 29115908, 29274880, 29304809, 29111686, 28916645, 29730368, 30990287, 31210322, 31173288, 32160659, 32572625, 33151328, 33648329, 34027283, 34847994, 34722369, 34251864, 34197613, 34097113, 34605119, 34737830, 35041776, 35280694, 34942621, 34718045, 34326527, 34472033, 34312167, 34548961, 34437695, 33397048, 32684491, 31672565, 31445153, 31513504, 32266057, 32088751, 31743795, 31523117, 31625529, 31314803, 31272649, 31200877, 30350983, 31185866, 31331600, 30785421, 30148449, 30183781, 30740968]
9014C0740968J91024J85899M78398L23631l361n0637J05086J28426Q4368O18968
9004C2802770K80968P4437J69489K05866m17496M78710j06224l77869K75972K58973
8994C3645596k71409P9412K78647R0310K33432K24690O12198O65063j47257J59030
8984C5569712P75080j27727J001619J102836j75084K53193R57420R41341J05849
8975D0404239J557196J267648L3751J206098J183261J006498P63274J440745J280542
8966E0143252L26927M29649n64016k28120P90412q4228q0263K96326Q91753J92655
8956E2114347P55524J272525L36421M5842L78100N74348J041146J691072J275908
8947E9485233O35368J801915J386432J129727J970021K919061K669654L164998
$$ y = [30740968, 30931992, 31117891, 31596289, 31919920, 31916559, 31865922, 31971008, 32099434, 32183802, 32802770, 33083738, 33158175, 33327664, 33533530, 33116034, 33594744, 33488520, 33110651, 33386623, 33645596, 33374187, 33453599, 33732246, 33822556, 34055988, 34280678, 34892876, 35557939, 35410682, 35569712, 36344792, 36217065, 37218684, 38321520, 38146436, 38399629, 39357049, 40298390, 40404239, 41961435, 43229083, 43262834, 44468932, 45652193, 46658691, 47421965, 48862710, 50143252, 50470179, 50899828, 50335812, 50107692, 50898104, 50813876, 50733613, 51029939, 51921692, 52114347, 52869871, 54142396, 54478817, 54524659, 54902759, 55477107, 56518253, 58209325, 59485233, 60120601, 61922516, 63308948, 64438675, 66408696, 69327757, 71997411, 75162409]
8939G5162409L263154M568529M650995N526295P398922Q883381J0161276J5337225
8931A34952186J9040527K3691266L1080206M3797866N7841244N5334833K195930
8924C67934058n1041680o2661291n1693202l2489224k1181222j5531354j1909293
8917A21426792p976160o287091n240538m855932m214071l371386l428387k794435
8909H3258792j521115k310017k362532l508244l672770l893834k381008k788786
8901F0820486j036944j001838q07727j008911k92042l05879n97874r04101j387729
8892E3477441l20773L99523N2410O30620L65623J048693J131104J689552J856175
8883F0330368J108930Q50016J168424N70879m33051m46208o30710n66943p99035
$$ y = [75162409, 78425563, 82994092, 87645087, 93171382, 100570304, 109453685, 119614961, 134952186, 153992713, 177683979, 208764185, 252562051, 310403295, 365738128, 367934058, 316892378, 254231087, 202537885, 170048661, 148867439, 133336085, 121426792, 113450632, 107163541, 101923003, 97067071, 92853000, 89481614, 86053227, 83258792, 81737677, 79427660, 77065128, 73556884, 69884114, 65990280, 63609272, 60820486, 59783542, 58781704, 57973977, 56965066, 56673024, 56367145, 55769271, 54865170, 53477441, 53156668, 53556191, 53608601, 54239221, 54604844, 55653537, 56784641, 58474193, 60330368, 61439298, 62289314, 63457738, 64028617, 63595566, 63149358, 62518648, 61951705, 61152670]
8874F1152670j139318o96555j246498j677008j646940j959028j593139j170085
8866E0024099j174609M76M91142L25731j029590j283755n31885o78304j73622
8857D5969683K37643l29705m03388k95909M46390P77136N51719J16002q4360j70519
8847D6814692j0723L1528l2637M86570Q28768K00133K69715M19975l10483Q7704
8837D8785242n94586J76561N18823K91531R61937J016623J004559J559855J424849
8828E5145394J080600j89740m21861p90373n66511j59689N80040Q45108J4279
8819E5537247M65202J238787R57759j46922j327932k140139j507953j372310o91232
8810E1012507K05858O987j68338l06759k07255j191497j9410n13898Q9240k60924
$$ y = [61152670, 60013352, 59316797, 58070299, 56393291, 54746351, 52787323, 51194184, 50024099, 48849490, 48849966, 49341108, 49666839, 48637249, 47353494, 46821609, 46143305, 45969683, 46207326, 45877621, 45474233, 45178324, 45624714, 46401850, 46953569, 47069571, 46985211, 46814692, 46803969, 46835497, 46802860, 47289430, 48118198, 48318331, 48588046, 49008021, 48697538, 48785242, 48190656, 48367217, 48886040, 49177571, 50139508, 51156131, 52160690, 53720545, 55145394, 56225994, 56036254, 55614393, 54824020, 54257509, 54097820, 54677860, 55522968, 55537247, 56002449, 57241236, 58198995, 58052073, 56724141, 54584002, 53076049, 51703739, 51012507, 51218365, 51225352, 51057014, 50750255, 50543000, 49351503, 49332093, 48818195, 48907435, 48646511]
8800D8646511P0351Q68135O73583J506644P21631O02870O73830O55655J598421
8791E6017631N36147k62927p38482j222920j391512l66609K36029K67758l9005
8782E3036110J12631J127075Q38264O14789j002875j761161j576078j512387r08942
8773D8967426j174271l40218p24866r32155m94353m10233k12283k88422j49929
8764D4240696n64708l18728m04651k04944j52288k64403p2945L51181R88007L12805
8754D3910022L18672j01228J26979M34904K52587m9846m65936J22183k01331j79102
8744D4167904L63267K00527r4149j75102m71058j33555O63090q2789j21744m55385
8734D3861006o04156O5083j147684q17396q04177n23831n24117m88214q3007k77347
$$ y = [48646511, 48716862, 49584997, 50258580, 51765224, 52486855, 53089725, 53763555, 54419210, 56017631, 56553778, 56290851, 55552369, 54329449, 52937937, 52571328, 52807357, 53075115, 53036110, 53148741, 54275816, 55114080, 55728869, 54725994, 52964833, 51388755, 49876368, 48967426, 47793155, 47452937, 46728071, 45795916, 45301563, 44891330, 44679047, 44390625, 44240696, 43675988, 43357260, 42952609, 42747665, 42595377, 42330974, 42258029, 42609210, 43597217, 43910022, 44228694, 44127466, 44254445, 44689349, 44941936, 44892090, 44426154, 44548337, 44347006, 44167904, 44531171, 44731698, 44637549, 44462447, 43991389, 43857834, 44520924, 44438135, 44316391, 43861006, 43256850, 43321933, 42174249, 41356853, 40552676, 40028845, 39504728, 39016514, 38933507, 38656160]
8724C8656160K0294k26169R4565J006l04226N45002q39810q7061O13041k86293
8714C8186509K26400N50952k85962L21689J05364M28526K51304j83417p06584
8705C8894781n19331N14987L65778L81195K10364n73136J90389P30156N65858
8696D0761041J462082J162397J42177n379J7925m93148l3051Q26662R11024M85023
8686D5236753O85891J104173J252925J913806K062318J886521J162414R19556
8678E6224357O23702l58363j465014j010497p97179k085327r80407m32550l88826
8669D9329896p09774J78590O52069J150063M13803r713j06495l62453P09549J079981
8659E2325516J779408J064526k48993o49482j279500j240415o76746p1920M48682
$$ y = [38656160, 38676454, 38450285, 38544850, 38545856, 38241630, 38786632, 37946822, 37859761, 38472802, 38186509, 38412909, 38963861, 38677899, 38999588, 39104952, 39533478, 39784782, 39601365, 38894781, 38375450, 38890437, 39256215, 39637410, 39847774, 39274638, 39465027, 40195183, 40761041, 42223123, 43385520, 43527697, 43522318, 43540243, 43047095, 43014044, 43840706, 44751730, 45236753, 45922644, 47026817, 48279742, 50193548, 52255866, 54142387, 55304801, 56224357, 56848059, 56489696, 55024682, 54014185, 53217006, 51131679, 50151272, 49718722, 49329896, 48620122, 48798712, 49450781, 50600844, 51014647, 51004934, 50898439, 50535986, 51245535, 52325516, 54104924, 55169450, 54920457, 54270975, 52991475, 51751060, 51074314, 51002394, 51451076]
8650E1451076P13182J666666K161794K071524K839151J526770M11236j09062J011682
8641F3744019P70810m23912k99783q48509k78476q33254j798936j388555j091180
8632E7552224M12024O14225J243366J851323J346843Q64632N66017R96168j9766
8623F5427056O50449P15396J714692K100771J875967o35734j318482j380046l356411
8614F5793658k260912j136416j083347p7575J337371K621904L064106K127249
8606G0386038Q18262r76235j180180j256417j413446p46614j449835k876584j963422
8597E9341567p05558j271811q55299K98796m9517Q5552J277207J194836J026328
8588F0342101R45875J12916j132187n49063j92833l24071N92505N28462N02378
$$ y = [51451076, 52164258, 53830924, 55992718, 58064242, 60903393, 62430163, 62841399, 62732337, 63744019, 64514829, 64090917, 63791134, 62942625, 62664149, 61830895, 60031959, 58643404, 57552224, 57964248, 58578473, 59821839, 61673162, 63020005, 63884637, 64450654, 65446822, 65427056, 66077505, 66792901, 68507593, 70608364, 72484331, 71848597, 70530115, 69150069, 65793658, 63532746, 62396330, 61312983, 61235408, 62572779, 65194683, 68258789, 70386038, 71204300, 70228065, 69047885, 67791468, 66378022, 65631408, 64181573, 61304989, 59341567, 58636009, 57364198, 56508899, 56807695, 56758178, 56843730, 58120937, 59315773, 60342101, 61287976, 61400892, 60268705, 59719642, 59526809, 59202738, 59795243, 60323705, 60826083]
8579F0826083R36703m19949q60058j657324j641558j272322r21294K03449m41631
8570E4752099K97409J701124J610083M82614O4588p96392j498275j717170j980972
8561E2915108j470096j688156j009122j008673j802636j227453k17342Q1341o34319
8552D3938652q25798k09889n49955o01802j58107j164306k69630r5257n54672
8543C9509236r23295l80586O1609J73191O87690J48765j011078K40478p701p86198
8533C7712111l54511L77040n85640P6069N96765J52580J6367n22088J94457M1818
8523C7704968o59996j138864p61633j096684q43218l19728l82858p54345m22098
8514C1325544J97900L11634j06012r96016m88574k54917m5370j46503m36163L23048
$$ y = [60826083, 61762786, 61342837, 60482779, 58825455, 57183897, 55911575, 54990281, 55193730, 54752099, 55049508, 56750632, 58360715, 58843329, 58907917, 58111525, 56613250, 54896080, 52915108, 51445012, 49756856, 48747734, 47739061, 45936425, 44708972, 44491630, 44572971, 43938652, 43112854, 42902965, 42353010, 41751208, 41593101, 40428795, 40159165, 40063908, 39509236, 38585941, 38205355, 38266964, 38440155, 39127845, 39276610, 38265532, 38506010, 38498309, 37712111, 37357600, 37734640, 37149000, 37225069, 37821834, 37974414, 37990781, 37468693, 37663150, 37704968, 37044972, 35906108, 35144475, 34047791, 33204573, 32884845, 32501987, 31747642, 31325544, 31523444, 31835078, 31729066, 30733050, 30244476, 29989559, 29944189, 29797686, 29361523, 29684571]
8504B9684571J53788k97530o84645n24941j31569r7034J67721p91391l09129k38825
8494B6931016n28432m7791r7710R15727k88494N9324J43077N3901m92019j71784
8484B6476815m36814m00246M76325n89679J1291j3222o24592M00825N30126n70497
8474B5260332J81968l47583k37315L99717j09237J11840l10956M44211l19863
8465B5073114k13746J70570K79698M10826k54523O01104J72359L82729R14819
8456B7536950R11009j25678m51411n7324L52217q79934m28298q3930p02700M63174
8446B6534075q95357j21763K74600K42075K44346R32398o7352J51275J204598
8437B8498895J718430K138639J913847K058308J391046j044977j939030j008443
$$ y = [29684571, 29838359, 29540829, 28856184, 28331243, 28199674, 28102640, 28270361, 27478970, 27169841, 26931016, 26402584, 26354793, 26257083, 27172810, 26884316, 26943640, 27086717, 27140618, 26648599, 26476815, 26040001, 25639755, 26116080, 25526401, 25537692, 25524470, 24899878, 25300703, 25830829, 25260332, 25442300, 25094717, 24857402, 25257119, 25147882, 25259722, 24948766, 25392977, 25073114, 24859368, 25029938, 25309636, 25720462, 25465939, 26067043, 26239402, 26622131, 27536950, 28447959, 28322281, 27870870, 27813546, 28165763, 27285829, 26857531, 26773601, 26070901, 26534075, 25638718, 25516955, 25791555, 26033630, 26277976, 27210374, 27143022, 27294297, 28498895, 30217325, 32355964, 34269811, 36328119, 37719165, 36674188, 34735158, 33726715]
8429C3726715j251142j368204m71002P55216J138156J037422J689791K525951
8421C7782903J475926Q97558q04362j594189k525825k652146j595998j127530
8413B9856337j210562r11631q47808o64357L25710n03023R3738N17888L28385
8404B6984677K7359O03320J127893L91836J074439J683668K274817K208980L829273
8395D0206262M165557L403111J397887q29952j340369k603972l438387k779337
8387C8180800j578564j101621o91741P9495R20066J364781J174214o12124j540645
8378C6194661j185424j228626n31364m2528N50345J150262J118718O21651J21836
8369C6769531j526115j836159k503726j876275j557809j376414j149397m78874
$$ y = [33726715, 32475573, 31107369, 30636367, 31391583, 32529739, 33567161, 35256952, 37782903, 39258829, 40156387, 39352025, 37757836, 35232011, 32579865, 30983867, 29856337, 28645775, 27734144, 26886336, 26221979, 26547689, 26044666, 26138404, 26656292, 26984677, 27012036, 27615356, 28743249, 29135085, 30209524, 31893192, 34168009, 36376989, 40206262, 44371819, 47774930, 49172817, 48342865, 47002496, 44398524, 40960137, 38180800, 36602236, 35500615, 34808874, 34888369, 35808435, 37173216, 38347430, 37735306, 36194661, 35009237, 33780611, 33249247, 33206719, 33757064, 34907326, 36026044, 36647695, 36769531, 35243416, 33407257, 30903531, 29027256, 27469447, 26093033, 24943636, 24464762]
8361B4464762k38754p50948O1788k70235J127015N13878P75078R39098J688280
8352B8309962R65606J0727m71540j328598j031845k080226j824350p44395L3653
8343B1838994p64001p10607k99966l68644J88231P32209K48723K67253Q94474
8334B2026666N25899J001382J107347J372669Q98538o80746j303588j293282j435507
8325B2219378q88831n79887j010903j413978l0888N14478m40232o23216o01825
8316A7144096l95611k24575L14394P487K18057o0002p69155O3628j3016k63154
8306A6022149k17911l96151M1905k96626q4059M99539N1004L04491j64462K11119
8296A5970998L98375k37481l60963N74853L30850J39737L49089j1975M09456o5653
$$ y = [24464762, 24226008, 23475060, 23536848, 23266613, 24393628, 24907506, 25682584, 26621682, 28309962, 29275568, 29286295, 28814755, 27486157, 26454312, 24374086, 22549736, 21805341, 21838994, 21074993, 20364386, 20064420, 19695776, 19884007, 20616216, 20864939, 21132192, 22026666, 22552565, 23553947, 24661294, 26033963, 26932501, 26251755, 24948167, 23654885, 22219378, 21330547, 20750660, 19739757, 18325779, 18294891, 18809369, 18369137, 17745921, 17144096, 16748485, 16523910, 16838304, 16845791, 17063848, 17003846, 16234691, 16298319, 16285303, 16022149, 15804238, 15408087, 15449992, 15153366, 15069307, 15568846, 15619850, 15924341, 15759879, 15970998, 16369373, 16131892, 15770929, 16345782, 16676632, 16816369, 17165458, 17153483, 17562939, 17497286]
8286A7497286M35609Q5603K25550M42548N56129M92660M31480J049482Q71157
8277B2087504J444611K398252J354406J887660K370794J827905P98711O59970
8269C4829813P15600n62140j287301r91890j923076k040347o39590j393341q86866
8260B5820862J5258K44691J223199J691983J595307J203044J470790R96491j91803
8251C4069822J42515q09247k98471k43221p94625j652248j933926k038584j753315
8242B4688700m79358k00885P775M01757k1286Q66420K040931R77407J314971J195911
8232C0792343J007151r6458m09184m67783r66771r19942j533560j563367j222524
8223B4619905n92147r59682K7470j14986P80866J318937J164971J379800J005464
$$ y = [17497286, 17932895, 18018498, 18244048, 18686596, 19242725, 19735385, 20166865, 21216347, 22087504, 23532115, 25930367, 27284773, 29172433, 31543227, 33371132, 34169843, 34829813, 35545413, 34983273, 33695972, 32704082, 30781006, 28740659, 28101069, 26707728, 25820862, 25836120, 26080811, 27304010, 28995993, 30591300, 31794344, 33265134, 34261625, 34069822, 34212337, 33403090, 33104619, 32861398, 32066773, 30414525, 28480599, 26442015, 24688700, 24209342, 24008457, 24016232, 24417989, 24396703, 25263123, 27304054, 28281461, 29596432, 30792343, 31799494, 31703036, 31293852, 30826069, 29859298, 28939356, 27405796, 25842429, 24619905, 24027758, 23068076, 23095546, 22980560, 23761426, 25080363, 26245334, 27625134, 28630598]
8214B8630598M59515r7329J24348L98065q86210Q8003n9501k122207j401947k015450
8204B3117885j814910j983653j024109r03623L62454l72490k18954q27373o06840
8195A5728387j258325l8947j945325L180752L811452k182040j54252p09498j65655
8186A6266549r95952K01911r79983l48007o27729q42771k35687O70358j19930
8177A2988759M92205L58211l62845n99280L92818O00696n21638L6939K9760j4055
8167A3401570M76635p44974l92688O5800p1914n94923j46066L30582j80643J08600
8157A2251979q71271N55736k4582O92394J8260k92584q43593J5931Q49768n19614
8147A1832424J16918J41679K27088O2259q16636p70230m71813J02280k48722k32842
$$ y = [28630598, 29090113, 28992784, 29117132, 29515197, 28628987, 28716990, 28657489, 26535282, 25133335, 23117885, 21302975, 19319322, 18295213, 17391590, 17754044, 17381554, 17162600, 16335227, 15728387, 14470062, 14431115, 12485790, 15666542, 19477994, 17295954, 17141702, 16432204, 16266549, 15270597, 15472508, 14492525, 14144518, 13516789, 12674018, 12438331, 13108689, 12988759, 13480964, 13839175, 13476330, 12877050, 13269868, 13870564, 13348926, 13385865, 13415625, 13401570, 13878205, 13133231, 12740543, 12806343, 12734429, 12139506, 11993440, 12324022, 12143379, 12251979, 11380708, 11936444, 11911862, 12604256, 12622516, 12329932, 11486339, 11502270, 12352038, 11832424, 11949342, 12091021, 12318109, 12380368, 11563732, 10793502, 10321689, 10423969, 10175247, 9942405]
8137I942405J38716K95512k51029l89191K42499j15157j26859l3601k7366n43585
8127I132344M80943k34340l37563k26699r3814R3328O25945j05889p00871K3266
8117H656650N15121M45954K95803l58538k1335J54698j90150m05380o34001M34046
8107H892868J71718q57062P45205N57456l98306M55199r6907L71248O58326K26938
8097A0726683L10623j67933l23199J51274J47614K87033l39148Q2453K45375L70333
8087A1491108N3465j0427K12354J49456l0269o0869l80154N05345K58060Q00371
8077A2988440m23821J06902M36293N42369J295691N75977O05355O97298J065880
8068A7890384L32713M41346Q01978K463755K574552K658205L235050N031512O444835
$$ y = [9942405, 10081121, 10376633, 10125604, 9736413, 9978912, 9863755, 9736896, 9703295, 9675929, 9132344, 9613287, 9378947, 9041384, 8814685, 8720871, 8814199, 9440144, 9334255, 8633384, 8656650, 9171771, 9617725, 9913528, 9554990, 9533655, 9688353, 9498203, 9092823, 8458822, 8892868, 9064586, 8207524, 8952729, 9510185, 9111879, 9567078, 9470171, 9841419, 10499745, 10726683, 11037306, 10869373, 10546174, 10697448, 10845062, 11132095, 10792947, 10875400, 11120775, 11491108, 11544573, 11534146, 11746500, 11895956, 11865687, 11804818, 11424664, 11930009, 12188069, 12988440, 12564619, 12671521, 13107814, 13650183, 14945874, 15521851, 16127206, 16824504, 17890384, 18223097, 18664443, 19466421, 21930176, 24504728, 27162933, 30397983, 35429495, 41874330]
8059D1874330O129591O623544L749474m54713n036862p324502o980387o027047
8051C2553428n404640k969226k069250k183320j299698j007918p66718j191289
8043A5661369n68871m9566O7422n01603m24307o46099O0629L87892m74054q60072
8033A2652740J6739Q74456J20572P691M57424l84405l19539n61551Q7162L22969
8023A3274258j27330K32746m8668k49206l40437L59410M62112N80605K989n46465
8013A3600014l65728j70777K74635M99471N2136q3490M95983j21797M5600K36158
8003A4462205O50741J550427J272110J508524J302920J367076J979378J799725
7995B5893106K452961L479794M357457M923917M700292P85834m022882n986161
$$ y = [41874330, 48003921, 54627465, 58376939, 57922226, 52885364, 45560862, 38580475, 32553428, 27148788, 24179562, 22110312, 19926992, 18627294, 17619376, 16852658, 15661369, 15092498, 15042932, 15110354, 14608751, 14184444, 13538345, 13598974, 13986866, 13512812, 12652740, 12669479, 13543935, 13664507, 13672198, 14129622, 13745217, 13425678, 12864127, 12951289, 13274258, 13146928, 13379674, 13331006, 13081800, 12741363, 13100773, 13562885, 14143490, 14146479, 13600014, 13234286, 13063509, 13338144, 13837615, 13889751, 13806261, 14302244, 14180447, 14226047, 14462205, 15112946, 16663373, 17935483, 19444007, 20746927, 22114003, 24093381, 25893106, 28346067, 31825861, 36183318, 41107235, 45807527, 46593361, 42570479, 36584318]
7987C6584318n897949n007505l406081k887592j725418j093257j769758j024534
7979A3772224p10558l20334J1418l53573m99190o08484J58053m30291p8064o72290
7969A0268911n82628j66341j95983r3472K3069n80997P5189K61011o33386M5644
7959H421017r5156j37495m83451K69495N03983J85711Q5519m0274j070996l05187
7949G333166K1580q8178k68139m03361R6698k12616l816j41628m4206k70734K12273
7938F231039M38670l25081m4892K92371J5092n3243N3729j51952J80559J60784
7928F797076N46929n5174p8971n01643r51722J43927J86192O29824K88760j72447
7918F832751N94557K04288m33830n78753m60633r7446N27890j03133l03685k23396
$$ y = [36584318, 30686369, 25678864, 22272783, 19385191, 17659773, 16566516, 14796758, 13772224, 13061666, 12741332, 12752750, 12399177, 11899987, 11291503, 11449556, 11019265, 10941201, 10268911, 9686283, 9519942, 9323959, 9230487, 9253556, 8672559, 8747748, 9008759, 8375373, 8421017, 8325861, 8188366, 7704915, 7974410, 8478393, 8664104, 8749623, 8709349, 7638353, 7333166, 7354746, 7266568, 6998429, 6595068, 6691766, 6479150, 6475334, 6333706, 6289500, 6018766, 6231039, 6669709, 6344628, 6299736, 6592107, 6607199, 6553956, 6607685, 6455733, 6636292, 6797076, 7344005, 7288831, 7209860, 6708217, 5756495, 5900422, 6086614, 6716438, 7005198, 6832751, 7427308, 7631596, 7197766, 6619013, 6158380, 6060934, 6588824, 6485691, 6182006, 5958610]
7908E958610j10731L15848K79282l19610l2371R5487K8192N4549k01669n2053
7898F015534K37448m62949m94966j43889N28405K13791K3761K44973L47871q8882
7888F421097o3143N852p22332L00576K5318o7357N0279J53907j56857M87419J98219
7877F632978j22638n72144k05073O91517m6109R4377n24046M73464N63348j40090
7867F845584L05476R6128k80185m54398n4693r6215K57644M98313j97945l73210
7857F546499O1128k91935J0588j46633p6089J27663l55578K68866K33880m41420
7847E936969j26023L00542n01437N64670j4520n46044o91593j16942R44843n73306
7837E177159l20137M24233l51873N71343k59542K8558J72213m13210J65868L56312
$$ y = [5958610, 5847879, 6163727, 6443009, 6123399, 6091028, 6186515, 6214707, 6269256, 6067587, 6015534, 6252982, 5790033, 5295067, 5151178, 5679583, 5893374, 5917135, 6162108, 6509979, 6421097, 6357954, 6363806, 5641474, 5942050, 5967368, 5900011, 5950290, 6104197, 5947340, 6434759, 6632978, 6510340, 5938196, 5733123, 6424640, 6378531, 6472908, 5948862, 6422326, 6985674, 6845584, 7151060, 7247188, 6967003, 6512605, 6457912, 6361697, 6619341, 7117654, 6919709, 6546499, 6607627, 6315692, 6326280, 6179647, 6103558, 6231221, 5875643, 6144509, 6378389, 5936969, 5810946, 6111488, 5610051, 6174721, 6160201, 5614157, 4922564, 4805622, 5750465, 5177159, 4857022, 5281255, 4929382, 5500725, 5241183, 5269741, 5441954, 5028744, 5194612, 5550924]
7827E550924P67241l89836J35907j60970J09286N64115O1909n54297L16429q2132
7817F318576m9516q67568j71915J078990J32427K58616j88387n67847Q25087q40296
7807E928167P76429K172217K7036p37196m3912K0941j86428J91966m51421o52939
7797G044860m8152R83476L2408r4528K0071l24771M59658N12618K77685J36403
7787H999728M7036L77822K24361j45627j25954N18644L42112j28085j269831l3841
7777H806365P1682l20850j71420p93055R5601L51226k98410L2316m36150j61153
7767G176152j88925k98173L76654j04926m85260j0090q0009P09704m21862j02265
7757F571000L57021k53137O0204n76433k66764M88300L29795J3184p9826m20502
$$ y = [5550924, 6318165, 5928329, 6064236, 5903266, 6012552, 6576667, 6638576, 6084279, 6400708, 6318576, 6269060, 5401492, 5229577, 6308567, 6440994, 6699610, 6511223, 5943376, 6768463, 5928167, 6704596, 8876813, 8903849, 8166653, 8122741, 8143682, 7957254, 8149220, 7697799, 7044860, 6996708, 7980184, 8012592, 7918064, 7938135, 7613364, 8073022, 8585640, 8863325, 8999728, 9046764, 9424586, 9648947, 9503320, 9377366, 9896010, 10238122, 10110037, 8840206, 8806365, 8878047, 8557197, 8385777, 7592722, 7688323, 8039549, 7741139, 7773455, 7337305, 7176152, 6987227, 6689054, 7065708, 6960782, 6475522, 6465432, 6385423, 7095127, 6673265, 6571000, 6928021, 6674884, 6735088, 6158655, 5891891, 6380191, 6709986, 6723170, 6643344, 6222842]
7747F222842j07130N09533l74143N9758L92495K73732j28992j062437R08912J82174
7737F876744J26480j27642n08442O07167J76094l10495N07221Q5100k33480j49807
7727G048940k19581L54166j29766L07232P51384l57535k64640M83746J63632O14132
7717H751710K39209J12910M90556P63923p30268k69288K02699L29356K45823l29507
7707I807123k66587O12652J367902j25791J192172Q54022Q18223J838309J577925
7698A7675950J350265K478076L899165M976534M555282L966356J346352k757103
7690C7490877n206152m731768m827428l499962k257448j855401j830332j454763
7682A1827623j45633j69328p35240n78387m35700r39419l99949J59105P1365r25009
$$ y = [6222842, 6115712, 6625245, 6251102, 6310860, 6703355, 6977087, 6848095, 5785658, 6694570, 6876744, 7003224, 6875582, 6367140, 6974307, 7150401, 6839906, 7347127, 7432227, 7198747, 7048940, 6829359, 7183525, 7053759, 7360991, 8112375, 7754840, 7490200, 7973946, 8137578, 8751710, 8990919, 9103829, 9594385, 10358308, 9628040, 9358752, 9561451, 9890807, 10136630, 9807123, 9540536, 10153188, 11521090, 11395299, 12587471, 13441493, 14259716, 16098025, 17675950, 19026215, 21504291, 25403456, 30379990, 34935272, 38901628, 40247980, 37490877, 32284725, 27552957, 22725529, 19225567, 16968119, 15112718, 13282386, 11827623, 11681990, 11512662, 10777422, 10199035, 9763335, 8823916, 8423967, 8583072, 8654437, 7729428]
7672G729428l09088j64438j13651M39196j19051p51986l34617m89953N3004L75717
7662F314561m94260J25926J76160m42909J54941J05506p1206L43502N48956l3623
7652F727554o07305o14833k22190R0566l94574o5990k02102o53427K48766M47765
7642D754230L13012M8962J89388n2513p0199l43363j34323J6528P7227m91650
7632D307299L54186R9581L12923O17285j54055K92447k26043o7203Q60691K48768
7622F645879j24999q1450p59742p15967k38765R5259k54392k78811m50728J17429
7612C953713Q80199k48090K18434o01205m64140P2384M80106j44705L99598j79371
7602D366923n27490L84063l0545m48114k66537J47047p78865k9489L81832M58299
$$ y = [7729428, 7420340, 7255902, 7142251, 7581447, 7462396, 6710410, 6375793, 5885840, 5938844, 6314561, 5820301, 5946227, 6122387, 5679478, 5834419, 5939925, 5868719, 6212221, 6761177, 6727554, 6120249, 5505416, 5283226, 5373792, 4979218, 4913228, 4711126, 4057699, 4306465, 4754230, 5067242, 5116204, 5305592, 5253079, 5182880, 4839517, 4705194, 4721722, 4798949, 4307299, 4661485, 4761066, 5073989, 5691274, 5537219, 5829666, 5603623, 5536420, 6397111, 6645879, 6520880, 6439430, 5679688, 4963721, 4724956, 4820215, 4565823, 4287012, 3836284, 3953713, 4833912, 4585822, 4804256, 4203051, 3738911, 3811295, 4291401, 4146696, 4546294, 4366923, 3839433, 4223496, 4192951, 3744837, 3478300, 3625347, 2846482, 2816993, 3198825, 3657124]
7592C657124j44421K34911J56128p343J09498o18280n65535O55449n46298j99889
7582B731344J45968N47453j9758o77469K31068K77674L05250J24144L4774P22519
7572D422967j032693N2039K42718l97817K02627k66397o93411k965J61248J86161
7562B874477M69592n65005J96479O4530J7070O58280l03694J92088l80323o84469
7552B539025O59367K82956n94201o76285J13949j1695j563M20734r1566J8531
7542B659252K33527J92132k53719n34159J90772o3633M07195J2972q756n85554
7532B250029O35043K53868m17290O1607j096848N38281L99337m6737J90303J65328
7522B932921l5168n24377k63176J17096M80124L65411o99187m77107O13782L16886
$$ y = [3657124, 3512703, 3747614, 3903742, 3896399, 4005897, 3387617, 2822082, 3477531, 2931233, 2731344, 2877312, 3424765, 3405007, 2727538, 2958606, 3236280, 3541530, 3665674, 3700448, 4422967, 3390274, 3442313, 3685031, 3287214, 3489841, 3223444, 2530033, 2527068, 2688316, 2874477, 3344069, 2779064, 2975543, 3040073, 3057143, 3715423, 3411729, 3603817, 3223494, 2539025, 3198392, 3481348, 2887147, 2210862, 2324811, 2313116, 2311553, 2732287, 2640721, 2659252, 2892779, 3084911, 2831192, 2297033, 2487805, 2424172, 2831367, 2844339, 2835583, 2250029, 2885072, 3138940, 2721650, 2783257, 1686409, 2224690, 2624027, 2577290, 2767593, 2932921, 2897753, 2373376, 2110200, 2227296, 2707420, 3072831, 2373644, 1896537, 2510319, 2827205]
7512B827205q8184J83812M36531r14426m8667L26136k80582m7388n5201L9446
7502B378682Q2141K13121M45126m171j77549p5381l60737k25176l9124K99977
7492B536909M3644J39053j30028k74321P37825l84320k52507K01295R8566k4408
7482B691708k71928j84523J88566l94941K07181M40194l420j59777j70613J20081
7472B462528j37014K20487J59188P57891K05386n49436K43824o3366j60237j28651
7462C010600m21745L70884K64865m60868o36055J39253L74566j762K29614p00243
7452B169109J54506Q45349l47061J79856J22645R4842p04550o80989M31550O25608
7442B890865j14693k48893J88021j60616j96984j89059N395P03675l87116j50506
$$ y = [2827205, 2739021, 2922833, 3359364, 2444938, 2396271, 2722407, 2441825, 2394437, 2339236, 2378682, 2460823, 2673944, 3119070, 3114899, 2937350, 2861969, 2501232, 2276056, 2236932, 2536909, 2580553, 2719606, 2589578, 2315257, 3053082, 2668762, 2416255, 2617550, 2716116, 2691708, 2419780, 2235257, 2423823, 2028882, 2236063, 2676257, 2672837, 2513060, 2342447, 2462528, 2325514, 2546001, 2705189, 3463080, 3668466, 3119030, 3362854, 3299488, 3139251, 3010600, 2588855, 2959739, 3224604, 2763736, 2127681, 2266934, 2641500, 2639738, 2869352, 2169109, 2323615, 3168964, 2821903, 3001759, 3124404, 3219246, 2514696, 1833707, 2265257, 2890865, 2776172, 2527279, 2715300, 2554684, 2357700, 2168641, 2174036, 2877711, 2490595, 2340089]
7432B340089r1269J27791N1990J68935l68830J07583Q8752m57624O92852Q4081
7422B744350J68448J77480J05451j65012M0877l42585k24428L71390q60892m75442
7412A539637j41710L32739N33090q8911l15151J62305K40171n7770J10381K26711
7402B541492J39154k24064L92880l57785K43335l86156k94688L06142K56817n47494
7392B069633j67532m0775L58685O9611k10604n8392J92208j80902j42606P73353
7382B662679j86166n63948j55064K17513R8062j10449L72389J32784k99031j11917
7372B056852k2114M67507J48209Q4014o91024j39403L51528N02533n61385m38164
7362A758553M54160J95587m53908M24920P0175n35726m9909J22285j32615o8815
$$ y = [2340089, 2248820, 2376611, 2428601, 2597536, 2228706, 2336289, 2425041, 1967417, 2660269, 2744350, 2912798, 3090278, 3195729, 3030717, 3071594, 2729009, 2504581, 2875971, 2015079, 1539637, 1397927, 1730666, 2263756, 2174845, 1859694, 2021999, 2262170, 2204400, 2314781, 2541492, 2680646, 2456582, 2849462, 2491677, 2735012, 2348856, 2054168, 2360310, 2617127, 2069633, 1902101, 1861326, 2220011, 2289622, 2079018, 2020626, 2212834, 2031932, 1889326, 2662679, 2476513, 1912565, 1757501, 1975014, 2073076, 1962627, 2335016, 2467800, 2168769, 2056852, 2034738, 2502245, 2650454, 2734468, 2043444, 1904041, 2255569, 2758102, 2196717, 1758553, 2212713, 2408300, 1954392, 2379312, 2449487, 1913761, 1863852, 1986137, 1853522, 1784707]
7352A784707R8703J43431M33195l14907l1216P24071n18120K64018k72967l91993
7342A918922P99018n90842K11727j45062J18526M01304r2319K23575j24462J9445
7332B739832j78695n68450K62886n52608J14095m2507k33475M13150k42999L93682
7322B104911J14414N90858m39944r2806l76021l34500R11645m52240l04126M45403
7312B167594J30399M95920J65591m15086J01882J88543p99505j247618P04375
7303A492095J070240n0555K34703J88806n18744l27821L75101L6403K6060r32964
7293A593324K30928K44245K52623l0668n46419K23391J5816J35368j30777j40113
7283A847718j39743M3932J38085M85939p79268M48369k69202J65808j69933R8480
$$ y = [1784707, 1883410, 2026841, 2460036, 2145129, 2113913, 2837984, 2319864, 2583882, 2310915, 1918922, 2717940, 2127098, 2338825, 2193763, 2312289, 2713593, 2621274, 2844849, 2720387, 2739832, 2561137, 1992687, 2255573, 1702965, 1817060, 1774553, 1541078, 1954228, 1711229, 2104911, 2219325, 2810183, 2370239, 2277433, 1901412, 1566912, 2478557, 2026317, 1722191, 2167594, 2297993, 2793913, 2959504, 2544418, 2646300, 2834843, 2035338, 787720, 1492095, 2562335, 2511780, 2746483, 2935289, 2416545, 2088724, 2463825, 2500228, 2526288, 1593324, 1824252, 2068497, 2321120, 2290452, 1744033, 1967424, 1983240, 2118608, 1987831, 1847718, 1707975, 1751907, 1889992, 2375931, 1596663, 2045032, 1775830, 1941638, 1771705, 1870185]
7273A870185J23198N59031K21712j27968k89245n56768M08208N05611J19738r69414
7263A864288J18871L91845k12092j88522P68984l73822n25385m31810L57120N32476
7253B301953r7278j5610j79083K46388P32099n53052k6483o07753o7145k46036
7243A488000N73677j06769j47392J43699n23274R43299k69864k1133K70492l47965
7233B002770N9650M89509N35700j62252o26028R82425n02675N56o7200n56465
7223B155990p4362j84137L88247M47485m96212K27587K02724l16207k2731m81265
7213A847119P7154J10399k1222N78077l35052J96765K21306k9806o80991k4357
7203A939392J22688J1812k50830n14634O27161N49148J01086j55856J2983m50187
$$ y = [1870185, 1993383, 2552414, 2774126, 2646158, 2356913, 1800145, 2208353, 2713964, 2833702, 1864288, 1983159, 2375004, 2162912, 1974390, 2743374, 2369552, 1844167, 1412357, 1769477, 2301953, 2204675, 2189065, 2009982, 2256370, 2988469, 2435417, 2408934, 1801181, 1734036, 1488000, 2061677, 1954908, 1807516, 1951215, 1427941, 2371240, 2101376, 2080243, 2350735, 2002770, 2062420, 2551929, 3087629, 2925377, 2299349, 3281774, 2779099, 2779655, 2712455, 2155990, 2081628, 1897491, 2285738, 2733223, 2237011, 2464598, 2667322, 2351115, 2328384, 1847119, 1924273, 2034672, 2013450, 2591527, 2256475, 2453240, 2674546, 2644740, 1963749, 1939392, 2062080, 2073892, 1823062, 1308428, 1935589, 2484737, 2585823, 2429967, 2442950, 1992763]
7193A992763o85329M31654M53500k3299k98774J47829J20005o3134r3419M52752
7183B434548J53219l83912K76833N52517P4010q83268M44814j68020K71981n5840
7173B716882l77413l24177J69255K08349j39184N2743r569O0809j22192l0299
7163B205204J79537j79222j28570m09692J64983k04351P592N05874J86922p7103
7153B251174j24536K0729r1603O84034Q77226J31864o53969q3189J41349L51433
7143C504512j09143j43204K32859j13538N36406k46470o84348J7115L02565l67459
7133B929295r6781n80438K26196R6813k34994M54837R11543m47501o95796O9425
7123B632599J87614j72940n67165k1183M6940k12526J07374N1383Q9151N0075
$$ y = [1992763, 1307434, 1739088, 2192588, 2169289, 1870515, 2018344, 2138349, 2075215, 1981796, 2434548, 2587767, 2203855, 2480688, 3033205, 3107215, 2223947, 2668761, 2500741, 2772722, 2716882, 2339469, 2015292, 2184547, 2392896, 2253712, 2306455, 2296886, 2357695, 2235503, 2205204, 2384741, 2205519, 2076949, 1667257, 1832240, 1627889, 1635481, 2141355, 2328277, 2251174, 2126638, 2147367, 2055764, 2739798, 3617024, 3748888, 3094919, 3011730, 3153079, 3504512, 3395369, 3252165, 3485024, 3371486, 3907892, 3661422, 2977074, 2994189, 3296754, 2929295, 2832514, 2252076, 2478272, 2575085, 2340091, 2794928, 3706471, 3258970, 2563174, 2632599, 2820213, 2647273, 2080108, 2058925, 2105865, 1893339, 2000713, 2052096, 2141247, 2191322]
7113B191322m24261k28495o892K98921K28567M12823k21559l01073J10899O31580
7103B691832L81875j093247N09628O7322k00621l2055k80468K87177j20297L5547
7093B246693Q812l84097j6693L79467k20187K85849k56433N04605K84332P9492
7083B911840l48916J64539l50093o7917j80253M37595J043152n95941o13747j96026
7073B204233L25512k03362R8242J25528P2072l5589J7918N75507m64529l34082
7063B381450M1687J73400m3952N62501l92595K91525k21947J01091l28928k98692
7053B265540m89941L53799L08605J23399L07611K62629L4446j77107O9665l37214
7043B721432l38383k40327L077R62359Q5949j50288K30119j132102l10820K83089
$$ y = [2191322, 1767061, 1538566, 1531674, 1830595, 2059162, 2471985, 2250426, 1949353, 2060252, 2691832, 3073707, 1980460, 2490088, 2557410, 2356789, 2324734, 2044266, 2331443, 2211146, 2246693, 2255505, 1871408, 1854715, 2234182, 2013995, 2299844, 2043411, 2548016, 2832348, 2911840, 2562924, 2727463, 2377370, 2309453, 2129200, 2566795, 3609947, 3014006, 2400259, 2204233, 2529745, 2326383, 2424625, 2550153, 2622225, 2586636, 2604554, 3180061, 2715532, 2381450, 2423137, 2596537, 2552585, 3115086, 2722491, 3014016, 2792069, 2893160, 2564232, 2265540, 1775599, 2129398, 2438003, 2561402, 2869013, 3131642, 3166088, 2988981, 3058646, 2721432, 2383049, 2142722, 2145799, 3108158, 3194107, 3043819, 3273938, 2141836, 1831016, 2114105]
7033B114105J137240k78750k05872r5526L2630M21659M0988j63241R4129L87146
7023C484508O0645k11462L95664j38205j00673L48190O54210K99211j80620j29631
7013D481837j10960p25356n45222j04675N8501m5104j41974L96191O56571q72114
7003C047695K97059Q9728n44147K75145k61988k24085J52225p23340m7783N05423
6993B565932K77769K11347j18079m38542L87167K80545m95548K13793K27069L99084
6983C510537J49570n62715m06774J4201p1768O08569L5460l7173l55083j18239
6973B766585K67646o00739j55204L31345K6718M46034O8949L05261N3836o4307
6963C446124q1635J67192m00227k75058J43702M38347m278m86027n8606m73779
$$ y = [2114105, 3251345, 2972595, 2766723, 2671197, 2703827, 3125486, 3166474, 3003233, 3097362, 3484508, 3545153, 3333691, 3729355, 3591150, 3490477, 3838667, 4492877, 4792088, 4611468, 4481837, 4370877, 3645521, 3100299, 2995624, 3054125, 3009021, 2867047, 3263238, 3919809, 3047695, 3344754, 3434482, 2890335, 3165480, 2903492, 2679407, 2831632, 2108292, 2060509, 2565932, 2843701, 3055048, 2936969, 2498427, 2885594, 3166139, 2670591, 2884384, 3111453, 3510537, 3660107, 3097392, 2690618, 2704819, 2633051, 3241620, 3277080, 3239907, 2884824, 2766585, 3034231, 2433492, 2278288, 2609633, 2636351, 3082385, 3151334, 3456595, 3510431, 3446124, 3364489, 3531681, 3131454, 2856396, 3000098, 3438445, 3434167, 2948140, 2889534, 2415755]
6953B415755L07969j2189l8336J92433M26868o44492O48986K4842p86435J39687
6943B675088L95158j87462O16321J45204n67493J10169p6423L46727r67161j76828
6933B313300J198936K35742l16255k97332n68324k73865J30714M43348N18462
6924C384726r8529N512m76940P62231O98551p85585j3191j54938l13130M51802
6914C460509n88491r2423O17761k30615k1225j03278m02751k5278M14672J7801
6904C046682K21942N2074L37896o94437j73980M82106K68949k9644l97194l96471
6894B717923n12208R53039k96962q3425l1233l8540O49493K3467o8724k34158
6884C078672k32724m6886k78200l16048Q73249N35617K95621m0955r67623L4932
$$ y = [2415755, 2723724, 2711535, 2673199, 2865632, 3292500, 2648008, 3296994, 3321836, 2535401, 2675088, 3070246, 2882784, 3499105, 3644309, 3076816, 3186985, 3110562, 3457289, 2490128, 2313300, 3512236, 3747978, 3431723, 3134391, 2566067, 2292202, 2422916, 2866264, 3384726, 3286197, 3291709, 2814769, 3577000, 4275551, 3489966, 3476775, 3321837, 3008707, 3460509, 2872018, 2779595, 3397356, 3166741, 3145516, 3042238, 2639487, 2614209, 3028881, 3046682, 3268624, 3320698, 3658594, 2964157, 2790177, 3272283, 3541232, 3511588, 3114394, 2717923, 2205715, 3158754, 2861792, 2778367, 2747134, 2708594, 3358087, 3381554, 3312830, 3078672, 2845948, 2799062, 2520862, 2204814, 3078063, 3613680, 3909301, 3868346, 2900723, 2935655]
6874B935655Q96504l41786m5515J45487O9085n31206k9947j9333K98614N62080
6864C939638j87733q3301n93415R1251J106256m13810J33423J85684l0122l56654
6854C791217J04431l16671K3321J35538N45987K41983K22459j84967j95738Q92877
6844E260437k00456p34166L2372L86033J53203O1138m59835J99279M20556M05987
6834E524548j68193m49077J46789k4997J67598L92306k61344p9762J93914N38773
6824E980555k9749k25208o4720J33827k36939m58397n28748K36845M49069N79522
6814E836057J85104j00658Q7466K04743k7836Q47012P96572o45390k88778O99583
6804G593875K78385K80560N83919j94624n7469M98862L09877l52753O21870m76324
$$ y = [2935655, 3832159, 3490373, 3444858, 3590345, 3659430, 3128224, 3098277, 3078944, 3377558, 3939638, 3751905, 3668604, 3075189, 3166440, 4272696, 3858886, 3992309, 4177993, 4147871, 3791217, 3895648, 3578977, 3602298, 3737836, 4283823, 4525806, 4748265, 4563298, 4367560, 5260437, 5059981, 4325815, 4358187, 4744220, 4897423, 4958561, 4498726, 4698005, 5118561, 5524548, 5356355, 4907278, 5054067, 5029070, 5196668, 5588974, 5327630, 5247868, 5441782, 5980555, 5950806, 5725598, 5660878, 5794705, 5557766, 5099369, 4570621, 4807466, 5256535, 5836057, 6021161, 5920503, 6007969, 6212712, 6184876, 7031888, 7828460, 7183070, 6894292, 7593875, 7872260, 8152820, 8736739, 8542115, 8484646, 8983508, 9293385, 8940632, 9562502, 9086178]
6794I086178n2976J259663O79013k8539o52680J046104O22176R4720m21258l74732
6784A1257669J46415k13729j0858m75742L36953N6377j39901R2320k88665k99037
6774A0461802r51584K34361M70864q32703J88722L71591n64998l32800N6706N23843
6764I625804M79925K72987M45417M84007K66674J295730L14115K07110L76207
6755A3767976Q54864J046980J689047J795670J574831J241486K659337L117932
6747B7748123K572702L043410K823186J797030p50093k116677k258442k816370
6739C0042869l610496k494815k544708k702229j391349j667836r40762r40145
6731A3750529o57866n53726o81641k32833r10665r44343k1723k61900j36006k13433
$$ y = [9086178, 9033202, 10292865, 10971878, 10943339, 10290659, 11336763, 11958939, 12053659, 11632401, 11257669, 11404084, 11190355, 11179497, 10703755, 11040708, 11097085, 10957184, 11049504, 10760839, 10461802, 9510218, 9744579, 10215443, 9382740, 9571462, 9943053, 9378055, 9045255, 9101961, 9625804, 10105729, 10378716, 10824133, 11308140, 11574814, 12870544, 13184659, 13391769, 13767976, 14622840, 15669820, 17358867, 19154537, 20729368, 21970854, 24630191, 27748123, 30320825, 33364235, 36187421, 37984451, 37234358, 35117681, 32859239, 30042869, 26432373, 23937558, 21392850, 18690621, 17299272, 15631436, 14690674, 13750529, 13092663, 12538937, 11857296, 11624463, 10713798, 9769455, 9747732, 9485832, 9349826, 9136393]
6721I136393m07296r0561J27677M99553j95863r1339m76219k54493j43127N5471
6711H160196M24121j98188j97489l21385p30759L35467k774m9744K26324j64462
6701G481307q39900J2529k06712L9007k27066j92966N12026q81336j24666K06057
6691E778280J77368J68932K20080Q2458k64038J16966q9672l72274j0157L42840
6681F150783l82385j43830l14788Q2457K79941K95014j30020K41549R7397K25165
6671F401283p2171k01982k83160j0909O90396j91609p70242j54540L69893L57696
6661F134655k01993o720j38840O66370l18163K70530J63636R3103j92855m83369
6651E986354K31197L35992J41249k644P26218k38561k92499m5105N26540k50119
$$ y = [9136393, 8729097, 8638536, 8766213, 9265766, 9069903, 8978564, 8502345, 8247852, 8104725, 8160196, 8584317, 8386129, 8188640, 7867255, 7136496, 7471963, 7469189, 7419445, 7645769, 7481307, 6641407, 6653936, 6447224, 6486231, 6259165, 6066199, 6578225, 5696889, 5572223, 5778280, 5955648, 6124580, 6344660, 6427118, 6163080, 6280046, 6190374, 5818100, 5807943, 6150783, 5768398, 5624568, 5309780, 5392237, 5672178, 5967192, 5837172, 6078721, 6176118, 6401283, 6329112, 6127130, 5843970, 5833061, 6523457, 6331848, 5561606, 5407066, 5776959, 6134655, 5932662, 5925942, 5787102, 6453472, 6135309, 6405839, 6569475, 6662578, 6469723, 5986354, 6217551, 6553543, 6694792, 6692148, 7418366, 7179805, 6887306, 6842201, 7368741, 7118622]
6641G118622N13903m5831p97912K1638M08572L98940R7431l29827K94284L03011
6631G982831m12346j98340O69562O30547Q3492N3876J73662J046882j72756o81938
6621I175472K86995L75788p3846J82424J052578L43737K40017K5435P17578R064
6611A2335242o26200J10904Q97554M82780J016376P03653M47631P42402L30382
6602A6440724J182465J653605N82823L55464P66059j25918q82801p94223r5620
6593A9082578M58364P01315Q17169M98504M71056O07604N83737J021398J000869
6584B5242594R02584N98580N22246K6317J64008J70874j64396r19155j581254
6575B4962398j048453K7581k29464j388265L35775J50844L69505Q02446J571061
$$ y = [7118622, 7632525, 7586694, 6788782, 6810420, 7218992, 7617932, 7715363, 7385536, 7679820, 7982831, 7570485, 7372145, 8041707, 8672254, 8755746, 8809622, 8983284, 10030166, 9857410, 9175472, 9462467, 9838255, 9764409, 9946833, 10999411, 11343148, 11583165, 11608600, 12326178, 12335242, 11709042, 11819946, 12717500, 13200280, 14216656, 14920309, 15367940, 16110342, 16440724, 17623189, 19276794, 19859617, 20215081, 20981140, 20855222, 19972421, 19178198, 19082578, 19540942, 20242257, 21059426, 21557930, 22028986, 22636590, 23220327, 24241725, 25242594, 26145178, 26743758, 27266004, 27292321, 27456329, 27627203, 27462807, 26543652, 24962398, 23913945, 23941526, 23712062, 22323797, 22659572, 22810416, 23179921, 23982367, 25553428]
6566B5553428J354745P4153l5762J268411R66683N64836k12235j540315j781629
6557B6212315j866887j832239j173794p02545j071957j167730j178078l50315
6549A6868770m26275o68118n13354L92495K70185p513L6980K67615l83601j047164
6539A4790020p56936j018223q28720m13894m19878l71841l67935J796o53608l07065
6529I653716N99977l4980l65095k47063K70923O98382l09450l17112L72731J28537
6519A0450566l25778M40140j41684j78963m30531R9249l18817q70117K95517l56336
6509H663246q0346p1244j46631l68013o48359K89791j8588q9466l0159M88874
6499G989105j2063l03070J5941M6844N2887K3690K58428r9741q1806J4060K36921
$$ y = [25553428, 26908173, 26982326, 26946564, 28214975, 29181658, 29746494, 29534259, 27993944, 26212315, 24345428, 22513189, 21339395, 20636850, 19564893, 18397163, 17219085, 16868770, 16442495, 15774377, 15261023, 15653518, 15923703, 15916190, 15953170, 16220785, 15837184, 14790020, 14033084, 13014861, 12186141, 11772247, 11352369, 10980528, 10612593, 10614389, 9960781, 9653716, 10253693, 10218713, 9853618, 9606555, 9877478, 10575860, 10266410, 9949298, 10322029, 10450566, 10124788, 10564928, 10423244, 10244281, 9813750, 9912999, 9594182, 8724065, 9019582, 8663246, 8582900, 8511656, 8365025, 7997012, 7348653, 7638444, 7619856, 7530390, 7500231, 7989105, 7977042, 7673972, 7689913, 7736757, 7789644, 7813334, 8071762, 7972021, 7890215, 7904275, 8141196]
6488H141196o28296p6205K24129L16297K86915k66375O25415M9778k28841J85598
6478H629611q6977M77622j04138k8619K96506m73478o86534K50483L73768K24
6468H648468l24741Q1169J46245Q4328n9492j86253M97973N828j23409n7317k67241
6457H445558j83633M50247o8540j18334n68104J96165P20798k10273L30897j18091
6447H876690K34289j37687M590K37794L05234L17794K43146n8195r12878j75069
6437H935708p6984L1381L30633K39272l49928m56842L3056N45222j56030k15079
6427H860409L57297o1914j46090L28404m3589K12625J8384K98720k52718K6160
6417I597688r3660j81456M40047O5452K47076M50506l4278l49592L10431J06435
$$ y = [8141196, 7512900, 7436695, 7660824, 7977121, 8264036, 7997661, 8623076, 8672854, 8444013, 8629611, 8542634, 9020256, 8916118, 8887499, 9184005, 8710527, 8023993, 8274476, 8648244, 8648468, 8323727, 8404896, 8551141, 8635469, 8575977, 8389724, 8887697, 8893525, 8770116, 8712799, 8445558, 8261925, 8712172, 8643632, 8525298, 7957194, 8153359, 8874157, 8663884, 8994781, 8876690, 9110979, 8973292, 8977882, 9215676, 9520910, 9838704, 10081850, 10023655, 9110777, 8935708, 8858724, 8890105, 9220738, 9460010, 9110082, 8653240, 8686296, 9231518, 9075488, 8860409, 9217706, 9155792, 9009702, 9338106, 9294517, 9507142, 9525526, 9824246, 9571528, 9597688, 9504028, 9322572, 9762619, 9828071, 10075147, 10525653, 10491375, 10141783, 10452214, 10558649]
6407A0558649p07197J97232L40922m4497J28003j4300r4239K28080L12699J64901
6397A1070253l00461l36996L45007p0402J88391K48317L35278J95175J9287N98811
6387A2292660L9701N2178n1997J63077K91460Q7963J54072Q002N45813M52615
6377A4035544K60197l30696J47578L52207N59465L7640Q59125M81913Q54959J011170
6367A8269102K69655p49324o27727m03227l80467R7539Q7218L61686j17260k39526
6357A6567669O99708J73212L13401J64454K27454M77559K19293n56189J053069
6348A9339630L28434K96462m80573M96768J158575P78617J041666P46499P03047
6339B4409125M55820L30962m29952P54160Q12685N3537j81123M55757j11316O13998
$$ y = [10558649, 9851452, 10048684, 10389606, 10345109, 10473112, 10458812, 10364573, 10592653, 10905352, 11070253, 10769792, 10432796, 10777803, 10707401, 10895792, 11144109, 11479387, 11674562, 11693849, 12292660, 12332361, 12384539, 12332542, 12495619, 12787079, 12875042, 13029114, 13037116, 13582929, 14035544, 14295741, 13965045, 14112623, 14464830, 15024295, 15061935, 15921060, 16402973, 17257932, 18269102, 18538757, 17789433, 17161706, 16758479, 16378012, 16475551, 16562769, 16924455, 16807195, 16567669, 17267377, 17440589, 17753990, 17918444, 18145898, 18623457, 18842750, 18286561, 19339630, 19668064, 19964526, 19483953, 19980721, 21139296, 21917913, 22959579, 23706078, 24409125, 24864945, 25195907, 24765955, 25520115, 26332800, 26386337, 26205214, 26660971, 26549655, 27163653]
6329B7163653J034581Q78715Q82835J96029j64710P66934M41552P79799O11714
6320C2591102J085737Q09808O35198L9363P11438Q56354J177266O76245J523640
6311D0106151J520422R02304P06521N23603J032209J299477Q98699J161987K95878
6302D8447251O01538J193172P93158P16411Q3192O93298L64847O45918M76421
6293E4015206J387809K859536K678095L775982M044569M447249M078889L569783
6285H0857118J405970J143940Q84511j213063j873172j946009n09762L82507J283556
6276H0415596K851467M149963L557805J413029o4234m73999J002361K509647K381884
6267I7743519L134319K348084J898764J628275J316062J218813L78097j45683
$$ y = [27163653, 28198234, 29076949, 29959784, 30155813, 29991103, 30758037, 31199589, 31979388, 32591102, 33676839, 34486647, 35121845, 35161208, 35872646, 36729000, 37906266, 38582511, 40106151, 41626573, 42528877, 43235398, 43759001, 44791210, 46090687, 46989386, 48151373, 48447251, 49048789, 50241961, 51035119, 51751530, 51834722, 52528020, 52892867, 53538785, 54015206, 55403015, 58262551, 60940646, 64716628, 68761197, 73208446, 77287335, 80857118, 82263088, 83407028, 84291539, 83078476, 81205304, 79259295, 78749533, 79132040, 80415596, 83267063, 87417026, 90974831, 92387860, 92323626, 91849627, 92851988, 95361635, 97743519, 100877838, 103225922, 105124686, 106752961, 108069023, 109287836, 109665933, 109520250]
6259A09520250j825883j824699n73863m17737J389168j24898j456135k949320
6251A01736883k909723j806736L23388K151281L075890L032613J125297O26598
6243A07355491k011694l703561m534464m956065m560724l281777o91750P06211
6235H4321667K075204K119827N24861j665028l174322l293266m576697n228073
6227G1104173m529693l938265k706549k472449j045728j5487J080496R89952J099477
6218E9565927r7273o08370m56222r18446j938426k301642l107227k628583k055317
6209D5454421j845252n54110j043921j006861j153838j102593J76958n35167o86476
6200C7703161l2588p72716J24322L16825l24623l14434Q56246Q2799p5432n83977
$$ y = [109520250, 107694367, 105869668, 105295805, 104878068, 106267236, 106142338, 104686203, 101736883, 98827160, 97020424, 97343812, 99495093, 102570983, 105603596, 106728893, 107355491, 105343797, 101640236, 97105772, 92149707, 87588983, 84307206, 83615456, 84321667, 86396871, 88516698, 89041559, 87376531, 84202209, 80908943, 76332246, 71104173, 66574480, 62636215, 59929666, 57457217, 56411489, 56396002, 57476498, 58466450, 59565927, 59468654, 58860284, 58404062, 57485616, 55547190, 53245548, 50138321, 47509738, 45454421, 43609169, 43055059, 42011138, 41004277, 39850439, 38747846, 38924804, 38389637, 37703161, 37670573, 36897857, 37022179, 37339004, 37014381, 36699947, 37556193, 37638992, 37563560, 36979583]
6190C6979583J78463M00256L29487q76570p78846p39016l63966N35132K82742
6181C5947265l7536J78048J14595J342364O11749N62918P74030n14752r40133
6172C8038548n65356j2140n71036L36956k02169j34031j12403K56323K79621o57243
6162C6657070k79267K54319L97407J59556m23587m97044o30940j46212n55665
6153C4935637m51094n8011j27706M62510P35023M61476m13699r61343n77986j114346
6143C2890461n9997M95198o0896l17972L62772k01509o83731j717666l75734o31864
$$ y = [36979583, 37158046, 37558302, 37887789, 37011219, 36232373, 35493357, 35129391, 35664523, 35947265, 35909729, 36087777, 36202372, 37544736, 38156485, 38719403, 39493433, 38978681, 38038548, 37473192, 37461052, 36890016, 37226972, 37024803, 36890772, 36778369, 37034692, 37314313, 36657070, 36377803, 36632122, 37029529, 37189085, 36765498, 36268454, 35637514, 35491302, 34935637, 34484543, 34426532, 34298826, 34761336, 35496359, 35957835, 35544136, 34582793, 34004807, 32890461, 32830464, 33325662, 33264766, 32946794, 33309566, 33108057, 32424326, 30706660, 30330926, 29699062]
$$ [...]
##END NTUPLES=NMR SPECTRUM
##END=
