##TITLE=1H_CG-1191-a11
 CDCl3
 8sc, 
 16.2.2024
##JCAMPDX= 6.0         $$ Bruker NMR JCAMP-DX V2.0
##DATA TYPE= NMR SPECTRUM
##DATA CLASS= NTUPLES
##ORIGIN= UXNMR, Bruker Analytische Messtechnik GmbH
##OWNER= root
$$ XWIN-NMR		Version 3.5
$$ Fri Feb 16 15:29:02 2024 Russian Standard Time (UT+4h)  she@DPX200
##.OBSERVE FREQUENCY= 200.1313
##.OBSERVE NUCLEUS= ^1H
##.ACQUISITION MODE= SIMULTANEOUS
##.ACQUISITION SCHEME= undefined
##.AVERAGES= 8
##.DIGITISER RES= 18
##SPECTROMETER/DATA SYSTEM= spect
##.PULSE SEQUENCE= zg30
##.SOLVENT NAME= DMSO
##.SHIFT REFERENCE= (INTERNAL, DMSO, 0, 15.4736)
##AUDIT TRAIL= $$ (NUMBER, WHEN, WHO, WHERE, WHAT)
$$ ##TITLE= Audit trail, XWIN-NMR		Version 3.5
$$ ##JCAMPDX= 5.01
$$ ##ORIGIN= Bruker BioSpin GmbH
$$ ##OWNER= she
$$ F:/spectra/data/she/nmr/H-F/1/pdata/1/auditp.txt
$$ ##AUDIT TRAIL=  $$ (NUMBER, WHEN, WHO, WHERE, WHAT)
(   1,<2024-02-16 15:27:53.78 +0400>,<she>,<DPX200>,
      <created by zg, POWCHK disabled, PULCHK disabled
       configuration hash MD5:
       00 E9 B6 7A A2 85 ED C7 34 08 36 98 17 FE 4E 26
       data hash MD5: 16K
       4A 66 A8 24 48 B2 17 4A F2 EE 1C 57 BE 88 F9 88>)
(   2,<2024-02-16 15:27:58.15 +0400>,<she>,<DPX200>,
      <Start of raw data processing
       efp BC_mod = 2 LB = 0.24 FT_mod = 6 PKNL = 1 PHC0 = -24957.57 PHC1 = 8.85264 SI = 16K 
       data hash MD5: 16K
       DD BF 52 67 DF 78 55 58 A1 29 62 C0 3B F9 58 5C>)
(   3,<2024-02-16 15:28:17.15 +0400>,<she>,<DPX200>,
      <pk PHC0 = -2.722523 PHC1 = 4.2 
       data hash MD5: 16K
       6C 21 49 68 A3 66 FC BC 37 4C 53 AD 42 64 AC F7>)
(   4,<2024-02-16 15:28:20.53 +0400>,<she>,<DPX200>,
      <abs ABSG = 5 
       data hash MD5: 16K
       0A 0D 42 80 06 F0 F9 2A 77 03 4D 3E E9 DB 3F F8>)
$$ ##END=
$$ 
$$ hash MD5
$$ 7A 1E C4 0D 47 C8 89 77 14 D5 53 17 06 20 78 26
##$RELAX= 
##$RELAX= 
##$RELAX= 
##$RELAX= 
##$RELAX= 
##$RELAX= 
$$ Bruker specific parameters
$$ --------------------------
##$DU= <F:/spectra>
##$EXPNO= 1
##$NAME= <H-F>
##$PROCNO= 1
##$TYPE= <nmr>
##$USER= <she>
##$AMP= (0..31)
100 100 100 100 100 100 100 100 100 100 100 100 100 100 100 100 100 100 
100 100 100 100 100 100 100 100 100 100 100 100 100 100 
##$AQSEQ= 0
##$AQ_mod= 1
##$AUNM= <au_zg>
##$AUTOPOS= <>
##$BF1= 200.13
##$BF2= 200.13
##$BF3= 200.13
##$BF4= 200.13
##$BF5= 200.13
##$BF6= 200.13
##$BF7= 200.13
##$BF8= 200.13
##$BYTORDA= 1
##$CFDGTYP= 0
##$CFRGTYP= 5
##$CHEMSTR= <none>
##$CNST= (0..31)
1 1 145 1 1 1 1 1 1 1 1 1 1 1 1 1 1 1 1 1 1 1 1 1 1 1 1 1 1 1 1 1 
##$CPDPRG= <>
##$CPDPRG1= <>
##$CPDPRG2= <>
##$CPDPRG3= <>
##$CPDPRG4= <mlev>
##$CPDPRG5= <mlev>
##$CPDPRG6= <mlev>
##$CPDPRG7= <mlev>
##$CPDPRG8= <mlev>
##$CPDPRGB= <>
##$CPDPRGT= <>
##$D= (0..31)
0 1.2 0 0 0 0 0 0 0 0.06 0 0.03 0 0 0 0 0.0002 0 0 0 0 0 0 0 0 0 0 0 0 
0 0 0 
##$DATE= 1708082873
##$DBL= (0..7)
120 120 120 120 120 120 120 120 
##$DBP= (0..7)
150 150 150 150 150 150 150 150 
##$DBP07= 0
##$DBPNAM0= <>
##$DBPNAM1= <>
##$DBPNAM2= <>
##$DBPNAM3= <>
##$DBPNAM4= <>
##$DBPNAM5= <>
$$ [...]
##$SUBNAM3= <"">
##$SUBNAM4= <"">
##$SUBNAM5= <"">
##$SUBNAM6= <"">
##$SUBNAM7= <"">
##$SUBNAM8= <"">
##$SUBNAM9= <"">
##$SW= 18.0517328524113
##$SWIBOX= (0..15)
0 0 2 0 0 0 0 0 0 0 0 0 0 0 0 0 
##$SW_h= 3612.71676300578
##$TD= 16384
##$TD0= 1
##$TE= 0
##$TE2= 300
##$TE3= 300
##$TEG= 300
##$TL= (0..7)
0 120 120 120 120 120 120 120 
##$TP= (0..7)
150 150 150 150 150 150 150 150 
##$TP07= 0
##$TPNAME0= <>
##$TPNAME1= <>
##$TPNAME2= <>
##$TPNAME3= <>
##$TPNAME4= <>
##$TPNAME5= <>
##$TPNAME6= <>
##$TPNAME7= <>
##$TPOAL= (0..7)
0.5 0.5 0.5 0.5 0.5 0.5 0.5 0.5 
##$TPOFFS= (0..7)
0 0 0 0 0 0 0 0 
##$TUNHIN= 0
##$TUNHOUT= 0
##$TUNXOUT= 0
##$USERA1= <user>
##$USERA2= <user>
##$USERA3= <user>
##$USERA4= <user>
##$USERA5= <user>
##$V9= 5
##$VALIST= <valist>
##$VCLIST= <CCCCCCCCCCCCCCC>
##$VD= 0
##$VDLIST= <DDDDDDDDDDDDDDD>
##$VPLIST= <PPPPPPPPPPPPPPP>
##$VTLIST= <TTTTTTTTTTTTTTT>
##$WBST= 1024
##$WBSW= 4
##$XGAIN= (0..3)
0 0 0 0 
##$XL= 0
##$YL= 0
##$YMAX_a= 165497
##$YMIN_a= -264565
##$ZGOPTNS= <>
##$ZL1= 120
##$ZL2= 120
##$ZL3= 120
##$ZL4= 120
##$ABSF1= 15.43618
##$ABSF2= -2.615669
##$ABSG= 5
##$ABSL= 3
##$ALPHA= 0
##$AQORDER= 0
##$ASSFAC= 0
##$ASSFACI= 0
##$ASSFACX= 0
##$ASSWID= 0
##$AUNMP= <proc_1d>
##$AZFE= 0.1
##$AZFW= 0.1
##$BCFW= 0
##$BC_mod= 2
##$BYTORDP= 0
##$COROFFS= 0
##$CY= -3
##$DATMOD= 1
##$DC= 0
##$DFILT= <>
##$DTYPP= 0
##$F1P= 0
##$F2P= 0
##$FCOR= 1
##$FTSIZE= 16384
##$FT_mod= 6
##$GAMMA= 0
##$GB= 0
##$INTBC= 1
##$INTSCL= 3.70164e-10
##$ISEN= 128
##$LB= 0.24
##$LEV0= 0
##$LPBIN= 0
##$MAXI= 10000
##$MC2= 0
##$MEAN= 0
##$ME_mod= 0
##$MI= 1.114404
##$NCOEF= 0
##$NC_proc= -8
##$NLEV= 6
##$NOISF1= 3.799351
##$NOISF2= 2.8
##$NSP= 0
##$NTH_PI= 0
##$NZP= 0
##$OFFSET= 15.47364
##$PC= 1
##$PHC0= -24960.29
##$PHC1= 13.05264
##$PH_mod= 1
##$PKNL= yes
##$PPARMOD= 0
##$PSCAL= 0
##$PSIGN= 0
##$REVERSE= no
##$SF= 200.130009617454
##$SI= 16384
##$SIGF1= 3
##$SIGF2= 2
##$SINO= 5.538805
##$SIOLD= 16384
##$SREGLST= <1H.CDCl3>
##$SSB= 0
##$STSI= 16384
##$STSR= 0
##$SW_p= 3612.71676300578
##$SYMM= 0
##$S_DEV= 0
##$TDeff= 16384
##$TDoff= 0
##$TI= <>
##$TILT= no
##$TM1= 0
##$TM2= 0
##$TOPLEV= 0
##$USERP1= <user>
##$USERP2= <user>
##$USERP3= <user>
##$USERP4= <user>
##$USERP5= <user>
##$WDW= 1
##$XDIM= 16384
##$YMAX_p= 455053047
##$YMIN_p= -1034660
$$ End of Bruker specific parameters
$$ ---------------------------------
##NTUPLES= NMR SPECTRUM
##VAR_NAME=  FREQUENCY,     SPECTRUM/REAL,   SPECTRUM/IMAG
##SYMBOL=    X,             R,               I
##VAR_TYPE=  INDEPENDENT,   DEPENDENT,       DEPENDENT
##VAR_FORM=  AFFN,          ASDF,            ASDF
##VAR_DIM=   16384,         16384,           16384
##UNITS=     HZ,            ARBITRARY UNITS, ARBITRARY UNITS
##FACTOR=    0.220516191357247, 1,           1
##FIRST=     3096.73981045338, 0,            0
##LAST=      -515.976952552403, 0,           0
##MIN=       -515.976952552403, -1034660,    0
##MAX=       3096.73981045338, 455053047,    0
$$ Real data points
##PAGE= N=1
##DATA TABLE= (X++(R..R)), XYDATA
$$ [...]
7678A037837j38191j32894l96220m1198J15579L16994k9375k19068k34929J19262
$$ 1037837 899646 766752 370532 329334 444913 761907 732532 513464 278535 397797
7668C97797O7011m05537J31626K13632K36918Q7551m35668K83345N1972l36637
$$ 397797 464808 59271 190897 404529 641447 728998 293330 576675 628647 292010
7658B92010J7899K62351m624Q9652O992l9957K12805k98551K47514j85386K3238
$$ 292010 309909 572260 567636 657288 664280 624323 837128 538577 786091 600705 623943
7647F23943P9658l95000k64011j90286J00296L45525n894J63629p9881J59559
$$ 623943 703601 308601 44590 -145696 -45400 300125 294231 457860 377979 537538
7637E37538n02308k49144K42329j66340R6828p340K68059k21284k65338L34809
$$ 537538 35230 -213914 28415 -137925 -41097 -48437 219622 -1662 -267000 67809
7627F7809J44305l23020L8565n6822m2831m0832j32717L39698r6770j00665J20428
$$ 67809 212114 -110906 -72341 -129163 -171994 -212826 -345543 -5845 -102615 -203280 -82852
7616h2852M4973M51313o11752m760J45074q150J96736Q9334n32744M35485J78983
$$ -82852 -37879 413434 -198318 -203078 -58004 -66154 130582 219916 -312828 122657 301640
7605C01640j43667o7471Q2423L74675o308j89426J45371k87477k33337M16564
$$ 301640 157973 90502 172925 547600 541292 351866 497237 209760 -23577 392987
7595C92987j17448l80157J30051K12902J38934k07983k05757O7157N33180l44103
$$ 392987 275539 -104618 25433 238335 377269 169286 -36471 30686 563866 219763
7585B19763j65632n64782k48009K65230J58520J49783L65160k17307J4517j63177
$$ 219763 54131 -510651 -758660 -493430 -334910 -185127 180033 -37274 -22757 -185934
7575a85934k27316J76388K92226K67258m16712j99532K02091K92657O9217j98024
$$ -185934 -413250 -236862 55364 322622 -94090 -293622 -91531 201126 270343 72319
7565G2319j30974L23242M7453Q4407l38187n0026N3642J84636j098k4563n9286
$$ 72319 -58655 264587 312040 396447 58260 8234 61876 246512 245414 220851 161565
7554A61565j52647j23814K62928k56039Q7010j78204K47475N10188l33919k95757
$$ 161565 8918 -114896 148032 -108007 -20997 -199201 48274 558462 224543 -71214
7544g1214J18452l713j0816j90251P4843Q3377O5412j43694M5630J39464K1299
$$ -71214 47238 43525 32709 -157542 -82699 678 66090 -77604 -31974 107490 128789
7533A28789j33147j19559J5915l90j49612k93997j03057J78488N63994J77207
$$ 128789 -4358 -123917 -108002 -108392 -258004 -552001 -655058 -476570 87424 264631
7523B64631M5977m12168R9439j63742j18599j58256O3183K94515M32810m96614
$$ 264631 310608 -101560 -2121 -165863 -284462 -442718 -379535 -85020 347790 -148824
7513a48824l45405L01205O14343K13821m40989L4055p51943P6917j86755N38755
$$ -148824 -494229 -193024 421319 635140 194151 228206 -523737 -446820 -633575 -94820
7503i4820J22286m25459j71498k97416L66124L08152L95725K01750n26900J67241
$$ -94820 27466 -397993 -569491 -866907 -500783 -192631 203094 404844 -122056 45185
7493D5185K22566l50096k08522J27610O3951k58589k86446L71985J35465q1156
$$ 45185 267751 -82345 -290867 -163257 -99306 -357895 -644341 -272356 -136891 -218047
7483b18047k92918J66261J18509m1831J27307Q8977m6727m7401N41618J02024
$$ -218047 -510965 -344704 -226195 -268026 -140719 -51742 -98469 -145870 395748 497772
7473D97772k19637l5947L08139J27366l60259j20427Q11j00086k44805J96469
$$ 497772 278135 242188 550327 677693 317434 197007 197818 97732 -147073 49396
7463D9396j4802k72411K59763K75024R0767r1833J42632J14124O8487k29506k30286
$$ 49396 34594 -237817 21946 296970 387737 295904 438536 552660 621147 391641 161355
7452A61355p7000l8115P3723J39973J7587J34338l64643q1819J47031m2069j26413
$$ 161355 84355 46240 119963 259936 277523 411861 47218 -34601 112430 70361 -56052
7441e6052N98075j73941m66993O0977M52286j90713m2264L23554m78749K6468
$$ -56052 542023 368082 -98911 -37934 414352 223639 181375 504929 26180 52648
7431E2648o8329r2786J14100J99092n70521K73537K89903j27618K74257k50638
$$ 52648 -15681 -108467 5633 204725 -365796 -92259 197644 70026 344283 93645
7421I3645j22974l43718K89845M59427l08466K21440k41349j11318J66283l05582
$$ 93645 -29329 -373047 -83202 376225 67759 289199 47850 -63468 102815 -202767
7411b02767l68902N26007J12548L2157M238p8190K70736l16628K69506j09265
$$ -202767 -571669 -45662 66886 99043 103281 25091 295827 -20801 248705 139440
7401A39440L87368l97724p63425J13302N94898L34988J08521l9706l91249J65946
$$ 139440 526808 129084 -634341 -521039 73859 408847 517368 477662 86413 252359
7391B52359l30777j75010O05622K61764n92826j15460J9709l08242j1501J72675
$$ 252359 -78418 -253428 352194 613958 21132 -94328 -74619 -382861 -394362 -221687
7381b21687M39116j0908k27252j33467N2743M73183M0986j54499l63434K6420
$$ -221687 217429 206521 -20731 -154198 -101455 371728 412714 258215 -105219 -78799
7371g8799L0947p5966K67261j77690L8813l59925L70529L69801j27467j98598
$$ -78799 -47852 -123818 143443 -34247 4566 -355359 15170 384971 257504 58906
7361E8906j48541j35832O8034l59175Q6754N29360p4618j24785j24430J16637
$$ 58906 -89635 -225467 -157433 -516608 -429854 99506 24888 -99897 -224327 -107690
7351a07690M47227M2756k38022k86930m5081j75811L46029k00386J54084M43565
$$ -107690 339537 382293 144271 -142659 -187740 -363551 -17522 -217908 -63824 379741
7341C79741j78009j22211j01186j61240l90681L90572K11060l277k59344K72189
$$ 379741 201732 79521 -21665 -182905 -573586 -183014 28046 24769 -234575 37614
7331C7614K39038J17906K07560l32104m96873j93543L58061M8993j65537j11006
$$ 37614 276652 394558 602118 270014 -226859 -420402 -62341 -13348 -178885 -289891
7321b89891K68217R7902l01332q5244k38334k07534K986J30473N63957m4750O9203
$$ -289891 -21674 76228 -225104 -310348 -548682 -756216 -753230 -622757 -58800 -103550 -34347
7310c4347L03720q3679j99826j74106J61933o01806N34827K20304p1589L15334
$$ -34347 269373 185694 -14132 -188238 -26305 -628111 -93284 127020 55431 370765
7300C70765j95294n72073j6289J08796N4245J07045L09837j81148l91380J47089
$$ 370765 175471 -396602 -412891 -304095 -249850 -142805 167032 -14116 -405496 -258407
7290b58407L49880K44606L63098P8404k54007k32770o5033O0647j5906k31368
$$ -258407 91473 336079 699177 777581 523574 290804 225771 286418 270512 39144
7280C9144Q1084q5287M9425J21778J97833k75138k10151l581P53M4088N8112P7999
$$ 39144 120228 34941 84366 206144 403977 128839 -81312 -84893 -84140 -40052 18060 96059
7268I6059k55043K2767j68034n448N60936j10525J26188K83714n46199r7556j42070
$$ 96059 -158984 -136217 -304251 -309699 251237 140712 266900 550614 4415 -93141 -235211
7257b35211L62512r3495l8595M01353K4562n12299J61354J36321j35409m1010
$$ -235211 127301 33806 -4789 396564 421126 -91173 70181 206502 71093 30083
7247C0083k10362o5184l2636J95467m24422j82663M96468N45176l6910K08036
$$ 30083 -180279 -245463 -278099 -82632 -507054 -689717 -193249 351927 315017 523053
7237E23053p53643p73949J047602M3249k30151L84677k54877j32387J65184o5057
$$ 523053 -230590 -1004539 43063 86312 -143839 240838 -14039 -146426 18758 -46299
7227d6299n8391k26513O5529q9824j61254M12064j59617K64001k40577J87456
$$ -46299 -104690 -331203 -265674 -355498 -516752 -104688 -264305 -304 -240881 -53425
7217e3425J51569N984L06807j79681P2784l92354k11570K09116J04059J72782
$$ -53425 98144 104128 410935 231254 304038 -88316 -299886 -90770 13289 186071
7207A86071j50934j09644K53330l31298K91093O7810m38827M35721M75564k2629
$$ 186071 35137 -74507 178823 -152475 138618 206428 -232399 203322 678886 656257
7197F56257l83622p42948L85890O82760k11930n13279L12148m3032k74560M54676
$$ 656257 272635 -470313 -84423 598337 386407 -126872 185276 142244 -132316 322360
7187C22360K29650l53138k41344n79271K01230O55534K00496K42230k19939r6903
$$ 322360 552010 198872 -42472 -621743 -420513 235021 435517 677747 457808 360905
7177C60905n19492r7722L06425k822K42535l6593L8220p1444m72795J41867P4364
$$ 360905 -158587 -256309 50116 47294 289829 253236 291456 220012 -252783 -110916 -36552
7166c6552J05395K99997J48006l86901j90783o8312k17472K69617k40112J68445
$$ -36552 68843 368840 516846 129945 -60838 -129150 -346622 -77005 -317117 -148672
7156a48672K41932L4107k03375N91710k39779L07000j98839l55235J72898N45034
$$ -148672 93260 127367 -76008 515702 275923 582923 384084 28849 201747 746781
7146G46781L32290K73266K3977N04277K37037K59953m79665q34750Q3468l1846
$$ 746781 1079071 1352337 1376314 1880591 2117628 2377581 1897916 1063166 1146634 1114788
7136A114788j90023n32078k72670K88442n04832P7319M98117o4661K86068m18454
$$ 1114788 924765 392687 120017 408459 -96373 -19054 479063 414402 700470 282016
7126B82016j40371M1332M72237o13024K36273k50181N2988L8082l0340j49077
$$ 282016 141645 182977 655214 42190 278463 28282 81270 119352 89012 -60065
7116f0065J218J57283j66487j6768l3676J24479N14253J10782q0934k54323n11764
$$ -60065 -58847 98436 -68051 -84819 -118495 5984 520237 631019 550085 295762 -216002
7105b16002K59885r0847m4287o6465K86493L25477r6061m18996J13393o9508j04154
$$ -216002 43883 -46964 -91251 -157716 128777 454254 358193 -60803 52590 -16918 -121072
7094a21072O06359m81526o0892M2679J34567j84700J05510j29829K34719k5272
$$ -121072 485287 3761 -57131 -14452 120115 -64585 40925 -88904 145815 120543
7084A20543m1723k19733k171N20199J00514o90085J14719J75042J28080N1049
$$ 120543 78820 -140913 -143084 377115 477629 -212456 -97737 77305 205385 256434
7074B56434l97817j81625j27880L8639O4359L58391o9119J73144r5340k90827
$$ 256434 -141383 -323008 -450888 -412249 -347890 10501 -58618 114526 19186 -271641
7064b71641P3223R2099M15483N4421L0770p52729R2850N41732o7447k57073k21639
$$ -271641 -198418 -106319 309164 363585 394355 -358374 -265524 276208 208761 -48312 -269951
7053b69951J63817l16610O9999L59385l3705j23089L72600j52845k5882P9567
$$ -269951 -106134 -422744 -352745 6640 -27065 -150154 222446 69601 43719 123286
7043A23286K61693k45556j96526j29649k4936N48588J6028r4713j1227J8309P9407
$$ 123286 384979 139423 -57103 -186752 -211688 336900 352928 258215 246988 265297 344704
7032C44704l31882L48579j38765j69059J212K0336M36074N145j54521R0690l22195
$$ 344704 12822 361401 222636 53577 54789 75125 511199 516344 361823 452513 130318
7021A30318K59390N92239M90781l92653L0762r5999j23918j5906p4093L13715
$$ 130318 389708 981947 1472728 1080075 1110837 1014838 890920 875014 800921 1114636
7011A114636l52611q3723l17093l54663K05508K61737r0642m4682m7163L52746
$$ 1114636 762025 678302 361209 6546 212054 473791 383149 338467 291304 644050
7001F44050j58681N5334k74488j52489O6606K1550P7801k66422J86336K62236
$$ 644050 485369 540703 266215 113726 180332 201882 279683 13261 199597 461833
6991D61833l63647k79917L53630n26794O5306J95027K08910J62823K99361R5062
$$ 461833 98186 -181731 171899 -354895 -289589 -94562 114348 277171 576532 671594
6981F71594k92890l99848l0585p5293j18267K90711J01117l24487j39530L41351
$$ 671594 378704 -21144 -51729 -127022 -245289 45422 146539 -177948 -317478 23873
6971B3873J7179j38430L67036k81429m23693L54158K66756j96807k3424N22866
$$ 23873 41052 -97378 269658 -11771 -435464 -81306 185450 -11357 -34781 488085
6961D88085K16593o65590j06500J18763K07770R5886j0872K13796J91012m43994
$$ 488085 704678 39088 -67412 51351 259121 355007 344135 557931 748943 304949
6951C04949k25205J46337j96919k92915k47652L80925M43164J42640m25394r2411
$$ 304949 79744 226081 29162 -263753 -511405 -130480 312684 455324 29930 -62481
6941f2481J42489M41965j98750L8674q1482L78724k13759m33988k09208k27857
$$ -62481 80008 521973 323223 361897 280415 659139 445380 11392 -197816 -425673
6931d25673M86898L04772l54319K0871L33126k36703r479L0602m20079k22049
$$ -425673 61225 365997 11678 32549 365675 128972 119493 150095 -269984 -492033
6921d92033N58034K59129J39938k38123J82613P1769K65813r2796J6447m40584
$$ -492033 66001 325130 465068 226945 409558 481327 747140 654344 670791 230207
6911B30207P3923L51649m97251o6760R3871M2151j77841j80778K97234r4945k8855
$$ 230207 304130 655779 158528 91768 185639 227790 49949 -130829 166405 71460 42605
6900D2605K47031o93372L01318Q6438J24520j13692K20160l86475l12936L35614
$$ 42605 289636 -403736 -102418 -15980 108540 -5152 215008 -171467 -484403 -148789
6890a48789L18178K09720n16313L8075M7942K66907M03986m47210m76914o6309
$$ -148789 169389 379109 -137204 -99129 -51187 215720 619706 172496 -304418 -370727
6880c70727J49737J41478K71493j91902l6368J3008L67137N2782l91438j30595
$$ -370727 -220990 -79512 191981 79 -36289 -23281 343856 396638 5200 -125395
6870a25395L25121J5999j5070j56661J49757J25915j23090j98781L09165M6154
$$ -125395 199726 215725 200655 43994 193751 319666 196576 -2205 306960 353114
6860C53114k52145L78869m40799J56288P9065j1569p3819j3773k31189R0903J40618
$$ 353114 100969 479838 39039 195327 274392 262823 189004 175231 -55958 34945 175563
6849A75563K63016L04742j75559j60892l44929J01160P7712O8709L37692j28283
$$ 175563 438579 743321 567762 406870 61941 163101 240813 309522 647214 518931
6839E18931l94033j36002N06601J82986k84075J09137n9839L11881N5717j88595
$$ 518931 124898 -11104 495497 678483 394408 503545 443706 755587 811304 622709
6829F22709j65212k40710J78497L50647m26240J11253L94925o34646m55251K40042
$$ 622709 457497 216787 395284 745931 319691 430944 825869 191223 -264028 -23986
6819b3986Q8255N43823k18495j85644Q6729j60169j92241O0888L18852j70445
$$ -23986 64269 608092 389597 203953 290682 130513 -61728 -840 318012 147567
6809A47567j47420K89945K6641J92627J08219k56803L08282j41972Q3590K55062
$$ 147567 147 290092 316733 509360 617579 360776 669058 527086 610676 865738
6799H65738l77056o4585K95402k96134q471J36857k98658q7305M99592K896M07682
$$ 865738 488682 424097 719499 423365 414894 551751 253093 165788 665380 668276 1075958
6788A075958j27622k90255k49929K37564K0695J36080K41577Q0837m50397j30939
$$ 1075958 948336 658081 408152 645716 666411 802491 1044068 1124905 674508 543569
6778E43569K48687r0734l02661j05208j47488k22692r8018K57211J87547N4202
$$ 543569 792256 701522 398861 293653 146165 -76527 -174545 82666 270213 324415
6768C24415j52184j65982J01000O40678L2484N3064p46331j52852Q29076L24177
$$ 324415 172231 6249 107249 747927 780411 833475 87144 -65708 763368 1087545
6758A087545j41581k25501n3688k7611J03881j34964J52042k41378J15315p360
$$ 1087545 945964 720463 666775 639164 743045 608081 760123 518745 634060 626700
6748F26700M76448M01373l91065J67371j03122r6370m11934J34983K75821o0453
$$ 626700 1103148 1504521 1113456 1280827 1177705 1081335 669401 804384 1080205 1019752
6738A019752k64700m51808K44940J22435j21195N56449J43878J20333k2559n08754
$$ 1019752 755052 303244 548184 670619 549424 1105873 1249751 1370084 1347525 838771
6728H38771K16364j73728m7240l7745O93744m01140r7791R9556p7965K06849m6573
$$ 838771 1055135 881407 834167 796422 1490166 1089026 991235 1090791 1012826 1219675 1173102
6717A173102j4281M1224j65306q950O8580K85119m6951j22070j95370j01170K25092
$$ 1173102 1158821 1200045 1034739 1025789 1094369 1379488 1332537 1210467 1015097 913927 1139019
6706A139019k09427k82161j98679j29179L86120N13174j19683r7748K30168J76161
$$ 1139019 929592 647431 448752 319573 705693 1218867 1099184 1001436 1231604 1407765
6696A407765J88632O925m6966o34471j4279k74977N68685K61920j82876m51563
$$ 1407765 1596397 1603322 1556356 921885 907606 632629 1201314 1463234 1280358 828795
6686H28795j32090J63875n40117K74162L16755l1298j27668m8710N03379k6677
$$ 828795 696705 860580 320463 594625 911380 880082 752414 703704 1207083 1180406
6676A180406l392l27233l52945J40643M29588o0020M24131q9189k64008N4785
$$ 1180406 1177014 849781 496836 637479 1067067 1007047 1431178 1341989 1077981 1132766
6666A132766l43595L44465k58679J59838k34500L17072J40745Q2511p9181p645
$$ 1132766 789171 1133636 874957 1034795 800295 1117367 1258112 1340623 1261442 1253797
6656A253797J85169k81847l64052K14082l6259O718j565k38869J64261k19280
$$ 1253797 1438966 1157119 793067 1007149 970890 977608 976043 737174 901435 682155
6646F82155q9828l17271L32703L10356K36034M28410j17313m8570L31026j63021
$$ 682155 592327 275056 607759 918115 1154149 1582559 1465246 1416676 1747702 1584681
6636A584681J28141k9401n25610L40332k27988P7246J2117J90977N2272k04497
$$ 1584681 1712822 1683421 1157811 1498143 1270155 1347401 1359518 1550495 1602767 1398270
6626A398270J01058j29259J59960N0970p6856K35298p9890m8661j96917L63763
$$ 1398270 1499328 1370069 1530029 1580999 1504143 1739441 1659551 1610890 1413973 1777736
6616A777736k69914J44801L28243N83944k23297L06832l8905o9674J7329K35144
$$ 1777736 1507822 1652623 1980866 2564810 2341513 2648345 2609440 2539766 2557095 2792239
6606B792239O67254L00052P009J54878M5105K06314m2558p10399j77138j96299
$$ 2792239 3459493 3759545 3766554 3921432 3966537 4172851 4130293 3419894 3242756 3046457
6596C046457N88660L5497p9770j60331J92670O22852K09016L43220N64513j67135
$$ 3046457 3635117 3670614 3590844 3430513 3623183 4246035 4455051 4798271 5362784 5195649
6586E195649J86625N07980J33804J74785J00893m87645k25857l47148l52570j82522
$$ 5195649 5382274 5890254 6024058 6198843 6299736 5812091 5586234 5239086 4886516 4703994
6576D703994n2920j39251j3062J28930R9757m88465N0042M09711L88881N13725
$$ 4703994 4651074 4511823 4498761 4627691 4727448 4238983 4289025 4698736 5087617 5601342
6566E601342l39923K02480M72195p3663q03034j86275k53357j084849k88101q057
$$ 5601342 5261419 5463899 5936094 5862431 5059397 4873122 4619765 3534916 3246815 3238758
6556C238758q5217N5711K53461l74481j75582J2569j26322q1696N52808m40214
$$ 3238758 3153541 3209252 3462713 3088232 2912650 2925219 2798897 2717201 3270009 2829795
6546B829795J5664K00606k56908O001n3293j81361L99331P11026k17928m67998
$$ 2829795 2845459 3046065 2789157 2795158 2741865 2560504 2959835 3670861 3452933 2984935
6536B984935J78048J82817k6305k6980m61091j07981K92463J00667k80575N6343
$$ 2984935 3162983 3345800 3319495 3292515 2831424 2723443 3015906 3116573 2835998 2892341
6526B892341O52777j51020l69885J67599J40347k3477j67232l18349J82613J67917
$$ 2892341 3545118 3394098 3024213 3191812 3332159 3308682 3141450 2823101 3005714 3173631
6516C173631Q9880P0151j19165l6259l17255N23186j31814j13658K36377L8305
$$ 3173631 3263511 3333662 3214497 3178238 2860983 3384169 3252355 3138697 3375074 3413379
6506C413379k47968j64445J8004n3777M40065K90815j0348J29985k60630J43938
$$ 3413379 3165411 3000966 3018970 2965193 3405258 3696073 3685725 3815710 3555080 3699018
6496C699018o7381j88929J10409L10023j630l43165K8245j28733j01161J65590
$$ 3699018 3631637 3442708 3553117 3863140 3861510 3518345 3546590 3417857 3316696 3482286
6486C482286k45518k36291L27111L49671k01852M72009r0290k11716K6897N1213
$$ 3482286 3236768 3000477 3327588 3677259 3475407 3947416 3857126 3645410 3672307 3723520
6476C723520J85369k90116k14877R2562L60093J91124m5874j38254K22380N08700
$$ 3723520 3908889 3618773 3403896 3496458 3856551 4047675 4001801 3863547 4085927 4594627
6466D594627j60235o62628K87106j10283L60963N78904j89836M1492n368j1098
$$ 4594627 4434392 3771764 4058870 3948587 4309550 4888454 4698618 4740110 4734742 4723644
6456D723644j1044M6820J17362K99282M28565M08729J55688K0567K70299J94578
$$ 4723644 4712600 4759420 4876782 5176064 5604629 6013358 6169046 6189613 6459912 6654490
6446F654490r5232J022605L64566J88869P69691Q83681O96685P37157O68936o3589
$$ 6654490 6559258 7581863 7946429 8135298 8904989 9788670 10485355 11222512 11891448 11827859
6436A1827859L5436o66292j151886j119939m62447k78192n8654J27686J10508
$$ 11827859 11863295 11197003 10045117 8925178 8462731 8184539 8125885 8253571 8364079
6427H364079j80706M78633M89969K47813k95479K73077J071167N28691P16415
$$ 8364079 8183373 8662006 9151975 9399788 9104309 9377386 10448553 10977244 11693659
6418A1693659J206880J508407J517246J599137P59673O89552P3273p99724j609765
$$ 11693659 12900539 14408946 15926192 17525329 18285002 18974554 19047827 18248103 16638338
6409A6638338k081263j369691j633994o76926m73180j004149m98164K05900o42974
$$ 16638338 14557075 13187384 11553390 10876464 10403284 9399135 8900971 9106871 8463897
6400H463897p37893K7937J70077J24070N82606K85157K98991K68037Q25777J222491
$$ 8463897 7726004 7753941 7924018 8048088 8630694 8915851 9214842 9482879 10308656 11531147
6390A1531147M48745O39323M54161j82949r13492j162110j050090r97595q03003
$$ 11531147 11979892 12619215 13073376 12890427 11976935 10814825 9764735 8767140 7964137
6381G964137n18995l86533m21233l64418k2740J20432j42829o87713k16504j7994
$$ 7964137 7445142 7058609 6637376 6272958 6250218 6370650 6227821 5540108 5323604 5305610
6371E305610K22626K08082k13971o473l70115j62576K66845j14736l6444m2056
$$ 5305610 5528236 5736318 5522347 5515874 5145759 4983183 5250028 5135292 5098848 5056792
6361E056792J41461N42K46901J08348k20906J32587K73276r7445k41509O06983
$$ 5056792 5198253 5198795 5445696 5554044 5333138 5465725 5739001 5641556 5400047 6007030
6351F007030m34779J35356l9123k20270J53787l0403o6379K35867L01333j32883
$$ 6007030 5572251 5707607 5668484 5448214 5602001 5571598 5505219 5741086 6042419 5909536
6341E909536J79422l69244J36844n11671K08254J78584j49387k57275M41977M81867
$$ 5909536 6088958 5719714 5856558 5344887 5553141 5731725 5582338 5325063 5767040 6248907
6331F248907N4501J23870L16153J3053n69076L22778J00950K56616J87923P00246
$$ 6248907 6303408 6427278 6743431 6756484 6187408 6510186 6611136 6867752 7055675 7755921
6321G755921k16866O6083L79846k58085o6335N6944j57333K09000K83494K08174
$$ 7755921 7539055 7605138 7984984 7726899 7660564 7717508 7560175 7769175 8052669 8260843
6311H260843O51464p35764N225M26515L45853P9811L3102M71267J86878K48592
$$ 8260843 8912307 8176543 8181768 8608283 8954136 9033947 9067049 9538316 9725194 9973786
6301I973786K39471J37045J00666o2254Q6868l1191L02295O8688M74474M11158
$$ 9973786 10213257 10350302 10450968 10388714 10475582 10444391 10746686 10815374 11289848 11701006
6291A1701006l44843r9170J87482j38753K51959O58900J53258j08306L17263O99208
$$ 11701006 11356163 11256993 11444475 11305722 11557681 12216581 12369839 12261533 12578796 13278004
6281A3278004L1133L10836R8127N13985M14437q4041Q7397O9495P59335R2169
$$ 13278004 13309137 13619973 13718100 14232085 14646522 14562481 14649878 14719373 15478708 15570877
6271A5570877N68007N79369J70489O5190N00194K96126N85560J008801O91358
$$ 15570877 16138884 16718253 16888742 16953932 17454126 17750252 18335812 19344613 20035971
6262B0035971M05089K78576M61326K52121N45354L87611M65045N29023p5888l77296
$$ 20035971 20441060 20719636 21180962 21433083 21978437 22366048 22831093 23360116 23284228 22906932
6252B2906932N51569N29183P38828O20642J060545Q21508J002875O44658K64159
$$ 22906932 23458501 23987684 24726512 25347154 26407699 27229207 28232082 28876740 29140899
6243B9140899J37602M31630L12069m4110O54950O81169Q62872Q02580N19520O45614
$$ 29140899 29278501 29710131 30022200 29978090 30633040 31314209 32177081 32979661 33499181 34144795
6233C4144795K09517P48879M11028O11251R33365P8538M16843K6730R12196R62602
$$ 34144795 34354312 35103191 35514219 36125470 37058835 37137373 37554216 37580946 38493142 39455744
6223C9455744J405111J237029J564475J609097N07219J140577J603557J023521
$$ 39455744 40860855 42097884 43662359 45271456 45778675 46919252 48522809 49546330
6215D9546330J764768J424607K161849K430978K620900L928351M185182N360302
$$ 49546330 51311098 52735705 54897554 57328532 59949432 63877783 68062965 73423267
6207G3423267O714758Q206470R220098J1389056J1151263J0093385M868090k870508
$$ 73423267 80138025 88344495 97564593 108953649 120104912 130198297 135066387 132195879
6199A32195879q397792r568369q122985m543104j206808J381278M071185N945830
$$ 132195879 123798087 114229718 106106733 101563629 100356821 101738099 105809284 111755114
6191A11755114P591748Q323461P622578M013987L19734K7609K962268N824542
$$ 111755114 119346862 127670323 135292901 139306888 139626622 139654231 142616499 148441041
6183A48441041P954718O738902K204874k669142p009636p351078m407111K26082
$$ 148441041 156395759 163134661 165339535 162670393 155660757 148309679 143902568 144128650
6175A44128650L740866N939760P698928M994696J666292L58959J877933L492092
$$ 144128650 147869516 153809276 161508204 166502900 168169192 168528151 170406084 173898176
6167A73898176M456048L878389K051774J562712J148551K188028l56169p917196
$$ 173898176 178354224 182232613 184284387 185847099 186995650 189183678 188827509 180910313
6159A80910313j4725434j6768312j4235536j0243149p323256l750524k555675
$$ 180910313 166184879 149416567 135181031 124937882 117614626 113864102 111308427
6152A11308427p32118P20811K196587M639798O732945R159252J1721160J4430959
$$ 111308427 110576309 111297120 113493707 118133505 124866450 134025702 145746862 160177821
6144A60177821J5557720J5166497J0582431L025603p287282j6225780k0742532
$$ 160177821 175735541 190902038 201484469 204510072 197222790 180997010 160254478
6137A60254478k0070979j6245580j2609004r475591p415649o733994n183374l492633
$$ 160254478 140183499 123937919 111328915 101853324 94437675 87703681 82520307 79027674
6129G9027674k439588j860277j14226R50108J016517J631915K351207M000071
$$ 79027674 76588086 74727809 74613583 75563691 76580208 78212123 80563330 84563401
6121H4563401N171269O726885Q611934Q322682O764554K542225k864057q019453
$$ 84563401 89734670 96461555 105073489 113396171 120160725 122702950 119838893 111819440
6113A11819440j2080172j3675615j1872928r745720p478953n896938m798436m153376
$$ 111819440 99739268 86063653 74190725 64445005 56966052 51069114 46270678 42117302
6105D2117302l150260k501649k592167k158117j679986k044554r47206j133125
$$ 42117302 38967042 36465393 33873226 31715109 30035123 27990569 27043363 25910238
6097B5910238j215425j155900j165430r46319j106937k00633q02227q66879q55847
$$ 25910238 24694813 23538913 22373483 21427164 20320227 20119594 19317367 18450488 17594641
6088A7594641l69958m47148q05018o26523l32552l06521n43320k68402m86150
$$ 17594641 17224683 16777535 15972517 15345994 15013442 14706921 14163601 13895199 13409049
6079A3409049q4501J9391l62775N504n33787o15477l76459j32408l11650L885
$$ 13409049 13324548 13343939 12981164 12986668 12452881 11837404 11460945 11328537 11016887 11020772
6069A1020772r6871m82200l02102j54255k46379k90738J5277J29165p17531p2914
$$ 11020772 10923901 10441701 10139599 9985344 9738965 9448227 9463504 9592669 8875138 8802224
6059H802224n12055J18969M58998k26969J90371k28430o23775M3395J28116j94235
$$ 8802224 8290169 8409138 8868136 8641167 8831538 8603108 7979333 8022728 8150844 7956609
6049G956609J96687k32969l66658K9189l44795k22522J21371k15235O0752L72437
$$ 7956609 8153296 7920327 7553669 7582858 7238063 7015541 7136912 6921677 6982429 7354866
6039G354866p8688j12565m33912n80274p6470N63781j47298o02220j14469J18814
$$ 7354866 7276178 7163613 6729701 6149427 6072957 6636738 6489440 5887220 5772751 5891565
6029E891565L05141J91662M3515k62771Q7039j71198l68666p1960K29769k73625
$$ 5891565 6196706 6388368 6431883 6169112 6256151 6084953 5716287 5644327 5874096 5600471
6019E600471j88703K21124M91974j17837k78669k72199L20243q8432J86166k86296
$$ 5600471 5411768 5632892 6124866 6007029 5728360 5456161 5776404 5687972 5874138 5587842
6009E587842k91998j75989N0144N92231k98243j23577j54971J38996j6093k11251
$$ 5587842 5295844 5119855 5169999 5762230 5463987 5340410 5185439 5324435 5308342 5097091
5999E097091L1117J69917J25973k23720J19161J75577m45677j17047N1590J68920
$$ 5097091 5128208 5298125 5424098 5200378 5319539 5495116 5049439 4932392 4983982 5152902
5989E152902o1190l66433k87436L2391K05970R3252o5976j06173j23160L52239
$$ 5152902 5091712 4725279 4437843 4470234 4676204 4769456 4703480 4597307 4474147 4826386
5979D826386j51455k57787K73885m56541L5987K01811j25741j38600K73212K81030
$$ 4826386 4674931 4417144 4691029 4234488 4270475 4472286 4346545 4207945 4481157 4762187
5969D762187j64766K7322o4655j67149l24617N26541J3902R0195J73401l6974
$$ 4762187 4597421 4624743 4560088 4392939 4068322 4594863 4608765 4698960 4872361 4835387
5959D835387j38811Q7195p2128M25234o1913K5887k07718j56865L00869L35245
$$ 4835387 4696576 4783771 4711643 5136877 5074964 5100851 4893133 4736268 5037137 5372382
5949E372382k04059n8356J59855Q0297J66920L1483L41039o9270j810J71475m08470
$$ 5372382 5168323 5109967 5269822 5350119 5517039 5548522 5889561 5820291 5818481 5989956 5581486
5938E581486K2531L04121K47695j10921o2463L25391N62567k85940M3949J91153
$$ 5581486 5604017 5908138 6155833 6044912 5982449 6307840 6870407 6584467 6628416 6819569
5928F819569p09002J84024J83783L54646O41995l69272r5578O14128m08917O7001
$$ 6819569 6110567 6294591 6478374 6833020 7475015 7105743 7010165 7624293 7215376 7282377
5918G282377N83805L23634q6052p3647k1750K87205k9080K55657M82852N7050
$$ 7282377 7866182 8189816 8103764 8030117 8008367 8295572 8266492 8522149 9005001 9062051
5908I062051N19732O32140K49548N44420P80303P48306R66467J443397Q30869
$$ 9062051 9581783 10213923 10463471 11007891 11788194 12536500 13502967 14946364 15777233
5899A5777233M62270j37493m24796o18732p07546j101724n55255k40199o71579
$$ 15777233 16239503 16102010 15677214 15058482 14350936 13249212 12693957 12453758 11782179
5890A1782179l95093J91429k44288L27265K77587k4607J47310P07939P61857M06970
$$ 11782179 11387086 11578515 11334227 11661492 11939079 11914472 12061782 12769721 13531578 13938548
5880A3938548J112325J284022J199897K642998J518999J306284N78157j60742
$$ 13938548 15050873 16334895 17534792 20177790 21696789 23003073 23581230 23420488
5872B3420488q57587k112012j805888j557170j659476r83929q0291l98280m24567
$$ 23420488 22562901 20450889 18645001 17087831 15428355 14444426 14364135 13965855 13541288
5863A3541288k7453n39943K38649K15224j34887l8217O73833K80407j6027O24580
$$ 13541288 13513835 12973892 13212541 13427765 13292878 13254661 13928494 14208901 14192874 14817454
5853A4817454O33745J010559K65381Q41473M51372Q2203o14199n86724j057345
$$ 14817454 15451199 16461758 16727139 17568612 18019984 18102187 17487988 16901264 15843919
5844A5843919j514860m56276j01977K05916l62292o72792K4858m97675L64494
$$ 15843919 14329059 13872783 13770806 13976722 13614430 12941638 12966496 12468821 12833315
5835A2833315K06251K89894N42074j63277k69376M60742K86941r1004k09984j79403
$$ 12833315 13039566 13329460 13871534 13708257 13438881 13899623 14186564 14095560 13885576 13706173
5825A3706173o753L30243J57288K42373K51045K30536m6571O17849m06784j93420
$$ 13706173 13699420 14029663 14186951 14429324 14680369 14910905 14864334 15482183 15075399 14881979
5815A4881979N56245j7423K84910N73429K73484o23579N82983Q31910k00453k13049
$$ 14881979 15438224 15420801 15705711 16279140 16552624 15929045 16512028 17343938 17143485 16930436
5805A6930436L72988M34432k51380M62128O75384L78377P07607L28069K43998
$$ 16930436 17303424 17737856 17486476 17948604 18623988 19002365 19709972 20038041 20282039
5796B0282039M03703M23720K46952J59403M81352P18843O53304K51318K27795
$$ 20282039 20685742 21109462 21356414 21515817 21997169 22716012 23369316 23620634 23848429
5787B3848429L59627L62440O51291J52878L89346N37500R04538Q90308O23754
$$ 23848429 24208056 24570496 25221787 25374665 25764011 26301511 27206049 28096357 28720111
5778B8720111O80980N81809J157896J432569J154145R28842J229887J899018J892841
$$ 28720111 29401091 29982900 31140796 32573365 33727510 34656352 35886239 37785257 39678098
5769C9678098J755455K186042J992558K747806L807282M592969M646822N243755
$$ 39678098 41433553 43619595 45612153 48359959 52167241 56760210 61407032 66650787
5761F6650787O842481Q428978R645752J0317216J0154915Q478199L295442l044072
$$ 66650787 73493268 81922246 91567998 101885214 112040129 120518328 123813770 120769698
5753A20769698q196270j0463370j0307850p921128n947647m838192l273089j762185
$$ 120769698 112573428 102110058 91802208 83881080 77933433 73095241 69822152 68059967
5745F8059967p88449J3926J327052J866278K671470L801964M857784O177006Q154433
$$ 68059967 67271518 67285444 68612496 70478774 73150244 76952208 81809992 87986998 96141431
5736I6141431J0185555J2504173J4988931J6941357J8391750J6273166P911048
$$ 96141431 106326986 118831159 133820090 150761447 169153197 185426363 193337411
5729A93337411m378785j5593491k1101471k1528516j8306411j4097276j0026541
$$ 193337411 188958626 173365135 152263664 130735148 112428737 98331461 88304920
5722H8304920p908780n303776m363060m172309k676831j655588j72703n5697M29420
$$ 88304920 80396140 75092364 70729304 66556995 63880164 62224576 62051873 61996176 62425596
5713F2425596J434233K501482L577467M595968N259526O682214P103287O045800
$$ 62425596 63859829 66361311 69938778 74534746 79794272 86476486 93579773 99625573
5705I9625573L505272o03564n045258q585800j0056989r855303p237058n841228
$$ 99625573 103130845 102527281 97482023 88896223 78839234 68983931 61746873 55905645
5697E5905645m045683l114663k398089k458295j908360j159581j587504r28235
$$ 55905645 51859962 48745299 46347210 43888915 41980555 40820974 39233470 38305235
5689C8305235r80211q96643j08220o63796j79559m42608l78038o00424o59294
$$ 38305235 37325024 36428381 36320161 35656365 35476806 35034198 34656160 34055736 33396442
5680C3396442p21535r41936l58422j181936j77674p70299n26178k83524L50182
$$ 33396442 32674907 31732971 31374549 30192613 30014939 29244640 28718462 28434938 28785120
5671B8785120O34299j58616L52850Q96397Q84828L83722N34718l93916n08480
$$ 28785120 29419419 29260803 29613653 30510050 31394878 31778600 32313318 31919402 31410922
5662C1410922k68554m87417p31346k78898Q3363p5344j80368L88116l4006L01278
$$ 31410922 31142368 30654951 29923605 29644707 29728070 29652726 29472358 29860474 29826468 30127746
5652C0127746K59256O36763L4842M34562J013878J236382J421750K59353K63243
$$ 30127746 30387002 31023765 31058607 31493169 32507047 33743429 35165179 35424532 35687775
5643C5687775J83942J092255O53957N59179Q69981R15842O44988Q92017K98219
$$ 35687775 35871717 36963972 37617929 38177108 39047089 39962931 40607919 41499936 41798155
5634D1798155P81051J293199M53810J67837j17378N97450J470515J882180K903954
$$ 41798155 42579206 43872405 44326215 44494052 44376674 44974124 46444639 48326819 51230773
5625E1230773K621673K756792L493558M270408N241006O597307Q267048R568159
$$ 51230773 53852446 56609238 60102796 64373204 69614210 76211517 84478565 94046724
5617I4046724J1717472J3277279J3764736J1487034O321264k603292j0616327
$$ 94046724 105764196 119041475 132806211 144293245 150614509 148011217 137394890
5610A37394890j2601234j0591523o373790k461167R20316L551049N923146P416722
$$ 137394890 124793656 114202133 107828343 105367176 106287492 109838541 115761687 123178409
5602A23178409O605651L907112r70932k798330j028432J664296N221127P527153
$$ 123178409 129784060 133691172 132720240 129921910 128893478 130557774 135778901 143306054
5594A43306054P453896M968996M19478o603635r928048q943684n568253k154087
$$ 143306054 150759950 155728946 156148424 149544789 139616741 130673057 125104804 122950717
5586A22950717L9207j250815n117523q244770q327297o496500l346694R0387K252209
$$ 122950717 122989924 121739109 116621586 108376816 100049519 93553019 90206325 90296712 92548921
5577I2548921N194613O364784O945434P119048M015587l134642j1817926j5009990
$$ 92548921 97743534 104108318 111053752 118172800 122188387 119053745 107235819 92225829
5569I2225829j3879663j1901812q325646o567274n066593m084316l681099k750983
$$ 92225829 78346166 66444354 58118708 51551434 46484841 42400525 38719426 35968443
5561C5968443k483662k353975j446015j660475j534030j369701j111867p39491
$$ 35968443 33484781 31130806 29684791 28024316 26490286 25120585 24008718 23269227
5553B3269227j048572j138802n74149j234520p65938n43276j035338o58331n65382
$$ 23269227 22220655 21081853 20507704 19273184 18507246 17963970 16928632 16270301 15704919
5544A5704919L5102k54484n03455o20226n02131m77413M7236N6498k81688j094185
$$ 15704919 15740021 15485537 14982082 14361856 13859725 13382312 13429548 13486046 13204358 12110173
5534A2110173j09398m55399n52083q1945l76889k56144k81634m56163L02331l78942
$$ 12110173 12000775 11545376 10993293 10911348 10534459 10278315 9996681 9540518 9842849 9463907
5524I463907l11040o9680k11641R6091m96052l93370j96172m52006J45573P4654
$$ 9463907 9152867 9083187 8871546 8967637 8471585 8078215 7882043 7430037 7575610 7650264
5514G650264P2838L67977j23045m72745k49854m44773k1385K7636j02624j25122
$$ 7650264 7723102 8091079 7968034 7495289 7245435 6800662 6779277 6806913 6704289 6579167
5504F579167Q2126k16889k9662K29926k99660j22661l72072N88512j08484j16389
$$ 6579167 6661293 6444404 6414742 6644668 6345008 6222347 5850275 6438787 6330303 6213914
5494F213914r5236R3538K2885l14127m4146n8208l8732J2568k27456J53210J50448
$$ 6213914 6118678 6212216 6235101 5920974 5876828 5818620 5779888 5792456 5565000 5718210 5868658
5483E868658j58163l62537j06806l58895K03832K9226K8674J43228N62349m35888
$$ 5868658 5710495 5347958 5241152 4882257 5086089 5115315 5143989 5287217 5849566 5413678
5473E413678J68441M8004Q1948M90967o03265K08756j69480n1209J78770k35319
$$ 5413678 5582119 5630123 5712071 6203038 5599773 5808529 5639049 5587840 5766610 5531291
5463E531291k95080k11340K67113N10890l48724k4312L44767j70755m3146r7740
$$ 5531291 5236211 5024871 5291984 5802874 5454150 5429838 5774605 5603850 5560704 5462964
5453E462964k70949k59336j34015k85529J98255j34505k33305J86239j43795m8087
$$ 5462964 5192015 4932679 4798664 4513135 4711390 4576885 4343580 4529819 4386024 4337937
5443D337937K86424j63060k40911J63675m33740K53634L11208L34370K03693o63224
$$ 4337937 4624361 4461301 4220390 4384065 3950325 4203959 4515167 4849537 5053230 4390006
5433D390006m34419q7885K92761k25814k56510M70037L01089k24204k32284M0996
$$ 4390006 3955587 3867702 4160463 3934649 3678139 4148176 4449265 4225061 3992777 4033773
5423D033773L4607M18407O1840l33036m53320M41779K35162j06104j41087K69490
$$ 4033773 4068380 4486787 4548627 4215591 3762271 4204050 4439212 4333108 4192021 4461511
5413D461511N77046p03135J03385J71987k22827K90581k0514k34719J69419K17625
$$ 4461511 5038557 4335422 4438807 4610794 4387967 4678548 4658034 4423315 4592734 4810359
5403D810359p81973J74748K30137m01607K87234Q9184l3479l93002l36203J46994
$$ 4810359 4028386 4203134 4433271 4031664 4318898 4408082 4374603 3981601 3645398 3792392
5393C792392O52128L9491o7862j60563K08376j41606n80672K57631K01237J46217
$$ 3792392 4444520 4484011 4416149 4255586 4463962 4322356 3741684 3999315 4200552 4346769
5383D346769N1239K91573o7675n8895k9804j80500O442l1155L75901q1548J46159
$$ 4346769 4398008 4689581 4621906 4563011 4533207 4352707 4359149 4327994 4703895 4622347 4768506
5372D768506K37775q4488K26822J32709K22137j23563K57208M77066M47193M31434
$$ 4768506 5006281 4921793 5148615 5281324 5503461 5379898 5637106 6114172 6561365 6992799
5362F992799R06550j0181j21184k4770m03104l56492l95491n60430o62237l41043
$$ 6992799 7899349 7889168 7767984 7743214 7340110 6983618 6588127 6027697 5365460 5024417
5352E024417J16899R4398O5289L46667o9124m12541k27975K39400m7843L33621
$$ 5024417 5141316 5235714 5301003 5647670 5578546 5166005 4938030 5177430 5129587 5463208
5342E463208L04521k89878N59160K761L41165O97040L88684N68193K26422Q12727
$$ 5463208 5767729 5477851 6037011 6039772 6380937 7077977 7466661 8034854 8261276 9074003
5332I074003J801496J343277J483483J591632N35062p65640j391618j755729j447642
$$ 9074003 10875499 12218776 13702259 15293891 15828953 15063313 13671695 11915966 10468324
5323A0468324j276187o61065n71052l42879m18471l83603P9341n86777R0736k97140
$$ 10468324 9192137 8531072 7960020 7617141 7198670 6815067 6894408 6307631 6398367 6101227
5313F101227Q3655R4974R9976k14885o5254L32904J31350K24655O44583N92384
$$ 6101227 6184882 6279856 6379832 6164947 6099693 6432597 6563947 6788602 7433185 8025569
5303H025569O24944P11954J237342N32317J183444J447607N39749J412238M72277
$$ 8025569 8650513 9362467 10599809 11132126 12315570 13763177 14302926 15715164 16187441
5294A6187441j317244j532158j843560j545161q47338p33200l32298p28476k49451
$$ 16187441 14870197 13338039 11494479 9949318 9101980 8368780 8036482 7308006 7058555
5285G058555k40572k54815k17409q11179j05297J46278M6496j66175K07371j91915
$$ 7058555 6817983 6563168 6345759 5534580 5429283 5575561 5622057 5455882 5663253 5471338
5275E471338R9069J53518L14514L27704p5189L95707L426Q3064N07754N96508
$$ 5471338 5570407 5723925 6038439 6366143 6290954 6686661 6690087 6773151 7280905 7877413
5265G877413O56535P14083l51555m49516n23525o37795n10131j55567o12626k47413
$$ 7877413 8533948 9248031 8896476 8446960 7923435 7285640 6775509 6619942 6007316 5759903
5255E759903l00146p4198J2605l8816J69029n7921K93047J72259l40502L17835
$$ 5759903 5459757 5385559 5398164 5359348 5528377 5470456 5763503 5935762 5595260 5913095
5245E913095k62976n54045m6375l6668l02313L41344J69412l45623L30401K93510
$$ 5913095 5650119 5096074 5049699 5013031 4710718 5052062 5221474 4875851 5206252 5499762
5235E499762l16694k65963N6219K19870l12990j67310K07066j90011J76930P15261
$$ 5499762 5183068 4917105 4973324 5193194 4880204 4712894 4919960 4729949 4906879 5622140
5225E622140O09500K28688k77066N3158L99253l69354j06453K67780K98925l26428
$$ 5622140 6231640 6460328 6183262 6236420 6635673 6266319 6159866 6427646 6726571 6400143
5215F400143j35132k8662M41558M87088P4461j70148R1477k16291j94427M04683
$$ 6400143 6265011 6236349 6677907 7164995 7239456 7069308 7160785 6944494 6750067 7154750
5205G154750j29403k7141N44341L6216M98120J99735O42865K8576L98759L88095
$$ 7154750 7025347 6998206 7542547 7578763 8076883 8276618 8919483 8948059 9346818 9734913
5195I734913K04185L21191J97314r42769j70444m4654k62567k58698j08019p6557
$$ 9734913 9939098 10260289 10457603 9514834 9344390 9299736 9037169 8778471 8670452 8593895
5185H593895K06034j84714J82846j09261m02598O08125K13849k58232j18011M98751
$$ 8593895 8799929 8615215 8798061 8688800 8286202 8894327 9108176 8849944 8731933 9230684
5175I230684l95797J70246L68876K24840n47922j68527n3607l28084k50872K87600
$$ 9230684 8834887 9005133 9374009 9598849 9050927 8882400 8828793 8500709 8249837 8537437
5165H537437q9635J48582m03592k869J64487n1018k4944J56312J88409j12835
$$ 8537437 8447802 8596384 8192792 8189923 8354410 8303392 8278448 8434760 8623169 8510334
5155H510334j93567R5274j94875l78344J0645o0356P2143J07165J09005L94587
$$ 8510334 8316767 8412041 8217166 7838822 7849467 7789111 7861254 7968419 8077424 8472011
5145H472011j11759k16899K80950P5397M01972K92035j82073K80931K32613M64013
$$ 8472011 8360252 8143353 8424303 8499700 8901672 9193707 9011634 9292565 9525178 9989191
5135I989191M60301M79541K75988J74640L05540k93734n56979J44756K43380j39762
$$ 9989191 10449492 10929033 11205021 11379661 11685201 11391467 10834488 10979244 11222624 11082862
5125A1082862m41912J79831l6220k76966K15244K7439N50612N42443j76255n37054
$$ 11082862 10640950 10820781 10784561 10507595 10722839 10750278 11300890 11843333 11667078 11130024
5115A1130024M28731O08946n7601J55059J54717j24918k38932L89579O00577J06948
$$ 11130024 11558755 12167701 12110100 12265159 12419876 12294958 12056026 12445605 13046182 13153130
5105A3153130K70380N82743J50008j09363K39209N51915j74800M50352L54049
$$ 13153130 13423510 14006253 14156261 14046898 14286107 14838022 14663222 15113574 15467623
5096A5467623k02520N28107Q87657P11290k56702L64821M38179K84829R51588
$$ 15467623 15265103 15793210 16680867 17392157 17135455 17500276 17938455 18223284 19174872
5087A9174872O53853L51139J576474P27831R67427J916221J447703J478313J397828
$$ 19174872 19828725 20179864 21756338 22484169 23451596 25367817 26815520 28293833 29691661
5078B9691661R10509J546249Q40715K42535J42838N57442K19904M89721N46081
$$ 29691661 30602170 32148419 32989134 33231669 33374507 33931949 34151853 34641574 35187655
5069C5187655K90489O51558l8912Q5547L198k755k79195n73956k56018L34590
$$ 35187655 35478144 36129702 36090790 36176337 36179535 36176780 35897585 35323629 35067611 35402201
5059C5402201N34570j23589j29327K03888K88562M74838J92954K12943m59600
$$ 35402201 35936771 35813182 35683855 35887743 36176305 36651143 36844097 37057040 36597440
5050C6597440k19402l88105p04296j122785k57128j85348n96289j323640p30629
$$ 36597440 36378038 35989933 35285637 34162852 33905724 33720376 33124087 31800447 31069818
5041C1069818r32935o56013o06157q12812p64960q5056J94486r5496O90630O37633
$$ 31069818 30136883 29480870 28874713 28061901 27296941 27211885 27406371 27310875 28001505 28639138
5031B8639138N89568J151383J701513J579408K323401K799349L300554L995891
$$ 28639138 29228706 30380089 32081602 33661010 35984411 38783760 42084314 46080205
5023D6080205L600567K92797k211529j594711o56596n96380M16117Q80879O61076
$$ 46080205 49680772 49973569 47762040 46167329 45510733 44914353 45330470 46211349 46872425
5014D6872425J018P83258J44411k4884o31092m97967K88039N85828R74501K40045
$$ 46872425 46873443 47656701 47801112 47776228 47145136 46647169 46935208 47521036 48495537 48735582
5004D8735582O15028R94206L61228p0708K44513j67915J8391l82634r27557n86404
$$ 48735582 49350610 50344816 50706044 50635336 50879849 50711934 50730325 50347691 49420134 48833730
4994D8833730n02075m18424j91341l54034p33060j005694q93204r57483j149920
$$ 48833730 48331655 47913231 47721890 47367856 46634796 45629102 44735898 43778415 42628495
4985D2628495p79803q04924q04061q93624j429288j189258j178116j310030j099492
$$ 42628495 41848692 41043768 40239707 39346083 37916795 36727537 35549421 34239391 33139899
4976C3139899j469870o87754m46200l86611J62352K0817p88431l02674Q4188J08448
$$ 33139899 31670029 30982275 30536075 30149464 30311816 30332633 29544202 29241528 29325716 29434164
4966B9434164K93325j19304L47825J18122K18987Q0218N38483M14780J064357
$$ 29434164 29727489 29608185 29956010 30074132 30293119 30373337 30911820 31326600 32390957
4957C2390957N56538J05366O96074Q62782Q09291Q48210J867974J218531J496149
$$ 32390957 32947495 33052861 33748935 34611717 35421008 36269218 38137192 39355723 40851872
4948D0851872J040696P75141K14153O76374N23227J266617J289353J388281K331709
$$ 40851872 41892568 42667709 42881862 43558236 44081463 45348080 46637433 48025714 50357423
4939E0357423K774312K747428K144495J830531J772581J036996O36439Q3048j69490
$$ 50357423 53131735 55879163 58023658 59854189 61626770 62663766 63300205 63383253 63213763
4930F3213763P16209O22837Q21619J472402J622136R32354J118021q5004j242551
$$ 63213763 63929972 64552809 65374428 66846830 68468966 69401320 70519341 70434337 69191786
4921F9191786k95041q53771p18819p5096N8302M64121Q88739J296411R53857J113168
$$ 69191786 68896745 68042974 67324155 67249059 67307361 67771482 68660221 69956632 70910489 72023657
4911G2023657N20655P18752N24724J071395J656117K358528K918810L438272L938284
$$ 72023657 72544312 73263064 73787788 74859183 76515300 78873828 81792638 85230910 89169194
4902H9169194L988370L160552M78843j379031j173959k36241J486165L308825
$$ 89169194 93157564 96318116 96796959 95417928 94243969 94007728 95493893 98802718
4894I8802718M523129N266294P465616R239248J1213175J4027166J7826110K2915453
$$ 98802718 103325847 108592141 116057757 125297005 136510180 150537346 168363456 191278909
4886A91278909K9016170L6229122M7917385N2057720N3447334M5106407l587473
$$ 191278909 220295079 256524201 304441586 356499306 409946640 455053047 451465574
4879D51465574n3084980o4263798n4707159l7543056k3405579j4202600q362005
$$ 451465574 398380594 334116796 279409637 241866581 218461002 204258402 195896397
4872A95896397m073828k728091l762465n004914q259133r137821p248218m621429
$$ 195896397 191822569 189094478 185332013 180327099 172067966 162930145 155681927 151060498
4864A51060498k822618m90118k9437n70779k499909o403780r446430q888594p699645
$$ 151060498 148237880 147747762 147718325 147147546 144647637 138243857 128797427 119908833 112209188
4855A12209188o861626n411246l970004l331354j416569q46336j426083o02555
$$ 112209188 105347562 99936316 95966312 92634958 91218389 90372053 88945970 88343415
4847H8343415n46354l37767l19008J23208K96870N88543P31846R53691J768496
$$ 88343415 87797061 87459294 87140286 87263494 87560364 88148907 88880753 89834444 91602940
4838I1602940K021417L001568K851446K517649J822653J347548J104932N04196
$$ 91602940 93624357 96625925 99477371 101995020 103817673 105165221 106270153 106774349
4830A06774349n19038K51628p0352j124969j009644j223328q36151r95287n99815
$$ 106774349 106255311 106506939 106436587 105311618 104301974 103078646 102242495 101247208 100647393
4821A00647393Q52124O19438R41210K517083K829665L262649L775636M241129
$$ 100647393 101499517 102118955 103060165 105577248 108406913 111669562 115445198 119686327
4813A19686327M676656N334645N079116N135075M988507M308162L460539J918983
$$ 119686327 124362983 129697628 134776744 139911819 144900326 149208488 152669027 154588010
4805A54588010j269394k312722l135141l805130l859128m242047m655125n062654
$$ 154588010 153318616 151005894 147870753 144065623 140206495 135964448 131309323 126246669
4797A26246669n142513n160133m863266l465573j964105j561337m59417J123302
$$ 126246669 121104156 115944023 111080757 107615184 105651079 104089742 103630325 104753627
4789A04753627J390859J664468K257373L062110L924341M969278N313548N450374
$$ 104753627 106144486 107808954 110066327 113128437 117052778 122022056 127335604 132785978
4781A32785978N703617N665963M772009L497599K558246J685130K61180r41876
$$ 132785978 138489595 144155558 148927567 152425166 154983412 156668542 156929722 155987846
4773A55987846j546741k386841k532075k573527k081379q44430L96381n40095
$$ 155987846 154441105 152054264 149522189 146948662 144867283 144022853 144419234 143879139
4765A43879139n348919p869661p417810n580833k733448j981719R6418J341694
$$ 143879139 138530220 130660559 123242749 117661916 114928468 112946749 113043167 114384861
4757A14384861K484636L598417M259964M483281M617495M409533L546528K327551
$$ 114384861 116869497 120467914 124727878 129211159 133828654 138238187 141784715 144112266
4749A44112266K587020K048765J480323P01030j211412l551660n707094o344234
$$ 144112266 146699286 148748051 150228374 150929404 149717992 146166332 140459238 134115004
4741A34115004n927228o657059o059963m541765m336672m077125l389699k718746
$$ 134115004 128187776 121530717 115470754 110928989 106592317 102515192 99125493 96406747
4733I6406747k386234j373945j99403j82771N63300K44012R50842L41661N79647
$$ 96406747 94020513 92646568 92447165 92264394 92827694 93071706 94022548 94364209 94943856
4724I4943856m0484p33046o57615j034126j658698j966800l013474l987634m087760
$$ 94943856 94903372 94170326 93512711 92478585 90819887 88853087 85839613 81851979 77764219
4715G7764219m318982l849356m241710l555726l292735l477244l017096k839985
$$ 77764219 73445237 69595881 65354171 61798445 58505710 55028466 52011370 49171385
4707D9171385k196990j913485j833685j442934j390787q66853j228707j219677
$$ 49171385 46974395 45060910 43227225 41784291 40393504 39526651 38297944 37078267
4699C7078267q95697o40172j134956r04841q13754o87340o95777m65977m00110
$$ 37078267 36182570 35542398 34407442 33502601 32688847 32001507 31305730 30839753 30439643
4690C0439643l78783n41871j76532j60029m90163p9495L8772l2094N71061n4851
$$ 30439643 30060860 29518989 29342457 29182428 28692265 28612770 28651542 28619448 29190509 29135658
4680B9135658j43073K94652p0971O0824O14708n5620k48367j33722L30559q2033
$$ 29135658 28992585 29287237 29216266 29277090 29891798 29836178 29587811 29454089 29784648 29702615
4670B9702615M10198N58749Q28933J568545O34175J619999J945399Q89651J168225
$$ 29702615 30112813 30671562 31500495 33069040 33703215 35323214 37268613 38158264 39326489
4661C9326489O83577k08766j58437m94601r23730j220145j159705j068393j094032
$$ 39326489 40010066 39801300 39642863 39148262 38224532 37004387 35844682 34776289 33682257
4652C3682257J18905J73642Q33486O97391P64163J533163P95423l1449J1934o20863
$$ 33682257 33801162 33974804 34808290 35505681 36269844 37803007 38598430 38566981 38578915 37958052
4642C7958052q75393r99005j374939j767962r09487l99913p95664l52203k86277
$$ 37958052 37082659 36083654 34708715 32940753 32031266 31631353 30835689 30483486 30197209
4633C0197209k26442N3920N8711J30356J25436N77577M04273N72706J266950J473601
$$ 30197209 29970767 30024687 30083398 30213754 30339190 30916767 31321040 31893746 33160696 34634297
4623C4634297J041314J264521J393911J713156R48890R38614N29783o83722j572264
$$ 34634297 35675611 36940132 38334043 40047199 40996089 41934703 42464486 41780764 40208500
4614D0208500j315947r59228j275699l50462r62930n90560j07689K32981J17888
$$ 40208500 38892553 37933325 36657626 36307164 35344234 34753674 34645985 34878966 34996854
4605C4996854K18751L30601j35646K80219Q74006R60096L34894O43307J571236
$$ 34996854 35215605 35546206 35410560 35690779 36564785 37524881 37859775 38503082 40074318
4596D0074318J513959J453788J779870K297052K130698K660659K851115K905109
$$ 40074318 41588277 43042065 44821935 47118987 49249685 51910344 54761459 57666568
4588E7666568K768759L134926K201436K177517J081102N25575j13346j095580
$$ 57666568 60435327 63570253 65771689 67949206 69030308 69555883 69442537 68346957
4580F8346957p63197j031290p17515l15048k06163M37093N97316J191073J075842
$$ 68346957 67583760 66552470 65834955 65519907 65313744 65750837 66348153 67539226 68615068
4571F8615068J566317J939519K186472K832145L138583L869856M034925M712831
$$ 68615068 70181385 72120904 74307376 77139521 80278104 84147960 88182885 92895716
4563I2895716N213918N761606O162715O274630O897534P084642Q122394R376284
$$ 92895716 98109634 103871240 110033955 116308585 123206119 130290761 138413155 147789439
4555A47789439J1162949J3953208J7918204K3346714K9310884L4297269L6181300
$$ 147789439 158952388 172905596 190823800 214170514 243481398 277778667 313959967
4548C13959967L3121746K6070647J3784364k001249j8917741l2153649l9175608
$$ 313959967 347081713 373152360 386936724 384935475 366017734 333864085 294688477
4541B94688477m2378643l9692107l3622363k6655584j9195736j4437787j1121166
$$ 294688477 252309834 212617727 178995364 152339780 133144044 118706257 107585091
4534A07585091q766616o673541n571834m565742m047803m079841k863399k518779
$$ 107585091 98818475 92144934 86573100 82007358 77959555 73879714 71016315 68497536
4526F8497536j922665k573539k242169j911500k675482k491308k756801k470654
$$ 68497536 66574871 64001332 61759163 59847663 57172181 54680873 51924072 49453418
4518D9453418j954115j825559j884278j024681r81168j034617n12338r76164o23412
$$ 49453418 47499303 45673744 43789466 42764785 41783617 40749000 40236662 39260498 38637086
4509C8637086o30879p28441j72613M04298M11803P75443M20062O08963n4970j2205
$$ 38637086 38006207 37277766 37105153 37509451 37921254 38696697 39116759 39725722 39670752 39658547
4499C9658547O0912q15133r14606j314767j724073j521392j164714j796227j132556
$$ 39658547 39719459 38904326 37989720 36674953 34950880 33429488 32264774 30468547 29335991
4490B9335991q71246j001917p92276p53655n97571j81663p10519m17544m62043
$$ 29335991 28464745 27462828 26670552 25916897 25319326 25137663 24427144 24009600 23547557
4481B3547557m78134j17654j95777k81489l26454j97809k20099N42730j89307
$$ 23547557 23069423 22951769 22755992 22474503 22148049 21950240 21730141 22272871 22083564
4472B2083564k16161L5858p09287O06564j06087n89202M58523j73320j80553j84332
$$ 22083564 21867403 21903261 21193974 21800538 21694451 21105249 21563772 21390452 21209899 21025567
4462B1025567J28518m84193o5993Q2296j40892N1941K07931K07599j17518K05182
$$ 21025567 21154085 20669892 20603899 20686195 20545303 20597244 20805175 21012774 20895256 21100438
4452B1100438Q7787o34291k09483L22504J57408m03468k68633j52193j2357k89500
$$ 21100438 21188225 20553934 20344451 20666955 20824363 20420895 20152262 20000069 19987712 19698212
4442A9698212M46344K44385N40272L61758M05604j0705J19048J043260J095689
$$ 19698212 20144556 20388941 20929213 21290971 21696575 21685870 21804918 22848178 23943867
4433B3943867K6092J88323O09167P15211Q83245K86687J249039J002330J031167
$$ 23943867 23969959 24158282 24767449 25482660 26365905 26652592 27901631 28903961 29935128
4424B9935128J886033K059919J334840J316321R50939J376893R11662n6527m62046
$$ 29935128 31821161 33881080 35215920 36532241 37483180 38860073 39771735 39715208 39253162
4415C9253162L40466L13100k75360n05091p25856p88453j167541l75443J70888
$$ 39253162 39593628 39906728 39631368 39126277 38400421 37611968 36444427 36068984 36239872
4406C6239872k91118l50049O44465R1930N14224j85040l11343k75517q70923r85488
$$ 36239872 35948754 35598705 36243170 36335100 36849324 36664284 36352941 36077424 35206501 34221013
4396C4221013l00724l58336q4972l35283j38992M42684L14866q2907n91579q2960
$$ 34221013 33920289 33561953 33476981 33141698 33002706 33445390 33760256 33677349 33085770 33002810
4386C3002810j84159m39188q80456j61470J07056R7235J34336J88969K5948K2933
$$ 33002810 32818651 32379463 31499007 31337537 31444593 31541828 31676164 31865133 31891081 31914014
4376C1914014J94198J57250r6771o3955m07833K28612J84494K89350N88893n08763
$$ 31914014 32108212 32265462 32168691 32104736 31696903 31925515 32110009 32399359 32988252 32479489
4366C2479489j80697k4226m08797j90634n0911M99223N22336O03677O91407j27948
$$ 32479489 32298792 32274566 31865769 31675135 31624224 32123447 32645783 33249460 33940867 33812919
4356C3812919n32630k23551k30343n88539l59934J4642m27683J49767L7772K19134
$$ 33812919 33280289 33056738 32826395 32237856 31877922 31892564 31464881 31614648 31652420 31871554
4346C1871554K4410M23701J7869J60002n60891o80826l72226n20810o29927p09588
$$ 31871554 31895964 32319665 32337534 32497536 31936645 31255819 30883593 30362783 29732856 29023268
4336B9023268j44887M80105M87423k16728j01403N2775r35341r51785o19289p34512
$$ 29023268 28878381 29358486 29845909 29629181 29527778 29580553 28645212 27693427 27074138 26339626
4326B6339626n25074n20829m56182p84257p35905l89438j143k39213N4146r0153
$$ 26339626 25814552 25293723 24837541 24053284 23317379 22927941 22926798 22687585 22741731 22651578
4316B2651578o79502j29874o53398n24679m62029p40772k07147p16250m43954
$$ 22651578 21972076 21842202 21188804 20664125 20202096 19461324 19254177 18537927 18093973
4307A8093973r6213p79524o16856k78851o99070n04336o50872k56761j83872p00245
$$ 18093973 17997760 17218236 16601380 16322529 15623459 15119123 14468251 14211490 14027618 13327373
4297A3327373m31859k23271j1041o2728n59374K44996j1627j28848J44416m12451
$$ 13327373 12895514 12672243 12661202 12598474 12039100 12284096 12272469 12143621 12288037 11875586
4287A1875586J04932k41600m0393K48590Q4487J26631j04938k37886k61792l25906
$$ 11875586 11980518 11738918 11698525 11947115 12031602 12158233 12053295 11815409 11553617 11227711
4277A1227711N463M77695m4889j47373J81099O8497P9389O3999K65528J73836
$$ 11227711 11233174 11710869 11665980 11518607 11699706 11768203 11847592 11911591 12177119 12350955
4267A2350955M2638j94632r8861M69729N68318o4565M8250J28686k44072K56929
$$ 12350955 12393593 12198961 12100100 12569829 13138147 13073582 13121832 13250518 13006446 13263375
4257A3263375L45491j27718K1049k49957J8879k95579k57695M61318j2354j50339
$$ 13263375 13608866 13481148 13502197 13252240 13271119 12975540 12717845 13179163 13166809 13016470
4247A3016470m07485K54238m54947n2201N81862r2612j9138l91640k41964O48788
$$ 13016470 12608985 12863223 12408276 12356075 12937937 12845325 12826187 12434547 12192583 12841371
4237A2841371L44691k62250P0819L14680J97326l95190j45839L81446l7930l4978
$$ 12841371 13186062 12923812 12994631 13309311 13506637 13111447 12965608 13347054 13309124 13274146
4227A3274146L22076o8237O04O23165K73955j85028M15208N61341l37696N5846
$$ 13274146 13596222 13527985 13528589 14151754 14425709 14240681 14655889 15217230 14879534 14935380
4217A4935380O3380J27229K82489J15982r3988N37995l5939l9740K94789j13460
$$ 14935380 14998760 15125989 15408478 15524460 15430472 15968467 15932528 15892788 16187577 16074117
4207A6074117L00825J31367O1273J28689j56165N14079K60393J40140N0751M5986
$$ 16074117 16374942 16506309 16567582 16696271 16540106 17054185 17314578 17454718 17505469 17551455
4197A7551455k06151M56314O16322l05292L8105L77496J44514K13178j26949N86320
$$ 17551455 17345304 17801618 18417940 18112648 18150753 18528249 18672763 18885941 18758992 19345312
4187A9345312P75662J85311l27049N01052O41345j0993N60744O35999O3650k19979
$$ 19345312 20120974 20306285 19979236 20480288 21121633 21110640 21671384 22307383 22371033 22151054
4177B2151054K41155L24697L36733N79162O3674M20748P70471q224q6147R94307
$$ 22151054 22392209 22716906 23053639 23632801 23696475 24117223 24887694 24879470 24793323 25787630
4167B5787630O16689O96046K30986K18898K8357J121280J015573N22269O56972
$$ 25787630 26404319 27100365 27331351 27550249 27578606 28699886 29715459 30237728 30894700
4158C0894700O82016J216484J038783Q55989N70419J137632J057128J123346J539843
$$ 30894700 31576716 32793200 33831983 34687972 35258391 36396023 37453151 38576497 40116340
4149D0116340P79463K33848Q84433J54657K45545R44317Q51337Q11687N09761
$$ 40116340 40895803 41129651 42014084 42168741 42414286 43358603 44209940 45021627 45531388
4140D5531388P13949J075225J526723J973250J698463K030605J555596K015669
$$ 45531388 46245337 47320562 48847285 50820535 52518998 54549603 56105199 58120868
4132E8120868Q98654Q18929J26922J174393J248907Q50702R57162J741402J644518
$$ 58120868 59019522 59838451 59965373 61139766 62388673 63239375 64196537 65937939 67582457
4123F7582457J563014J349401J295834Q85021J553024O67792Q42076J027456N89547
$$ 67582457 69145471 70494872 71790706 72675727 74228751 74896543 75738619 76766075 77355622
4114G7355622k19055M84762J451233K285958K374855L285605L744242M013362
$$ 77355622 77136567 77621329 79072562 81358520 83733375 87018980 90763222 94776584
4106I4776584K818784K047575P06412q89454N9610P6451M168j48014m54527k96643
$$ 94776584 97595368 99642943 100349355 99459901 99519511 99595962 99600130 99452116 98997589 98700946
4096I8700946R1067K92116J77097J33343R55913Q48730Q47515J76736j8936n24365
$$ 98700946 98792013 99084129 99261226 99394569 100350482 101199212 102046727 102223463 102204527 101680162
4086A01680162n68841l2768M12125J122811J935178K223618L452928M021812L347008
$$ 101680162 101111321 101078553 101490678 102613489 104548667 106772285 110225213 114247025 117594033
4077A17594033K660043J890929J485689J582704P37197J529930R66776P81174
$$ 117594033 120254076 122145005 123630694 125213398 125950595 127480525 128447301 129228475
4069A29228475K2200l63353O0000K10397k81947q55465p72186n98219m05600J29892
$$ 129228475 129250675 128887322 128947322 129157719 128875772 128020307 127248121 126649902 126244302 126374194
4059A26374194J97979N65397J47630P14270J464732J753760J450663J140848n5757
$$ 126374194 126572173 127137570 127285200 127999470 129464202 131217962 132668625 133809473 133753716
4050A33753716m49219j818308k104753k175586j105899m0508l28053J52140L12939
$$ 133753716 133304497 131486189 129381436 127205850 126099951 126059443 125731390 125883530 126196469
4041A26196469N86585L38875l92833q04427k20171K09868j13688j95530m81548
$$ 126196469 126783054 127121929 126729096 125924669 125704498 125914366 125800678 125605148 125123600
4032A25123600q74352j212016j709057j828814j984697j558620j537250k513351
$$ 125123600 124249248 123037232 121328175 119499361 117514664 115956044 114418794 111905443
4024A11905443l331995l502504m627389l456204j645925j422742r62287j12197
$$ 111905443 108573448 105070944 100443555 96987351 95341426 93918684 92956397 92844200
4016I2844200N28456P61512n7338R1551N8861l11901j388922p42877q87610n29230
$$ 92844200 93372656 94134168 94076830 94168381 94227242 93915341 92526419 91783542 90895932 90366702
4006I0366702o61848r01496q77419j124767q48531l82276Q33765Q00383M73601
$$ 90366702 89704854 88803358 87925939 86801172 85952641 85570365 86404130 87204513 87678114
3997H7678114j346177k089870k999411l717845k878257k268466j719410m10330
$$ 87678114 86331937 84242067 81242656 77524811 74646554 72378088 70658678 70248348
3989G0248348o44199J68325K1107l86380j016278r85472j495935r15998o63265
$$ 70248348 69604149 69772474 69793581 69407201 68390923 67405451 65909516 64993518 64330253
3980F4330253j117078l84720m28557j95244q33082o16939N4600k45361l25227
$$ 64330253 63213175 62828455 62399898 62204654 61371572 60754633 60809233 60563872 60238645
3971F0238645n81382o62302j110548j181177j277279j003885p14153k34920n90936
$$ 60238645 59657263 58994961 57884413 56703236 55425957 54422072 53707919 53472999 52882063
3962E2882063n96421M16419N38524L94543J78269M40054M40705Q35133O25440
$$ 52882063 52285642 52702061 53240585 53635128 53813397 54253451 54694156 55529289 56154729
3953E6154729Q14435L79321L27527N04928L11318M32092l76021J06476N36271
$$ 56154729 56969164 57348485 57676012 58180940 58492258 58924350 58548329 58654805 59191076
3944E9191076M76072M70483j79947L76133N247L37115J64468J53434j4545q0975
$$ 59191076 59667148 60137631 59957684 60333817 60339064 60676179 60840647 60994081 60979536 60898561
3934F0898561L52480K99022Q9893K11599l69206o19357k79443o09512M88297M94879
$$ 60898561 61251041 61550063 61639956 61851555 61482349 60862992 60583549 59974037 60462334 60957213
3924F0957213L27493P58273J72945J009276O63071J024137J104557R58853L05554
$$ 60957213 61284706 62042979 62215924 63225200 63888271 64912408 66016965 66975818 67281372
3915F7281372O64487Q07554Q67133P45761N0164l80169K65723J71691j9182k0043
$$ 67281372 67945859 68753413 69620546 70366307 70416471 70036302 70302025 70473716 70454534 70434491
3905G0434491k1173q2832o74691K07596O4784M95082L69402l15704l77025o78686
$$ 70434491 70413318 70330486 69655795 69863391 69928175 70423257 70792659 70476955 70099930 69421244
3895F9421244l86850j419622j654462r36736n26838j022001l78018M3540k4845
$$ 69421244 69034394 67614772 65960310 65023574 64496736 63474735 63096717 63140257 63115412
3886F3115412Q48151N89830L00678r29813j919026j935110k848185l318140l044080
$$ 63115412 63963563 64553393 64854071 63924258 62005232 60070122 57221937 53903797 50859717
3877E0859717k560143j724826j640801j045536q04653o74444k01422l92400j059951
$$ 50859717 48299574 46574748 44933947 43888411 43083758 42409314 42207892 41815492 40755541
3868D0755541p70247j092801j239963j595123j342126j334199j163061j006120
$$ 40755541 39985294 38892493 37652530 36057407 34715281 33381082 32218021 31211901
3860C1211901p54358o45936q90765j47579n90131l50643k63127o46868M87756
$$ 31211901 30457543 29811607 28920842 28773263 28183132 27832489 27569362 26922494 27410250
3851B7410250L52270k04722N58718Q10150N61578R45666N41326M15440M56733
$$ 27410250 27762520 27557798 28116516 28926666 29488244 30433910 30975236 31390676 31847409
3842C1847409L65377J53718o42315m6180j22183m10992M40853J37132N81355R41004
$$ 31847409 32212786 32366504 31724189 31678009 31555826 31144834 31585687 31722819 32304174 33245178
3832C3245178J411942J503319N25710R76618Q33829l86545n32263j046328r13888
$$ 33245178 34657120 36160439 36686149 37662767 38496596 38110051 37577788 36531460 35617572
3823C5617572r19953j340383j082822o13492n30015j96096l5423K13463n30646
$$ 35617572 34697619 33357236 32274414 31660922 31130907 30934811 30899388 31112851 30582205
3814C0582205m30516j069502r29661k93154n99207r19980q61794m15967o97001
$$ 30582205 30151689 29082187 28152526 27859372 27260165 26340185 25478391 25062424 24365423
3805B4365423l70335q10848q3302m36462j22088J41637k37292j005392m871J79369
$$ 24365423 23995088 23184240 23100938 22664476 22542388 22684025 22446733 21441341 21436470 21615839
3795B1615839k50713K78982k91035K06895K82734j49957L22478Q54483M61753
$$ 21615839 21365126 21644108 21353073 21559968 21842702 21692745 22015223 22869706 23331459
3786B3331459J88897P14318J750899J267572Q72514R12503Q77222P3631N31311
$$ 23331459 23520356 24234674 25985573 27253145 28125659 29038162 29915384 29989015 30520326
3777C0520326P31991J6886P59468N19725j55140l30800o98545n93655o10882P8727
$$ 30520326 31252317 31269203 32028671 32548396 32393256 32062456 31363911 30770256 30159374 30238101
3767C0238101p8312j89609m8981k33166p08643j092926q82576o34085l93545j13289
$$ 30238101 30159789 29970180 29921199 29688033 28979390 27886464 27003888 26369803 25976258 25862969
3757B5862969Q4884j38328N55332L54965P020L81711J35389n56575L05164k33149
$$ 25862969 25947853 25809525 26364857 26719822 26726842 27108553 27243942 26687367 26992531 26759382
3747B6759382N68561L35002J12727J33385j80579j98434q05841o96363o11017
$$ 26759382 27327943 27662945 27775672 27909057 27728478 27530044 26724203 26027840 25416823
3738B5416823l25320q98779j019354M9509l53357m22044O03558L73714M85726
$$ 25416823 25091503 24192724 23173370 23222879 22869522 22447478 23051036 23424750 23910476
3729B3910476K92636O52137J187274J592398J454451Q56710j177J82136n59545
$$ 23910476 24203112 24855249 26042523 27634921 29089372 29946082 29944905 30127041 29567496
3720B9567496p01565j164545j165858q83302j464466j202837m67206n49757m43221
$$ 29567496 28865931 27701386 26535528 25652226 24187760 22984923 22517717 21967960 21524739
3711B1524739n79261m41892l46346k20572P0132L74025N43256J35222O57250K36930
$$ 21524739 20945478 20503586 20157240 19936668 20006800 20380825 20924081 21059303 21716553 21953483
3701B1953483O69085J45903K50336N04160j21412k63934n12682l64779p8578j28060
$$ 21953483 22622568 22768471 23018807 23522967 23401555 23137621 22624939 22260160 22181582 22053522
3691B2053522o75190K32362L56928j48547m10147l51581o52265p38023l63909
$$ 22053522 21378332 21610694 21967622 21819075 21408928 21057347 20405082 19667059 19303150
3682A9303150n52827M0202j9282j79840J92564k6998J260K67183o222O14958L62435
$$ 19303150 18750323 18790525 18771243 18591403 18783967 18756969 18758229 19025412 19019190 19634148 19996583
3671A9996583M93463O55158P54129M33176M07211k07049o26314p33521j173727
$$ 19996583 20490046 21145204 21899333 22332509 22739720 22532671 21906357 21172836 19999109
3662A9999109j514752p69961o22638p34002m84859l8903j25059n31844j55842
$$ 19999109 18484357 17714396 17091758 16357756 15872897 15833994 15708935 15177091 15021249
3653A5021249N31554J66862m32842K09803L50354M23938O23394j84811Q30N7409
$$ 15021249 15552803 15719665 15286823 15496626 15846980 16270918 16894312 16709501 16710331 16767740
3643A6767740n53073o92314j34667o5332l05289J37484n32431k45494j98053k05118
$$ 16767740 16214667 15522353 15387686 15322354 15017065 15154549 14622118 14376624 14178571 13973453
3633A3973453k21217j91480k65254o4465m12817k35634n12354o68672K56597r8901
$$ 13973453 13752236 13560756 13295502 13231037 12818220 12582586 12070232 11401560 11658157 11559256
3623A1559256K03402N95510k5393l01121K12665N33703j95377m2318L68321J41969
$$ 11559256 11762658 12358168 12332775 12031654 12244319 12778022 12582645 12540327 12908648 13050617
3613A3050617j350K93268J42546Q9239J53238m45704m87961n74065l87166o04370
$$ 13050617 13049267 13342535 13485081 13574320 13727558 13281854 12793893 12219828 11832662 11228292
3603A1228292M3009j46952L23290o8164L54913L50948r3573j44903M45081N50281
$$ 11228292 11271301 11124349 11447639 11379475 11734388 12085336 11991763 11846860 12291941 12842222
3593A2842222j36040L00915J24304m58794O15137L96136j26610R952N5359j92963
$$ 12842222 12706182 13007097 13131401 12672607 13287744 13683880 13557270 13567222 13622581 13429618
3583A3429618k88400l48201l04144K67642J58319N69698l77034k3644j46221J74237
$$ 13429618 13141218 12793017 12488873 12756515 12914834 13484532 13107498 13083854 12937633 13111870
3573A3111870J9227Q2301k13852P32406J99920P43818L79633k73471L6991P83271
$$ 13111870 13131097 13213398 12999546 13731952 13931872 14675690 15055323 14781852 14818843 15602114
3563A5602114N80437K97609O34331O16689L58939K49617J040260J383768J609406
$$ 15602114 16182551 16480160 17114491 17731180 18090119 18339736 19379996 20763764 22373170
3554B2373170J849548J391939K032449J686041O84903K86002n21960q60960j005257
$$ 22373170 24222718 25614657 27647106 29333147 30018050 30304052 29782092 28921132 27915875
3545B7915875j181951j013850j157507n53797m51116l30977K12775l19786n8463
$$ 27915875 26733924 25720074 24562567 24008770 23557654 23226677 23439452 23119666 23061203
3536B3061203R2109p1437O78814J128976M67305J140279J263835R42435J750548
$$ 23061203 23153312 23081875 23760689 24889665 25356970 26497249 27761084 28703519 30454067
3527C0454067J786678J270681R17346K57956k4397l95060k67169o24693j014985
$$ 30454067 32240745 33511426 34428772 34686728 34662331 34267271 34000102 33375409 32360424
3518C2360424q03370q04566q37563m36898j99138l41339M83950N22634k46995
$$ 32360424 31557054 30752488 29914925 29478027 29278889 28937550 29421500 29944134 29697139
3509B9697139L47388J51730N34479N02856O28206J063034J203599O51243Q49629
$$ 29697139 30044527 30196257 30730736 31233592 31861798 32924832 34128431 34779674 35629303
3500C5629303P31218R51088O46692J263342J738769J859667J753094J964833K266529
$$ 35629303 36360521 37311609 37958301 39221643 40960412 42820079 44573173 46538006 48804535
3491D8804535J436868K230878K520385K103783K509690J841203J460693J886000
$$ 48804535 50241403 52472281 54992666 57096449 59606139 61447342 62908035 64794035
3483F4794035J055422P25570r0131P86069O50856k73391p42119j144842j215027
$$ 64794035 65849457 66575027 66484896 67270965 67921821 67648430 66906311 65761469 64546442
3474F4546442j099495n23092P58793P40355K20126o96835k898867l205398l110364
$$ 64546442 63446947 62923855 63682648 64423003 64643129 63946294 61047427 57842029 54731665
3465E4731665k770049k004557j410096j715233j505741j170324r00229j462122
$$ 54731665 51961616 49957059 48546963 46831730 45325989 44155665 43255436 41793314
3457D1793314j421858j374466j480719j466081j083475j007452r34373q20040
$$ 41793314 40371456 38996990 37516271 36050190 34966715 33959263 33024890 32204850
3449C2204850l53588N8604m55827N1245Q90105J097016J163263K360491K650716
$$ 32204850 31851262 31909866 31454039 31505284 32395389 33492405 34655668 37016159 39666875
3440C9666875L198828L430444K659989P77215l001959l623147l803997k472053
$$ 39666875 42865703 46296147 48956136 49733351 46731392 43108245 39304248 36832195
3432C6832195k622070k143313j240293j240736j420000j381007j461050j719365
$$ 36832195 34210125 32066812 30826519 29585783 28165783 26784776 25323726 23604361
3424B3604361j038366j153194n57147r70681q65351q70129L95963J27732L22629
$$ 23604361 22565995 21412801 20855654 19884973 19019622 18149493 18545456 18673188 18995817
3415A8995817L54122M08955Q21199N01392P89441J931385K170397J691444K768866
$$ 18995817 19349939 19758894 20580093 21081485 21870926 23802311 25972708 27664152 30433018
3406C0433018J843066J079854j296499l010340l706508l568093k715150j840677
$$ 30433018 32276084 33355938 32059439 29049099 25342591 21774498 19059348 17218671
3398A7218671r85882j059700q92989j125712j227101n63177m7071l79104j39477
$$ 17218671 16232789 15173089 14280100 13154388 11927287 11364110 11317039 10937935 10798458
3389A0798458n34259o14644k12657m84286o22860L24787o4385p15531k69607P30902
$$ 10798458 10264199 9649555 9436898 8952612 8329752 8654539 8590154 7874623 7605016 8335918
3379H335918j97159n80110j97845M39257j23450k07468n98780n65949K13925J44274
$$ 8335918 8138759 7558649 7360804 7800061 7676611 7469143 6870363 6304414 6518339 6662613
3369F662613M53179l59594m08664n00322K93585K13546p25870q9804R3259k08075
$$ 6662613 7115792 6756198 6347534 5847212 6140797 6354343 5628473 5538669 5631928 5423853
3359E423853K12436L83276n84913O6624n20264j26034M0503l09878L0402L40086
$$ 5423853 5636289 6019565 5434652 5501276 4981012 4854978 4895481 4585603 4616005 4956091
3349D956091P9935J82533P2241p7691J05440R1987k14957k75060m16493j13097
$$ 4956091 5036026 5218559 5290800 5213109 5318549 5410536 5195579 4920519 4504026 4390929
3339D390929Q5482n7586J48242j96358M4061L25186l31050m83505P6002M65709
$$ 4390929 4476411 4418825 4567067 4370709 4414770 4739956 4408906 3925401 4001403 4467112
3329D467112M8265k216Q5365k86224Q2734N8200l53319l20238j92601j03755N10013
$$ 4467112 4515377 4513161 4598526 4312302 4395036 4453236 4099917 3779679 3587078 3483323 3993336
3318C993336j74400Q2416L55633n42221m02504L41859k30496L73350K15641j21060
$$ 3993336 3818936 3901352 4256985 3714764 3312260 3654119 3423623 3796973 4012614 3891554
3308C891554k40001J52790M74653q1276l06795j09666m09587l08766J69997J43603
$$ 3891554 3651553 3804343 4278996 4197720 3890925 3781259 3371672 3062906 3232903 3376506
3298C376506L33365l57134l52052J74545R3239K67294m9814o22630l13719O76613
$$ 3376506 3709871 3352737 3000685 3175230 3268469 3535763 3485949 2863319 2549600 3226213
3288C226213L6272j0897n6781j04448j61436j67065l01471M08979K53567j51509
$$ 3226213 3262485 3251588 3194807 3090359 2928923 2761858 2460387 2869366 3122933 2971424
3278B971424R5503L64456k82295l36580j96118k2484K83303J27486k74963L7375
$$ 2971424 3066927 3431383 3149088 2812508 2616390 2593906 2877209 3004695 2729732 2767107
3268B767107J00274L83291P1722l70885k90067j0567j25762J56300M36386m5482
$$ 2767107 2867381 3250672 3322394 2951509 2661442 2650875 2525113 2681413 3117799 3072317
3258C072317J66890M2151j46770j07730j70230o7264Q3437k24076O5501M73211
$$ 3072317 3239207 3281358 3134588 3026858 2856628 2789364 2872801 2648725 2714226 3187437
3248C187437j58580o0002L99835n97128k3718l07095J13524K69813N70172m1308
$$ 3187437 3028857 2968855 3368690 2771562 2747844 2440749 2554273 2824086 3394258 3352950
3238C352950p31141k9721M45037K68438j26230j96838J14783m76664K77135K50016
$$ 3352950 2621809 2592088 3037125 3305563 3179333 2982495 3097278 2620614 2897749 3147765
3228C147765Q3211j7499N93569k4503K58672k8492l10538m81791R0386K31943
$$ 3147765 3230976 3213477 3807046 3782543 4041215 4012723 3702185 3220394 3310780 3542723
3218C542723M70735K78612j94887N3004j2399J18095r2215j29996j79357J69089
$$ 3542723 4013458 4292070 4097183 4150187 4137788 4255883 4163668 4033672 3854315 4023404
3208D023404k36430M6398J10235J83735l9458j57343j65825k03985K62791M153
$$ 4023404 3786974 3833372 3943607 4127342 4087884 3930541 3764716 3560731 3823522 3827675
3198C827675l92625N44490M25371J21433K63995j20063J04894J12786P5554J26088
$$ 3827675 3435050 3979540 4404911 4526344 4790339 4670276 4775170 4887956 4963510 5089598
3188E089598Q9923K7623J04214K49476L8966L21140j85216L63105r6105j90104
$$ 5089598 5179521 5207144 5311358 5560834 5599800 5920940 5735724 6098829 6002724 5812620
3178E812620k27552l42099Q719N09674P1038O6317k08862N1352J27867K82131
$$ 5812620 5585068 5242969 5251688 5761362 5832400 5898717 5689855 5741207 5869074 6151205
3168F151205k538P0857m8018O63398j76853j89172L46144j10778K6883M19629
$$ 6151205 6148667 6219524 6171506 6834904 6658051 6468879 6815023 6704245 6731128 7150757
3158G150757J55530l92145J92327L85116O8084L20986k39138M6446L66739J86922
$$ 7150757 7306287 6914142 7106469 7491585 7559669 7880655 7641517 7687963 8054702 8241624
3148H241624K68852m8373J14803O43125L68793k1820K28744K31891J50143Q5156
$$ 8241624 8510476 8462103 8576906 9220031 9588824 9567004 9795748 10027639 10177782 10262938
3138A0262938k55426k71618l17156j24169k91521n08735o39631M6072L07299q16550
$$ 10262938 10007512 9735894 9418738 9294569 9003048 8494313 7854682 7900754 8208053 7391503
3128G391503l1505l19709M47320j29012O63210R9700Q0515J9650K07590K32744
$$ 7391503 7359998 7040289 7487609 7358597 8021807 8121507 8202022 8221672 8429262 8662006
3118H662006O4491m8732R712O56764J1866R1053n19497O6991R9506m82002L97252
$$ 8662006 8726497 8677765 8687477 9344241 9356107 9447160 8927663 8994654 9094160 8612158 9009410
3107I009410j96178m08241o90895m41626k66866q4487l69614M8818J3950l73510
$$ 9009410 8813232 8404991 7714096 7272470 7005604 6921117 6551503 6600321 6614271 6240761
3097F240761J83488J82529J9235l40552R1869k1460j6117L90456m19839o936m46214
$$ 6240761 6424249 6606778 6626013 6285461 6377330 6355870 6339753 6730209 6310370 6303434 5857220
3086E857220K0841N35105p75275k32490j37557J26973m64595n22402J54150m04252
$$ 5857220 5878061 6413166 5637891 5405401 5267844 5394817 4930222 4407820 4561970 4157718
3076D157718p6164L29193k35829l92581k79049K09541q187n52026j09116j55158
$$ 4157718 4081554 4410747 4174918 3782337 3503288 3712829 3704642 3152616 3043500 2888342
3066B888342J69049J87166m87j47135m0432J26403k74164l98129q0862J21945
$$ 2888342 3057391 3244557 3244070 3096935 3056503 3182906 2908742 2510613 2429751 2551696
3056B551696J00228m9328k02885J42892k87193k66879J98954r5294m16643K25500
$$ 2551696 2651924 2602596 2399711 2542603 2255410 1988531 2187485 2092191 1675548 1901048
3046A901048j16203p6144J59284m9872M5652q3377K04660j99749l56204J60642
$$ 1901048 1784845 1708701 1867985 1818113 1863765 1780388 1985048 1785299 1429095 1589737
3036A589737k73119J37072J49412j39496J1758N1655Q6441l00474J7921l302J3702
$$ 1589737 1316618 1453690 1603102 1463606 1475364 1527019 1613460 1312986 1330907 1327605 1341307
3025A341307n48853K43913O62079l44610J68670j79647j17643K91329j95612q5667
$$ 1341307 792454 1036367 1698446 1353836 1522506 1342859 1225216 1516545 1320933 1235266
3015A235266J93046m4674k38263q797m676j08703K09399J48126K31197m09771
$$ 1235266 1428312 1383638 1145375 1136578 1131902 1023199 1232598 1380724 1611921 1202150
3005A202150k35461p1648k70334N1453N41807P1758l800k09971n92379M41242
$$ 1202150 966689 895041 624707 676160 1217967 1289725 1285925 1075954 483575 924817
2995I24817K24562j79047J92932k58022m01241M58669K68302p82855K59239L27258
$$ 924817 1149379 970332 1163264 905242 504001 962670 1230972 448117 707356 1034614
2985A034614J57537j74299J52980k53791p8790L33261k01464o7905r9495K07884
$$ 1034614 1192151 1017852 1170832 917041 838251 1171512 970048 902143 802648 1010532
2975A010532N77640m21922l12018J59892P2082k2035o52246K64323k64362J0945
$$ 1010532 1588172 1166250 854232 1014124 1086206 1064171 411925 676248 411886 422831
2965D22831O01364L25255k25047k12156j95072L0955L06471k58877L7953p6964
$$ 422831 1024195 1349450 1124403 912247 717175 748130 1054601 795724 833677 756713
2955G56713j48119K31873L19342k19935m60507j34571q3188j9913J70497M36557
$$ 756713 608594 840467 1159809 939874 479367 344796 261608 241695 412192 848749
2945H48749j87785o02920J52892J79608o1812k57473K91159j70042J45442L55093
$$ 848749 660964 58044 210936 390544 328732 71259 362418 192376 337818 692911
2935F92911l10869J67660j17864Q9478k11725m93649P47j0442L40112L93459N7323
$$ 692911 382042 549702 431838 521316 309591 -184058 -183311 -193753 146359 539818 597141
2924E97141J26082j66008M1457K61551n9801j49349k23714k27963k85994j19905
$$ 597141 723223 557215 598672 860223 800422 651073 427359 199396 -86598 -206503
2914b06503L46532J59861J71423k36534q4077J62576l44558n78393L90559J57384
$$ -206503 140029 299890 471313 234779 150702 313278 -31280 -609673 -219114 -61730
2904f1730K37236K46818N1459J6929l5598j20572K68206p45029m1576L58773k07529
$$ -61730 175506 422324 473783 490712 455114 334542 602748 -142281 -183857 174916 -32613
2893c2613n3760k23952Q8588J96484K12849n7969K69380N6783j6337n5842l94270
$$ -32613 -86373 -310325 -221737 -25253 187596 129627 399007 455790 439453 383611 -10659
2882a0659L12319L16628L70607m87702j52979l32627j8041M22204k10165m9551
$$ -10659 301660 618288 988895 501193 348214 15587 -2454 419750 209585 160034
2872A60034K4000K39168j83172l81691j94114K89535O5529m28029r3353N22863
$$ 160034 184034 423202 240030 -141661 -335775 -46240 19289 -408740 -502093 20770
2862B0770O3550N6894K89791K73991j45449j92696p2823J38031O2463q2690j04985
$$ 20770 84320 141214 431005 704996 559547 366851 294028 432059 494522 411832 306847
2851C06847j13O53686j70139q39318Q562L85094j77888j16082k47843J49361L33305
$$ 306847 306734 960420 790281 -49037 -40475 344619 166731 50649 -197194 -47833 285472
2840B85472j75483J72066K79367l1700o14489J10266J10369m08239p662M57572
$$ 285472 109989 282055 561422 529722 -84767 25499 135868 -272371 -280033 177539
2830A77539j48090k61573M74464k26720q6685M16755R9114K59321m66726k18464
$$ 177539 29449 -232124 242340 15620 -71065 345690 444804 704125 237399 18935
2820A8935L0585J29936p9117l8759J40446j0316n37493M23557j58857P2123K56148
$$ 18935 49520 179456 100339 61580 202026 191710 -345783 77774 -81083 -8960 247188
2809B47188K79159l29871O5399J50525l15274J96865j56444O2992O3473L93967
$$ 247188 526347 196476 261875 412400 97126 293991 137547 200539 264012 657979
2799F57979m41515k15944k27893k36113N01468l16403N15800R3688l77628M1055
$$ 657979 216464 520 -227373 -463486 37982 -278421 237379 331067 -46561 -5506
2789e506k23497P3269J5936j03807J00239M16722J42265n5230m06638L89214j09123
$$ -5506 -229003 -155734 -139798 -243605 -143366 273356 415621 360391 -46247 342967 233844
2778B33844j08306j05093j18405j29333k17923O23167O4263m02879K98883M43398
$$ 233844 125538 20445 -97960 -227293 -445216 177951 242214 -160665 138218 581616
2768E81616M3169o03442r5641K12434L37164j51088j23346J81360k92838K55609
$$ 581616 624785 21343 -74298 138136 475300 324212 200866 382226 89388 344997
2758C44997N8320P3626K33306m50179j73908O8464p7742K47707j13885j13991
$$ 344997 403317 476943 710249 260070 86162 154626 76884 324591 210706 96715
2748I6715k91960M6452o0866J97573J40556m41446j80814P7798O9576L30843n3709
$$ 96715 -195245 -148793 -209659 -12086 128470 -312976 -493790 -415992 -346416 -15573 -69282
2737f9282J10505K65063p8605j36971r3524J72302J31419L13833l05587j83746
$$ -69282 41223 306286 227681 90710 -2814 169488 300907 614740 309153 125407
2727A25407k387K02725j2936n07638R4486j2239j30153M02284m09441L16648R7179
$$ 125407 123020 325745 312809 -194829 -100343 -112582 -242735 159549 -249892 66756 163935
2716A63935J59597j1910j69222j01720r5743J8144L59015Q7169k59825Q823k38378
$$ 163935 323532 311622 142400 40680 -55063 -36919 322096 409265 149440 158263 -80115
2705h0115J79594P0508N66346j25927n37596K0960L4931J20442j69416J87443
$$ -80115 99479 169987 736333 610406 72810 93770 128701 249143 79727 267170
2695B67170o00457J18708O96674J17838l02696o22349R2256K83001j4947j42114
$$ 267170 -333287 -214579 482095 599933 297237 -325112 -232856 50145 35198 -106916
2685a06916p8680j07728j91531L6408j10447J90188P624j28867L40654N78081
$$ -106916 -185596 -293324 -484855 -448447 -558894 -368706 -361082 -489949 -149295 428786
2675D28786l7725n1329p725o88260q628K10704J20663l32052M52831m72754k04668
$$ 428786 391061 339732 332007 -356253 -364881 -154177 -33514 -365566 87265 -385489 -590157
2664e90157N25559J12893K06011N40172k50767l59222q2296l80577M3169M064
$$ -590157 -64598 48295 254306 794478 543711 184489 102193 -278384 -235215 -231151
2654b31151j84062J26775j96206n2368O12624p9444K45019P2466K12384p9596
$$ -231151 -415213 -288438 -484644 -537012 75612 -3832 241187 313653 526037 446441
2644D46441q8590r1474m6852k93j54962Q3075J23685J41464l25730Q5749k50012
$$ 446441 357851 266377 219525 219232 64270 147345 271030 412494 86764 172513 -77499
2633g7499M48148L51750K09908m14224n06792J51216j77891J31220q7831M33966
$$ -77499 370649 722399 932307 518083 11291 162507 -15384 115836 28005 461971
2623D61971l46704j481J79403j88065J0521K55004m22853j90759K54156M03323
$$ 461971 115267 113786 293189 105124 115645 370649 -52204 -242963 11193 414516
2613D14516K81621j22193J19533m21126L19191J46002j75521j92257J27488m04636
$$ 414516 696137 573944 693477 272351 591542 737544 562023 369766 497254 92618
2603I2618J83322M13977j00796l07695k74463q0190L75944K34005k02961j29504
$$ 92618 275940 689917 589121 281426 6963 -73227 302717 536722 333761 204257
2593B04257J04476n4845J49339l13151j58573J43071L2153l10616J4192L32592
$$ 204257 308733 253888 403227 90076 -68497 74574 106727 -203889 -189697 142895
2583A42895k29129J87035L65917r2169k84814J10599l03555L47983K34711k35538
$$ 142895 -86234 100801 466718 374549 89735 200334 -103221 244762 479473 243935
2573B43935n2405l69199n3648M21960p5329k50452r8929N85328l3357j30442M05297
$$ 243935 191530 -177669 -231317 190643 115314 -135138 -234067 351261 317904 187462 592759
2562E92759j70317o18943J16502R7571L53795k22120m93379J2843m0253M10670
$$ 592759 422442 -196501 -79999 17572 371367 149247 -344132 -331289 -371542 39128
2552C9128Q1530m0424k80517K25288L55288k26139K87009J07073l56792r6469
$$ 39128 120658 80234 -200283 25005 380293 154154 441163 548236 191444 94975
2542I4975L26193j07625j74199n57679O4369N71059J27227j41969k15330J54850
$$ 94975 421168 313543 139344 -418335 -353966 217093 344320 202351 -12979 141871
2532A41871J75235k75568j1793O55214m24847L39254j95721j74342N3808L58121
$$ 141871 317106 41538 29745 684959 260112 599366 403645 229303 283111 641232
2522F41232k56302r3366J08313l66560L01287J36649L55923j62656j79964k80289
$$ 641232 384930 291564 399877 33317 334604 471253 827176 664520 484556 204267
2512B04267j07332M9375n2254p8200J84390l2962J36618K70659o859k65926k48
$$ 204267 96935 146310 94056 15856 200246 167284 303902 574561 567702 301776 301528
2501C01528k11002K39613J30613k46262N35041k80747j73318n921j45278n4169
$$ 301528 90526 330139 460752 214490 749531 468784 295466 289545 144267 90098
2491I0098l7139M1583n0633M63185Q514k15532m588O5306o9446k84647j28563
$$ 90098 52959 94542 43909 507094 515608 300076 295488 360794 291348 6701 -121862
2480a21862N40649K23987j71072L35753q0309l43093K6349L67874L16596l60000
$$ -121862 418787 642774 471702 807455 727146 384053 410402 778276 1094872 734872
2470G34872J291l54002q4221M6546M01256k13677k14959j5271l34352M56419O7693
$$ 734872 736163 382161 297940 344486 745742 532065 317106 301835 -32517 423902 491595
2459D91595K2804j33462K00111n14153L10735Q53178k46822n6252K58963r5726
$$ 491595 514399 380937 581048 66895 377630 1230808 983986 927734 1186697 1090971
2449A090971q8267o5306j7356L5067J17750p2846J06989P3192j27654K03855N99625
$$ 1090971 1002704 937398 920042 955109 1072859 1000013 1107002 1180194 1052540 1256395 1856020
2438A856020L57941l87276k28162O8846P6849l27889J03148K20756k99685K6740
$$ 1856020 2213961 1826685 1598523 1667369 1744218 1416329 1519477 1740233 1440548 1467288
2428A467288J62694L32156O0487k46486L25837J30213j33896k7373J33832K68182
$$ 1467288 1629982 1962138 2022625 1776139 2101976 2232189 2098293 2070920 2204752 2472934
2418B472934k43991J53682r4562k34473K55102K23279l47611p1960k6575m00243
$$ 2472934 2228943 2382625 2288063 2053590 2308692 2531971 2184360 2112400 2085825 1685582
2408A685582k70994J75331J82610J0438M63532N60973n2891k92599P4620K74027
$$ 1685582 1414588 1589919 1772529 1782967 2246499 2807472 2754581 2461982 2536602 2810629
2398B810629K13276J577k33258P9759j68309n4544j77636L33169M84180M30420
$$ 2810629 3023905 3025482 2792224 2871983 2703674 2649130 2471494 2804663 3288843 3719263
2388C719263k01470l27973L82354Q69219L68537q8463J06156j21053L50924K16384
$$ 3719263 3517793 3189820 3572174 4441393 4809930 4721467 4827623 4706570 5057494 5273878
2378E273878K37389J95465L30855L71507Q2422j34169L72355r1320k25727K73515
$$ 5273878 5511267 5706732 6037587 6409094 6491516 6357347 6729702 6638382 6412655 6686170
2368F686170L39105j00798L97085R73807R7486K24321L84175K52025P25351P69917
$$ 6686170 7025275 6924477 7321562 8295369 8392855 8617176 9001351 9253376 9978727 10748644
2358A0748644N08960P94719R51666J206421Q63993O16627R73458R36433J783590
$$ 10748644 11257604 12052323 13003989 14210410 15074403 15691030 16664488 17600921 19384511
2349A9384511K306080L580392M392812N759985O808884Q623993J1380226J6827059
$$ 19384511 21690591 25270983 29663795 35423780 42232664 50856657 62236883 79063942
2341G9063942J8252585R309155j1327068k0229152j7468132j3995037q586551
$$ 79063942 97316527 106625682 95298614 75069462 57601330 43606293 35019742
2334C5019742o699036m705773k361866j554941k148188j682033q93140m73025
$$ 35019742 28320706 23614933 21253067 19698126 17549938 15867905 14974765 14501740
2326A4501740p51416p91712j387047q86552j392764p54316k46928q33408k77080
$$ 14501740 13750324 12958612 11571565 10685013 9292249 8537933 8291005 7457597 7180517
2317G180517k38892m42880l89196n84551k5758k76305m70388j90474r6607k32090
$$ 7180517 6941625 6498745 6109549 5524998 5499240 5222935 4752547 4562073 4465466 4233376
2307D233376m24912R1990J32096m58346j07464k17863p1752l95810o6114j05745
$$ 4233376 3808464 3900454 4032550 3574204 3466740 3248877 3177125 2781315 2715201 2609456
2297B609456k22134j80786N4637r7534J74606j37665j52968p03227Q0798N74488
$$ 2609456 2387322 2206536 2261173 2163639 2338245 2200580 2047612 1344385 1425183 1999671
2287A999671o6118J32396p1752J12434l4625n52806l93419K49696J09224j62053
$$ 1999671 1933553 2065949 1994197 2106631 2072006 1519200 1125781 1375477 1484701 1322648
2277A322648j86820j62793j47802R5119M1456J45845j03958K94475n6126L9623
$$ 1322648 1135828 973035 825233 920352 961808 1107653 1003695 1298170 1242044 1281667
2267A281667L20839k36871p9328N5376o55749O7051L15597m73200K35911n1502
$$ 1281667 1602506 1365635 1286307 1341683 685934 752985 1068582 595382 831293 779791
2257G79791j51809N18767l80760k2765K05176k23020k42214l21068J17761L89003
$$ 779791 627982 1146749 765989 743224 948400 725380 483166 162098 279859 668862
2247F68862K7726P2005j26785l12165o6846M11081n4766L8573k19377m79982Q0924
$$ 668862 696588 768593 641808 329643 262797 673878 619112 657685 438308 -41674 39250
2236C9250K16045K70640J36749j13924l53735k68677M78156K49428p4277j24851
$$ 39250 255295 525935 662684 548760 195025 -73652 404504 653932 579655 454804
2226D54804k31174N49550j24496o71781j87864M15444j5431k36123M67212R2104
$$ 454804 223630 773180 648684 -23097 -210961 204483 189052 -47071 420141 512245
2216E12245k12515k1767r0813L55976j17850J64840k31636Q2383j87396L6590
$$ 512245 299730 277963 187150 543126 425276 590116 358480 440863 253467 290057
2206B90057N056k16932N5247J34374K25866L28215n90411m74011J55785L67219
$$ 290057 295113 78181 133428 267802 493668 821883 231472 -242539 -86754 280465
2196B80465j15794k68387L08056j58468l6638q7307L13866m25538J2978j0592
$$ 280465 164671 -103716 204340 45872 9234 -78073 235793 -189745 -176767 -187359
2186a87359K72286O29727k09211k39452q2999k41686L22964k18227J92056J76925
$$ -187359 84927 714654 505443 265991 182992 -58694 264270 46043 238099 415024
2176D15024J22313m58566k35404K55119K15852j25062k73558M36541m43328J50491
$$ 415024 537337 78771 -156633 98486 314338 189276 -84282 352259 -91069 59422
2166E9422K81160k79141K30543l92597J22213n3533K11907k17871j87911N04820
$$ 59422 340582 61441 291984 -100613 21600 -31933 179974 -37897 -225808 279012
2156B79012k95467j07143L18227L17792l16640m17970J22246K19928n66604K21986
$$ 279012 -16455 -123598 194629 512421 195781 -222189 -99943 119985 -446619 -224633
2146b24633M53898p1739Q1966K44969k62422n08500K65280K24543k26315N26088
$$ -224633 229265 157526 239492 484461 222039 -286461 -21181 203362 -22953 503135
2136E03135K33481r86054J88028N16228k70647m4682j6120J4171q1002K4604r0701
$$ 503135 736616 -249438 -61410 454818 184171 139489 123369 137540 56538 81142 -9559
2125i559l95703k3720j34875R298K28605M9032N30180L08949k57145k5093J27384
$$ -9559 -405262 -428982 -563857 -554559 -325954 -276922 253258 562207 305062 279969 407353
2114D07353l84852Q5749K70538j12998J98636R0263m26185L5222L33072k75077
$$ 407353 22501 108250 378788 265790 464426 554689 128504 163726 496798 221721
2104B21721n6485Q968L00019j60658k53508K40493K07999l33851l3416k31556
$$ 221721 165236 174204 474223 313565 60057 300550 508549 174698 141282 -90274
$$ [...]
##END NTUPLES=NMR SPECTRUM
##END=
