##TITLE=1H_CG-1191-C1
 CDCl3
 8 sc, 
 11.4.2024
##JCAMPDX= 6.0         $$ Bruker NMR JCAMP-DX V2.0
##DATA TYPE= NMR SPECTRUM
##DATA CLASS= NTUPLES
##ORIGIN= UXNMR, Bruker Analytische Messtechnik GmbH
##OWNER= root
$$ XWIN-NMR		Version 3.5
$$ Thu Apr 11 13:40:07 2024 Russian Standard Time (UT+4h)  she@DPX200
##.OBSERVE FREQUENCY= 200.1309
##.OBSERVE NUCLEUS= ^1H
##.ACQUISITION MODE= SIMULTANEOUS
##.ACQUISITION SCHEME= undefined
##.AVERAGES= 8
##.DIGITISER RES= 18
##SPECTROMETER/DATA SYSTEM= spect
##.PULSE SEQUENCE= zg30
##.SOLVENT NAME= CDCl3
##.SHIFT REFERENCE= (INTERNAL, CDCl3, 0, 15.4858)
##AUDIT TRAIL= $$ (NUMBER, WHEN, WHO, WHERE, WHAT)
$$ ##TITLE= Audit trail, XWIN-NMR		Version 3.5
$$ ##JCAMPDX= 5.01
$$ ##ORIGIN= Bruker BioSpin GmbH
$$ ##OWNER= she
$$ F:/spectra/data/she/nmr/H-F/1/pdata/1/auditp.txt
$$ ##AUDIT TRAIL=  $$ (NUMBER, WHEN, WHO, WHERE, WHAT)
(   1,<2024-04-11 13:38:44.35 +0400>,<she>,<DPX200>,
      <created by zg, POWCHK disabled, PULCHK disabled
       configuration hash MD5:
       00 E9 B6 7A A2 85 ED C7 34 08 36 98 17 FE 4E 26
       data hash MD5: 16K
       0C 3C 4C C5 74 E1 86 00 DA 07 2D FD AC A6 97 04>)
(   2,<2024-04-11 13:38:46.73 +0400>,<she>,<DPX200>,
      <Start of raw data processing
       efp BC_mod = 2 LB = 0.24 FT_mod = 6 PKNL = 1 PHC0 = -25303.11 PHC1 = 12.58731 SI = 16K 
       data hash MD5: 16K
       72 BC 83 BC 53 0D 5E D8 11 77 D3 BD 1A 6B 8F 61>)
(   3,<2024-04-11 13:39:05.15 +0400>,<she>,<DPX200>,
      <pk PHC0 = 1.421932 PHC1 = -0.2 
       data hash MD5: 16K
       F2 4D EB D1 02 E0 68 92 B1 83 68 98 CE 32 3F B8>)
(   4,<2024-04-11 13:39:10.12 +0400>,<she>,<DPX200>,
      <abs ABSG = 5 
       data hash MD5: 16K
       EC 2E 45 7C 82 D7 15 8B 81 E5 BC F6 5B 94 92 0E>)
$$ ##END=
$$ 
$$ hash MD5
$$ 10 2F 0C B0 BC 73 39 3A BA 1F C3 AA 83 CE E2 E5
##$RELAX= 
##$RELAX= 
##$RELAX= 
##$RELAX= 
##$RELAX= 
##$RELAX= 
$$ Bruker specific parameters
$$ --------------------------
##$DU= <F:/spectra>
##$EXPNO= 1
##$NAME= <H-F>
##$PROCNO= 1
##$TYPE= <nmr>
##$USER= <she>
##$AMP= (0..31)
100 100 100 100 100 100 100 100 100 100 100 100 100 100 100 100 100 100 
100 100 100 100 100 100 100 100 100 100 100 100 100 100 
##$AQSEQ= 0
##$AQ_mod= 1
##$AUNM= <au_zg>
##$AUTOPOS= <>
##$BF1= 200.13
##$BF2= 200.13
##$BF3= 200.13
##$BF4= 200.13
##$BF5= 200.13
##$BF6= 200.13
##$BF7= 200.13
##$BF8= 200.13
##$BYTORDA= 1
##$CFDGTYP= 0
##$CFRGTYP= 5
##$CHEMSTR= <none>
##$CNST= (0..31)
1 1 145 1 1 1 1 1 1 1 1 1 1 1 1 1 1 1 1 1 1 1 1 1 1 1 1 1 1 1 1 1 
##$CPDPRG= <>
##$CPDPRG1= <>
##$CPDPRG2= <>
##$CPDPRG3= <>
##$CPDPRG4= <mlev>
##$CPDPRG5= <mlev>
##$CPDPRG6= <mlev>
##$CPDPRG7= <mlev>
##$CPDPRG8= <mlev>
##$CPDPRGB= <>
##$CPDPRGT= <>
##$D= (0..31)
0 1.2 0 0 0 0 0 0 0 0.06 0 0.03 0 0 0 0 0.0002 0 0 0 0 0 0 0 0 0 0 0 0 
0 0 0 
##$DATE= 1712828323
##$DBL= (0..7)
120 120 120 120 120 120 120 120 
##$DBP= (0..7)
150 150 150 150 150 150 150 150 
##$DBP07= 0
##$DBPNAM0= <>
##$DBPNAM1= <>
##$DBPNAM2= <>
##$DBPNAM3= <>
##$DBPNAM4= <>
$$ [...]
##$SUBNAM3= <"">
##$SUBNAM4= <"">
##$SUBNAM5= <"">
##$SUBNAM6= <"">
##$SUBNAM7= <"">
##$SUBNAM8= <"">
##$SUBNAM9= <"">
##$SW= 18.0517689322627
##$SWIBOX= (0..15)
0 0 2 0 0 0 0 0 0 0 0 0 0 0 0 0 
##$SW_h= 3612.71676300578
##$TD= 16384
##$TD0= 1
##$TE= 0
##$TE2= 300
##$TE3= 300
##$TEG= 300
##$TL= (0..7)
0 120 120 120 120 120 120 120 
##$TP= (0..7)
150 150 150 150 150 150 150 150 
##$TP07= 0
##$TPNAME0= <>
##$TPNAME1= <>
##$TPNAME2= <>
##$TPNAME3= <>
##$TPNAME4= <>
##$TPNAME5= <>
##$TPNAME6= <>
##$TPNAME7= <>
##$TPOAL= (0..7)
0.5 0.5 0.5 0.5 0.5 0.5 0.5 0.5 
##$TPOFFS= (0..7)
0 0 0 0 0 0 0 0 
##$TUNHIN= 0
##$TUNHOUT= 0
##$TUNXOUT= 0
##$USERA1= <user>
##$USERA2= <user>
##$USERA3= <user>
##$USERA4= <user>
##$USERA5= <user>
##$V9= 5
##$VALIST= <valist>
##$VCLIST= <CCCCCCCCCCCCCCC>
##$VD= 0
##$VDLIST= <DDDDDDDDDDDDDDD>
##$VPLIST= <PPPPPPPPPPPPPPP>
##$VTLIST= <TTTTTTTTTTTTTTT>
##$WBST= 1024
##$WBSW= 4
##$XGAIN= (0..3)
0 0 0 0 
##$XL= 0
##$YL= 0
##$YMAX_a= 209977
##$YMIN_a= -295168
##$ZGOPTNS= <>
##$ZL1= 120
##$ZL2= 120
##$ZL3= 120
##$ZL4= 120
##$ABSF1= 15.48029
##$ABSF2= -2.571595
##$ABSG= 5
##$ABSL= 3
##$ALPHA= 0
##$AQORDER= 0
##$ASSFAC= 0
##$ASSFACI= 0
##$ASSFACX= 0
##$ASSWID= 0
##$AUNMP= <proc_1d>
##$AZFE= 0.1
##$AZFW= 0.1
##$BCFW= 0
##$BC_mod= 2
##$BYTORDP= 0
##$COROFFS= 0
##$CY= -3
##$DATMOD= 1
##$DC= 0
##$DFILT= <>
##$DTYPP= 0
##$F1P= 0
##$F2P= 0
##$FCOR= 1
##$FTSIZE= 16384
##$FT_mod= 6
##$GAMMA= 0
##$GB= 0
##$INTBC= 1
##$INTSCL= 3.70164e-10
##$ISEN= 128
##$LB= 0.24
##$LEV0= 0
##$LPBIN= 0
##$MAXI= 10000
##$MC2= 0
##$MEAN= 0
##$ME_mod= 0
##$MI= 1.114404
##$NCOEF= 0
##$NC_proc= -7
##$NLEV= 6
##$NOISF1= 3.799351
##$NOISF2= 2.8
##$NSP= 0
##$NTH_PI= 0
##$NZP= 0
##$OFFSET= 15.48579
##$PC= 1
##$PHC0= -25301.69
##$PHC1= 12.38731
##$PH_mod= 1
##$PKNL= yes
##$PPARMOD= 0
##$PSCAL= 0
##$PSIGN= 0
##$REVERSE= no
##$SF= 200.129607193461
##$SI= 16384
##$SIGF1= 3
##$SIGF2= 2
##$SINO= 5.538805
##$SIOLD= 16384
##$SREGLST= <1H.CDCl3>
##$SSB= 0
##$STSI= 16384
##$STSR= 0
##$SW_p= 3612.71676300577
##$SYMM= 0
##$S_DEV= 0
##$TDeff= 16384
##$TDoff= 0
##$TI= <>
##$TILT= no
##$TM1= 0
##$TM2= 0
##$TOPLEV= 0
##$USERP1= <user>
##$USERP2= <user>
##$USERP3= <user>
##$USERP4= <user>
##$USERP5= <user>
##$WDW= 1
##$XDIM= 16384
##$YMAX_p= 344356550
##$YMIN_p= -613281
$$ End of Bruker specific parameters
$$ ---------------------------------
##NTUPLES= NMR SPECTRUM
##VAR_NAME=  FREQUENCY,     SPECTRUM/REAL,   SPECTRUM/IMAG
##SYMBOL=    X,             R,               I
##VAR_TYPE=  INDEPENDENT,   DEPENDENT,       DEPENDENT
##VAR_FORM=  AFFN,          ASDF,            ASDF
##VAR_DIM=   16384,         16384,           16384
##UNITS=     HZ,            ARBITRARY UNITS, ARBITRARY UNITS
##FACTOR=    0.220516191357247, 1,           1
##FIRST=     3099.16512035029, 0,            0
##LAST=      -513.551642655485, 0,           0
##MIN=       -513.551642655485, -613281,     0
##MAX=       3099.16512035029, 344356550,    0
$$ Real data points
##PAGE= N=1
##DATA TABLE= (X++(R..R)), XYDATA
$$ [...]
$$ plain form
7180 853780 681244 816373 947991 1055580 988269 787498 708044 732040 789482 761268 908686
7169 908686 887571 652629 667565 805834 719319 743433 846986 821582 670281 742203 704253
7158 704253 815186 755208 665523 666305 560602 488585 557675 585435 571006 793988 756117
7147 756117 723663 599133 509805 436231 477753 613936 701263 836275 718975 662616 630777
7136 630777 766450 691535 732039 751736 583937 451179 625989 585957 662400 602071 617802
7125 617802 612877 768406 609957 420523 473572 606662 735701 611723 625943 668442 553088
7114 553088 710491 861900 789321 703051 706577 752536 614119 514044 586416 490135 516922
7103 516922 771950 903147 978324 844049 876540 903056 1006523 816849 767067 789681 868952
$$ packed form
7180H53780j72536J35129J31618J07589o7311k00771p9454K3996N7442k8214J47418
7169I08686k1115k34942J4936J38269q6515K4114J03553k5404j51301P1922l7950
7158G04253J10933n9978q9685P82j05703p2017O9090K7760j4429K22982l7871
7147G56117l2454j24530q9328p3574M1522J36183Q7327J35012j17300n6359l1839
7136F30777J35673p4915M0504J9697j67799j32758J74810m0032P6443o0329J5731
7125F17802m925J55529j58449j89434N3049J33090J29039j23978J4220M2499j15354
7114E53088J57403J51409p2579q6270L526M5959j38417j00075P2372r6281K6787
7103E16922K55028J31197P5177j34275L2491K6516J03467j89674m9782K2614P9271
$$ plain form
7092 868952 1111777 1162057 1058522 926889 905176 890047 932419 815096 879195 1038926 1034468
7081 1034468 1068129 964291 792512 1055696 1144513 1107545 1261345 1218734 1036184 1190645
7071 1190645 1261046 1345693 1419673 1318616 1321306 1381825 1306973 1227155 1467385 1622794 1514526
7060 1514526 1571428 1862798 1993543 1998672 1868533 1877009 1923229 1973602 1923537 1969774 1806796
7049 1806796 1819705 1873995 1976536 2189864 2332931 2238502 2393495 2418847 2240151 2342827
7039 2342827 2480727 2657182 3009698 3000845 3059940 3075866 3221978 3451378 3575287 3626588
7029 3626588 3536764 3619655 3751492 3725703 3517146 3505860 3655876 3820421 3860375 3645776
7019 3645776 3768580 3717629 3466149 3568497 3710171 3683585 3466904 3429020 3456625 3350555
$$ packed form
7092H68952K42825N0280j03535j31633k1713j5129M2372j17323O4099J59731m458
7081A034468L3661j03838j71779K63184Q8817l6968J53800m2611j82550J54461
7071A190645P0401Q4647P3980j01057K690O0519p4852p9818K40230J55409j08268
7060A514526N6902K91370J30745N129j30139Q476M6220N0373n0065M6237j62978
7049A806796J2909N4290J02541K13328J43067r4429J54993K5352j78696J02676
7039B342827J37900J76455L52516q853N9095J5926J46112K29400J23909N1301
7029C626588q9824Q2891J31837k5789k08557j1286J50016J64545L9954k14599
7019C645776J22804n0951k51480J02348J41674k6586k16681l7884K7605j06070
$$ plain form
7009 3350555 3425378 3354056 3375748 3701868 3629860 3557129 3565862 3666551 3792400 3585132 3643427
6998 3643427 3799248 3625900 3606302 3778443 3670860 3479962 3352467 3304287 3219524 3126058
6988 3126058 3286979 3158808 3072314 3006495 2762470 2610706 2689199 2553692 2302852 2078710
6978 2078710 2084303 1992333 1953976 1884971 1950386 1675785 1311510 1376626 1307269 1331818 1377789
6967 1377789 1294319 1260195 1105017 1197164 1128580 1035336 1094208 1175025 1085274 1190195 1221899
6956 1221899 1396401 1395588 1348154 1203351 1144476 1039012 1203128 1188512 1062735 1102430 915744
6945 915744 950048 931774 986362 966179 1182686 1197685 1078339 1264246 1151841 1023762 1186843
6934 1186843 1262736 1194591 1160431 1086052 972433 1041025 955499 869085 738992 992296 1152728
$$ packed form
7009C350555P4823p1322K1692L26120p2008p2731Q733J00689J25849k07268N8295
6998C643427J55821j73348j9598J72141j07583j90898j27495m8180q4763r3466
6988C126058J60921j28171q6494o5819k44025j51764P8493j35507k50840k24142
6978B078710N593r1970l8357o9005O5415k74601l64275O5116o9357K4549M5971
6967A377789q3470l4124j55178R2147o8584r3244N8872Q0817q9751J04921L1704
6956A221899J74502q13m7434j44803n8875j05464J64116j4616j25777L9695j86686
6945I15744L4304j8274N4588k0183K16507J4999j19346J85907j12405j28079J63081
6934A186843P5893o8145l4160p4379j13619O8592q5526q6414j30093K53304J60432
$$ plain form
6923 1152728 1083588 927762 923396 1045608 1046997 1083326 1224739 1337406 1265865 1106490 1136467
6912 1136467 1028462 1171383 1231755 1132071 1145076 1110530 926053 985545 1032162 1175865 1114356
6901 1114356 1186091 980947 1106739 1224798 1205970 1244790 1146736 1030517 1066680 1080759 1080089
6890 1080089 1145448 1175294 1200653 1232778 1271257 1399137 1359267 1219245 1266341 1270155 1220597
6879 1220597 1201404 1360397 1288463 1246824 1421073 1214198 1154240 1174408 978481 1088490
6869 1088490 1087960 1184053 1277642 1352609 1386076 1336645 1212052 1113226 1197967 1089625 1126365
6858 1126365 1216300 1041973 1111659 1012119 1086307 1033174 1245538 1406276 1358508 1049093 1052837
6847 1052837 1003910 861409 992308 1137389 1165442 1277027 1342539 1323698 1412869 1342214 1422945
$$ packed form
6923A152728o9140j55826m366J22212J389L6329J41413J12667p1541j59375K9977
6912A136467j08005J42921O0372r9684J3005l4546j84477N9492M6617J43703o1509
6901A114356P1735k05144J25792J18059j8828L8820r8054j16219L6163J4079o70
6890A080089O5359K9846K5359L2125L8479J27880l9870j40022M7096L814m9558
6879A220597j9193J58993p1934m1639J74249k06875n9958K0168j95927J10009
6869A088490n30R6093R3589P4967L3467m9431j24593r8826Q4741j08342L6740
6858A126365Q9935j74327O9686r9540P4188n3133K12364J60738m7768l09415L744
6847A052837m8927j42501J30899J45081K8053J11585O5512j8841Q9171p0655Q0731
$$ plain form
6836 1422945 1315218 1356786 1383998 1083270 911423 931721 1082241 1218539 1558042 1367709
6826 1367709 1162576 952954 1030289 1035645 1102856 1266698 1183702 1169504 1211939 1188954 1196049
6815 1196049 1115031 1073023 1313862 1338275 1336748 1237085 1212906 1249322 1188210 1377640 1335139
6804 1335139 1397448 1162644 1092460 1255932 1404751 1409218 1336815 1285214 1323188 1290213 1091736
6793 1091736 1033358 1020584 1266241 1283505 1318221 1344237 1439021 1512554 1528104 1482095 1600058
6782 1600058 1473445 1507686 1648710 1423163 1388241 1623102 1655275 1823124 1603884 1593891
6772 1593891 1630288 1721070 1679355 1601261 1671773 1673580 1749377 1900176 1746844 1558784 1478575
6761 1478575 1662727 1637281 1621346 1927296 1947247 1814356 1833301 1738715 1682182 1560228 1678065
$$ packed form
6836A422945j07727M1568K7212l00728j71847K0298J50520J36298L39503j90333
6826A367709k05133k09622P7335N356O7211J63842q2996j4198M2435k2985P095
6815A196049q1018m2008K40839K4413j527r9663k4179L6416o1112J89430m2501
6804A335139O2309k34804p0184J63472J48819M467p2403n1601L7974l2975j98477
6793A091736n8378j2774K45657J7264L4716K6016R4784P3533J5550m6009J17963
6782A600058j26613L4241J41024k25547l4922K34861L2173J67849k19240r993
6772A593891L6397R0782m1715p8094P0512J807P5797J50799j53332j88060q0209
6761A478575J84152k5446j5935L05950J9951j32891J8945r4586n6533j21954J17837
$$ plain form
6750 1678065 1744215 1549348 1527998 1547750 1694073 1678297 1815643 1872222 1725088 1675247 1718032
6739 1718032 1782545 1853675 1875894 1741754 1897550 1902046 1734200 1897345 1954723 1937803 1959722
6728 1959722 1761613 1862344 1676967 1661946 1741874 1891682 1800204 1902332 1982725 1772342
6718 1772342 1821935 1967004 2183493 2055768 1950534 1842809 1961787 1763664 1740994 1630125
6708 1630125 1547865 1898051 1976371 1873887 1997659 1864800 1808231 1871203 1947726 1915923 1967661
6697 1967661 1918413 1692428 1762886 1841643 1683279 1704361 1853463 1910347 1888264 1850363 1653014
6686 1653014 1571832 1652511 1718825 1744208 1681564 1898903 1928124 1797707 1861064 1761116 1933124
6675 1933124 1931438 1754136 1812480 1896947 1802783 1924960 1876856 1962527 2272961 2384718 2146916
$$ packed form
6750A678065O6150j94867k1350J9752J46323j5776J37346N6579j47134m9841M2785
6739A718032O4513P1130K2219j34140J55796M496j67846J63145N7378j6920K1919
6728A959722j98109J00731j85377j5021P9928J49808r1478J02128Q0393k10383
6718A772342M9593J45069K16489j27725j05234j07725J18978j98123k2670j10869
6708A630125q2260L50186P8320j02484J23772j32859n6569O2972P6523l1803N1738
6697A967661m9248k25985P0458P8757j58364K1082J49102N6884k2083l7901j97349
6686A653014q1182Q0679O6314K5383o2644K17339K9221j30417O3357r9948J72008
6675A933124j686j77302N8344Q4467r4164J22177m8104Q5671L10434J11757k37802
$$ plain form
6664 2146916 1940267 2068393 2026083 1886255 1828429 2049732 1864872 1890941 2081608 1980184
6654 1980184 2145356 2178410 2197239 2225891 2254636 2304023 2344917 2309832 2288127 2101090 2218771
6643 2218771 2458289 2420770 2325044 2342829 2220745 2467726 2497382 2545027 2639862 2703827 2586321
6632 2586321 2654832 2539403 2444536 2799342 2783910 2672794 2485896 2661490 2820878 2844027
6622 2844027 2985544 2923204 2840788 3051283 3067602 3111707 3120589 3112252 3172491 3148482 3058386
6611 3058386 3064876 3296494 3552963 3449247 3304925 3268472 3375158 3286038 3393276 3534692
6601 3534692 3581884 3611235 3522780 3635565 3761783 3815964 3773276 3620634 3523217 3455615 3872054
6590 3872054 3872060 3767808 3905798 3869797 3837256 3952676 3983972 3978176 4068678 4444897 4300032
$$ packed form
6664B146916k06649J28126m2310j39828n7826K21303j84860K6069J90667j01424
6654A980184J65172L3054J8829K8652K8745M9387M0894l5085k1705j87037J17681
6643B218771K39518l7519r5726J7785j22084K46981K9656M7645R4835O3965j17506
6632B586321O8511j15429r4867L54806j5432j11116j86898J75594J59388K3149
6622B844027J41517o2340q2416K10495J6319M4105Q882q337O0239k4009r0096
6611C058386O490K31618K56469j03716j44322l6453J06686q9120J07238J41416
6601C534692M7192K9351q8455J12785J26218N4181m2688j52642r7417o7602M16439
6590C872054Oj04252J37990l6001l2541J15420L1296n796R0502L76219j44865
$$ plain form
6579 4300032 4423472 4257311 4215617 4182867 4147511 4296768 4159133 4170974 3920094 4113790
6569 4113790 4340367 4229373 4140338 4109829 4162501 4264218 4295010 4215420 4133478 4173996 4199003
6558 4199003 4233580 4161708 4131151 3837909 4040941 3882319 3892297 4141924 4095155 4131257 4146068
6547 4146068 4353476 4460177 4361286 4352619 4399900 4432468 4368890 4290733 4263035 4332675 4199802
6536 4199802 4150535 4233618 4054464 4394837 4518150 4401655 4397778 4286563 4250003 4342409 4283537
6525 4283537 4373193 4200156 4240511 4310943 4226903 4135641 4170582 4276137 4360918 4324732 4326135
6514 4326135 4346582 4462018 4339262 4327363 4433893 4705666 4736254 4505434 4408853 4531040
6504 4531040 4715298 4698237 4706421 4671899 4640902 4439806 4431201 4460440 4443481 4339266 4433033
$$ packed form
6579D300032J23440j66161m1694l2750l5356J49257j37635J1841k50880J93696
6569D113790K26577j10994q9035l0509N2672J01717L0792p9590q1942M0518K5007
6558D199003L4577p1872l0557k93242K03032j58622R978K49627m6769L6102J4811
6547D146068K07408J06701r8891q667M7281L2568o3578p8157k7698O9640j32873
6536D199802m9267Q3083j79154L40373J23313j16495l877j11215l6560R2406n8872
6525D283537Q9656j73037M0355P0432q4040r1262L4941J05555Q4781l6186J403
6514D326135K0447J15436j22756j1899J06530K71773L0588k30820r6581J22187
6504D531040J84258j7061Q184l4522l0997k01096q605K9239j6959j04215R3767
$$ plain form
6493 4433033 4279955 4239748 4215061 4073767 4112019 4301532 4368673 4343346 4165236 4364593
6483 4364593 4425379 4611173 4390247 4409432 4378011 4449575 4624752 4525861 4370026 4189221
6473 4189221 4306723 4267173 4228510 4338074 4338823 4436849 4224932 4061552 4195348 4235098 4051382
6462 4051382 4144878 4240079 4051788 3962567 3987463 4249370 4392940 4413409 4414030 4424276 4408981
6451 4408981 4371577 4373911 4450050 4362164 4441595 4521406 4497144 4494360 4373781 4276088 4335288 4021415
6439 4021415 4102585 4415139 4437545 4389586 4483514 4425440 4485986 4538297 4576307 4437508 4472372
6428 4472372 4597122 4572886 4572299 4691396 4788126 4678146 4517246 4574220 4493422 4376408 4471184
6417 4471184 4540942 4621539 4476904 4388592 4531388 4573164 4582476 4586977 4659165 4773133 4665520
$$ packed form
6493D433033j53078m0207k4687j41294L8252J89513O7141k5327j78110J99357
6483D364593O0786J85794k20926J9185l1421P1564J75177r8891j55835j80805
6473D189221J17502l9550l8663J09564P49R8026k11917j63380J33796L9750j83716
6462D051382R3496R5201j88291q9221K4896K61907J43570K0469O21J0246j5295
6451D408981l7404K334P6139q7886P9431P9811k4262k784j20579r7693N9200l13873
6439D021415Q1170L12554K2406m7959R3928n8074O0546N2311L8010j38799L4864
6428D472372J24750k4236n87J19097R6730j09980j60900N6974q0798j17014R4776
6417D471184O9758Q0597j44635q8312J42796M1776R312M501P2188J13968j07613
$$ plain form
6406 4665520 4513175 4379568 4443696 4418812 4516378 4653017 4707379 4694295 4707766 4721932 4636935
6395 4636935 4581143 4542318 4613276 4633830 4514772 4391684 4452117 4466781 4405107 4544594 4538150
6384 4538150 4465718 4548707 4761070 4650431 4799266 4850736 4768369 4725574 4755936 4853336 5120238
6373 5120238 4858783 4666809 4583517 4649155 4640185 4682165 4747237 4706361 4854912 4888735 4948301
6362 4948301 4877435 4911439 5090003 5135713 5127891 5045134 4863319 4994673 4937024 4902310 5102479
6351 5102479 5369924 5240832 5380247 5174141 5067395 5228617 5344351 5443705 5577218 5666513
6341 5666513 5639482 5631362 5465989 5321257 5492441 5551338 5440355 5554002 5691259 5631801
6331 5631801 5619888 5724536 5863289 6052946 6128606 6155910 6189030 5997898 6306046 6397414
$$ packed form
6406D665520j52345j33607O4128k4884R7566J36639N4362j3084J3471J4166q4997
6395D636935n5792l8825P0958K0554j19058j23088O0433J4664o1674J39487o444
6384D538150p2432Q2989K12363j10639J48835N1470q2367m2795L0362R7400K66902
6373E120238k61455j91974q3292O5638q970M1980O5072m0876J48551L3823N9566
6362D948301p0866L4004J78564M5710p822q2757j81815J31354n7649l4714K00169
6351E102479K67445j29092J39415k06106j06746J61222J15734R9354J33513Q9295
6341E666513k7031q120j65373j44732J71184N8897j10983J13647J37257n9458
6331E631801j1913J04648J38753J89657P5660K7304L3120j91132L08148R1368
$$ plain form
6321 6397414 6320732 6293534 6418797 6673897 6492849 6620536 6701963 6611957 6785356 6735473
6311 6735473 6816814 6972499 7052869 7143839 7191728 7005512 7164410 7201274 7268416 7416919 7612750
6300 7612750 7637828 7429135 7515211 7654756 7608671 7768378 7882044 7820037 7769457 7753243 7967635
6289 7967635 8075933 8037311 7945687 8025397 8113528 8254980 8446868 8542205 8384971 8525145
6279 8525145 8682668 8535477 8480469 8622748 8614562 8717598 8864321 8840854 8961244 8953282 8812674
6268 8812674 8803953 8781834 9036322 9010730 8970967 9024913 8974255 9186282 9309922 9354701 9333613
6257 9333613 9444671 9542968 9502626 9640927 9501596 9539077 9615156 9664976 9451153 9494609 9644061
6246 9644061 9579428 9572397 9604570 9777608 9683860 9748337 9958154 10048070 10249040 10154570 10204366
$$ packed form
6321F397414p6682k7198J25263K55100j81048J27687Q1427r0006J73399m9883
6311F735473Q1341J55685Q0370R0970M7889j86216J58898L6864O7142J48503J95831
6300G612750K5078k08693Q6076J39545m6085J59707J13666o2007n0580j6214K14392
6289G967635J08298l8622r1624P9710Q8131J41452J91888R5337j57234J40174
6279H525145J57523j47191n5008J42279q186J03036J46723k3467J20390p962j40608
6268H812674q721k2119K54488k5592l9763N3946n0658K12027J23640M4779k1088
6257I333613J11058R8297m0342J38301j39331L7481P6079M9820k13823M3456J49452
6246I644061o4633p031L2173J73038r3748O4477K09817Q9916K00970r4470M9796
$$ plain form
6235 10204366 10248536 10123552 10167351 10279398 10406498 10536297 10637875 10775445 10838549 11074783
6225 11074783 11199432 11149958 11054002 10907623 11000143 11139890 11269044 11153308 11145442 11076817
6215 11076817 11228941 11190982 11152516 11520602 11681102 11828902 12033534 11982599 12037237 12447780
6205 12447780 12507786 12670589 12830601 13072467 13110628 13250825 13274717 13251295 13178241 13309355
6195 13309355 13412589 13565943 13624701 13934746 13952909 14144455 14532946 14840265 14981745 15040177
6185 15040177 15233769 15380978 15392082 15780385 16085767 16140882 16625827 17157414 17261453 17392863
6175 17392863 17792509 18119949 18512449 18782473 19196479 19556643 20014345 20501985 21109704
6166 21109704 21528307 21931501 22474091 22929596 23447657 23877477 24323371 24970734 25767082
$$ packed form
6235A0204366M4170j24984M3799J12047J27100J29799J01578J37570O3104K36234
6225A1074783J24649m9474r5956j46379R2520J39747J29154j15736p866o8625
6215A1076817J52124l7959l8466L68086J60500J47800K04632n0935N4638M10543
6205A2447780O0006J62803J60012K41866L8161J40197K3892k3422p3054J31114
6195A3309355J03234J53354N8758L10045J8163J91546L88491L07319J41480N8432
6185A5040177J93592J47209J1104L88303L05382N5115M84945N31587J04039J31410
6175A7392863L99646L27440L92500K70024M14006L60164M57702M87640O07719
6166B1109704M18603M03194N42590M55505N18061M29820M45894O47363P96348
$$ plain form
6157 25767082 26637594 27394855 28194773 29101970 29869253 30772177 31974506 32961977 34177077
6148 34177077 35287341 36632627 37776515 39259206 40920068 42803783 44391244 46166930
6140 46166930 47783714 49072384 50030361 50688651 50548109 50262692 49626922 48862511 48437849
6131 48437849 47876286 47448556 47520514 47463158 47712660 48463627 49301703 50211162 51244235 52387287
6121 52387287 53942254 55696398 57740968 59698755 61674228 64256852 66999281 69480521
6113 69480521 72211709 74668986 76276380 76689674 76014550 74053781 70931108 67155312
6105 67155312 63488918 60256872 57134859 54411537 52152306 50404671 48976192 47926832
6097 47926832 46891487 46022887 45681304 45410538 45129202 45069800 45297734 45743935 46263105
$$ packed form
6157B5767082Q70512P57261P99918R07197P67283R02924J202329R87471J215100
6148C4177077J110264J345286J143888J482691J660862J883715J587461J775686
6140D6166930J616784J288670R57977O58290j40542k85417o35770p64411m24662
6131D8437849n61563m27730P1958n7356K49502P50967Q38076R09459J033073J143052
6121E2387287J554967J754144K044570J957787J975473K582624K742429K481240
6113F9480521K731188K457277J607394M13294o75124j960769l122673l775796
6105F7155312l666394l232046l122013k723322k259231j747635j428479j049360
6097D7926832j035345q68600l41583k70766k81336n9402K27934M46201N19170
$$ plain form
6088 46263105 47005585 47892102 48701232 49193723 49740367 49619683 48966360 47782462 46034627
6079 46034627 43664728 41249954 38963791 36808594 34512053 32707847 31148360 29873213
6071 29873213 28486087 27477707 26707257 25809510 25080741 24418183 23762792 23368552 22788889
6062 22788889 22293529 21820877 21612952 21471124 21067426 20450509 19819359 19708867 19593861
6053 19593861 19172070 18816488 18635031 18652605 18349068 18182443 18123694 18194798 18317240 18291346
6043 18291346 18199917 18296266 18412255 18474229 18599278 18947351 19010879 19030087 19137169 19119478
6033 19119478 18881692 18463627 17978429 17519530 17368109 17055046 16741266 16402834 16313500 16248967
6023 16248967 16239344 16463519 16507275 16502069 16645626 16711003 16786449 16926524 17039387 17017475 17096415
$$ packed form
6088D6263105P42480Q86517Q09130M92491N46644j20684o53323j183898j747835
6079D6034627k369899k414774k286163k155197k296541j804206j559487j275147
6071B9873213j387126j008380p70450q97747p28769o62558o55391l94240n79663
6062B2788889m95360m72652k07925j41828m03698o16917o31150j10492j15006
6053A9593861m21791l55582j81457J7574l03537j66625n8749P1104J22442k5894
6043A8291346r1429R6349J15989O1974J25049L48073O3528J9208J07082j7691
6033A9119478k37786m18065m85198m58899j51421l13063l13780l38432q9334o4533
6023A6248967r623K24175M3756n206J43557O5377P5446J40075J12863k1912P8940
$$ plain form
6012 17096415 17140619 17109193 17055163 16739129 16561537 16454063 16180323 15982323 15880109 15722712
6002 15722712 15690288 15845656 15797694 15852758 15834095 16176491 16027013 16161061 16317678 16227307
5992 16227307 16404290 16185338 16329293 16244344 16067993 16038223 15819418 15282621 14960249 14551225
5982 14551225 14128014 13890521 13717194 13666976 13684965 13451319 13447058 13443030 13407307 13508188 13666822
5971 13666822 13697826 13637519 13619182 13469691 13456793 13451021 13301168 12913166 12788970 12628486
5961 12628486 12662787 12331659 12049529 11724417 11468316 11319396 11081049 10819277 10735115 10578823
5951 10578823 10559737 10530857 10214064 10037420 9889328 9820029 9888133 9777991 9805088 9719100
5941 9719100 9690633 9748171 9619410 9560720 9367152 9224887 9037683 9015057 9053316 8912421
$$ packed form
6012A7096415M4204l1426n4030l16034j77592j07474k73740j98000j02214j57397
6002A5722712l2424J55368m7962N5064j8663L42396j49478J34048J56617r0371
5992A6227307J76983k18952J43955q4949j76351k9770k18805n36797l22372m09024
5982A4551225m23211k37493j73327n0218J7989k33646m261m028l5723J00881J58634
5971A3666822L1004o0307j8337j49491j2898n772j49853l88002j24196j60484
5961A2628486L4301l31128k82130l25112k56101j48920k38347k61772q4162j56292
5951A0578823j9086k8880l16793j76644j48092o9299O8104j10142K7097q5988
5941I719100k8467N7538j28761n8690j93568j42265j87204k2626L8259j40895
$$ plain form
5931 8912421 8819737 8625328 8654063 8634909 8644840 8614283 8641759 8664412 8641208 8547061 8513566
5920 8513566 8741293 8781083 8547226 8342885 8186875 8233828 8213675 8122814 8033900 8101369 8124914
5909 8124914 8060032 7850988 7760398 7685008 7644798 7390295 7317824 7308577 7277758 7388075 7255049
5898 7255049 7307794 7334445 7127987 7136530 7246211 7235884 7028605 6780806 7010565 7001744 6923029
5887 6923029 6753663 6780562 6781306 6769219 6568623 6538081 6789992 6791565 6597078 6641091 6570645
5876 6570645 6468643 6347957 6446852 6503944 6435679 6423631 6407347 6484442 6472771 6611408 6578311
5865 6578311 6588562 6683348 6587734 6912592 6876177 6836898 7129092 7028794 6689461 6814637
5855 6814637 6810069 6986241 7093479 6927424 7196406 7134439 7153333 7204618 7307604 7313408 7013771
$$ packed form
5931H912421r2684j94409K8735j9154R931l0557K7476K2653k3204r4147l3495
5920H513566K27727L9790k33857k04341j56010M6953k0153r0861q8914O7469K3545
5909H124914o4882k09044r0590p5390m0210k54503p2471r247l0819J10317j33026
5898G255049N2745K6651k06458Q543J09681j0327k07279k47799K29759q821p8715
5887F923029j69366K6899P44j2087k00596l0542K51911J573j94487M4013p0446
5876F570645j02002j20686R8895N7092o8265j2048j6284P7095j1671J38637l3097
5865F578311J0251R4786r5614L24858l6415l9279K92194j00298l39333J25176
5855F814637m568J76172J07238j66055K68982o1967J8894N1285J02986N804k99637
$$ plain form
5844 7013771 7334821 7492347 7433697 7491123 7361389 7476037 7443971 7338571 7402879 7442410
5834 7442410 7609105 7583705 7540972 7483355 7662979 7410281 7588768 7887990 7942437 7782713
5824 7782713 7774030 7911063 7899955 7885195 7668773 7695739 7685711 7956040 7949715 7844013 7934585
5813 7934585 7964318 8043964 8345816 8392474 8253080 8296201 8397189 8201721 8389607 8316156
5803 8316156 8503598 8602639 8427095 8570146 8685500 8681430 8891210 8999493 8898215 8873742
5793 8873742 8998634 8936306 8828566 8747591 8858029 8993149 9094137 9319810 9245054 9273545
5783 9273545 9233616 9280417 9345117 9500896 9442543 9372731 9471795 9678254 9752490 10024771 10135054
5772 10135054 10281700 10284452 10011644 10082365 10158365 10322019 10583830 10746979 10680281 10429199
$$ packed form
5844G013771L21050J57526n8650N7426j29734J14648l2066j05400O4308L9531
5834G442410J66695k5400m2733n7617J79624k52698J78487K99222N4447j59724
5824G782713q683J37033j1108j4760k16422K6966j0028K70329o325j05702R0572
5813G934585K9733P9646L01852M6658j39394M3121J00988j95468J87886p3451
5803H316156J87442R9041j75544J43051J15354m070K09780J08283j01278k4473
5793H873742J24892o2328j07740q0975J10438J35120J00988K25673p4756K8491
5783I273545l9929M6801O4700J55779n8353o9812R9064K06459P4236K72281J10283
5772A0135054J46646K752k72808P0721P6000J63654K61811J63149o6698k51082
$$ plain form
5762 10429199 10420225 10680656 10667745 10704152 10832208 10882214 10985712 10986904 11186760 11369694 11355723
5751 11355723 11550892 11721071 11893956 11972506 12020041 11854645 11978803 12020529 12132794 12407398
5741 12407398 12578373 12839345 12858368 12825922 12925033 13206117 13470926 13568099 13696744 13984255
5731 13984255 14134426 14298815 14289116 14281411 14460483 14734435 14991352 15234538 15286151 15530195
5721 15530195 15868279 16040663 16037595 16221997 16600722 16868035 17171979 17453851 17702886 17934255
5711 17934255 18315658 18681097 18908728 19338341 19591687 20031179 20591256 20763027 21180114
5702 21180114 21769464 22164336 22369917 22815171 23328283 24051779 24511246 25108908 25663601
5693 25663601 26238749 26804325 27482074 28237499 28970471 29805991 30649029 31405160 32192074
$$ packed form
5762A0429199q974K60431j2911L6407J28056N0006J03498J192J99856J82934j3971
5751A1355723J95169J70179J72885P8550M7535j65396J24158M1726J12265K74604
5741A2407398J70975K60972J9023l2446R9111K81084K64809R7173J28645K87511
5731A3984255J50171J64389r699p705J79072K73952K56917K43186N1613K44044
5721A5530195L38084J72384l068J84402L78725K67313L03944K81872K49035K31369
5711A7934255L81403L65439K27631M29613K53346M39492N60077J71771M17087
5702B1180114N89350L94872K05581M45254N13112P23496M59467N97662N54693
5693B5663601N75148N65576O77749P55425P32972Q35520Q43038P56131P86914
$$ plain form
5684 32192074 33230759 34238568 35468867 36783122 38164388 39551857 41184646 43012683
5676 43012683 44783792 46348466 48131179 50068374 52273244 54244834 55997707 57396198
5668 57396198 58037654 58343074 57926246 56979975 55786752 54301808 53110278 52398457 51726788
5659 51726788 51443332 51527971 51740150 52337044 53126169 54038110 55101872 56569788 58286473
5650 58286473 60132584 62141964 64356087 66920978 69661516 72745063 75659151 78366965
5642 78366965 80114160 80644259 80174607 78237241 74945477 71057173 67166709 63599458
5634 63599458 60281296 57557353 55183884 53330840 51846229 50648517 50129429 49755557
5626 49755557 49583833 49484704 49568974 49824520 50574535 51421588 52099598 53018679 53779412 54702087
$$ packed form
5684C2192074J038685J007809J230299J314255J381266J387469J632789J828037
5676D3012683J771109J564674J782713J937195K204870J971590J752873J398491
5668E7396198O41456L05420m16828r46271j193223j484944j191530p11821o71669
5659E1726788k83456Q4639K12179N96894P89125R11941J063762J467916J716685
5650E8286473J846111K009380K214123K564891K740538L083547K914088K707814
5642G8366965J747195N30099m69652j937366l291764l888304l890464l567251
5634F3599458l318162k723943k373469j853044j484611j197712n19088l73872
5626D9755557j71724r9129Q4270K55546P50015Q47053O78010R19081P60733R22675
$$ plain form
5616 54702087 55363206 55688318 55557548 55049834 53880533 52204716 50326317 48026868 46018669
5607 46018669 44118863 42219603 40835834 39710083 38654498 37750991 37192063 36701427 36238027
5598 36238027 36284400 36268614 36301441 36229273 36091822 36181843 35857286 35770381 35642248 34856411
5588 34856411 33984142 33343368 32659965 32027708 31623549 30966627 30483768 30324923 30371384 30048877
5578 30048877 29860984 29815946 29884479 29733004 29644177 29608179 29718924 29929906 30022657 29970636
5568 29970636 29971084 29735474 29594982 29409597 29280847 29163386 29002481 28837338 28526109 28208761
5558 28208761 28113623 28113018 27847288 27842260 27970809 28060444 28280739 28398794 28508580 28627036 28377869
5547 28377869 28153510 28233027 27782708 27333859 27188970 26966884 27020197 26535216 26221198 25993476
$$ packed form
5616E4702087O61119L25112j30770n07714j169301j675817j878399k299449k008199
5607D6018669j899806j899260j383769j125751j055585r03507n58928m90636m63400
5598C6238027M6373j5786L2827p2168j37451R0021l24557q6905j28133p85837
5588C4856411q72269o40774o83403o32257m04159o56922m82859j58845M6461l22507
5578C0048877j87893m5038O8533j51475q8827l5998J10745K10982R2751n2021
5568B9970636M48k35610j40492j85385j28750j17461j60905j65143l11229l17348
5558B8208761r5138o05k65730n028J28549Q9635K20295J18055J09786J18456k49167
5547B8377869k24359P9517m50319m48849j44889k22086N3313m84981l14018k27722
$$ plain form
5537 25993476 25746371 25647732 25314145 25197072 25241704 25249422 25187154 25389226 25511462 25324095
5527 25324095 25339492 25547736 25617093 25742169 25655132 25779985 25630215 25337359 25347530 25215156
5517 25215156 25062814 25047334 24898518 24653145 24816676 24842890 24677118 24616303 24970437 24951541
5507 24951541 25123530 25520605 25512352 25659692 25974810 26197560 26600210 27263341 27735702 27907958
5497 27907958 28400783 28896994 29496110 30017477 30676633 31338581 32170147 32992605 33799826
5488 33799826 34291184 35014336 36448351 37427657 38544674 39805416 41290775 43028131 44874419
5479 44874419 46610079 48414924 50139108 51642591 52779134 53238400 53266659 52573891 51741227
5470 51741227 50560489 49492854 48825701 48579114 48243152 48206291 48641559 49097412 49767644
$$ packed form
5537B5993476k47105r8639l33587j17073M4632P718o2268K02072J22236j87367
5527B5324095J5397K08244O9357J25076q7037J24853j49770k92856J0171j32374
5517B5215156j52342j5480j48816k45373J63531K6214j65772o0815L54134j8896
5507B4951541J71989L97075q253J47340L15118K22750M02650O63131M72361J72256
5497B7907958M92825M96211N99116N21367O59156O61948Q31566Q22458Q07221
5488C3799826M91358P23152J434015R79306J117017J260742J485359J737356J846288
5479D4874419J735660J804845J724184J503483J136543M59266K8259o92768q32664
5470E1741227j180738j067635o67153k46587l35962l6861M35268M55853O70232
$$ plain form
5461 49767644 50966725 52156788 53584743 55192682 56780168 58876047 61127877 63453957
5453 63453957 66109669 68783828 70765045 71941327 72065695 70818088 68230230 64944021
5445 64944021 61207111 57245095 53594536 50719360 48021448 45598261 43669136 42479648
5437 42479648 41543421 40801489 40449712 40285816 40211148 40079948 40107636 40676140 41301909 42106139
5427 42106139 42968685 43536869 43663791 43127870 42121670 40104548 37708486 35127914 32787835
5418 32787835 30251840 27541317 25754288 24132536 22535893 21245379 20148505 18936424
5410 18936424 17872375 16998916 16335852 15631650 15203762 14777225 14333157 13757893 13359858
5401 13359858 12995664 12382059 12126081 12025176 11763646 11352451 11007571 10463444 10146072
$$ packed form
5461D9767644J199081J190063J427955J607939J587486K095879K251830K326080
5453F3453957K655712K674159J981217J176282J24368j247607k587858l286209
5445F4944021l736910l962016l650559k875176k697912k423187j929125j189488
5437D2479648r36227p41932l51777j63896p4668j31200K7688N68504O25769Q04230
5427D2106139Q62546N68184J26922n35921j006200k017122k396062k580572k340079
5418C2787835k535995k710523j787029j621752j596643j290514j096874j212081
5410A8936424j064049q73459o63064p04202m27888m26537m44068n75264l98035
5401A3359858l64194o13605k55978j00905k61530m11195l44880n44127l17372
$$ plain form
5392 10146072 9967424 9646075 9514270 9354217 9119605 9129691 9069975 8799191 8734054 8638764
5382 8638764 8293211 8029919 7940107 7917025 7700768 7482469 7197987 7238689 7062677 6852484
5372 6852484 6838227 6963179 6829657 6816768 6519586 6444335 6413240 6181634 6046481 6046598 6012243
5361 6012243 5808324 5949907 6163018 6067840 5708534 5583518 5315590 5527829 5509549 5279716
5351 5279716 5358634 5442034 5359665 5496269 5513622 5345452 5306354 5262922 5190165 5360876 5465237
5340 5465237 5556535 5435952 5457533 5521101 5438067 5271748 5227459 5361532 5371490 5271904 5261165
5329 5261165 5121916 5145224 5152461 5525635 5621190 5455210 5311373 5367614 5451973 5497713 5565360
5318 5565360 5525203 5557440 5686814 5649383 5630772 5567424 5505476 5449026 5500576 5532682 5354344
$$ packed form
5392A0146072j78648l21349j31805j60053k34612J0086n9716k70784o5137r5290
5382H638764l45553k63292q9812k3082k16257k18299k84482M0702j76012k10193
5372F852484j4257J24952j33522j2889k97182p5251l1095k31606j35153J17l4355
5361F012243k03919J41583K13111r5178l59306j25016k67928K12239j8280k29833
5351E279716P8918Q3400q2369J36604J7353j68170l9098m3432p2757J70711J04361
5340E465237R1298j20583K1581O3568q3034j66319m4289J34073R958r9586j0739
5329E261165j39249K3308P237L73174R5555j65980j43837N6241Q4359M5740O7647
5318E565360m0157L2237J29374l7431j8611o3348o1948n6450N1550L2106j78338
$$ plain form
5307 5354344 5526258 5653121 5591220 5304688 5254113 5287145 5495293 5448737 5228499 5058426
5297 5058426 5149123 5294571 5413860 5462719 5349034 5451359 5356899 5230183 5325574 5440646
5287 5440646 5318857 5141213 4975798 4929819 5138492 5017812 4973198 5047062 5051333 5067094 5147786
5276 5147786 4995548 4994973 4983486 4909834 4848239 4878671 4913316 4939671 4883495 5110854 5052018
5265 5052018 4883102 4694379 4626422 4553260 4719597 4659395 4552855 4578820 4760618 4699219
5255 4699219 4521587 4572534 4384192 4512184 4462446 4410772 4574871 4692661 4682541 4794107
5245 4794107 4683991 4468983 4338843 4409625 4356997 4299388 4265676 4170994 4088971 3959598 4034511
5234 4034511 4089766 4028942 4039433 4169245 4168665 4156563 4289842 4319430 4344223 4334338 4330690 4278805
$$ packed form
5307E354344J71914J26863o1901k86532n0575L3032K08148m6556k20238j70073
5297E058426R0697J45448J19289M8859j13685J02325r4460j26716R5391J15072
5287E440646j21789j77644j65415m5979K08673j20680m4614P3864M271J5761Q0692
5276E147786j52238n75j1487p3652o1595L0432L4645K6355n6176K27359n8836
5265E052018j68916j88723o7957p3162J66337o0202j06540K5965J81798o1399
5255D699219j77632N0947j88342J27992m9738n1674J64099J17790j0120J11566
5245D794107j10116k15008j30140P0782n2628n7609l3712r4682q2023j29373P4913
5234D034511N5255o0824J0491J29812n80j2102J33279K9588K4793r885l648n1885
$$ plain form
5222 4278805 4301425 4412899 4180524 4223438 4215205 4165826 4149335 4147628 4128705 4147397 4054907
5211 4054907 4074272 4014183 4067899 4277358 4290202 4455722 4437582 4546528 4568990 4697610 4749574
5200 4749574 4750453 4810072 4644923 4397130 4444239 4565164 4601415 4697669 4698562 4751680 4840582 4754761
5188 4754761 4838891 4860503 4950055 5107273 4937218 4805814 4945415 5051141 5193566 5390864
5178 5390864 5538849 5388077 5262474 5316723 5434798 5218000 5287940 5496255 5581795 5762322
5168 5762322 5954636 5897106 5957703 5949539 5932814 6144947 6079804 6165773 6548832 6391478 6518182
5157 6518182 6723191 6587397 6644471 6564029 6531546 6618266 6670710 6865894 6881105 6893709 7066839
5146 7066839 6830528 6942015 7044853 7111940 6925864 6962009 7253169 7278195 7181832 7057713
$$ packed form
5222D278805K2620J11474k32375M2914q233m9379j6491j707j8923J8692r2490
5211D054907J9365o0089N3716K09459J2844J65520j8140J08946K2462J28620N1964
5200D749574Q79N9619j65149k47793M7109J20925L6251R6254Q93N3118Q8902q5821
5188D754761Q4130K1612Q9552J57218j70055j31404J39601J05726J42425J97298
5178E390864J47985j50772j25603N4249J18075k16798O9940K08315Q5540J80527
5168E762322J92314n7530O0597q164j6725K12133o5143Q5969L83059j57354J26704
5157F518182K05009j35794N7074q0442l2483Q6720N2444J95184J5211J2604J73130
5146G066839k36311J11487J02838O7087j86076L6145K91160K5026r6363j24119
$$ plain form
5136 7057713 7116085 7157139 7274470 7307474 7543761 7801491 7754950 7663626 7664893 7895908 7712062
5125 7712062 7656069 7764450 7794948 7747840 7609208 7667742 7963703 7879299 7731192 7648445 7641860
5114 7641860 7712656 7725442 7663884 7714175 7601383 7558311 7872072 7996951 7959531 7920532 7836817
5103 7836817 7968785 8015938 7876671 7799810 8011045 8160277 8047571 8098018 8132981 8340524
5093 8340524 8321820 8422555 8338047 8629106 8604710 8673523 9065155 9061117 8996872 9059432 9018162
5082 9018162 8773301 8668070 9013483 9237969 9153400 9078015 9092450 9080601 9004732 9086981 8917758
5071 8917758 8928046 9350062 9609624 9439038 9730289 9707009 9625461 9818926 10094131 10129706
5061 10129706 9852104 9896862 10477081 10657692 10734262 10960338 10898041 11055030 11226997 11492255
$$ packed form
5136G057713N8372M1054J17331L3004K36287K57730m6541r1324J267K31015j83846
5125G712062n5993J08381L0498m7108j38632N8534K95961q4404j48107q2747o585
5114G641860P0796J2786o1558N0291j12792m3072L13761J24879l7420l8999q3715
5103G836817J31968M7153j39267p6861K11235J49232j12706N0447L4963K07543
5093H340524j8704J00735q4508K91059k4396O8813L91632m038o4245O2560m1270
5082I018162k44861j05231L45413K24486q4569p5385J4435j1849p5869Q2249j69223
5071H917758J0288M22016K59562j70586K91251k3280q1548J93465K75205L5575
5061A0129706k77602M4758N80219J80611P6570K26076o2297J56989J71967K65258
$$ plain form
5051 11492255 11592337 11855587 11937466 11867455 11942338 12246505 12413915 12445738 12434912 12604611
5041 12604611 12865038 12822414 12902043 13084165 13117612 13409072 13701656 13908451 14133443 14324718
5031 14324718 14408098 14624074 14851681 15184334 15492906 15946784 16156898 16359302 16675934 17071692
5021 17071692 17459460 17762807 18016880 18463095 18590169 18767172 19308468 19548496 19938918
5012 19938918 20002159 20619272 20944778 21206838 21427179 21811842 22243039 23048111 23592485 24161898
5002 24161898 24943691 25520286 25764408 25904111 25907171 25452150 25039755 24687606 24057698 23540208
4992 23540208 23126782 22739286 22639747 22545545 22516375 22178406 22274751 22521836 22551877 22607972
4982 22607972 22730601 22677049 22618038 22633105 22684293 22723403 22723884 22905296 23066761 23365232 23366176
$$ packed form
5051A1492255J00082K63250Q1879p0011P4883L04167J67410L1823j0826J69699
5041A2604611K60427m2624P9629J82122L3447K91460K92584K06795K24992J91275
5031A4324718Q3380K15976K27607L32653L08572M53878K10114K02404L16632L95758
5021A7071692L87768L03347K54073M46215J27074J77003N41296K40028L90422
5012A9938918O3241O17113L25506K62060K20341L84663M31197Q05072N44374N69413
5002B4161898P81793N76595K44122J39703L060m55021m12395l52149o29908n17490
4992B3540208m13426l87496r9539r4202k9170l37969R6345K47085L0041N6095
4982B2607972J22629n3552n9011J5067N1188L9110M81J81412J61465K98471R44
$$ plain form
4971 23366176 23285386 23259296 23433062 23376336 23213745 22993878 22877316 22954094 22885585 22892465 23049926
4960 23049926 22921503 22635136 22626819 22534196 22504997 22675980 22931163 23055278 23273614 23379707
4950 23379707 23409878 23488453 23773357 24175061 24481827 24368304 24628619 25113451 25558430 26022795
4940 26022795 26308444 26933868 27139801 27423839 27463114 27068547 26420583 25565691 24761554 23722652
4930 23722652 22770856 21997979 21246615 20648748 20193397 19772424 19622942 19382687 19132722
4921 19132722 18632925 18377293 18325431 18070810 17642656 17611414 17614734 17376752 17210468 17241066
4911 17241066 17101669 17048881 17092600 17085209 17124876 16992831 17073066 17256406 17241611 17140713 17271253
4900 17271253 17074673 17009653 17188098 17316693 17362921 17412198 17234830 17302598 17309932 17204630
$$ packed form
4971B3366176q0790k6090J73766n6726j62591k19867j16562P6778o8509O880J57461
4960B3049926j28423k86367q317r2623k9199J70983K55183J24115K18336J06093
4950B3379707L0171P8575K84904M01704L06766j13523K60315M84832M44979M64365
4940B6022795K85649O25424K05933K84038L9275l94567o47964q54892q04137j038902
4930B3722652r51796p72877p51364n97867m55351m20973j49482k40255k49965
4921A9132722m99797k55632n1862k54621m28154l1242L320k37982j66284L0598
4911A7241066j39397n2788M3719p391L9667j32045Q0235J83340j4795j00898J30540
4900A7271253j96580o5020J78445J28595M6228M9277j77368O7768P334j05302
$$ plain form
4890 17204630 17382525 17325777 17401470 17308514 17336556 17464508 17462582 17474682 17703462 17645297 17786148
4879 17786148 17962718 18153147 18234820 18539540 18720076 18757660 18984237 19161548 19361509 19448581
4869 19448581 19741623 19970405 20220267 20399298 20638985 20889414 21217238 21279639 21442358 21955081
4859 21955081 22181314 22365088 22772114 23237024 23286135 23603373 24124386 24538191 24782864 25323793
4849 25323793 25737011 26081865 26580898 26989042 27640379 28128329 28780381 29153360 29483979
4840 29483979 29962611 30443850 31219925 31748299 32316975 33075747 33806399 34545512 35208433
4831 35208433 35929756 36769684 37701513 38694416 39762028 40650012 41653752 42906694 44173383
4822 44173383 45274233 46399778 47676651 49318795 50658638 52017183 53562533 55115530
$$ packed form
4890A7204630J77895n6748P5693r2956K8042J27952j926J2100K28780n8165J40851
4879A7786148J76570J90429Q1673L04720J80536L7584K26577J77311J99961Q7072
4869A9448581K93042K28782K49862J79031K39687K50429L27824O2401J62719N12723
4859B1955081K26233J83774M07026M64910M9111L17238N21013M13805K44673N40929
4849B5323793M13218L44854M99033M08144O51337M87950O52052L72979L30619
4840B9483979M78632M81239P76075N28374N68676P58772P30652P39113O62921
4831C5208433P21323Q39928R31829R92903J067612Q87984J003740J252942J266689
4822D4173383J100850J125545J276873J642144J339843J358545J545350J552997
$$ plain form
4814 55115530 56509011 57865474 59003040 60031687 60963118 61887487 62591687 63216742 63909009
4805 63909009 64499190 65151552 65623417 66019066 66567513 67363071 68005934 69084729 70289254
4796 70289254 71274881 72614358 74239630 75662408 77372738 79115126 80533693 82263501
4788 82263501 83714781 84832238 85948808 87018248 87458991 87172351 86859835 86110762 85375408
4779 85375408 84802324 83981642 82834139 81948543 81349286 80565778 79959284 79952684 80219846 80773369
4769 80773369 81398605 82146771 83341199 84546502 86057811 87548989 89040886 90400469
4761 90400469 91736071 92880012 93815301 94294503 94381655 94026753 93223081 92162821 90777504
4752 90777504 89455383 88427852 87515226 86634283 85917488 85493545 85072983 85274021 85580370
$$ packed form
4814E5115530J393481J356463J137566J028647R31431R24369P04200O25055O92267
4805F3909009N90181O52362M71865L95649N48447P95558O42863J078795J204525
4796G0289254R85627J339477J625272J422778J710330J742388J418567J729808
4788H2263501J451280J117457J116570J069440M40743k86640l12516p49073p35354
4779H5375408n73084q20682j147503q85596n99257p83508o06494o600K67162N53523
4769H0773369O25236P48166J194428J205303J511309J491178J491897J359583
4761I0400469J335602J143941R35289M79202Q7152l54902q03672j060260j385317
4752I0777504j322121j027531r12626q80943p16795m23943m20562K01038L06349
$$ plain form
4743 85580370 86154673 86992106 87878430 89169638 90512148 91924272 92823992 93751148 94641118
4734 94641118 95097808 95396353 95665342 95398420 94661382 93495749 92162697 90760350 89141427
4725 89141427 87310234 85666928 84264201 82773290 81840914 80586669 79544274 78896819
4717 78896819 78162067 77652611 77198421 76974801 76605926 76382096 75858983 75287893 74811069
4708 74811069 73942629 73001615 72182519 71134292 70004561 68623095 67106729 65564719 63894276
4699 63894276 62375563 60734335 59526682 58121407 56795818 55580118 54383760 53121734
4691 53121734 51937939 51097687 50224271 49300890 48495529 47603391 46700015 46116855 45511636
4682 45511636 44924477 44344571 43936621 43458865 42824464 42343770 41892557 41197685 40868321
$$ packed form
4743H5580370N74303Q37433Q86324J291208J342510J412124Q99720R27156Q89970
4734I4641118M56690K98545K68989k66922p37038j165633j333052j402347j618923
4725H9141427j831193j643306j402727j490911r32376j254245j042395o47455
4717G8896819p34752n09456m54190k23620l68875k23830n23113n71090m76824
4708G4811069q68440r41014q19096j048227j129731j381466j516366j542010j670443
4699F3894276j518713j641228j207653j405275j325589j215700j196358j262026
4691E3121734j183795q40252q73416r23381q05361q92138r03376n83160o05219
4682D5511636n87159n79906m07950m77756o34401m80694m51213o94872l29364
$$ plain form
4673 40868321 40490737 39991554 39643052 39271892 38896283 38620735 38165718 37787621 37557429
4664 37557429 37126767 36823791 36580411 36105812 35837436 35771648 35617199 35367399 35376888 35163158
4654 35163158 35251317 35428257 35259888 35028524 34964295 34746008 34637498 34486533 34206020 34154970
4644 34154970 33662611 33506612 33574135 33353754 33216957 33106817 33247398 33117286 33137574 33109640
4634 33109640 33020300 33226069 33535414 33542523 33523979 33876480 34041330 33981193 34215808 34339239
4624 34339239 34670383 34823766 34849948 35178401 35369209 35449148 35480156 35722893 35948167 36199915
4614 36199915 36491065 36588580 36784663 37164328 37435135 37849753 38383387 38744673 39198323 39709539
4604 39709539 40188586 40920576 41812814 42615677 43332017 44233823 45053414 45883345 46686689
$$ packed form
4673D0868321l77584m99183l48502l71160l75609k75548m55017l78097k30192
4664C7557429m30662l02976k43380m74599k68376o5788j54449k49800R489k13730
4654C5163158Q8159J76940j68369k31364o4229k18287j08510j50965k80513n1050
4644C4154970m92359j55999O7523k20381j36797j10140J40581j30112K0288k7934
4634C3109640q9340K05769L09345P109j8544L52501J64850o0137K34615J23431
4624C4339239L31144J53383K6182L28453J90808P9939L1008K42737K25274K51748
4614C6199915K91150R7515J96083L79665K70807M14618N33634L61286M53650N11216
4604C9709539M79047P31990Q92238Q02863P16340R01806Q19591Q29931Q03344
$$ plain form
4595 46686689 47603662 48604584 49883851 50877263 52248665 53344563 54542354 56036908
4587 56036908 57449383 59030201 60731793 62538972 64383904 66634809 68896109 70969729
4579 70969729 72656855 73836004 74895021 75240175 75075507 74740076 74315188 73920062 73676992
4570 73676992 73824266 74412027 75338275 76420743 77608558 79097050 80855397 82969955 85179519
4561 85179519 87713467 90639808 93635816 96688512 100061249 103398215 106411737 108904732
4553 108904732 110781495 111855484 111614300 110352080 108523992 106512663 104042209 101381100
4545 101381100 98759897 96207731 93766514 91476797 89327301 87409099 85251744 83285108
4537 83285108 81252185 79149562 77483928 75900297 74733930 73733505 73119755 72676955
$$ packed form
4595D6686689R16973J000922J279267R93412J371402J095898J197791J494554
4587E6036908J412475J580818J701592J807179J844932K250905K261300K073620
4579G0969729J687126J179149J059017L45154j64668l35431m24888l95126k43070
4570G3676992J47274N87761R26248J082468J187815J488492J758347K114558K209564
4561H5179519K533948K926341K996008L052696L372737L336966L013522K492995
4553A08904732J876763J073989k41184j262220j828088k011329k470454k661109
4545A01381100k621203k552166k441217k289717k149496j918202k157355j966636
4537H3285108k032923k102623j665634j583631j166367j000425o13750m42800
$$ plain form
4529 72676955 72272833 71726627 70628846 69355979 67608613 65568419 63652687 61647656
4521 61647656 59609711 57685128 55896120 54068948 52359920 50526149 48880548 47448042
4513 47448042 45731167 44126465 42796859 41463548 40143122 38802788 37380363 36164217
4505 36164217 35152752 34138539 33325770 32540705 31942806 31102202 30488592 29901096 29524331
4496 29524331 29037985 28520967 28033237 27571351 27157031 26831800 26551022 26059009 25851677
4487 25851677 25782210 25303209 24835509 24614378 24364641 24290376 24066420 24113537 23957754 23914314
4477 23914314 23989148 23735546 23694063 23750222 23799807 23881623 23885458 24007708 24043760 24206170 24201702
4466 24201702 24423858 24368704 24636817 24806607 24968185 25008551 25303888 25359093 25501973 25710534
$$ packed form
4529G2676955m04122n46206j097781j272867j747366k040194j915732k005031
4521F1647656k037945j924583j789008j827172j709028j833771j645601j432506
4513D7448042j716875j604702j329606j333311j320426j340334j422425j216146
4505C6164217j011465j014213q12769p85065n97899q40604o13610n87496l76765
4496B9524331m86346n17018m87730m61886m14320l25231k80778m92013k07332
4487B5851677o9467m79001m67700k21131k49737p4265k23956M7117j55783m3440
4477B3914314P4834k53602m1483N6159M9585Q1816L835J22250L6052J62410m468
4466B4201702K22156n5154K68113J69790J61578M0366K95337N5205J42880K08561
$$ plain form
4456 25710534 25897234 25946840 26357500 27047016 27167102 27398454 27726814 27964704 28392973 28742669
4446 28742669 29216202 29488868 29841987 30108762 30419648 30829769 30975394 31152341 31318386
4437 31318386 31670497 31947596 32238789 32514420 32949498 33253817 33617756 34198683 34448229
4428 34448229 34725913 35295946 35852352 36449096 36906063 37502437 38114122 38801776 39693950
4419 39693950 40343029 41005105 41779226 42369294 43094126 43947799 44828521 45687230 46661595
4410 46661595 47571648 48337639 49353860 50243810 51231333 52304112 53183908 54099165 54996791
4401 54996791 56318628 57278267 58171770 59313544 60605210 61627988 62775102 64072204
4393 64072204 65420690 66825179 68422311 69802272 71352183 73086581 74958337 76985594
$$ packed form
4456B5710534J86700M9606M10660O89516J20086K31352L28360K37890M28269L49696
4446B8742669M73533K72666L53119K66775L10886M10121J45625J76947J66045
4437C1318386L52111K77099K91193K75631M35078L04319L63939N80927K49546
4428C4448229K77684N70033N56406N96744M56967N96374O11685O87654Q92174
4419C9693950O49079O62076P74121N90068P24832Q53673Q80722Q58709R74365
4410D6661595R10053P65991J016221Q89950R87523J072779Q79796R15257Q97626
4401E4996791J321837R59639Q93503J141774J291666J022778J147114J297102
4393F4072204J348486J404489J597132J379961J549911J734398J871756K027257
$$ plain form
4385 76985594 78969911 81022869 83156163 85593749 88159265 90831452 93508648 96325203
4377 96325203 99474187 102695921 106105950 109722861 113707811 117894623 122270276 127073424
4369 127073424 132276261 137783349 143581706 149764077 156306826 163697486 171541492 180040330
4361 180040330 189043600 198614043 208827084 219751868 231454565 244355917 258629541
4354 258629541 274129366 291344179 309009791 325696984 338512538 344356550 341149390
4347 341149390 328575423 307589341 281776052 254163508 227709219 204033523 183378303
4340 183378303 165629822 150321631 137632883 126632517 117108756 109038394 102099421
4333 102099421 95811250 90365904 85550663 81318352 77344364 73688703 70360590 67361813
$$ packed form
4385G6985594J984317K052958K133294K437586K565516K672187K677196K816555
4377I6325203L148984L221734L410029L616911L984950M186812M375653M803148
4369A27073424N202837N507088N798357O182371O542749P390660P844006Q498838
4361A80040330R003270R570443J0213041J0924784J1702697J2901352J4273624
4354B58629541J5499825J7214813J7665612J6687193J2815554N844012l207160
4347C41149390j2573967k0986082k5813289k7612544k6454289k3675696k0655220
4340A83378303j7748481j5308191j2688748j1000366r523761q070362o938973
4333A02099421o288171n445346m815241m232311l973988l655661l328113k998777
$$ plain form
4325 67361813 64853038 62542739 60375279 58233468 56381090 54816802 53326839 51676900
4317 51676900 50164926 48914741 47626165 46542246 45464119 44330612 43143046 42209663
4309 42209663 41207705 40323178 39355964 38454532 37853049 37265803 36479772 35907378 35364805
4300 35364805 34664523 34051365 33475616 32898387 32280255 31725483 31191581 30609375 29937238
4291 29937238 29329674 28454193 27811261 27228211 26981278 26751224 26464278 26068177 25761590
4282 25761590 25482939 25002332 24217119 23800396 23224032 22556441 22274171 21917749 21792154
4273 21792154 21262648 20862256 20528911 20262290 20006070 19779849 19462706 19311474 18873808
4264 18873808 18610071 18501775 18246358 18059615 17673661 17523968 17482875 17346155 17362144 17220015
$$ packed form
4325F7361813k508775k310299k167460k141811j852378j564288j489963j649939
4317E1676900j511974j250185j288576j083919j078127j133507j187566r33383
4309D2209663j001958q84527r67214r01432o01483n87246p86031n72394n42573
4300C5364805p00282o13158n75749n77229o18132n54772n33902n82206o72137
4291B9937238o07564q75481o42932n83050k46933k30054k86946l96101l06587
4282B5761590k78651m80607p85213m16723n76364o67591k82270l56422j25595
4273B1792154n29506m00392l33345k66621k56220k26221l17143j51232m37666
4264A8873808k63737j08296k55417j86743l85954j49693m1093j36720J5989j42129
$$ plain form
4254 17220015 16798527 16371820 16294655 16252879 16381120 16379722 16304262 16147331 16014718 16087254
4244 16087254 16057873 15780589 15880420 15888276 15759108 15986389 16089208 16027977 16145766 16390720
4234 16390720 16294134 16389574 16485051 16427454 16458331 16661145 16688797 16904977 17037411 17249982
4224 17249982 17278227 17175849 17294972 17549962 17494901 17665934 18088491 18188818 18247832 18248478
4214 18248478 18487766 18473873 18371045 18425262 18749803 18881318 18862839 18974923 18929171 19091519
4204 19091519 19381066 19391810 19460616 19651518 19578520 19722942 20303764 20339459 20220115 20383301
4194 20383301 20536127 20807732 20888585 20929594 21027013 21171329 21382310 21564644 21787429 21745954
4184 21745954 21742400 22043337 22223605 22426073 22781954 22852321 22746336 22767452 22796335 22975713
$$ packed form
4254A7220015m21488m26707p7165m1776J28241j398p5460j56931j32613P2536
4244A6087254k9381k77284R9831P856j29168K27281J02819o1231J17789K44954
4234A6390720r6586R5440R5477n7597L0877K02814K7652K16180J32434K12571
4224A7249982K8245j02378J19123K54990n5061J71033M22557J00327N9014O46
4214A8248478K39288j3893j02828N4217L24541J31515j8479J12084m5752J62348
4204A9091519K89547J0744O8806J90902p2998J44422N80822L5695j19344J63186
4194B0383301J52826K71605Q0853M1009R7419J44316K10981J82334K22785m1475
4184B1745954l554L00937J80268K02468L55881P0367j05985K1116K8883J79378
$$ plain form
4174 22975713 23026899 23150819 23392391 23437355 23548817 23510760 23267907 23315044 23686852 23788313
4164 23788313 23900082 23983503 24005947 24029685 24008479 24213953 24633077 24855733 24929364 25028018
4154 25028018 25325866 25499261 25700438 25850615 26046435 26124519 26341611 26606874 26607602 26659480
4144 26659480 26701061 26789863 26938390 26811333 27113488 27511726 27427783 27811552 27968149 28163897
4134 28163897 28484291 28641513 28831973 29105477 29298184 29722373 30138121 30706061 31099221
4125 31099221 31567279 32215261 32450478 32791658 33203556 33660592 34076102 34296406 34803076
4116 34803076 35255191 35758056 36485100 37045163 37687115 38181396 38678200 39363194 39951468
4107 39951468 40487804 41236585 41945049 42148678 42689758 43170461 43638847 44309012 44736437
$$ packed form
4174B2975713N1186J23920K41572M4964J11462l8057k42853M7137L71808J01461
4164B3788313J11769Q3421K2444K3738k1206K05474M19124K22656P3631R8654
4154B5028018K97848J73395K01177J50177J95820P8084K17092K65263P28N1878
4144B6659480M1581Q8802J48527j27057L02155L98238q3943L83769J56597J95748
4134B8163897L20394J57222J90460K73504J92707M24189M15748N67940L93160
4125C1099221M68058O47982K35217L41180M11898M57036M15510K20304N06670
4116C4803076M52115N02865P27044N60063O41952M94281M96804O84994N88274
4107C9951468N36336P48781P08464K03629N41080M80703M68386O70165M27425
$$ plain form
4098 44736437 45503839 46142937 46603785 47519765 48098703 48640552 49188104 49849405 50586376
4089 50586376 51250531 51820995 52595225 53424415 54571321 55657714 56858100 57904528 58845482
4080 58845482 59575908 60504598 61176979 61678898 61977407 62423050 62881801 63219549 63887528
4071 63887528 64216044 64844447 65333175 65747025 66341479 67336162 68154391 68698376 69216993
4062 69216993 69969772 70435440 71045637 71910397 72825050 73938199 75226431 76305999 77897012
4053 77897012 79465840 80528035 81802841 83052376 84123054 85247207 86130906 86878599
4045 86878599 87424942 88169388 88633119 88710475 88936761 89207953 89462573 89491973 89256359 89350917
4035 89350917 89336649 89280273 89492616 89861686 90205803 90382855 90555501 90621826 90543902 90473189
$$ packed form
4098D4736437P67402O39098M60848R15980N78938N41849N47552O61301P36971
4089E0586376O64155N70464P74230Q29190J146906J086393J200386J046428R40954
4080E8845482P30426R28690O72381N01919K98509M45643M58751L37748O67979
4071F3887528L28516O28403M88728M13850N94454R94683Q18229N43985N18617
4062F9216993P52779M65668O10197Q64760R14653J113149J288232J079568J591013
4053G7897012J568828J062195J274806J249535J070678J124153Q83699P47693
4045H6878599N46343P44446M63731P7356K26286K71192K54620K9400k35614R4558
4035H9350917j4268n6376K12343L69070L44117J77052J72646O6325p7924p0713
$$ plain form
4025 90473189 90378388 90171900 90101434 89945522 89811106 89736405 89899823 90060264 90072368 90214055
4015 90214055 90012111 89905119 89932350 89814254 89527194 89361863 88969400 88181096 87450616 86770227
4005 86770227 85945427 85077826 84168844 82998742 81792748 80531796 78988927 77650012 76790977
3996 76790977 75913857 75369212 74991068 74424795 74055276 73857382 73609928 73322366 72746065
3987 72746065 72240407 71672404 71294923 70864857 70379709 69866728 69042671 68659709 68296738
3978 68296738 67699709 67024231 66370590 65632627 64733244 63403181 62148184 60794268 59244689
3969 59244689 57928963 56685873 55525434 54356758 53513602 52663616 51702022 50705319 49905730
3960 49905730 49246176 48307856 47333925 46528350 45939982 44921750 44151761 43627647 42901043
$$ packed form
4025I0473189r4801k06488p0466j55912j34416p4701J63418J60441J2104J41687
4015I0214055k01944j06992K7231j18096k87060j65331l92463p88304p30480o80389
4005H6770227q24800q67601r08982j170102j205994j260952j542869j338915q59035
3996G6790977q77120n44645l78144n66273l69519j97894k47454k87562n76301
3987G2746065n05658n68003l77481m30066m85148n12981q24057l82962l62971
3978F8296738n97029o75478o53641p37963q99383j330063j254997j353916j549579
3969E9244689j315726j243090j160439j168676q43156q49986r61594r96703p99589
3960D9905730o59554r38320r73931q05575n88368j018232p69989n24114p26604
$$ plain form
3951 42901043 42062946 41463924 40921014 40113041 39260650 38188960 37134733 36134680 34939199
3942 34939199 33873526 33114705 32260412 31269799 30379583 29502897 28839254 28450143 27772390
3933 27772390 26917258 26154929 25563038 25027818 24385981 23712592 23284263 22701512 22033528
3924 22033528 21532639 21217413 20783647 20230099 19709982 19438227 19135095 18826187 18343945
3915 18343945 17788523 17148094 16875368 16741788 16392476 16113130 15899956 15734174 15503110
3906 15503110 15071401 14781858 14614690 14304029 14154619 13982106 13828648 13746259 13553653 13341703
3896 13341703 13380750 13261691 12993528 12985856 12796824 12539736 12426034 12511625 12552707 12532364
3886 12532364 12421584 12369102 12423003 12203508 12023970 12057680 11816301 11583870 11213201 11026219
$$ packed form
3951D2901043q38097n99022n42910q07973q52391j071690j054227j000053j195481
3942C4939199j065673p58821q54293r90613q90216q76686o63643l89111o77753
3933B7772390q55132p62329n91891n35220o41837o73389m28329n82751o67984
3924B2033528n00889l15226m33766n53548n20117k71755l03132l08908m82242
3915A8343945n55422o40429k72726j33580l49312k79346k13174j65782k31064
3906A5503110m31709k89543j67168l10661j49410j72513j53458q2389j92606k11950
3896A3341703L9047j19059k68163p672j89032k57088j13702Q5591M1082k0343
3886A2532364j10780n2482N3901k19495j79538L3710k41379k32431l70669j86982
$$ plain form
3876 11026219 10841354 10499331 10273048 10038168 9805716 9675461 9413604 9340403 9327705 9120993
3866 9120993 8943126 8764402 8582499 8438028 8587977 8677582 8444238 8261367 8234829 8143742
3856 8143742 8147581 7863129 7787453 7714679 7658953 7807692 7626285 7560807 7530060 7594825 7625625
3845 7625625 7406565 7525522 7480883 7380239 7233480 7164284 7374463 7339763 7246075 7121227
3835 7121227 7141996 7002939 6816538 7066575 6750909 6548333 6625479 6572286 6535373 6413216
3825 6413216 6299990 6520808 6390742 6183471 6238484 6356479 6532307 6479851 6348957 6212122
3815 6212122 6210826 6112910 5782673 5670547 5592946 5506779 5588607 5642082 5633675 5644028 5672285
3804 5672285 5619791 5703107 5672584 5429857 5468263 5351764 5433099 5396542 5325493 5364135 5275347
$$ packed form
3876A1026219j84865l42023k26283k34880k32452j30255k61857p3201j2698k06712
3866I120993j77867j78724j81903j44471J49949Q9605k33344j82871k6538r1087
3856H143742L839k84452p5676p2774n5726J48739j81407o5478l0747O4765L0800
3845G625625k19060J18957m4639j00644j46759o9196K10179l4700r3688j24848
3835G121227K0769j39057j86401K50037l15666k02576P7146n3193l6913j22157
3825F413216j13226K20818j30066k07271N5013J17995J75828n2456j30894j36835
3815F212122j296r7916l30237j12126p7601q6167Q1828N3475q407J0353K8257
3804E672285n2494Q3316l0523k42727L8406j16499Q1335l6557p1049L8642q8788
$$ plain form
3793 5275347 5258964 5256145 5307909 5245967 5080053 4888430 4995913 5056086 5159851 5094188 4974957
3782 4974957 5008742 5112808 5014011 4846080 4794504 4856460 4866915 4877504 4840852 4937559 4825409
3771 4825409 4634295 4558684 4620117 4842922 4809522 4878559 4790072 4739759 4506232 4496743 4574100
3760 4574100 4695680 4799190 4797447 4563869 4528032 4603687 4507008 4550611 4689427 4617745 4655853
3749 4655853 4745123 4774349 4561915 4407910 4474774 4649517 4775291 4693529 4557181 4779395
3739 4779395 4706470 4506459 4476429 4425687 4541499 4515473 4446916 4274849 4392042 4458690 4472774
3728 4472774 4684341 4662613 4385380 4530875 4658841 4834032 4742576 4702135 4684167 4610877
3718 4610877 4512757 4558326 4582909 4635828 4434647 4293974 4566488 4529138 4426851 4416806 4388012
$$ packed form
3793E275347j6383k819N1764o1942j65914j91623J07483O0173J03765o5663j19231
3782D974957L3785J04066r8797j67931n1576O1956J0455J0589l6652R6707j12150
3771D825409j91114p5611O1433K22805l3400O9037q8487n0313k33527r489P7357
3760D574100J21580J03510j743k33578l5837P5655r6679M3603J38816p1682L8108
3749D655853Q9270K9226k12434j54005O6864J74743J25774q1762j36348K22214
3739D779395p2925k00011l0030n0742J15812k6026o8557j72067J17193O6648J4084
3728D472774K11567k1728k77233J45495J27966J75191r1456m0441j7968p3290
3718D610877r8120M5569K4583N2919k01181j40673K72514l7350j02287j0045k8794
$$ plain form
3707 4388012 4533563 4511550 4539797 4642350 4738692 4791605 4719498 4595926 4399065 4352855 4419719
3696 4419719 4269843 4195323 4283449 4281144 4227280 4469119 4355244 4206501 4445599 4406336 4361270
3685 4361270 4461373 4311913 4267564 4296694 4215323 4064587 4114748 4155981 4053228 4197785
3675 4197785 4073958 4115132 4005159 3757142 3804691 3758307 3716614 3841033 3907799 3955337 4007991
3664 4007991 3960222 3836100 3877301 3904671 3747177 3572404 3796089 3791268 3689887 3753718 3672537
3653 3672537 3735792 3615119 3588576 3588539 3869403 3830327 3467470 3446808 3502579 3538233 3491400
3642 3491400 3506252 3397166 3032956 3131970 3263753 3343772 3287071 3381885 3511927 3295698
3632 3295698 3492580 3678060 3667030 3281459 3451561 3531291 3130745 2987243 3058789 3072728
$$ packed form
3707D388012J45551k2013K8247J02553R6342N2913p2107j23572j96861m6210O6864
3696D419719j49876p4520Q8126k305n3864K41839j13875j48743K39098l9263m5066
3685D361270J00103j49460m4349K9130q1371j50736N0161M1233j02753J44557
3675D197785j23827M1174j09973k48017M7549m6384m1693J24419O6766M7538N2654
3664D007991m7769j24122M1201K7370j57494j74773K23685m821j01381O3831q1181
3653C672537O3255j20673k6543l7K80864l9076l62857k0662N5771L5654m6833
3642C491400J4852j09086l64210R9014J31783Q0019n6701R4814J30042k16229
3632C295698J96882J85480j1030l85571J70102P9730m00546j43502P1546J3939
$$ plain form
3622 3072728 3260168 3172988 3108394 2950685 2936017 2907376 2978545 3266388 3176104 3056446 3116781
3611 3116781 2980314 2795437 2782097 2911346 3071030 2919606 3054529 2998789 3191719 3315719
3601 3315719 3003815 3051696 3006086 3027815 3090758 3109914 3420603 3278292 3191058 3367280 3369568
3590 3369568 3142682 3216620 3282918 3222820 3436010 3512223 3510381 3544509 3571714 3684983 3612764
3579 3612764 3502710 3514741 3527679 3687350 3676467 3804035 3740340 3753271 3722224 3675569 3628698
3568 3628698 3499619 3437516 3722459 3780838 3926156 4038489 3947751 3839314 4005910 4033772
3558 4033772 4025718 4463764 4466702 4372410 4381764 4499390 4466463 4509318 4260680 4338685 4495401
3547 4495401 4593314 4513506 4467574 4570556 4606782 4561161 4606562 4699200 4705992 4960255 5115368
$$ packed form
3622C072728J87440q7180o4594j57709j4668k8641P1169K87843r0284j19658O0335
3611C116781j36467j84877j3340J29249J59684j51424J34923n5740J92930J24000
3601C315719l11904M7881m5610K1729O2943J9156L10689j42311q7234J76222K288
3590C369568k26886P3938O6298o0098K13190P6213j842L4128K7205J13269p2219
3579C612764j10054J2031J2938J59671j0883J27568o3695J2931l1047m6655m6871
3568C628698j29079o2103K84943N8379J45318J12333r0738j08437J66596K7862
3558D033772q054M38046K938r4292R354J17626l2927M2855k48638P8005J56716
3547D495401R7913p9808m5932J02982L6226m5621M5401R2638O792K54263J55113
$$ plain form
3536 5115368 4933632 4985604 5057148 5128904 5282859 5268893 5355218 5444094 5346084 5367823 5348887
3525 5348887 5263769 5518561 5729207 5814533 5691460 5613878 5664207 5840480 6073876 6206267
3515 6206267 6210235 6212782 6201571 6372042 6520371 6482052 6694765 6633359 6687122 6845792 6882253
3504 6882253 6988475 7006164 7094633 7244578 7367346 7342519 7412610 7787500 7875391 7896648 7951832
3493 7951832 8008641 8060927 8080467 8314105 8500251 8344563 8548963 8736644 8625650 9061536
3483 9061536 9238544 9355101 9403754 9695470 9848309 10128105 10477069 10776832 10976060 11180859
3473 11180859 11518253 11893484 12080730 12192850 12213187 12343059 12628307 12862607 13028054 12946420
3463 12946420 12743579 12412526 12086011 11693235 11311011 10844376 10480655 10101112 9760996
$$ packed form
3536E115368j81736N1972P1544P1756J53955j3966Q6325Q8876r8010K1739j8936
3525E348887q5118K54792K10646Q5326j23073p7582N0329J76273K33396J32391
3515F206267L968K547j1211J70471J48329l8319K12713o1406N3763J58670L6461
3504F882253J06222J7689Q8469J49945J22768k4827P0091L74890Q7891K1257N5184
3493G951832N6809N2286J9540K33638J86146j55688K04400J87681j10994M35886
3483I061536J77008J16557M8653K91716J52839K79796L48964K99763J99228K04799
3473A1180859L37394L75231J87246J12120K0337J29872K85248K34300J65447q1634
3463A2946420k02841l31053l26515l92776l82224m66635l63721l79543l40116
$$ plain form
3454 9760996 9582986 9372739 8981650 8609953 8164168 7674751 7285763 7061065 6637461 6504157
3444 6504157 6091874 5806190 5621894 5386378 5331769 5247852 4971835 4917326 4827474 4732861
3434 4732861 4619515 4569436 4418300 4472834 4212064 4073814 3959258 3863027 3899400 3623200
3424 3623200 3771934 3581247 3454508 3448334 3480764 3343485 3349658 3415931 3405995 3305463 3308472
3413 3308472 3398326 3377431 3201420 3185139 2960601 2927739 2970124 3011529 2884676 2808167 2730875
3402 2730875 2878861 2833268 2742698 2766491 2781819 2964298 3049558 2977776 2964058 2884332 2793000
3391 2793000 2759770 2618353 2592683 2490425 2520755 2355932 2469978 2496849 2464131 2536567 2588689
3380 2588689 2530175 2179122 2326106 2513493 2372903 2327250 2320497 2262040 2026561 1837329
$$ packed form
3454I760996j78010k10247l91089l71697m45785m89417l88988k24698m23604j33304
3444F504157m12283k85684j84296k35516n4609q3917k76017n4509q9852r4613
3434D732861j13346n0079j51136N4534k60770j38250j14556r6231L6373k76200
3424C623200J48734j90687j26739o174L2430j37279O173O6273r936j00532L009
3413C308472Q9854k0895j76011j6281k24538l2862M2385M1405j26853p6509p7292
3402B730875J47986m5593r0570K3793J5328J82479Q5260p1782j3718p9726r1332
3391B793000l3230j41417k5670j02258L0330j64823J14046K6871l2718P2436N2122
3380B588689n8514l51053J46984J87387j40590m5653o753n8457k35479j89232
$$ plain form
3370 1837329 1892546 1910280 1763278 1752097 1719539 1889093 1757744 1652026 1852685 1821942
3360 1821942 1826512 1564877 1411710 1628281 1665287 1595820 1483691 1519046 1469863 1266697 1353976
3349 1353976 1340922 1193149 1425861 1291360 1157119 1319515 1294563 1201387 1155589 1105307
3339 1105307 1077412 1172640 1392918 1356379 1073319 996889 1143372 1255022 1039848 1050407
3329 1050407 1201058 1164448 1459328 1285252 1073540 1104756 1209751 1029297 825152 1109333
3319 1109333 1389908 1295115 1142791 1257208 1216995 1156180 1171923 1077532 1040435 1085494 1025239
3308 1025239 1152538 1210499 1167826 1038413 1078029 1123625 1248738 1236657 1070447 893680
3298 893680 966569 955583 1162514 1236134 1109599 946650 972188 1073323 1040406 988816 1057615
$$ packed form
3370A837329N5217J7734j47002j1181l2558J69554j31349j05718K00659l0743
3360A821942M570k61635j53167K16571L7006o9467j12129L5355m9183k03166Q7279
3349A353976j3054j47773K32712j34501j34241J62396k4952r3176m5798n0282
3339A105307k7895R5228K20278l6539k83060p6430J46483J11650k15174J0559
3329A050407J50651l6610K94880j74076k11712L1216J04995j80454k04145K84181
3319A109333K80575r4793j52324J14417m0213o0815J5743r4391l7097M5059o0255
3308A025239J27299N7961m2673j29413L9616M5596J25113j2081j66210j76767
3298H93680P2889j0986K06931P3620j26535j62949K5538J01135l2917n1590O8799
$$ plain form
3287 1057615 1175995 906982 1125011 1234340 1035628 901284 868802 1191817 1230586 1061990
3277 1061990 1071924 1268601 1335330 1173916 1132692 1193194 1365342 1227282 1235916 1214385 1283978
3266 1283978 1468403 1232677 1390564 1502743 1352473 1397663 1494660 1242039 1231238 1325734
3256 1325734 1479940 1361041 1205812 1314976 1328807 1244644 1188075 1292677 1282898 1420533
3246 1420533 1413020 1661902 1535120 1531683 1427997 1336249 1285765 1261988 1294060 1163334 1283645
3235 1283645 1104350 1246447 1272380 1169750 1343196 1278571 1355103 1272637 1127060 1216710
3225 1216710 1170086 1298123 1547124 1505936 1398090 1359489 1298307 1291148 1341856 1404101 1343237
3214 1343237 1378511 1434524 1437438 1068634 1132392 1106208 1117555 1274798 1230022 1242705 1240497
$$ packed form
3287A057615J18380k69013K18029J09329j98712j34344l2482L23015L8769j68596
3277A061990R934J96677O6729j61414m1224O0502J72148j38060Q634k1531O9593
3266A283978J84425k35726J57887J12179j50270M5190R6997k52621j0801R4496
3256A325734J54206j18899j55229J09164J3831q4163n6569J04602r779J37635
3246A420533p513K48882j26782l437j03686r1748n0484k3777L2072j30726J20311
3235A283645j79295J42097K5933j02630J73446o4625P6532q2466j45577Q9650
3225A216710m6624J28037K49001m1188j07846l8601o1182p159N0708O2245o0864
3214A343237L5274N6013K914l68804O3758k6184J1347J57243m4776J2683k208
$$ plain form
3203 1240497 1129360 1127143 1148443 1257196 1149547 1124726 1134235 1042699 887563 954118 1112084
3192 1112084 1032630 1208845 1196464 1124657 1071726 1120967 1145615 1264568 1109477 1118368 1095552
3181 1095552 1098005 1121286 1103110 1078164 1133786 1187008 1489601 1510962 1168797 1177036 1354588
3170 1354588 1422540 1559213 1462574 1463504 1524088 1616136 1637912 1448676 1584536 1725338 1682224
3159 1682224 1701974 1840496 1889155 1753606 1605672 1736602 1852218 1916573 1877927 1977927
3149 1977927 1988263 1995381 2225822 2157599 2128967 2035454 2011521 2275374 2237200 2223670 2292054
3138 2292054 2028673 2176020 2125027 2266483 2498793 2528061 2438993 2388860 2471450 2567275 2655095
3127 2655095 2609691 2654507 2454619 2299259 2443577 2382650 2184373 2293510 2380800 2412905
$$ packed form
3203A240497j11137k217K1300J08753j07649k4821R509r1536j55136O6555J57966
3192A112084p9454J76215j2381p1807n2931M9241K4648J18953j55091Q891k2816
3181A095552K453K3281j8176k4946N5622N3222L02593K1361l42165Q239J77552
3170A354588O7952J36673r6639R30O0584R2048K1776j89236J35860J40802m3114
3159A682224J9750J38522M8659j35549j47934J30930J15616O4355l8646J00000
3149A977927J0336P118K30441o8223k8632r3513k3933K63853l8174j3530O8384
3138B292054k63381J47347n0993J41456K32310K9268q9068n0133Q2590R5825Q7820
3127B655095m5404M4816j99888j55360J44318o0927j98277J09137Q7290L2105
$$ plain form
3117 2412905 2169809 2348789 2415229 2258096 2242064 2230034 2213975 2157399 2224668 2238997 2254007
3106 2254007 2189706 2150343 2056688 2077399 2229361 2219469 1967222 2176438 2236592 2136181 2067579
3095 2067579 1974201 1954337 1887320 2081893 1949693 1858995 1672159 1736690 1662552 1460576 1557168
3084 1557168 1480145 1465741 1584433 1530918 1353014 1239827 1315519 1319103 1379310 1170956 1072636
3073 1072636 1258424 1333264 1176176 1176511 1154175 1204224 1043438 1070240 1092495 866383 929096
3062 929096 979967 907728 774383 633086 641390 859028 797653 739352 934928 822502 650462
3051 650462 714365 820812 780940 565438 569984 562026 597552 665361 715290 734929 524110
3040 524110 570295 589500 566113 485544 489067 346955 443479 593902 434204 499355 564332
$$ packed form
3117B412905k43096J78980O6440j57133j6032j2030j6059n6576O7269J4329J5010
3106B254007o4301l9363r3655K0711J51962r892k52247K09216O0154j00411o8602
3095B067579r3378j9864o7017J94573j32200r0698j86836O4531p4138k01976R6592
3084A557168p7023j4404J18692n3515j77904j13187P5692L584O0207k08354r8320
3073A072636J85788P4840j57088L35k2336N0049j60786K6802K2255k26112O2713
3062I29096N0871p2239j33345j41297Q304K17638o1375n8301J95576j12426j72040
3051F50462O3903J06447l9872k15502M546p958L5526O7809M9929J9639k10819
3040E24110M6185J9205k3387q0569L523j42112R6524J50423j59698O5151O4977
$$ plain form
3029 564332 503965 499913 397361 279516 567101 422291 588100 477073 460601 460014 293706
3018 293706 379080 308445 273898 283377 153731 195038 266735 195936 319765 343773 189566
3007 189566 183752 261913 242952 74784 123233 326806 167726 255099 311520 259212 462885
2996 462885 442919 45031 17056 19284 204998 186353 128009 221544 252903 184840 239480
2985 239480 387028 364501 478732 414469 382306 432792 418394 330398 403711 367029 539616
2974 539616 655345 583904 476185 627857 496198 521766 469294 610891 686543 322097
2964 322097 334281 493258 681375 649339 467465 575824 598631 611748 601622 556082 418417
2953 418417 392745 504046 468152 447713 593416 634624 618787 492106 398779 369386 553589
$$ packed form
3029E64332o0367m052j02552j17845K87585j44810J65809j11027j6472n87j66308
3018B93706Q5374p0635l4547R479j29646M1307P1697p0799J23829K4008j54207
3007A89566n814P8161j8961j68168M8449K03573j59080Q7373N6421n2308K03673
2996D62885j9966l97888k7975K228J85714j8645n8344R3535L1359o8063N4640
2985B39480J47548k2527J14231o4263l2163N0486j4398q7996P3313l6682J72587
2974E39616J15729p1441j07719J51672j31659K5568n2472J41597P5652l64446
2964C22097J2184J58977J88117l2036j81874J08359K2807J3117j0126m5540j37665
2953D18417k5672J11301l5894k0439J45703M1208j5837j26681r3327k9393J84203
$$ plain form
2942 553589 484751 435912 441759 353056 357869 292248 369157 285822 396737 472823 573906 663137
2930 663137 464917 525429 822020 550241 609038 539916 412801 579851 621260 481989
2920 481989 309380 265485 530164 617215 534662 457638 335927 195499 287698 430199 476769
2909 476769 461533 589117 455606 284753 167993 217967 273715 266587 246953 281756 192564
2898 192564 220890 310021 346603 262494 179674 195453 293145 417325 130871 84283 62654
2887 62654 66456 -72976 114163 261362 239653 281827 346838 384148 233428 -70934 -42488
2876 -42488 -24385 163114 152358 145777 49612 -63311 26947 -113816 -164915 -111145 -144851
2865 -144851 -98768 147298 76531 -14528 -178933 -177845 85984 153852 236345 194721 136763
$$ packed form
2942E53589o8838m8839N847q8703M813o5621P6909q3335J10915P6086J01083Q9231
2930F63137j98220O0512K96591k71779N8797o9122j27115J67050M1409j39271
2920D81989j72609m3895K64679Q7051q2553p7024j21711j40428R2199J42501M6570
2909D76769j5236J27584j33511j70853j16760M9974N5748p128j9634L4803q9192
2898A92564K8326Q9131L6582q4109q2820J5779R7692J24180k86454m6588k1629
2887F2654L802j39432J87139J47199k1709M2174O5011L7310j50720l04362K8446
2876d2488J8103J87499j0756o581r6165j12923R0258j40763n1099N3770l3706
2865a44851M6083K46066p0767r1059j64405J088K63829O7868Q2493m1624n7958
$$ plain form
2854 136763 216786 252204 135003 147143 136750 -42210 41464 132293 -17740 49342 172165
2843 172165 175794 279787 345109 295885 321123 347313 421536 396524 426492 183704 66731
2832 66731 149982 36902 185087 190878 352216 447489 414241 317920 388074 354679 271847
2821 271847 433678 298600 116960 109183 61924 151736 131549 314551 208456 135847 89083
2810 89083 16213 139261 391995 374215 623697 538595 219854 152939 339507 174157 189601
2799 189601 202580 160543 317809 318835 316288 412684 483476 322114 295270 166590 203444
2788 203444 214803 397207 494838 524438 550047 617938 504545 190189 268858 413950 235965
2777 235965 406220 316606 114731 44070 128280 165503 121098 145629 167391 338227 197666
$$ packed form
2854A36763Q0023L5418j17201J2140j0393j78960Q3674R0829j50033O7082J22823
2843A72165L629J03993O5322m9224K5238K6190P4223k5012K9968k42788j16973
2832F6731Q3251j13080J48185N791J61338R5273l3248r6321P0154l3395q2832
2821B71847J61831j35078j81640p777m7259Q9812k0187J83002j06095p2609m6764
2810H9083p2870J23048K52734j7780K49482q5102l18741o6915J86568j65350J5444
2799A89601J2979m2037J57266J026k547R6396P0792j61362k6844j28680L6854
2788B03444J1359J82404R7631K9600K5609O7891j13393l14356P8669J45092j77985
2777B35965J70255q9614k01875p0661Q4210L7223m4405K4531K1762J70836j40561
$$ plain form
2766 197666 265737 276594 121382 277425 414190 425409 403032 373111 -24698 -78153 32319
2755 32319 79930 151737 214332 192182 324354 288285 136814 7619 247924 292616 293970
2744 293970 125390 51447 137019 47179 103480 10741 -103887 41669 146984 52753 113294
2733 113294 80302 -78075 26645 223241 36468 67406 60153 -20388 -39644 -60319 190161
2722 190161 183910 -6542 159367 -56462 -150875 -4643 -141873 -169601 39200 -31602 -155985
2711 -155985 -76409 -108254 -131216 -75931 -5993 43302 -38315 -90549 -179405 -118652 179039
2700 179039 156003 188691 111405 46363 -55680 39097 -34045 -125287 -135179 -98757 -64104 25863
2688 25863 86452 75126 -16728 -204676 -192594 -32756 -53432 3797 158007 186681 110122
$$ packed form
2766A97666O8071J0857j55212J56043J36765J1219k2377k9921l97809n3455J10472
2755C2319M7611P1807O2595k2150J32172l6069j51471j29195K40305M4692J354
2744B93970j68580p3943Q5572q9840N6301r2739j14628J45556J05315r4231O0541
2733A13294l2992j58377J04720J96596j86773L0938p253q0541j9256k0675K50480
2722A90161o251j90452J65909k15829r4413J46232j37230k7728K08801p0802j24383
2711a55985P9576l1845k2962N5285O9938M9295q1617n2234q8856O0753K97691
2700A79039k3036L2688p7286o5042j02043R4777p3142r1242r892L6422L4653Q9967
2688B5863O0589j1326r1854j87948J2082J59838k0676N7229J54210K8674p6559
$$ plain form
2677 110122 4014 -179155 66215 268971 347959 304988 235759 140060 154372 457086 354840
2666 354840 115170 205384 234041 169369 124839 125136 160405 179914 312358 278525 450033
2655 450033 82962 267365 208185 20808 165605 322896 409831 379088 429548 294205
2645 294205 167640 185986 158893 142357 82511 261347 243548 288073 383613 372678 265060
2634 265060 363029 246184 283165 162945 5942 239641 300223 241284 90682 90411 317789
2623 317789 204867 135157 188152 204815 134488 51198 135524 251247 435039 306291 302679
2612 302679 370886 121054 44369 108525 -67578 -57499 242339 353301 274535 275900 227972
2601 227972 235223 370300 166554 88738 242149 302357 427069 260864 365070 338946 290265
$$ packed form
2677A10122j06108j83169K45370K02756P8988m2971o9229r5699J4312L02714j02246
2666C54840k39670R0214K8657o4672m4530K97L5269J9509J32444l3833J71508
2655D50033l67071J84403n9180j87377J44797J57291Q6935l0743N0460j35343
2645B94205j26565J8346k7093j6536n9846J78836j7799M4525R5540j0935j07618
2634B65060R7969j16845L6981j20220j57003K33699O0582n8939j50602k71K27378
2623C17789j12922o9710N2995J6663p0327q3290Q4326J15723J83792j28748l612
2612C02679O8207k49832p6685O4156j76103J0079K99838J10962p8766J365m7928
2601B27972P251J35077k03746p7816J53411O0208J24712j66205J04206k6124m8681
$$ plain form
2590 290265 522104 338623 210026 189882 161249 -25787 142523 347215 263005 24617
2580 24617 -58911 107285 133225 316757 215990 122291 166160 126348 213322 282306 236232
2569 236232 171644 100183 96101 -2491 -35893 -16019 30676 7789 8748 66186 67314 -68407
2557 -68407 4240 -74462 -93222 -134309 31823 -19085 -124196 -147 -10802 71808 92384
2546 92384 29494 172868 40006 6797 -93768 61516 140600 -67733 -96366 -41860 41075
2535 41075 258707 307622 236050 259179 84788 -8716 117988 137321 98706 139348 153900
2524 153900 337398 641671 543629 353422 195268 143066 443559 438228 359118 110263 261990
2513 261990 304806 383186 441718 374515 426714 350719 231523 220461 347429 255823 165272
$$ packed form
2590B90265K31839j83481j28597k0144k8633j87036J68310K04692q4210k38388
2580B4617q3528J66196K5940J83532j00767r3699M3869l9812Q6974O8984m6074
2569B36232o4588p1461m082r8592l3402J9874M6695k2887R59N7438J128j35721
2557f8407P2647p8702j8760m1087J66132n0908j05111J24049j0655Q2610K0576
2546I2384o2890J43374j32862l3209j00565J55284P9084k08333k8633N4506Q2935
2535D1075K17632M8915p1572K3129j74391r3504J26704J9333l8615M0642J4552
2524A53900J83498L04273r8042j90207j58154n2202L00493n331p9110k48855J51727
2513B61990M2816P8380N8532o7203N2199p5995j19196j1062J26968r1606r0551
$$ plain form
2502 165272 -52280 191327 178196 441768 556252 343097 184651 205915 103894 147909
2492 147909 342104 540792 499374 299136 332406 352870 374684 191062 215097 327920 618795
2481 618795 355822 223349 321542 228998 380905 351213 234727 381669 231227 159263
2471 159263 139501 326881 340156 432052 428571 498216 441302 451556 437932 309726 367697
2460 367697 449884 407792 447922 730442 707615 441906 426474 375700 239168 133926 308447
2449 308447 304543 266465 283233 336238 569559 628949 484383 231822 413105 559088 469330
2438 469330 480576 680101 586153 585164 661555 557651 423433 538395 508441 483083 449504
2427 449504 485562 659674 590088 680657 578928 649600 646447 516490 682186 955278 852855
$$ packed form
2502A65272k17552K43607j3131K63572J14484k13155j58446K1264j02021M4015
2492A47909J94195J98688m1418k00238L3270K0464K1814j83622K4035J12823K90875
2481F18795k62973j32473R8193r2544J51907k9692j16486J46942j50442p1964
2471A59263j9762J87380J3275R1896l481O9645n6914J0254j3624j28206N7971
2460C67697Q2187m2092M0130K82520k2827k65709j5432n0774j36532j05242J74521
2449C08447l904l8078J6768N3005K33321N9390j44566k52561J81283J45983q9758
2438D69330J1246J99525r3948r89P6391j03904j34218J14962k9954k5358l3579
2427D49504L6058J74112o9586R0569j01729P0672l153j29957J65696K73092j02423
$$ plain form
2416 852855 746477 861645 860309 1019362 921062 871416 833169 781573 894751 997341 1295416
2405 1295416 1187918 1065690 974368 1111348 1286869 1192865 1222330 1262582 1263410 1326233 1232088
2394 1232088 1327875 1449943 1610352 1665072 1592978 1605603 1624734 1779221 1749079 1736337 1798138
2383 1798138 1799074 1813413 2027026 1932232 2048428 2136333 2191712 2393370 2282390 2322574 2529578
2372 2529578 2705917 2773094 2942191 3120444 3048942 3020107 3185101 3285173 3592228 3806370
2362 3806370 3619060 3867579 4085612 4421827 4443371 4609618 4964256 5008461 5398363 5721299
2352 5721299 5761136 6098060 6271621 6530589 6888518 7215378 7733805 8301392 8870327 9355932
2342 9355932 9858012 10087713 10693109 11338602 12214472 13077506 13684183 14741541 16077642
$$ packed form
2416H52855j06378J15168j336J59053r8300m9646l8247n1596J13178J02590K98075
2405A295416j07498j22228r1322J36980J75521r4004K9465M0252Q28O2823r4145
2394A232088R5787J22068J60409N4720p2094J2625J9131J54487l0142j2742O1801
2383A798138R36J4339K13613r4794J16196Q7905N5379K01658j10980M0184K07004
2372B529578J76339O7177J69097J78253p1502k8835J64994J00072L07055K14142
2362C806370j87310K48519K18033L36215K1544J66247L54638M4205L89902L22936
2352E721299L9837L36924J73561K58968L57929L26860N18427N67587N68935M85605
2342I355932N02080K29701O05396O45493Q75870Q63034O06677J057358J336101
$$ plain form
2333 16077642 17816099 19848113 22693185 24823386 24637661 23634009 20860265 16838038
2325 16838038 14292850 12271725 10485090 8968500 7856020 6877773 6025119 5658316 5142439
2316 5142439 5054825 4873082 4536346 4186337 3813754 3511426 3248087 2899542 2892412 2780418
2306 2780418 2718253 2804122 2522856 2348034 2169696 2086557 1864347 2152509 2274585 2143389
2296 2143389 2106900 1937717 1772342 1890582 1833629 1539018 1168545 1132582 1150777 1274297
2286 1274297 1328286 1250876 1112718 832061 759917 950039 1002163 1170212 1160440 1102719 1009863
2275 1009863 1043112 894956 740330 763820 705896 852942 653404 569817 537640 658211
2265 658211 503926 622397 446863 199620 176738 347140 345560 260264 368771 522086
$$ packed form
2333A6077642J738457K032014K845072K130201j85725j003652k773744m022227
2325A6838038k545188k021125j786635j516590j112480r78247q52654l66803n15877
2316E142439q7614j81743l36736l50009l72583l02328k63339l48545p130j11994
2306B780418o2165Q5869k81266j74822j78338q3139k22210K88162J22076j31196
2296B143389l6489j69183j65375J18240n6953k94611l70473l5963J8195J23520
2286A274297N3989p7410j38158k80657p2144J90122N2124J68049r772n7721r2856
2275A009863L3249j48156j54626K3490n7924J47046j99538q3587l2177J20571
2265F58211j54285J18471j75534k47243k2882J70402j580q5296J08507J53315
$$ plain form
2255 522086 531098 271576 215532 392399 186883 19986 317246 392362 328597 192028 99966
2244 99966 40744 -58756 32229 137659 91087 -14525 -69651 -130872 -51856 97400 -16007
2233 -16007 84374 61830 -77348 99603 72014 200046 194066 200820 15637 -138302 -165468
2222 -165468 79814 -256192 -206627 -122129 -276895 -210913 -131870 -122001 -90006 34209 94811
2211 94811 53329 30583 110840 69891 92461 124512 -24884 26151 -21054 -266098 -29086
2200 -29086 51098 -173396 -150922 226491 330283 327689 239148 282219 58748 132711 229848
2189 229848 116173 21776 137710 -53008 -186755 -283182 32452 126258 -13100 122946
2179 122946 315317 209628 274263 394541 185779 108077 124626 167766 118468 124416 91838
$$ packed form
2255E22086R012k59522n6044J76867k05516j66897K97260P5116o3765j36569r2062
2244I9966n9222r9500R0985J05430m6572j05612n5126o1221P9016J49256j13407
2233a6007J00381k2544j39178J76951k7589J28032n980O754j85183j53939k7166
2222a65468K45282l36006M9565Q4498j54766O5982P9043R869L1995J24215O0602
2211I4811m1482k2746Q0257m0949K2570L2051j49396N1035m7205k45044K37012
2200b9086Q0184k24494K2474L77413J03792k594q8541M3071k23471P3963R7137
2189B29848j13675r4397J15934j90718j33747r6427L15634R3806j39358J36046
2179A22946J92371j05689O4635J20278k08762p7702J6549M3140m9298N948l2578
$$ plain form
2168 91838 40922 83042 125303 201742 252813 381336 348995 298935 406941 371449 262194
2157 262194 217242 324658 291412 132315 362006 282247 385951 437596 390070 284239 25019
2146 25019 220593 120012 300867 327288 166107 95076 198444 7306 142688 232324
2136 232324 151216 145381 51157 -57132 -117576 -135781 -3753 -24690 -19114 192941 124138
2125 124138 -30987 -36474 -53985 -59970 42579 28892 -94219 71153 85742 -203246 -128196
2114 -128196 66531 11717 -37538 86485 48887 44419 -89216 -19054 -112634 -88897 8775
2103 8775 -140104 -165523 -119521 -70606 -135049 -5113 -145096 -30458 262897 97503 -29835
2092 -29835 -50843 -242149 -290048 -153546 -93444 -106296 -197905 -151926 -147034 -55288 -222086
$$ packed form
2168I1838n0916M2120M2261P6439N1071J28523l2341n0060J08006l5492j09255
2157B62194m4952J07416l3246j59097K29691p9759J03704N1645m7526j05831k59220
2146B5019J95574j00581J80855K6421j61181p1031J03368j91138J35382Q9636
2136B32324q1108n835r4224j08289o0444j8205J32028k0937N576K12055o8803
2125A24138j55125n487j7511n985J02549j3687j23111J65372J4589k88988P5050
2114a28196J94727n4814m9255J24023l7598m468j33635P0162r3580K3737R7672
2103H775j48879k5419M6002M8915o4443J29936j39983J14638K93355j65394j27338
2092b9835k1008j91306m7899J36502O0102j2852r1609M5979M892R1746j66798
$$ plain form
2081 -222086 -201784 -67896 -12802 139730 -115889 -217863 -189432 -295207 -354978 -288142 -270847
2070 -270847 -102949 -74791 -204036 -142179 -200262 -257546 -292551 -53675 87775 -78802 28277
2059 28277 -1876 31637 -31640 -103122 36225 146931 69091 98763 -38302 -124592 -25574
2048 -25574 -2183 25479 99974 78397 123250 56144 22113 147417 77645 -10358 29723 68772
2036 68772 -85936 142684 70227 -39258 69344 -90158 -212012 -201243 -37477 241781
2026 241781 141023 243490 265708 292946 -7189 -177949 72012 -14802 -16674 -138658 31029
2015 31029 -101936 -115720 9698 93596 28714 -40760 121473 81546 -123182 -246839 130132
2004 130132 132246 182010 59606 95121 302129 386440 274739 129493 -193436 -114529 -85396
$$ packed form
2081b22086K0302J33888N5094J52532k55619j01974K8431j05775n9771O6836J7295
2070b70847J67898K8158j29245O1857n8083n7284l5005K38876J41450j66577J07079
2059B8277l0153L3513o3277p1482J39347J10706p7840K9672j37065q6290R9018
2048b5574K3391K7662P4495k1577M4853o7106l4031J25304o9772q8003M0081L9049
2036F8772j54708K28620p2457j09485J08602j59502j21854J0769J63766K79258
2026B41781j00758J02467K2218K7238l00135j70760K49961q6814j872j21984J69687
2015C1029j32965j3784J25418Q3898o4882o9474J62233l9927k04728j23657L76971
2004A30132K114M9764j22404L5515K07008Q4311j11701j45246l22929P8907K9133
$$ plain form
1993 -85396 8448 -33679 -114590 -53169 -11963 79008 169626 96399 144892 234711 128314 59569
1981 59569 -28485 4075 156441 101618 44621 90141 181719 225102 -84795 -6156 76315
1970 76315 25582 -165151 -2864 -135011 -88087 -83039 -57921 -19932 -122387 -154696 -50144
1959 -50144 -111732 -1181 83094 78727 -19720 -138386 -320352 -229359 -112381 -142507 -111242
1948 -111242 -173484 -252002 -169725 -5590 -132945 -42472 46563 -4813 -202495 -310297 -62978
1937 -62978 -259153 -287657 -293927 -158936 -114609 -154225 -119292 -255712 -226858 -188246 -14996
1926 -14996 -38124 -37692 129669 -62847 -207002 -142248 -237532 -100363 4873 -103420 -31953
1915 -31953 -9310 -158328 -137829 -147384 -126291 -258073 -127928 -185209 -138957 2207 -86817
$$ packed form
1993h5396R3844m2127q0911O1421M1206R0971R0618p3227M8493Q9819j06397o8745
1981E9569q8054L2560J52366n4823n6997M5520R1578M3383l09897P8639Q2471
1970G6315n0733j90733J62287j32147M6924N048K5118L7989j02455l2309J04552
1959e0144o1588J10551Q4275m367r8447j18666j81966R0993J16978l0126L1265
1948a11242o2242p8518Q2277J64135j27355R0473Q9035n1376j97682j07802K47319
1937f2978j96175k8504o270J34991M4327l9616L4933j36420K8854L8612J73250
1926a4996k3128M32J67361j92516j44155O4754r5284J37169J05236j08293P1467
1915c1953K2643j49018K0499r555K1093j31782J30145n7281M6252J41164q9024
$$ plain form
1904 -86817 -11356 -79402 -321381 -325307 -102427 -130801 -256341 -42993 82245 -26472 -66211
1893 -66211 -212021 -181490 -88140 97649 80109 -203199 23467 -158291 10777 -60738 -108085
1882 -108085 -143486 -61554 82204 -7838 56344 6432 47585 236350 346304 128197 158502
1871 158502 138929 124409 9145 95154 95122 221884 336483 158064 243758 159331 89412
1860 89412 333519 149497 166064 97217 113373 127262 343093 134842 99472 131037 151779
1849 151779 111653 61924 158213 167617 159850 -144664 -184153 -65198 105343 -3003 -73590
1838 -73590 -277161 -59958 -32039 -23830 -88376 16778 -53096 -66487 15087 -65928 3456
1827 3456 -67495 -134665 -228086 -135493 28124 114169 113738 76054 -111075 -252720 -296201 -141594
$$ packed form
1904h6817P5461o8046k41979l926K22880k8374j25540K13348J25238j08717l9739
1893f6211j45810L0531R3350J85789j7540k83308K26666j81758J69068p1515m7347
1882a08085l5401Q1932J43758r0042O4182m9912M1153J88765J09954k18107L0305
1871A58502j9573j4520j15264Q6009l2J26762J14599j78419Q5694q4427o9919
1860H9412K44107j84022J6567o8847J6156J3889K15831k08251l5370L1565K0742
1849A51779m0126m9729R6289R404p767l04514l9489J18955J70541j08346p0587
1838g3590k03571K17203K7919Q209o4546J05154o9874j3391Q1574q1015O9384
1827C456p0951o7170r3421R2593J63617Q6045m31l7684j87129j41645m3481J54607
$$ plain form
1815 -141594 115201 69402 86763 -41156 -106994 -149187 60127 45475 -59418 43138 124709
1804 124709 216503 -127434 -152790 -95990 -90271 76257 64524 38068 69326 58092 -57225
1793 -57225 59569 52335 -143030 -417735 -342660 -368800 -253039 7902 -20205 -85337 -16249
1782 -16249 -156995 -252441 -151730 -95027 -145268 -102198 46257 30329 -133387 -277070 -200271
1771 -200271 -285109 -344567 -298891 -95642 -285042 -201342 -52573 -177413 -249463 -262186 -107878
1760 -107878 -314737 -539682 -474157 -352151 -265250 -159238 -64085 -63133 -83430 44912 115837
1749 115837 -32924 -49920 -129503 -66458 32046 -40820 -122810 -47966 6257 -61113 -168434
1738 -168434 101214 118995 -8999 -32674 -35883 -46444 84252 175743 135336 -51744 -94432
$$ packed form
1815a41594K56795m5799J7361j27919o5838m2193K09314j4652j04893J02556Q1571
1804A24709R1794l43937k5356N6800N719J66528j1733k6456L1258j1234j15317
1793e7225J16794p234j95365k74705P5075k6140J15761K60941k8107o5132O9088
1782a6249j40746r5446J00711N6703n0241M3070J48455j5928j63716j43683P6799
1771b00271q4838n9458M5676K03249j89400Q3700J48769j24840p2050j2723J54308
1760a07878k06859k24945O5525J22006Q6901J06012R5153R52k0297J28342P0925
1749A15837j48761j6996p9583O3045R8504p2866q1990P4844N4223o7370j07321
1738a68434K69648J7781j27994k3675l209j0561J30696R1491m0407j87080m2688
$$ plain form
1727 -94432 -4057 -151593 -262603 -146575 -178427 52186 145510 58203 38270 172911 283506
1716 283506 222829 189979 58802 -39984 24682 29809 206117 172525 86722 -47770 -56346
1705 -56346 117928 119841 109531 48722 77972 171722 273015 212916 167161 -2223 -14487
1694 -14487 158212 223173 270904 176591 14214 76715 -55675 4048 -36315 -167492 77060
1683 77060 -72610 40016 204894 -12732 -152934 -69115 -164108 -143727 69753 18285 -46972
1672 -46972 285 114171 -46944 -180205 -273647 -50603 114989 138893 93222 -75942 -315814
1661 -315814 -283026 17390 164321 56120 99888 22781 -31875 83649 131806 -150626 -179218
1650 -179218 -140776 -79072 -74286 -67995 -196382 -184037 -160664 -373087 -219786 -127696 -131556 -253372
$$ packed form
1727i4432R0375j47536j11010J16028l1852K30613R3324q7307j9933J34641J10595
1716B83506o0677l2850j31177r8786O4666N127J76308l3592q5803j34492q576
1705e6346J74274J913j0310o0809K9250R3750J01293o0099m5755j69384j2264
1694a4487J72699O4961M7731r4313j62377O2501j32390N9723m0363j31177K44552
1683G7060j49670J12626J64878k17626j40202Q3819r4993K0381K13480n1468o5257
1672d6972M7257J13886j61115j33261r3442K23044J65592K3904m5671j69164k39872
1661c15814L2788L00416J46931j08201M3768p7107n4656J15524M8157k82432k8592
1650a79218L8442O1704M786O291j28387J2345K3373k12423J53301R2090l860j21816
$$ plain form
1638 -253372 -331859 -312622 -269657 -37950 -64517 -161134 -202750 -24589 -128936 -174853 -286149
1627 -286149 -172361 -84438 -170475 -262119 -418033 -399181 -250335 -80698 -117381 -134859 -246054
1616 -246054 -214823 -160821 -471095 -357373 -77406 -202396 -280401 -110020 46988 -63579
1606 -63579 -226976 -248725 89218 24236 101850 -50345 -141383 -27199 53711 -59179 -195996
1595 -195996 -60952 -65603 -43339 -146134 -187245 -89809 1132 29744 -42909 -74699 -229969
1584 -229969 -93339 16209 -118159 342 -93847 -177783 -22508 -206250 34890 264914
1574 264914 349097 210953 72215 159194 -201988 -143534 13629 27391 171412 177968 -110900
1563 -110900 -153958 -16535 -1339 22781 -39368 166411 101462 -118047 -155742 -13025 -101554
$$ packed form
1638b53372p8487J9237M2965K31707k6567r6617m1616J78161j04347m5917j11296
1627b86149J13788Q7923q6037r1644j55914J8852J48846J69637l6683j7478j11195
1616b46054L1231N4002l10274J13722K79967j24990p8005J70381J57008j10567
1606f3579j63397k1749L37943o4982P7614j52195r1038J14184Q0910j12890j36817
1595a95996J35044m651K2264j02795m1111R7436R0941K8612p2653l1790j55270
1584b29969J36630J09548j34368J18501r4189q3936J55275j83742K41140K30024
1574B64914Q4183j38144j38738Q6979l61182N8454J57163J3762J44021O556k88868
1563a10900m3058J37423J5196K4120o2149K05779o4949k19509l7695J42717q8529
$$ plain form
1552 -101554 -81458 -24008 124560 544 -59632 118602 67491 22231 26470 6986 -38891
1541 -38891 105735 235955 206645 141116 76326 731 -244905 -90586 36451 -21873 44722
1530 44722 168278 144236 58974 92946 -151784 -80726 155829 259889 170940 171030 174333 11902
1518 11902 -101785 -21449 -144895 -111843 -74700 -294173 -314447 -145925 21332 -96687 -86962
1507 -86962 2524 52023 69963 -143166 -30660 -116712 -304506 -194601 -55736 104165 -9219
1496 -9219 -174355 -47239 -17018 30351 -107704 -27104 -97127 -5842 161123 154770 158620 84504
1484 84504 23289 62983 36835 -238308 -98131 -99083 -223953 -245138 -210609 -82087 18534
1473 18534 -10739 -165985 -158134 72473 -135738 -231355 -287568 -263724 -120529 -345946 -390774
$$ packed form
1552a01554K0096N7450J48568j24016o0176J78234n1111m5260M239j9484m5877
1541c8891J44626J30220k9310o5529o4790p5595k45636J54319J27037n8324O6595
1530D4722J23556k4042q5262L3972k44730P1058K36555J04060q8949R0L303j62431
1518A1902j13687Q0336j23446L3052L7143k19473k0274J68522J67257j18019R725
1507h6962Q9486M9499J7940k13129J12506q6052j87794J09905J38865J59901j13384
1496i219j65136J27116L0221M7369j38055Q0600p0023R1285J66965o353L850p4116
1484H4504o1215L9694k6148k75143J40177r52j24870k1185L4529J28522J00621
1473A8534k9273j55246P851K30607k08211r5617n6213K3844J43195k25417m4828
$$ plain form
1462 -390774 -177067 -76797 -122078 -171971 -127272 -42382 -244860 -114547 -64395 -84895 -13298
1451 -13298 -17532 -20762 -220549 -224390 -212541 -102954 -197102 -310536 -235691 -176523 -93076 -165186
1439 -165186 -137374 -100840 -223604 -245006 -183709 -209747 -160739 -243932 -142108 -163868 -134366
1428 -134366 -59762 -62946 -178947 -317002 -96884 51240 48088 -200383 -209192 -62006 83713
1417 83713 -12344 70879 66097 82575 252030 273533 308445 150025 -3269 15386 13249 -11135
1405 -11135 118429 39894 -103720 -223458 -175131 -77628 -27631 -95033 -92730 -105079 -249324
1394 -249324 -191751 -191715 -320056 -288077 -179226 27523 130512 235906 226158 198708 45690
1383 45690 -243205 -121227 -97256 -2418 6912 35921 206198 214487 174915 379824 241087
$$ packed form
1462c90774K13707J00270m5281m9893M4699Q4890k02478J30313N0152k0500P1597
1451a3298m234l230j99787l841J1849J09587r4148j13434P4845N9168Q3447p2110
1439a65186K7812L6534j22764k1402O1297k6038M9008q3193J01824k1760K9502
1428a34366P4604l184j16001j38055K20118J48124l152k48471q809J47186J45719
1417H3713r6057Q3223m782J6478J69455K1503L4912j58420j53294J8655k137k4384
1405a1135J29564p8535j43614j19738M8327R7503M9997o7402K303j2349j44245
1394b49324N7573L6j28341L1979J08851K06749J02989J05394r748k7450j53018
1383D5690k88895J21978K3971R4838R330K9009J70277Q289l9572K04909j38737
$$ plain form
1372 241087 117842 136331 132765 16489 96345 163169 4674 57585 69222 -4707 -136325
1361 -136325 -116003 21076 -60738 -144020 14638 181956 -5156 -52785 170009 -37880
1351 -37880 -153949 -249617 -286759 -78154 -178155 -204718 -55746 -17987 -2063 -30611 108213
1340 108213 69694 6801 -251102 -306659 -17252 95024 -154380 -220335 -60951 76560
$$ packed form
1372B41087j23245J8489l566j16276P9856O6824j58495N2911J1637p3929j31618
1361a36325K0322J37079q1814q3282J58658J67318j87112m7629K22794k07889
1351c7880j16069r5668l7142K08605j00001k6563J48972L7759J5924k8548J38824
1340A08213l8519o2893k57903n5557K89407J12276k49404o5955J59384J37511
$$ [...]
##END NTUPLES=NMR SPECTRUM
##END=
