##TITLE=1H_CG-1191-C
 CDCl3
 8 sc, 
 10.4.2024
##JCAMPDX= 6.0         $$ Bruker NMR JCAMP-DX V2.0
##DATA TYPE= NMR SPECTRUM
##DATA CLASS= NTUPLES
##ORIGIN= UXNMR, Bruker Analytische Messtechnik GmbH
##OWNER= root
$$ XWIN-NMR		Version 3.5
$$ Wed Apr 10 14:00:20 2024 Russian Standard Time (UT+4h)  she@DPX200
##.OBSERVE FREQUENCY= 200.1309
##.OBSERVE NUCLEUS= ^1H
##.ACQUISITION MODE= SIMULTANEOUS
##.ACQUISITION SCHEME= undefined
##.AVERAGES= 8
##.DIGITISER RES= 18
##SPECTROMETER/DATA SYSTEM= spect
##.PULSE SEQUENCE= zg30
##.SOLVENT NAME= CDCl3
##.SHIFT REFERENCE= (INTERNAL, CDCl3, 0, 15.5299)
##AUDIT TRAIL= $$ (NUMBER, WHEN, WHO, WHERE, WHAT)
$$ ##TITLE= Audit trail, XWIN-NMR		Version 3.5
$$ ##JCAMPDX= 5.01
$$ ##ORIGIN= Bruker BioSpin GmbH
$$ ##OWNER= she
$$ F:/spectra/data/she/nmr/H-F/1/pdata/1/auditp.txt
$$ ##AUDIT TRAIL=  $$ (NUMBER, WHEN, WHO, WHERE, WHAT)
(   1,<2024-04-10 13:59:17.21 +0400>,<she>,<DPX200>,
      <created by zg, POWCHK disabled, PULCHK disabled
       configuration hash MD5:
       00 E9 B6 7A A2 85 ED C7 34 08 36 98 17 FE 4E 26
       data hash MD5: 16K
       24 4A 9E 99 7A AC 10 5D 82 90 51 4E 40 1F 74 B8>)
(   2,<2024-04-10 13:59:19.95 +0400>,<she>,<DPX200>,
      <Start of raw data processing
       efp BC_mod = 2 LB = 0.24 FT_mod = 6 PKNL = 1 PHC0 = -25460.42 PHC1 = 11.58731 SI = 16K 
       data hash MD5: 16K
       B7 87 F3 EB 76 B6 D5 C2 7D F9 A4 7D B0 4B 71 1A>)
(   3,<2024-04-10 13:59:36.65 +0400>,<she>,<DPX200>,
      <pk PHC0 = 159.4822 PHC1 = 0.6 
       data hash MD5: 16K
       40 41 83 96 AF 87 C8 B8 84 B1 A4 E9 C5 FD 7F 08>)
(   4,<2024-04-10 13:59:39.73 +0400>,<she>,<DPX200>,
      <abs ABSG = 5 
       data hash MD5: 16K
       3C F4 A9 FD 8E CF 7D EA 5E 40 AB 32 02 FC 99 06>)
$$ ##END=
$$ 
$$ hash MD5
$$ 8C CA 6D DE 27 50 8F F2 7C CE 38 15 A6 70 D3 99
##$RELAX= 
##$RELAX= 
##$RELAX= 
##$RELAX= 
##$RELAX= 
##$RELAX= 
$$ Bruker specific parameters
$$ --------------------------
##$DU= <F:/spectra>
##$EXPNO= 1
##$NAME= <H-F>
##$PROCNO= 1
##$TYPE= <nmr>
##$USER= <she>
##$AMP= (0..31)
100 100 100 100 100 100 100 100 100 100 100 100 100 100 100 100 100 100 
100 100 100 100 100 100 100 100 100 100 100 100 100 100 
##$AQSEQ= 0
##$AQ_mod= 1
##$AUNM= <au_zg>
##$AUTOPOS= <>
##$BF1= 200.13
##$BF2= 200.13
##$BF3= 200.13
##$BF4= 200.13
##$BF5= 200.13
##$BF6= 200.13
##$BF7= 200.13
##$BF8= 200.13
##$BYTORDA= 1
##$CFDGTYP= 0
##$CFRGTYP= 5
##$CHEMSTR= <none>
##$CNST= (0..31)
1 1 145 1 1 1 1 1 1 1 1 1 1 1 1 1 1 1 1 1 1 1 1 1 1 1 1 1 1 1 1 1 
##$CPDPRG= <>
##$CPDPRG1= <>
##$CPDPRG2= <>
##$CPDPRG3= <>
##$CPDPRG4= <mlev>
##$CPDPRG5= <mlev>
##$CPDPRG6= <mlev>
##$CPDPRG7= <mlev>
##$CPDPRG8= <mlev>
##$CPDPRGB= <>
##$CPDPRGT= <>
##$D= (0..31)
0 1.2 0 0 0 0 0 0 0 0.06 0 0.03 0 0 0 0 0.0002 0 0 0 0 0 0 0 0 0 0 0 0 
0 0 0 
##$DATE= 1712743156
##$DBL= (0..7)
120 120 120 120 120 120 120 120 
##$DBP= (0..7)
150 150 150 150 150 150 150 150 
##$DBP07= 0
##$DBPNAM0= <>
##$DBPNAM1= <>
##$DBPNAM2= <>
##$DBPNAM3= <>
##$DBPNAM4= <>
$$ [...]
##$SUBNAM3= <"">
##$SUBNAM4= <"">
##$SUBNAM5= <"">
##$SUBNAM6= <"">
##$SUBNAM7= <"">
##$SUBNAM8= <"">
##$SUBNAM9= <"">
##$SW= 18.0517689322627
##$SWIBOX= (0..15)
0 0 2 0 0 0 0 0 0 0 0 0 0 0 0 0 
##$SW_h= 3612.71676300578
##$TD= 16384
##$TD0= 1
##$TE= 0
##$TE2= 300
##$TE3= 300
##$TEG= 300
##$TL= (0..7)
0 120 120 120 120 120 120 120 
##$TP= (0..7)
150 150 150 150 150 150 150 150 
##$TP07= 0
##$TPNAME0= <>
##$TPNAME1= <>
##$TPNAME2= <>
##$TPNAME3= <>
##$TPNAME4= <>
##$TPNAME5= <>
##$TPNAME6= <>
##$TPNAME7= <>
##$TPOAL= (0..7)
0.5 0.5 0.5 0.5 0.5 0.5 0.5 0.5 
##$TPOFFS= (0..7)
0 0 0 0 0 0 0 0 
##$TUNHIN= 0
##$TUNHOUT= 0
##$TUNXOUT= 0
##$USERA1= <user>
##$USERA2= <user>
##$USERA3= <user>
##$USERA4= <user>
##$USERA5= <user>
##$V9= 5
##$VALIST= <valist>
##$VCLIST= <CCCCCCCCCCCCCCC>
##$VD= 0
##$VDLIST= <DDDDDDDDDDDDDDD>
##$VPLIST= <PPPPPPPPPPPPPPP>
##$VTLIST= <TTTTTTTTTTTTTTT>
##$WBST= 1024
##$WBSW= 4
##$XGAIN= (0..3)
0 0 0 0 
##$XL= 0
##$YL= 0
##$YMAX_a= 434247
##$YMIN_a= -535562
##$ZGOPTNS= <>
##$ZL1= 120
##$ZL2= 120
##$ZL3= 120
##$ZL4= 120
##$ABSF1= 15.03074
##$ABSF2= -3.021138
##$ABSG= 5
##$ABSL= 3
##$ALPHA= 0
##$AQORDER= 0
##$ASSFAC= 0
##$ASSFACI= 0
##$ASSFACX= 0
##$ASSWID= 0
##$AUNMP= <proc_1d>
##$AZFE= 0.1
##$AZFW= 0.1
##$BCFW= 0
##$BC_mod= 2
##$BYTORDP= 0
##$COROFFS= 0
##$CY= -3
##$DATMOD= 1
##$DC= 0
##$DFILT= <>
##$DTYPP= 0
##$F1P= 0
##$F2P= 0
##$FCOR= 1
##$FTSIZE= 16384
##$FT_mod= 6
##$GAMMA= 0
##$GB= 0
##$INTBC= 1
##$INTSCL= 3.70164e-10
##$ISEN= 128
##$LB= 0.24
##$LEV0= 0
##$LPBIN= 0
##$MAXI= 10000
##$MC2= 0
##$MEAN= 0
##$ME_mod= 0
##$MI= 1.114404
##$NCOEF= 0
##$NC_proc= -7
##$NLEV= 6
##$NOISF1= 3.799351
##$NOISF2= 2.8
##$NSP= 0
##$NTH_PI= 0
##$NZP= 0
##$OFFSET= 15.52987
##$PC= 1
##$PHC0= -25300.94
##$PHC1= 12.18731
##$PH_mod= 1
##$PKNL= yes
##$PPARMOD= 0
##$PSCAL= 0
##$PSIGN= 0
##$REVERSE= no
##$SF= 200.129598371638
##$SI= 16384
##$SIGF1= 3
##$SIGF2= 2
##$SINO= 5.538805
##$SIOLD= 16384
##$SREGLST= <1H.CDCl3>
##$SSB= 0
##$STSI= 16384
##$STSR= 0
##$SW_p= 3612.71676300577
##$SYMM= 0
##$S_DEV= 0
##$TDeff= 16384
##$TDoff= 0
##$TI= <>
##$TILT= no
##$TM1= 0
##$TM2= 0
##$TOPLEV= 0
##$USERP1= <user>
##$USERP2= <user>
##$USERP3= <user>
##$USERP4= <user>
##$USERP5= <user>
##$WDW= 1
##$XDIM= 16384
##$YMAX_p= 496740961
##$YMIN_p= -847098
$$ End of Bruker specific parameters
$$ ---------------------------------
##NTUPLES= NMR SPECTRUM
##VAR_NAME=  FREQUENCY,     SPECTRUM/REAL,   SPECTRUM/IMAG
##SYMBOL=    X,             R,               I
##VAR_TYPE=  INDEPENDENT,   DEPENDENT,       DEPENDENT
##VAR_FORM=  AFFN,          ASDF,            ASDF
##VAR_DIM=   16384,         16384,           16384
##UNITS=     HZ,            ARBITRARY UNITS, ARBITRARY UNITS
##FACTOR=    0.220516191357247, 1,           1
##FIRST=     3107.98665252089, 0,            0
##LAST=      -504.730110484878, 0,           0
##MIN=       -504.730110484878, -847098,     0
##MAX=       3107.98665252089, 496740961,    0
$$ Real data points
##PAGE= N=1
##DATA TABLE= (X++(R..R)), XYDATA
$$ [...]
$$ plain form
6092 45957865 43957908 42739710 42153940 41968055 42538124 43588591 45046279 47036147 49548675
6083 49548675 52386608 55632651 59188997 62280594 64913573 66924900 67088943 65382016
6075 65382016 62374409 58710689 54715731 51146663 48274527 46067427 44074975 42505945
6067 42505945 41596958 40908881 40749643 40803358 41424293 42466751 43739161 45600116 47903190
6058 47903190 50408993 53230607 55847930 57959176 59212927 59646491 59001845 57172677
6050 57172677 54820844 52028331 49241232 46926512 44869093 43491102 42408993 42007050
6042 42007050 41637000 41123773 39771322 38303700 36635128 35073720 34089043 33451514 33204320
6033 33204320 32990200 33150376 33222054 33336253 32911756 32469350 31798373 31097028 30460749 30239833
$$ packed form
6092D5957865j999957j218198n85770j85885N70069J050467J457688J989868K512528
6083D9548675K837933L246043L556346L091597K632979K011327J64043j706927
6075F5382016l007607l663720l994958l569068k872136k207100j992452j569030
6067D2505945r08987o88077j59238N3715O20935J042458J272410J860955K303074
6058D7903190K505803K821614K617323K111246J253751M33564o44646j829168
6050E7172677k351833k792513k787099k314720k057419j377991j082109m01943
6042D2007050l70050n13227j352451j467622j668572j561408r84677o37529k47194
6033C3204320k14120J60176P1678J14199m24497m42406o70977p01345o36279k20916
$$ plain form
6023 30239833 29644354 29116131 29019039 28887600 28673251 28388855 28423565 28426908 28454357 28380016
6013 28380016 28382223 28422751 28668121 29013587 29205427 29545125 29242653 28580148 27941471 27535120
6003 27535120 27243481 26846910 26943101 27152292 27659086 28151483 28815786 29529383 30436444 31138997
5993 31138997 31839028 32559348 33193373 34154534 35072483 36219212 37631820 39160458 40871752
5984 40871752 42694238 44697627 46280917 47935856 49545326 50679533 51791629 52650622
5976 52650622 52877726 52663428 52188806 51606720 50606304 49690214 48920138 48013802 47441195
5967 47441195 47215530 47185766 47498245 48457928 49763312 51285867 53286677 55619350 58734421
5958 58734421 62251604 65746447 69227879 72731869 75547079 77723109 79303813 79873558
$$ packed form
6023C0239833n95479n28223r7092j31439k14349k84396L4710L343K7449p4341
6013B8380016K207M0528K45370L45466J91840L39698l02472o62505o38677m06351
6003B7535120k91639l96571R6191K09191N06794M92397O64303P13597R07061P02553
5993C1138997P00031P20320O34025R61161R17949J146729J412608J528638J711294
5984D0871752J822486K003389J583290J654939J609470J134207J112096Q58993
5976E2650622K27104k14298m74622n82086j000416r16090p70076r06336n72607
5967D7441195k25665k9764L12479R59683J305384J522555K000810K332673L115071
5958E8734421L517183L494843L481432L503990K815210K176030J580704N69745
$$ plain form
5950 79873558 79666370 78195706 75778907 72764544 69976862 66971043 63606033 59755045
5942 59755045 55782018 52132454 49057701 46504687 44601362 43204798 42334393 42073717
5934 42073717 42228928 42737669 43825919 45038782 46594915 48110074 49201685 49979230 50400444
5925 50400444 50294349 49270632 47838343 46105948 44363016 42531878 40413259 38101050
5917 38101050 35751644 33202021 30841522 28320164 26292976 24457455 22640684 21177403
5909 21177403 19889163 18858518 17640425 16742075 16067689 15457637 14804228 14271738 13971138
5900 13971138 13392739 12914682 12746956 12371380 12032007 11875573 11717895 11457832 11394951 11284584
5890 11284584 10975244 10877547 10462877 10266222 10175225 9814204 9393425 9084098 8814621 8740869
$$ packed form
5950G9873558k07188j470664k416799l014363k787682l005819l365010l850988
5942E9755045l973027l649564l074753k553014j903325j396564q70405k60676
5934D2073717J55211N08741J088250J212863J556133J515159J091611P77545M21214
5925E0400444j06095j023717j432289j732395j742932j831138k118619k312209
5917C8101050k349406k549623k360499k521358k027188j835521j816771j463281
5909B1177403j288240j030645j218093q98350o74386o10052o53409n32490l00600
5900A3971138n78399m78057j67726l75576l39373j56434j57678k60063o2881j10367
5890A1284584l09340r7697m14670j96655r0997l61021m20779l09327k69477p3752
$$ plain form
5880 8740869 8706823 8705766 8396426 8218772 8132061 7815333 7849689 7747163 7687335 7496234 7428314
5869 7428314 7523895 7359554 7402486 7418364 7263559 7260501 7449209 7294646 7168722 7128829 7076251
5858 7076251 7046491 7058982 6957073 6895466 6873415 6788621 6662405 6649938 6807526 6601756 6596307
5847 6596307 6555266 6514126 6466746 6572983 6605724 6423646 6323346 6374312 6353907 6304366 6441205
5836 6441205 6671064 6763887 7000010 6898124 6970778 7139211 7019703 7154866 7088741 6991420
5826 6991420 7021094 6975302 6941700 6770625 6710231 6747893 6802826 6741872 6836268 6911250 6896702
5815 6896702 6921865 6916483 7243011 7128259 6912247 7172808 7596319 7767073 7763373 7720210 7678971
5804 7678971 7655644 7482952 7158173 6921796 7141516 7033184 6781589 6879610 6902081 6972558
$$ packed form
5880H740869l4046j057l09340j77654q6711l16728L4356j02526n9828j91101o7920
5869G428314R5581j64341M2932J5878j54805l058J88708j54563j25924l9893n2578
5858G076251k9760J2491j01909o1607k2051q4794j26216j2467J57588k05770n449
5847F596307m1041m1140m7380J06237L2741j82078j00300N0966k0405m9541J36839
5836F441205K29859R2823K36123j01886P2654J68433j19508J35163o6125r7321
5826F991420K9674m5792l3602j71075o0394L7662N4933o0954R4396P4982j4548
5815F896702K5163n382L26528j14752k16012K60561M23511J70754l700m3163m1239
5804G678971k3327j72692l24779k36377K19720j08332k51595R8021K2471P0477
$$ plain form
5794 6972558 7047387 7002765 6974788 7046394 6998515 6870437 6802274 7068563 7284707 7111021 7245196
5783 7245196 7584363 7635228 7510349 7559867 7406645 7591712 7656404 7602793 7507073 7555572 7628954
5772 7628954 7624600 7576777 7707779 7850271 8167010 8096654 8336557 8414605 8434734 8430570 8436266
5761 8436266 8564073 8548254 8683165 8736987 9031805 9171754 9439599 9796726 10071374 10061937
5751 10061937 10524336 10875272 11104686 11535421 11866754 12176821 12748993 13064053 13611858
5742 13611858 14173889 15166679 16033513 16974343 17934445 19023650 19961340 20224234 20583799
5733 20583799 20631188 19872129 19376157 18873746 18343712 18014733 17891862 17634310 17742110 18149206
5723 18149206 18458678 18517999 18807595 19297004 19888476 20710908 21667624 22571594 23857317
$$ packed form
5794F972558P4829m4622k7977P1606m7879j28078o8163K66289K16144j73686J34175
5783G245196L39167N0865j24879M9518j53222J85067O4692n3611r5720M8499P3382
5772G628954m354m7823J31002J42492L16739p0356K39903P8048K0129m164N696
5761H436266J27807j5819J34911N3822K94818J39949K67845L57127K74648r437
5751A0061937M62399L50936K29414M30735L31333L10067N72172L15060N47805
5742A3611858N62031R92790Q66834R40830R60102J089205R37690K62894L59565
5733B0583799M7389p59059m95972n02411n30034l28979j22871k57552J07800M07096
5723A8149206L09472N9321K89596M89409N91472Q22432R56716R03970J285723
$$ plain form
5714 23857317 25322470 26925536 28818155 30804168 32555585 33589777 33741249 32837082
5706 32837082 32057998 31116918 30416359 29915651 29857784 30046815 30317326 31040894 32115230
5697 32115230 33681369 35406194 37643161 39978207 42136259 43468361 44152638 44085342 43306581
5688 43306581 42874897 42675121 42952512 43841726 44673393 45094750 45016474 44417021 43737313 43036228
5678 43036228 42709549 42808808 43205737 43869432 45304088 46975538 49063287 52045869 55820254
5669 55820254 59494716 62666340 64513996 64596161 62716062 59679227 56809881 53789587
5661 53789587 50930334 48586828 46610084 44479875 42857686 41583180 40167004 39433433
5653 39433433 38617744 38038567 37976412 38010462 37782133 37701345 38075611 38562886 39470596 40898336
$$ packed form
5714B3857317J465153J603066J892619J986013J751417J034192J51472r04167
5706C2837082p79084r41080p00559n00708n7867J89031K70511P23568J074336
5697C2115230J566139J724825K236967K335046K158052J332102O84277o7296p78761
5688D3306581m31684j99776K77391Q89214Q31667M21357p8276n99453o79708p01085
5678D3036228l26679R9259L96929O63695J434656J671450K087749K982582L774385
5669E5820254L674462L171624J847656Q2165j880099l036835k869346l020294
5661E3789587k859253k343506j976744k130209j622189j274506j416176p33571
5653C9433433q15689n79177o2155L4050k28329q0788L74266M87275R07710J427740
$$ plain form
5643 40898336 42395758 43163153 43119618 42321501 40303933 37735064 35438349 33399785 31670755
5634 31670755 29874022 28332582 27217060 26213336 25203354 24489032 24063610 23894242 23603765
5625 23603765 23593942 23569390 23182463 22966224 22466407 21707069 20863190 20379639 19682578 19280811
5615 19280811 19016507 18584179 18570809 18439734 18285675 18299058 18216442 18211034 18311499 18628911
5605 18628911 18734427 18971142 19161170 19470529 20060728 20477819 20875360 21459333 21967180
5596 21967180 21852264 21549513 21194124 20768788 20252391 20030999 19749029 19447078 19655654
5587 19655654 19798646 19765350 20000343 20447501 20641875 20961356 21502685 21730412 22191997 22642794
5577 22642794 22915846 23412553 23781077 24243528 24831931 25637902 26191780 26555428 26897591
$$ packed form
5643D0898336J497422P67395m3535p98117k017568k568869k296715k038564j729030
5634C1670755j796733j541440j115522j003724j009982p14322m25422j69368k90477
5625B3603765r823k4552l86927k16239m99817p59338q43879m83551o97061m01767
5615A9280811k64304m32328j3370j31075j54059J3383q2616n408J00465L17412
5605A8628911J05516K36715J90028L09359N90199M17091L97541N83973N07847
5596B1967180j14916l02751l55389m25336n16397k21392k81970l01951K08576
5587A9655654J42992l3296K34993M47158J94374L19481N41329K27727M61585M50797
5577B2642794K73052M96707L68524M62451N88403Q05971N53878L63648L42163
$$ plain form
5568 26897591 27134191 27350900 27509009 27768462 28261046 28733121 29182922 29678721 30294665
5559 30294665 31053353 31904372 32584507 33384706 34560505 35635742 37254221 39278758 41563557
5550 41563557 44236105 46908246 49807938 52106781 52762381 52176042 51129071 50158566 49790581
5541 49790581 49662917 49652325 50110732 51179378 52670833 54046134 55050819 55641734 55791440
5532 55791440 56197728 57164847 59041054 61673857 64483156 66921428 68101517 68163508 66929423
5523 66929423 65519242 64457771 63882753 63717678 63835730 63971519 63612861 63450059 63843680
5514 63843680 64914815 66657727 68781225 71181868 73591252 75454407 76654425 77078788
5506 77078788 76487207 75525298 74195765 73369035 73425311 74367665 75404233 76401850 76298016
$$ packed form
5568B6897591K36600K16709J58109K59453M92584M72075M49801M95799O15944
5559C0294665P58688Q51019O80135Q00199J175799J075237J618479K024537K284799
5550D1563557K672548K672141K899692K298843O55600n86339j046971r70505l67985
5541D9790581j27664j0592M58407J068646J491455J375301J004685N90915J49706
5532E5791440M06288R67119J876207K632803K809299K438272J180089O1991j234085
5523F6929423j410181j061471n75018j65075J18052J35789l58658j62802L93621
5514F3843680J071135J742912K123498K400643K409384J863155J200018M24363
5506G7078788n91581r61909j329533q26730N6276R42354J036568R97617j03834
$$ plain form
5497 76298016 74903976 72628945 69889060 67126149 64592162 62841919 61860127 61583115
5489 61583115 62246593 63942777 66217161 69041519 71658888 73251313 73215075 71480757 68374452
5480 68374452 65276553 62417261 59892341 58531804 58007947 58137495 58957834 60416932 61737517
5471 61737517 62650007 62518219 61094259 58210737 54929081 51917631 49460563 47474133
5463 47474133 45793540 44633357 44038818 43876638 43786751 43548740 42957525 41889650 40617721
5454 40617721 38872956 37240584 35774197 34222669 33006576 32173221 31763930 31133913 31109985
5445 31109985 31219207 30921433 30667248 29858463 28750960 27550226 26211918 24907863 23742605
5436 23742605 22925899 22211745 21671267 21234306 20845609 20588232 20398206 20333992 20389267 20334289
$$ packed form
5497G6298016j394040k275031k739885k762911k533987j750243r81792k77012
5489F1583115O63478J696184K274384K824358K617369J592425l6238j734318l106305
5480F8374452l097899k859292k524920j360537n23857J29548Q20339J459098J320585
5471F1737517R12490j31788j423960k883522l281656l011450k457068j986430
5463D7474133j680593j160183n94539j62180q9887k38011n91215j067875j271929
5454D0617721j744765j632372j466387j551528j216093q33355m09291o30017k3928
5445C1109985J09222k97774k54185q08785j107503j200734j338308j304055j165258
5436B3742605q16706p14154n40478m36961l88697k57377j90026o4214N5275n4978
$$ plain form
5426 20334289 20767703 21327938 21618228 21548869 21135267 20724946 20316847 20019070 19817799 19897362
5416 19897362 19828838 19578916 19456809 19848314 20435591 21075457 21634326 22351580 23192791 24151728
5406 24151728 25539339 26756672 28558421 30442603 32220255 33648913 34617394 35021979
5398 35021979 35026008 34143873 32512714 30503500 28486672 26333753 24540566 22674893 21094129
5389 21094129 19640669 18537616 17653793 16811751 16457829 16203149 15730959 15340841 14662704
5380 14662704 13949183 13321900 13008522 12689737 12012867 11623743 11334757 11229188 11235525 11036964
5370 11036964 10910127 10827857 10770501 10835023 10748707 10816871 11006605 11290130 11729831 12097867
5360 12097867 12738448 13296861 13597541 13444726 12877136 12098475 11244735 10578636 10128366
$$ packed form
5426B0334289M33414N60235K90290o9359m13602m10321m08099k97777k01271P9563
5416A9897362o8524k49922j22107L91505N87277O39866N58869P17254Q41211R58937
5406B4151728J387611J217333J801749J884182J777652J428658R68481M04585
5398C5021979M029q82135j631159k009214k016828k152919j793187j865673j580764
5389B1094129j453460j103053q83823q42042l53922k54680m72190l90118o78137
5380A4662704p13521o27283l13378l18785o76870l89124k88986j05569O337j98561
5370A1036964j26837q2270n7356O4522q6316O8164J89734K83525M39701L68036
5360A2097867O40581N58413L00680j52815n67590p78661q53740o66099m50270
$$ plain form
5351 10128366 9654275 9163649 8721943 8647527 8639248 8282504 8202909 8033435 7878233 7619379
5341 7619379 7456953 7486310 7295671 7069641 7079582 7085334 6971603 6730934 6542501 6559685 6689700
5330 6689700 6909272 6921786 6696348 6671969 6669617 6578173 6507311 6505684 6513586 6575922 6458783
5319 6458783 6304777 6228342 6322879 6322416 6272788 6292266 6316870 5991243 5896537 5926353 5961279
5308 5961279 6003619 6047117 6149855 6193160 6274688 6445808 6574261 6463522 6405088 6500746 6387162
5297 6387162 6379081 6056523 5934696 5714680 5748465 5541096 5535869 5620324 5636205 5734582 5621843
5286 5621843 5570915 5631215 5647762 5701803 5749408 5505269 5736295 6031560 5997434 6123484 6362738
5275 6362738 6625550 6919617 7346316 7868765 8258074 8406207 9006908 8859179 8580233 8371777
$$ packed form
5351A0128366m74091m90626m41706p4416q279l56744p9595j69474j55202k58854
5341G619379j62426K9357j90639k26030R941N752j13731k40669j88433J7184J30015
5330F689700K19572J2514k25438k4379k352r1444p0862j627P902O2336j17139
5319F458783j54006p6435R4537m63m9628J9478K4604l25627r4706K9816L4926
5308E961279M2340M3498J02738M3305Q1528J71120J28453j10739n8434R5658j13584
5297F387162q081l22558j21827k20016L3785k07369n227Q4455J5881R8377j12739
5286E621843n0928O0300J6547N4041M7605k44139K31026K95265l4126J26050K39254
5275F362738K62812K94067M26699N22449L89309J48133O00701j47729k78946k08456
$$ plain form
5265 8371777 8109754 7797418 7519055 7281337 6796074 6625288 6523526 6525638 6370638 6242614
5255 6242614 6235102 5857500 5919410 5842995 5851055 5933664 6099691 5909571 5997318 5954533 5968594
5244 5968594 6193725 6448766 6708590 6916463 7223994 7631999 8151076 8302883 8705325 8389223
5234 8389223 8230913 7766848 7296789 6611809 6337097 6044195 5821856 5549646 5571430 5344264
5224 5344264 5375903 5234415 5060461 5153289 5034976 4857978 4875141 5027783 5291049 5140185
5214 5140185 5215776 5415532 5301181 5200943 5302009 5470458 5694276 5904561 6159453 6196695
5204 6196695 6281432 5954113 5792639 5631553 5579803 5594174 5491093 5335740 5353934 5319106
5194 5319106 5418265 5401262 5193154 5269284 5283718 5224605 5215969 5342981 5235117 5207161 5317730
$$ packed form
5265H371777k62023l12336k78363k37718m85263j70786j01762K112j55000j28024
5255F242614p512l77602O1910p6415Q060Q2609J66027j90120Q7747m2785J4061
5244E968594K25131K55041K59824K07873L07531M08005N19077J51807M02442l16102
5234H389223j58310m64065m70059o84980k74712k92902k22339k72210K1784k27166
5224E344264L1639j41488j73954R2828j18313j76998J7163J52642K63266j50864
5214E140185P5591J99756j14351j00238J01066J68449K23818K10285K54892L7242
5204F196695Q4737l27319j61474j61086n1750J4371j03081j55353J8194l4828
5194E319106R9159j7003k08108P6130J4434n9113q636J27012j07864k7956J10569
$$ plain form
5183 5317730 5315165 5166967 5277589 5336153 5348603 5338208 5422060 5333710 5477389 5475710 5619842
5172 5619842 5600880 5835297 5957732 6120627 6150705 6015036 6112463 6397753 6636668 6703575
5162 6703575 6755482 6836931 6938091 7121647 7280034 7526167 7485614 7438742 7493731 7415165 7614118
5151 7614118 7678695 8006809 8019634 8047442 8327270 8503025 8641685 9112024 9477002 9707380
5141 9707380 10140415 10314300 10596888 10939436 11502287 12149255 12669841 13385791 14274585 15112701
5131 15112701 15869866 17023970 18337990 19525156 20823587 21522974 22045825 22470024 22495446
5122 22495446 22076417 21138465 20224797 19117592 18046596 17398554 16738391 16143806 15592772
5113 15592772 15200534 15062813 15184308 15277633 15449505 15767348 16271021 16793234 17301918 17571025
$$ packed form
5183E317730k565j48198J10622N8564J2450j0395Q3852q8350J43679j679J44132
5172E619842j8962K34417J22435J62895L0078j35669R7427K85290K38915O6907
5162F703575N1907Q1449J01160J83556J58387K46133m0553m6872N4989p8566J98953
5151G614118O4577L28114J2825K7808K79828J75755J38660M70339L64978K30378
5141I707380M33035J73885K82588L42548N62851O46968N20586P15950Q88794Q38116
5131A5112701P57165J154104J314020J187166J298431O99387N22851M24199K5422
5122B2495446m19029r37952r13668j107205j070996o48042o60163n94585n51034
5113A5592772l92238j37721J21495R3325J71872L17843N03673N22213N08684K69107
$$ plain form
5103 17571025 18081674 19214474 20326868 21538857 22951073 24463649 26214814 28339803
5095 28339803 30536888 32412952 34086667 35079458 35921409 36539658 36401614 35845166 34741482
5086 34741482 32942690 30865500 28441206 25922940 23789671 21904094 20419859 19246396
5078 19246396 18321309 17553545 16840414 16417068 16119083 15982444 15975736 16056882 16238383 16424187
5068 16424187 16923732 17300933 17625968 18028485 18445791 19213041 19782695 20506388 20870506
5059 20870506 21048985 21206989 20973978 20842818 20748187 20407270 20128708 19469740 18565337 17481745
5049 17481745 16298595 15053330 14114839 13464666 12577388 11915986 11240441 10740037 10255730
5040 10255730 9857189 9572066 9342365 9112080 9078029 8841242 8877233 8719175 8493548 8222344
$$ packed form
5103A7571025N10649J132800J112394J211989J412216J512576J751165K124989
5095B8339803K197085J876064J673715R92791Q41951O18249j38044n56448j103684
5086C4741482j798792k077190k424294k518266k133269j885577j484235j173463
5078A9246396r25087p67764p13131m23346k97985j36639o708Q1146J81501J85804
5068A6424187M99545L77201L25035M02517M17306P67250N69654P23693L64118
5059B0870506J78479J58004k33011j31160r4631l40917k78562o58968r04403j083592
5049A7481745j183150j245265r38491o50173q87278o61402o75545n00404m84307
5040A0255730l98541k85123k29701k30285l4051k36787L5991j58058k25627k71204
$$ plain form
5030 8222344 8020033 7910913 7858225 7737356 7594697 7777638 7772867 7566467 7481628 7560099
5020 7560099 7375032 7400906 7461528 7419649 7459969 7485832 7524406 7475975 7501037 7435395 7326884
5009 7326884 7146904 7175994 7460698 7509589 7480601 7530509 7553114 7823880 7903136 7991210 7888163
4998 7888163 8121370 8213178 8125013 8202997 8362513 8397645 8539182 8643533 8520499 8535494
4988 8535494 8646082 8963919 9238901 9286215 9161178 9417208 9393564 9425635 9753690 9773026
4978 9773026 9904875 10171399 10168738 10361185 10344516 10293402 10437124 10906360 11179133 11531468
4968 11531468 11712222 12108235 12562414 12864337 13249333 13709435 14428912 15165424 15992886
4959 15992886 17093465 18204580 19299227 21050020 23101353 25753437 28890910 32553341
$$ packed form
5030H222344k02311j09120n2688j20869j42659J82941m771k06400q4839P8471
5020G560099j85067K5874O0622m1879M0320K5863L8574m8431K5062o5642j08511
5009G326884j79980K9090K84704M8891k8988M9908K2605K70766P9256Q8074j03047
4998G888163K33207R1808q8165P7984J59516L5132J41537J04351j23034J4995
4988H535494J10588L17837K74982M7314j25037K56030k3644L2071L28055J9336
4978I773026J31849K66524k661J92447j6669n1114J43722M69236K72773L52335
4968A1531468J80754L96013M54179L01923L84996M60102P19477P36512Q27462
4959A5992886J100579J111115J094647J750793K051333K652084L137473L662431
$$ plain form
4951 32553341 35864585 37611598 37303237 34974208 31523561 27992762 24626598 22085003
4943 22085003 20305017 18623534 17247590 16330102 15664830 14989897 14265269 13876312 13656585
4934 13656585 13532351 13313695 13065746 12791221 12754770 12614307 12633020 12735805 12435700 12459421
4924 12459421 12783323 12612704 12681654 12872945 12746201 12701065 12747957 13026630 12829368 12992060
4914 12992060 13202356 13509744 13545544 13493796 13855491 14120194 14382188 14683911 14962651 15762921
4904 15762921 16495429 17536674 18291334 19035480 20398651 21856350 23512983 25888928 28733373
4895 28733373 31990964 35120781 37230544 37975044 37518165 35857347 32833855 29342681
4887 29342681 26312129 24200719 22406506 20903069 19717857 18748360 18281430 17793737 17293857
$$ packed form
4951C2553341L311244J747013l08361k329029l450647l530799l366164k541595
4943B2085003j779986j681483j375944r17488o65272o74933p24628l88957k19727
4934A3656585j24234k18656k47949k74525l6451j40463J8713J02785l00105K3721
4924A2459421L23902j70619O8950J91291j26744m5136M6892K78673j97262J62692
4914A2992060K10296L07388L5800n1748L61695K64703K61994L01723K78740Q00270
4904A5762921P32508J041245P54660P44146J363171J457699J656633K375945K844445
4895B8733373L257591L129817K109763P44500m56879j660818l023492l491174
4887B9342681l030552k111410j794213j503437j185212r69497m66930m87693m99880
$$ plain form
4878 17293857 16998775 16636487 16412302 16347822 16446947 16235933 16314568 16406479 16565402 16700322
4868 16700322 16824309 16971498 17211204 17421545 17643640 17855455 18047595 18377253 18885280
4859 18885280 19070270 19348348 19475155 19919971 20521120 20788727 21152529 21591982 22068533
4850 22068533 22743000 23261747 23882997 24547494 25287129 26279374 27030243 28516847 30239748
4841 30239748 31976500 33888493 35187918 35833074 35353121 34872470 34663886 34500585 34844465
4832 34844465 35667123 36495336 37967940 39808601 41938585 44664851 47645858 51273054
4824 51273054 55495792 60607672 67456489 76478408 88025565 101503673 117600059 133108734
4816 133108734 138639356 132484652 115983205 98190785 84081779 73179554 64978127
$$ packed form
4878A7293857k95082l62288k24185o4480R9125k11014P8635R1911J58923J34920
4868A6700322J23987J47189K39706K10341K22095K11815J92140L29658N08027
4859A8885280J84990K78078J26807M44816O01149K67607L63802M39453M76551
4850B2068533O74467N18747O21250O64497P39635R92245P50869J486604J722901
4841C0239748J736752J911993J299425O45156m79953m80651k08584j63301L43880
4832C4844465Q22658Q28213J472604J840661K129984K726266K981007L627196
4824E1273054M222738N111880O848817R021919J1547157J3478108J6096386J5508675
4816A33108734N530622o154704j6501447j7792420j4109006j0902225q201427
$$ plain form
4809 64978127 58128997 52551917 48668252 45436362 42699289 40651980 38830501 37620680
4801 37620680 36494206 35520404 35003608 34550001 34077804 33748586 33327722 33076301 33111176
4792 33111176 33319433 33502960 33594397 33810321 34217762 34810553 35318584 35997361 36846056 37482104
4782 37482104 38338628 39067245 39859241 40672554 41429400 42268490 43236056 43753158 44320189
4773 44320189 44973485 45639567 46091250 46373596 46550393 47097618 47720828 47889389 48337643
4764 48337643 48997585 49653174 50377839 51088616 52374452 53648787 55089737 56486396 57876779
4755 57876779 59595563 61265205 62735638 64268954 65843800 67075087 68306215 69236868
4747 69236868 69746635 70070302 70132018 69928945 69825793 69620182 69322724 69357507 69295063 69372441
$$ packed form
4809F4978127o849130n577080l883665l231890k737073k047309j821479j209821
4801C7620680j126474r73802n16796m53607m72197l29218m20864k51421L4875
4792C3111176K08257J83527R1437K15924M07441N92791N08031O78777Q48695O36048
4782C7482104Q56524P28617P91996Q13313P56846Q39090R67566N17102N67031
4773D4320189O53296O66082M51683K82346J76797N47225O23210J68561M48254
4764D8337643O59942O55589P24665P10777J285836J274335J440950J396659J390383
4755E7876779J718784J669642J470433J533316J574846J231287J231128R30653
4747F9236868N09767L23667O1716k03073j03152k05611k97458L4783o2444P7378
$$ plain form
4737 69372441 69584867 69816439 70735939 71951548 73290252 74727870 76432109 78232657 80115240
4728 80115240 82005115 83874874 85759217 87785800 89641822 91542328 93068310 94619521
4720 94619521 96128516 97115569 97978158 98789133 99584117 100123183 101014175 102001500 103361792
4711 103361792 104656493 106154600 107983189 109958065 112024285 114204867 116400517 118629993
4703 118629993 120871710 122881259 124251068 125458920 126457099 126952588 127440039 127797569 128460192
4694 128460192 129109021 129718887 130196895 130978389 132075721 132999637 133955203 134758256 135836603
4685 135836603 137179918 138328931 139631716 140933441 142236898 143517196 144355505 144984940
4677 144984940 145093636 144687322 144010840 142640463 141259735 139858070 137974187 136184534
$$ packed form
4737F9372441K12426K31572R19500J215609J338704J437618J704239J800548J882583
4728H0115240J889875J869759J884343K026583J856022J900506J525982J551211
4720I4619521J508995R87053Q62589Q10975P94984N39066Q90992R87325J360292
4711A03361792J294701J498107J828589J974876K066220K180582K195650K229476
4703A18629993K241717K009549J369809J207852R98179M95489M87451L57530O62623
4694A28460192O48829O09866M78008P81494J097332R23916R55566Q03053J078347
4685A35836603J343315J149013J302785J301725J303457J280298Q38309O29435
4677A44984940J08696m06314o76482j370377j380728j401665j883883j789653
$$ plain form
4669 136184534 134230427 132425839 130478777 128856512 127375652 125964619 124444020 123146604
4661 123146604 121801558 120831886 120158856 119114383 118359141 117826782 117566922 117297292 117062423
4652 117062423 116549951 116020953 115604434 114987362 114155880 113231363 112208243 110967514 109681308
4643 109681308 108275817 106994778 105668138 104056335 102642527 101258364 99829193 98648291
4635 98648291 97596394 96509545 95543528 94254869 93389471 92672529 92006900 91585946 91353621
4626 91353621 91240165 91125379 91155062 91060101 90777832 90466571 89929902 89062321 87874154 86388348
4616 86388348 84183681 81923073 79826699 77844291 75621145 73228581 71107957 68851455
4608 68851455 66698021 64938071 63306012 61789119 60380795 59210568 58385214 57651124
$$ packed form
4669A36184534j954107j804588j947062j622265j480860j411033j520599j297416
4661A23146604j345046r69672o73030j044473p55242n32359k59860k69630k34869
4652A17062423n12472n28998m16519o17072q31482r24517j023120j240729j286206
4643A09681308j405491j281039j326640j611803j413808j384163j429171j180902
4635I8648291j051897j086849r66017j288659q65398p16942o65629m20954k32325
4626I1353621j13456j14786K9683r4961k82269l11261n36669q67581j188167j485806
4616H6388348k204667k260608k096374j982408k223146k392564k120624k256502
4608F8851455k153434j759950j632059j516893j408324j170227q25354p34090
$$ plain form
4600 57651124 57149361 56727601 55941430 55570019 55394863 54799807 54381535 53928967 53335071
4591 53335071 52714316 51986061 51155029 50472767 49718044 48627721 47612541 46323529 45098002
4582 45098002 43658753 42265641 40975471 39670220 38963891 38088693 37186533 36657623 36221836
4573 36221836 36017244 35803274 35659578 35645855 36010020 36395057 36694114 37179252 37842900 38701639
4563 38701639 39967729 41525375 43077237 44978496 47539774 50637045 54001961 58167144
4555 58167144 62172835 66086344 69656406 71962080 73025694 72640554 71216548 68361045
4547 68361045 64790658 60431711 55968501 51931108 48329482 45355231 42784015 40921630
4539 40921630 39164985 37736696 36478505 35506453 34607929 34010631 33556524 33055603 32817415
$$ packed form
4600E7651124n01763m21760p86171l71411j75156n95056m18272m52568n93896
4591E3335071o20755p28255q31032o82262p54723j090323j015180j289012j225527
4582D5098002j439249j393112j290170j305251p06329q75198r02160n28910m35787
4573C6221836k04592k13970j43696j3723L64165L85037K99057M85138O63648Q58739
4563C8701639J266090J557646J551862J901259K561278L097271L364916M165183
4555E8167144M005691L913509L570062K305674J063614l85140j424006k855503
4547F8361045l570387m358947m463210m037393l601626k974251k571216j862385
4539D0921630j756645j428289j258191r72052q98524n97298m54107n00921k38188
$$ plain form
4530 32817415 32690849 32683131 32786098 32951160 33208632 33454358 33889096 34215965 34633568 34916545
4520 34916545 35143043 35370701 35948238 36234688 36986214 38038900 39310631 40843459 42472044
4511 42472044 44290220 46410851 48975243 51943656 55629787 59989767 65398785 72079574
4503 72079574 79759050 87203671 93847659 98877273 101600317 102005992 99512039 94406502
4495 94406502 87795799 80209415 72374525 64886884 58417355 52621364 47433795 43028282
4487 43028282 39382578 36061914 33374673 31126786 29001903 27138951 25735017 24379497
4479 24379497 23190669 22117717 21195517 20434462 19466855 18803487 18526042 18313357 18035387
4470 18035387 17461695 17200231 17045894 16697093 16454275 16207236 15901458 15718534 15675120 15257424
$$ packed form
4530C2817415j26566p718J02967J65062K57472K45726M34738L26869M17603K82977
4520C4916545K26498K27658N77537K86450P51526J052686J271731J532828J628585
4511D2472044J818176K120631K564392K968413L686131M359980N409018O680789
4503G2079574P679476P444621O643988N029614K723044M05675k493953n105537
4495I4406502o610703p586384p834890p487641o469529n795991n187569m405513
4487D3028282l645704l320664k687241k247887k124883j862952j403934j355520
4479B4379497j188828j072952r22200p61055r67607o63368k77445k12685k77970
4470A8035387n73692k61464j54337l48801k42818k47039l05778j82924m3414m17696
$$ plain form
4460 15257424 15078180 14738073 14433686 14333099 14012187 13802500 13689182 13554743 13359679
4451 13359679 13176225 12833350 12663683 12858536 12616789 12364066 12262245 12231493 12136609 12031186
4441 12031186 11787780 11705483 11854514 11808612 11942704 11810208 11646184 11835517 11794477 11852198
4431 11852198 11816716 11848624 12073684 12036292 11774116 11577748 11485970 11356864 11139239 11074342
4421 11074342 11235507 11205622 11077240 10997238 11180016 11503048 11392411 11593029 11471239 11388366
4411 11388366 11604822 11433046 11275260 11325507 11432437 11425434 11466578 11477250 11536163 11346478
4401 11346478 11602444 11796048 11857847 11828064 11639400 11782409 11816011 11839557 12186541 12366713
4391 12366713 12530525 12605870 12868860 13108560 13192646 13321390 13455468 13596899 13690455 13946080
$$ packed form
4460A5257424j79244l40107l04387j00587l20912k09687j13318j34439j95064
4451A3359679j83454l42875j69667J94853k41747k52723j01821l0752r4884j05423
4441A2031186k43406q2297J49031m5902J34092j32496j64024J89333m1040N7721
4431A1852198l5482L1908K25060l7392k62176j96368r1778j29106k17625o4897
4421A1074342J61165k9885j28382q0002J82778L23032j10637K00618j21790q2873
4411A1388366K16456j71776j57786N0247J06930p003M1144J0672N8913j89685
4401A1346478K55966J93604O1799k9783j88664J43009L3602K3546L46984J80172
4391A2366713J63812P5345K62990K39700Q4086J28744J34078J41431R3556K55625
$$ plain form
4381 13946080 14342526 14506919 14917808 15248931 15662230 16164095 16605231 17312936 17786884
4372 17786884 18542391 19355971 20145419 21304752 22692788 24301801 26404882 28775118 30848692
4363 30848692 32899193 34663355 35445174 35396267 35009201 33699993 31837952 29439055 27117807
4354 27117807 25161973 23379857 22083249 20817834 19858886 18842662 18019124 17540357 17113049
4345 17113049 16591416 16346030 16018743 15725931 15945501 15891577 15991918 16035765 16264014 16506802
4335 16506802 16702375 17033319 17267191 17361323 17530641 17604324 17795378 17923535 17862346 17813997
4325 17813997 17622712 17426084 17164248 16826857 16535182 16613157 16360611 15915867 15448418 15184281
4315 15184281 14928578 14710651 14463348 14359904 14464057 14312400 13851424 13909058 14047304 13783670
$$ packed form
4381A3946080L96446J64393M10889L31123M13299N01865M41136P07705M73948
4372A7786884P55507Q13580P89448J159333J388036J609013K103081K370236K073574
4363C0848692K050501J764162P81819m8907l87066j309208j862041k398897k321248
4354B7117807j955834j782116j296608j265415r58948j016224q23538m78767m27308
4345A7113049n21633k45386l27287k92812K19570n3924J00341M3847K28249K42788
4335A6506802J95573L30944K33872R4132J69318P3683J91054J28157o1189m8349
4325A7813997j91285j96628k61836l37391k91675P7975k52546m44744m67449k64137
4315A5184281k55703k17927k47303j03444J04153j51657m60976N7634J38246k63634
$$ plain form
4305 13783670 13733802 13869153 14006231 14053675 14168479 14480041 14565754 14603601 14934983 15114662
4295 15114662 15108578 15349598 15855189 16051388 16220088 16413870 16517826 16689848 16656850 16817106
4285 16817106 16830247 16963215 17021526 17107913 17291610 17441239 17623078 17715936 18433222 19119799
4275 19119799 19508862 20092303 20864079 21893331 23121116 24576382 26211856 27778204 29671782
4266 29671782 31801695 33704175 34933409 34900129 34277067 34070619 33853528 33560965 33984343
4257 33984343 34080382 33646006 32976686 32078305 31063260 30020614 28843110 27982644 27484472
4248 27484472 26662183 25982896 25445113 25198186 24851070 24468156 24457590 24379336 24361045 24370535
4238 24370535 24325294 24400393 24293996 24456022 24459215 24380672 24533046 24556662 24750280 24959336
$$ packed form
4305A3783670m9868J35351J37078M7444J14804L11562Q5713L7847L31382J79679
4295A5114662o084K41020N05591J96199J68700J93782J03956J72022l2998J60256
4285A6817106J3141J32968N8311Q6387J83697J49629J81839R2858P17286O86577
4275A9119799L89063N83441P71776J029252J227785J455266J635474J566348J893578
4266B9671782K129913J902480J229234l3280o23062k06448k17091k92563M23378
4257C3984343R6039m34376o69320q98381j015045j042646j177504q60466m98172
4248B7484472q22289o79287n37783k46927l47116l82914j0566p8254j8291R490
4238B4370535m5241P5099j06397J62026L193p8543J52374K3616J93618K09056
$$ plain form
4228 24959336 25073745 25570334 25970649 26327387 26985681 27594752 27990451 28220622 27945817
4219 27945817 27490874 27069841 26102573 24915354 23988803 23215733 22344100 21615586 21079407
4210 21079407 20778766 20285013 19828750 19654697 19503347 19225011 18968074 18910202 18923176 18799448
4200 18799448 18699707 18778428 18923218 19167778 19363736 19626875 20207790 20860141 21175321 21743176
4190 21743176 22157864 22533382 22877609 22761586 22390253 21860992 21312564 20687858 20142028
4181 20142028 19725471 19347592 18885788 18711671 18555235 18231435 18086082 18056331 17899664 17808011
4171 17808011 17750926 17925491 18027186 18071887 18261309 18539676 18707983 19151475 19266702 19462247
4161 19462247 19696749 20039814 20327222 20555926 20767025 20978864 21496523 21887747 22144519
$$ packed form
4228B4959336J14409M96589M00315L56738O58294O09071L95699K30171k74805
4219B7945817m54943m21033r67268j187219r26551p73070q71633p28514n36179
4210B1079407l00641m93753m56263j74053j51350k78336k56937n7872J2974j23728
4200A8799448r9741P8721J44790K44560J95958K63139N80915O52351L15180N67855
4190B1743176M14688L75518L44227j16023l71333n29261n48428o24706n45830
4181B0142028m16557l77879m61804j74117j56436l23800j45353k9751j56667r1653
4171A7808011n7085J74565J01695M4701J89422K78367J68307M43492J15227J95545
4161A9462247K34502L43065K87408K28704K11099K11839N17659L91224K56772
$$ plain form
4152 22144519 22576237 23096490 23644970 24259887 24939592 26038737 27398743 29506654 31995772
4143 31995772 35080683 38143471 39498898 38795356 36275036 32862547 30037621 27849898
4135 27849898 26269935 24933358 23911752 23109658 22825307 22303159 21661312 21396229 21202102
4126 21202102 21158471 21253196 21241786 21142357 21153982 21186908 21116669 21141637 21165919 21437705 21459052
4115 21459052 21595156 21515522 21477046 21698683 22177419 22270939 22544020 22904709 22871635 23102084
4105 23102084 23225700 23700079 23890480 24238243 24322508 24564084 25187873 25473836 25827544 26231783
4095 26231783 26540341 26738536 27177185 27330109 27435192 27750097 27918340 28065677 28422911
4086 28422911 28940324 29023663 29452289 29942901 30357137 30890722 31409976 32133846 32838519 33492885
$$ packed form
4152B2144519M31718N20253N48480O14917O79705J099145J360006K107911K489118
4143C1995772L084911L062788J355427p03542k520320l412489k824926k187723
4135B7849898j579963j336577j021606q02094k84351n22148o41847k65083j94127
4126B1202102m3631R4725j1410r9429J1625L2926p0239K4968K4282K71786K1347
4115B1459052J36104p9634l8476K21637M78736R3520K73081L60689l3074K30449
4105B3102084J23616M74379J90401L47763Q4265K41576O23789K85963L53708M04239
4095B6231783L08558J98195M38649J52924J05083L14905J68243J47337L57234
4086B8422911N17413Q3339M28626M90612M14236N33585N19254P23870P04673O54366
$$ plain form
4076 33492885 33858935 34647444 35254521 35796714 36575264 37158721 38202002 38774566 39495484
4067 39495484 40412397 41190833 41895871 42363526 43192731 43851230 44313706 45061078 45640609
4058 45640609 46122546 46770977 47620335 48799262 50082835 51276440 52478865 53484496 54371814
4049 54371814 55069251 55833707 56593010 57513644 58263830 59093861 60015138 60954349 61818921
4040 61818921 62392658 63075196 63857634 64608934 65652611 66674677 67546452 68355183 69032509
4031 69032509 69956799 70889300 71887418 73000980 74371284 75824929 77372795 78970940 80660777
4022 80660777 82387038 83730068 85194610 86507182 87578904 88859536 89958906 91009213
4014 91009213 92017204 92948696 93793240 94729602 95719411 96783225 98040662 99072401 100245239
$$ packed form
4076C3492885L66050P88509O07077N42193P78550N83457J043281N72564P20918
4067C9495484R16913P78436P05038M67655Q29205O58499M62476P47372N79531
4058D5640609M81937O48431Q49358J178927J283573J193605J202425J005631Q87318
4049E4371814O97437P64456P59303R20634P50186Q30031R21277R39211Q64572
4040F1818921N73737O82538P82438P51300J043677J022066Q71775Q08731O77326
4031F9032509R24290R32501R98118J113562J370304J453645J547866J598145J689837
4022H0660777J726261J343030J464542J312572J071722J280632J099370J050307
4014I1009213J007991R31492Q44544R36362R89809J063814J257437J031739J172838
$$ plain form
4005 100245239 100985521 102152060 103321030 104399612 105793172 107609608 109340130 110886853
3997 110886853 112358661 113805434 115352282 116413092 117252373 117844430 118605536 119147965 119872030
3988 119872030 120691668 121673048 122818549 123928690 124772776 125833548 127150046 128571697
3980 128571697 129927765 131539137 133066432 134487997 135834975 136996741 138119071 139402788
3972 139402788 140881109 142633746 144338002 145647773 146810409 148206034 149497056 150451808
3964 150451808 151378300 152011192 152694285 153183748 153665130 153691424 153260378 152811435 152096157
3955 152096157 151399343 150739950 150066677 149805622 149508655 149264844 148874450 148890325 148179752
3946 148179752 147843090 147977815 147969818 147717128 147156528 146407783 145697837 144603221 143124034
$$ packed form
4005A00245239P40282J166539J168970J078582J393560J816436J730522J546723
3997A10886853J471808J446773J546848J060810Q39281N92057P61106N42429P24065
3988A19872030Q19638R81380J145501J110141Q44086J060772J316498J421651
3980A28571697J356068J611372J527295J421565J346978J161766J122330J283717
3972A39402788J478321J752637J704256J309771J162636J395625J291022R54752
3964A50451808R26492O32892O83093M89463M81382K6294m31046m48943p15278
3955A52096157o96814o59393o73273k61055k96967k43811l90394J5875p10573
3946A48179752l36662J34725p997k52690n60600p48745p09946j094616j479187
$$ plain form
3937 143124034 141747545 140180933 138532302 136824180 135005475 132963742 130700655 128401651
3929 128401651 126205212 123986715 121988588 120001288 118288650 116947335 116063593 114965512
3921 114965512 114022094 112807132 112056571 111216284 109945142 109054459 108055067 106799453 105465251
3912 105465251 104045375 102750117 101513974 100129849 98887836 97810653 96690120 95696438
3904 95696438 94639874 93713035 92519177 91674356 90877518 89846657 88582402 87656157 86759721
3895 86759721 85766544 84573609 83382123 81985246 80401447 79339606 77911886 76285054
3887 76285054 74866093 73580109 72578857 71458656 70334952 69514770 68949762 68048817 67226455
3878 67226455 66425796 65728555 65075323 64425628 63815702 63023449 62249946 61511611 60517945
$$ packed form
3937A43124034j376489j566612j648631j708122j818705k041733k263087k299004
3929A28401651k196439k218497j998127j987300j712638j341315q83742j098081
3921A14965512r43418j214962p50561q40287j271142q90683r99392j255614j334202
3912A05465251j419876j295258j236143j384125j242013j077183j120533r93682
3904I5696438j056564r26839j193858q44821p96838j030861j264255r26245q96436
3895H6759721r93177j192935j191486j396877j583799j061841j427720j626832
3887G6285054j418961j285984j001252j120201j123704q20182n65008r00945q22362
3878F7226455q00659o97241o53232o49695o09926p92253p73503p38335r93666
$$ plain form
3869 60517945 59747896 58883283 58096463 57387569 56398294 55792595 55029359 54333001 53662394
3860 53662394 53129128 52423152 51741661 51152944 50756203 49928980 49285000 48587647 47967411
3851 47967411 47417800 46761651 46262203 45634508 45149272 44521875 43663730 43210711 42710857
3842 42710857 42144990 41505026 40817832 40114257 39444779 38754913 38183824 37686949 36979018
3833 36979018 36268395 35780159 35403853 35171602 34662951 34264840 33953079 33778256 33457835
3824 33457835 33300690 32905284 32533127 32200183 31686496 31339423 31187346 31347177 31025834
3815 31025834 31023125 30697822 30484557 30389014 30440023 30350394 30116513 30146754 30078423 30128182 29790193
3804 29790193 29587531 29458623 29321261 29334745 28950690 28579670 28533550 28424259 28129586 27934329
$$ packed form
3869F0517945p70049q64613p86820p08894r89275o05699p63236o96358o70607
3860E3662394n33266p05976o81491n88717l96741q27223o43980o97353o20236
3851D7967411n49611o56149m99448o27695m85236o27397q58145m53019m99854
3842D2710857n65867o39964o87194p03575o69478o89866n71089m96875p07931
3833C6979018p10623m88236l76306k32251n08651l98111l11761j74823l20421
3824C3457835j57145l95406l72157l32944n13687l47073j52077J59831l21343
3815C1025834k709l25303k13265r5543N1009q9629k33881L0241o8331M9759l37989
3804B9790193k02662j28908j37362J3484l84055l71020m6120j09291k94673j95257
$$ plain form
3794 27934329 27705691 27514458 27221592 27151873 26884149 26612740 26446290 26613980 26554265 26487558
3784 26487558 26626139 26600976 26657208 26848751 26537541 26342730 26352743 26047239 26076559 25825342
3774 25825342 25869404 25934003 26094071 26159884 26396783 26579149 26776861 26966026 27537281 28065437
3764 28065437 28537124 29264941 29856580 29867021 29288058 28443191 27487873 26440500 25792722
3755 25792722 25151360 24610047 24188914 23795924 23557145 23436305 23336771 22947584 22687014 22728668
3745 22728668 22671318 22655245 22425153 22169613 22271754 22208270 22244579 22111079 22016715 22057408
3735 22057408 22065476 22020716 22009466 21800024 21800877 21908922 21975893 22041317 22193715 22250806 22219637
3724 22219637 22332588 22334251 22292245 22305788 22154597 22147964 22505751 22612633 22519957 22513739 22557399
$$ packed form
3794B7934329k28638j91233k92866o9719k67724k71409j66450J67690n9715o6707
3784B6487558J38581k5163N6232J91543l11210j94811J0013l05504K9320k51217
3774B5825342M4062O4599J60068O5813K36899J82366J97712J89165N71255N28156
3764B8065437M71687P27817N91639J0441n78963q44867r55318j047373o47778
3755B5792722o41362n41313m21133l92990k38779j20840r9534l89187k60570M1654
3745B2728668n7350j6073k30092k55540J02141o3484L6309j33500r4364M0693
3735B2057408Q068m4760j1250k09442Q53J08045O6971O5424J52398N7091l1169
3724B2219637J12951J663m2006J3543j51191o633L57787J06882r2676o218M3660
$$ plain form
3713 22557399 22744567 22915352 22898120 22962874 23062697 23123248 23091491 23187209 23323891 23347049 23488984
3702 23488984 23361890 23408652 23248789 23273769 23394575 23695995 23792079 23642096 23580180 23800397
3692 23800397 23843070 23890297 24121751 24071340 23856343 23770440 23878473 23782561 23887216 24202759
3682 24202759 24206275 24247396 24247793 24220180 24509699 24631856 24571000 24334866 24435233 24759091 24869162
3671 24869162 24971543 25007494 25090995 25067294 25201628 25108747 25198322 25224902 25109586 25092902 24946768
3660 24946768 24837718 24862241 25055959 25132879 25013865 24971192 24993873 24788803 24898369 24957999
3650 24957999 24948899 24943264 24968275 25277684 25478801 25560974 25522314 25449575 25382466 25514741 25619668
3639 25619668 25630695 25903945 25884074 26026602 26173289 26228462 26031629 25866589 26060906 26032636
$$ packed form
3713B2557399J87168J70785j7232O4754R9823O0551l1757R5718J36682K3158J41935
3702B3488984j27094M6762j59863K4980J20806L01420R6084j49983o1916K20217
3692B3800397M2673M7227K31454n0411k14997q5903J08033r5912J04655L15543
3682B4202759L516M1121L97k7613K89519J22157o0856k36134J00367L23858J10071
3671B4869162J02381L5951Q3501k3701J34334r2881Q9575K6580j15316j6684j46134
3660B4946768j09050K4523J93718P6920j19014m2673K2681k05070J09566N9630
3650B4957999r100n635K5011L09409K01117Q2173l8660p2739o7109J32275J04927
3639B5619668J1027K73250j9871J42528J46687N5173j96833j65040J94317k8270
$$ plain form
3629 26032636 26163027 26147357 26010833 26256018 26312791 26335740 26231700 26095921 26283219 26398797
3619 26398797 26509611 26616249 26580063 26806262 27013923 26902158 26931475 27166614 27489032 27578756
3609 27578756 27698516 27632787 27596785 27898867 28191469 28295374 28396773 28527078 28567901 28597463
3599 28597463 28638719 28775515 28909298 29166640 29131772 29340420 29443605 29562737 29802097 30007041
3589 30007041 30072204 30160950 30160553 30502277 30716922 30731564 31010493 31060833 31391923 31697818 31725968
3578 31725968 32004573 32223891 32527814 32801360 33006140 33389739 33777280 34128781 34351950
3569 34351950 34570699 34765531 35146888 35596389 35691852 36007401 36334189 36688372 36959460 37355302
3559 37355302 37894320 38196606 38567080 38933109 39467831 39788084 40244978 40548869 40922737
$$ packed form
3629B6032636J30391j5670j36524K45185N6773K2949j04040j35779J87298J15578
3619B6398797J10814J06638l6186K26199K07661j11765K9317K35139L22418Q9724
3609B7578756J19760o5729l6002L02082K92602J03905J01399J30305M0823K9562
3599B8597463M1256J36796J33783K57342l4868K08648J03185J19132K39360K04944
3589C0007041O5163Q8746l97L41724K14645J4642K78929N0340L31090L05895K8150
3578C1725968K78605K19318L03923K73546K04780L83599L87541L51501K23169
3569C4351950K18749J94832L81357M49501R5463L15549L26788L54183K71088L95842
3559C7355302N39018L02286L70474L66029N34722L20253M56894L03891L73868
$$ plain form
3550 40922737 41297439 41616316 42215447 42704332 42893315 43587483 44044294 44353500 44737292
3541 44737292 45079778 45851076 46390893 46848694 47427029 48024921 48599093 49202285 49639081
3532 49639081 50111255 50622736 51283190 51902845 52555221 53403458 54294178 55256342 55878521
3523 55878521 56487303 57275239 57942783 58807320 59738029 60767611 61890754 62806978 63839266
3514 63839266 64992410 65949399 67044559 68093099 69078993 70300938 71302039 72165351 73499079
3505 73499079 74867946 76132567 77491657 78990136 80270654 81661826 83318854 84586643
3497 84586643 85956052 87694642 89316206 90972553 92637179 94040587 95661582 97374463
3489 97374463 99146330 101102107 102973542 104885869 106942148 109302717 111613949 113746807
$$ packed form
3550D0922737L74702L18877N99131M88885J88983O94168M56811L09206L83792
3541D4737292L42486P71298N39817M57801N78335N97892N74172O03192M36796
3532D9639081M72174N11481O60454O19655O52376Q48237Q90720R62164O22179
3523E5878521O08782P87936O67544Q64537R30709J029582J123143R16224J032288
3514F3839266J153144R56989J095160J048540R85894J221945J001101Q63312J333728
3505G3499079J368867J264621J359090J498479J280518J391172J657028J267789
3497H4586643J369409J738590J621564J656347J664626J403408J620995J712881
3489I7374463J771867J955777J871435J912327K056279K360569K311232K132858
$$ plain form
3481 113746807 115909706 118309550 120545578 122848991 125291727 127615363 129986253 132470977
3473 132470977 135008920 137294492 139876668 142573692 145399578 148386876 151682117 155078199
3465 155078199 158603223 162360353 166046200 169891988 173838917 177428238 180784890 183623600
3457 183623600 186651492 190125609 193855430 197928780 202812305 208235382 214006559 220343960
3449 220343960 227473613 235364091 244115758 253700699 264096669 275713907 288310439 301874616
3441 301874616 316546446 332265750 348920922 366578508 384750625 403889246 423252460
3434 423252460 442077058 460012942 475777407 488088443 495465137 496740961 491274185
3427 491274185 478879928 460352112 438616115 416387050 395032283 375170968 357114921
$$ packed form
3481A13746807K162899K399844K236028K303413K442736K323636K370890K484724
3473A32470977K537943K285572K582176K697024K825886K987298L295241L396082
3465A55078199L525024L757130L685847L845788L946929L589321L356652K838710
3457A83623600L027892L474117L729821M073350M883525N423077N771177O337401
3449B20343960P129653P890478Q751667R584941J0395970J1617238J2596532J3564177
3441C01874616J4671830J5719304J6655172J7657586J8172117J9138621J9363214
3434D23252460J8824598J7935884J5764465J2311036P376694J275824n466776
3427D91274185j2394257j8527816k1735997k2229065k1354767j9861315j8056047
$$ plain form
3420 357114921 340845521 326509737 313492610 301946198 291737845 282672052 274458867
3413 274458867 266774132 259808779 253237044 247216518 241994101 237214767 233067940 228999143
3405 228999143 224987697 221050199 216935052 212747804 208620415 204718469 201254776 198048642
3397 198048642 194862559 191556542 188235491 184124634 179458292 174619330 170158037 165831827
3389 165831827 161564123 157660971 154016765 150931777 147714507 144905446 142249494 140019236
3381 140019236 137645940 134985421 132052508 128923966 125708227 122829226 119916674 116845579
3373 116845579 113966178 111530858 109169376 107157556 104953353 102922110 101158454 99443708
3365 99443708 97717410 96156429 94793850 93347875 91822896 90484732 89417516 88311415
$$ packed form
3420C57114921j6269400j4335784j3017127j1546412j0208353r065793q213185
3413B74458867p684735o965353o571735o020526n222417m779334m146827m068797
3405B28999143m011446l937498m115147m187248m127389l901946l463693l206134
3397A98048642l186083l306017l321051m110857m666342m838962m461293m326210
3389A65831827m267704l903152l644206l084988l217270k809061k655952k230258
3381A40019236k373296k660519k932913l128542l215739k879001k912552l071095
3373A16845579k879401k435320k361482k011820k204203k031243j763656j714746
3365I9443708j726298j560981j362579j445975j524979j338164j067216j106101
$$ plain form
3357 88311415 87127069 86106995 85123708 84045058 83474806 82724883 82112757 81697243 81070863
3348 81070863 80323978 79391262 78205139 77085358 75996247 74870724 73639308 72607040
3340 72607040 71645465 70445262 69472986 68718158 68006515 67514057 66845621 65966973 65514118
3331 65514118 64682831 64005279 63435054 62926817 62273388 61459378 60905799 60384190 59755391
3322 59755391 59282289 58824896 58147005 57631455 56994774 56432952 56030631 55597759 55048733
3313 55048733 54560717 54083186 53779603 53463114 53034445 52667674 52199550 51930123 51833156 51389931
3303 51389931 50952472 50728050 50255580 49884582 49720240 49278772 49212895 48777447 48423713 48269064
3293 48269064 48112907 47957439 47734753 47544218 47252644 46830918 46606300 46504016 46337302
$$ packed form
3357H8311415j184346j020074r83287j078650n70252p49923o12126m15514o26380
3348H1070863p46885r32716j186123j119781j089111j125523j231416j032268
3340G2607040r61575j200203r72276p54828p11643m92458o68436q78648m52855
3331F5514118q31287o77552n70225n08237o53429q14010n53579n21609o28799
3322E9755391m73102m57393o77891n15550o36681n61822m02321m32872n49026
3313E5048733m88016m77531l03583l16489m28669l66771m68124k69427r6967m43225
3303E1389931m37459k24422m72470l70998j64342m41468o5877m35448l53734j54649
3293D8269064j56157j55468k22686j90535k91574m21726k24618j02284j66714
$$ plain form
3284 46337302 46286328 45960131 45608753 45079636 45019398 45080988 44990288 44772876 44647347 44601684
3274 44601684 44440015 44368188 43993297 43647002 43475788 43412691 43378186 43067282 42900641 42749729
3264 42749729 42409138 42098614 42150332 41838189 41556643 41277708 40774117 40550611 40360451 39999474
3254 39999474 39719730 39292730 39275774 38854560 38464799 38385536 38115288 37973418 37847231 37649392
3244 37649392 37359816 37227421 36857385 36874541 36861847 36728291 36289219 36248967 36114677 35843664
3234 35843664 35791458 35509725 35186090 34908966 34611529 34357461 33992794 33706642 33389633 33083419
3224 33083419 32896601 32683194 32238780 31889914 31665767 31424006 31111052 30908597 30678546
3215 30678546 30432356 30394804 30313251 30139263 30107043 30123019 30079216 30125822 30207561 30288996 30256153
$$ packed form
3284D6337302n0974l26197l51378n29117o0238O1590r0700k17412j25529m5663
3274D4601684j61669p1827l74891l46295j71214o3097l4505l10904j66641j50912
3264D2749729l40591l10524N1718l12143k81546k78935n03591k23506j90160l60977
3254C9999474k79744m27000j6956m21214l89761p9263k70248j41870j26187j97839
3244C7649392k89576j32395l70036J7156j2694j33556m39072m0252j34290k71013
3234C5843664n2206k81733l23635k77124k97437k54068l64667k86152l17009l06214
3224C3083419j86818k13407m44414l48866k24147k41761l12954k02455k30051
3215C0678546k46190l7552q1553j73988l2220J5976m3803M6606Q1739Q1435l2843
$$ plain form
3204 30256153 30164798 30198764 30153753 29917652 30112592 30323564 30285151 30350739 30210543 30271314
3194 30271314 30452173 30459272 30638056 30689847 30558180 30737444 30952072 31150302 31262681 31648237
3184 31648237 31964739 32141869 32475310 32741262 32963037 33282276 33406133 33794529 34182547
3175 34182547 34622116 35100964 35499145 35708328 36085792 36413151 36775003 37241029 37714072
3166 37714072 38323789 38837870 39212386 39716745 40504774 40912099 41357274 41691611 41780840 41926150
3156 41926150 42297497 42736528 43297909 43721486 44373033 44938703 45382038 45921013 46645940
3147 46645940 47289408 48046079 48845056 49699197 50764723 51887224 52973872 53917844 54884022
3138 54884022 56005402 57228513 58586526 59718386 61203280 62727430 64007727 65532159
$$ packed form
3204C0256153r1355L3966m5011k36101J94940K10972l8413O5588j40196O0771
3194C0271314J80859P099J78784N1791j31667J79264K14628J98230J12379L85556
3184C1648237L16502J77130L33441K65952K21775L19239J23857L88396L88018
3175C4182547M39569M78848L98181K09183L77464L27359L61852M66026M73043
3166C7714072O09717N14081L74516N04359P88029M07325M45175L34337Q9229J45310
3156D1926150L71347M39031N61381M23577O51547N65670M43335N38975P24927
3147D6645940O43468P56671P98977Q54141J065526J122501J086648R43972R66178
3138E4884022J121380J223111J358013J131860J484894J524150J280297J524432
$$ plain form
3130 65532159 67065647 69175379 71234966 72983899 75039745 76978733 78836703 81133594
3122 81133594 83274279 85583044 88026445 90320001 92156185 93768694 95224231 96684023
3114 96684023 97913461 99157229 100264551 101028044 102154855 103410575 104800598 106215979
3106 106215979 107976520 109680514 111674767 113967003 116653679 119697592 123366695 127341722
3098 127341722 131700750 136264887 141246848 146261980 151841089 157537052 163305713 168906606
3090 168906606 173614334 176558381 177820737 176827018 174069179 169917902 164828441 159729537
3082 159729537 154783776 151030917 148348382 146467237 145514033 145141234 145727361 147288149
3074 147288149 149003698 151299986 154153019 157100288 160395999 164065958 167759314 171066237
$$ packed form
3130F5532159J533488K109732K059587J748933K055846J938988J857970K296891
3122H1133594K140685K308765K443401K293556J836184J612509J455537J459792
3114I6684023J229438J243768J107322P63493J126811J255720J390023J415381
3106A06215979J760541J703994J994253K292236K686676L043913L669103L975027
3098A27341722M359028M564137M981961N015132N579109N695963N768661N600893
3090A68906606M707728K944047J262356r93719k757839m151277n089461n098904
3082A59729537m945761l752859k682535j881145r53204l72799N86127J560788
3074A47288149J715549K296288K853033K947269L295711L669959L693356L306923
$$ plain form
3066 171066237 174574705 177767614 180541538 182692328 183377214 183245881 181466087 178333589
3058 178333589 174728038 170332304 164952018 159209338 153109606 147240516 142155583 137565795
3050 137565795 133829732 130788749 128413680 126730986 125347322 124792410 124590196 124600405 124734444
3041 124734444 124824609 124530895 123993839 122794137 121295026 119165502 116560394 113443782 109727016
3032 109727016 105589833 100962778 95917987 91334516 87074506 83040469 79313739 75696903
3024 75696903 72696584 69922610 67153412 64820396 62401116 60247266 58574678 57206887
3016 57206887 55592928 54223527 53097209 51861706 50656899 49637700 48572223 47463806
3008 47463806 46432291 45056844 43715092 42386794 41230022 39977706 38566223 37551713
$$ packed form
3066A71066237L508468L192909K773924K150790O84886j31333j779794l132498
3058A78333589l605551m395734n380286n742680o099732n869090n084933m589788
3050A37565795l736063l040983k375069j682694j383664n54912k02214J0209J34039
3041A24734444R0165k93714n37056j199702j499111k129524k605108l116612l716766
3032A09727016m137183m627055n044791m583471m260010m034037l726730l616836
3024G5696903l000319k773974k769198k333016k419280k153850j672588j367791
3016E7206887j613959j369401j126318j235503j204807j019199j065477j108417
3008D7463806j031515j375447j341752j328298j156772j252316j411483j014510
$$ plain form
3000 37551713 36305259 34975083 34198872 33393092 32498710 31681637 31169210 30627353 29754721
2991 29754721 29142215 28295195 27438519 26885206 26439133 25996344 25544864 25101058 24534211
2982 24534211 24083036 23554299 23067422 22762477 22396198 22195146 22004762 21620807 21361873
2973 21361873 21276319 21055657 20605892 20083768 19750411 19573252 19099235 18617468 18304096 17969151
2963 17969151 17590320 17131658 16682299 16194824 15851255 15620636 15050964 14643272 14438094
2954 14438094 14459539 14261487 14164203 13976628 13689984 13545867 13469545 13360718 13058723 12859211
2944 12859211 12811308 12624195 12244178 11932540 11878282 11636852 11192208 11061148 10949831 10965526
2934 10965526 10838741 10427339 10138487 10144607 9734941 9627231 9356892 8947657 8900364 8880083
$$ packed form
3000C7551713j246454j330176p76211q05780q94382q17073n12427n41857q72632
2991B9754721o12506q47020q56676n53313m46073m42789m51480m43806n66847
2982B4534211m51175n28737m86877l04945l66279k01052j90384l83955k58934
2973B1361873q5554k20662m49765n22124l33357j77159m74017m81767l13372l34945
2963A7969151l78831m58662m49359m87475l43569k30619n69672m07692k05178
2954A4438094K1445j98052r7284j87575k86644j44117p6322j08827l01995j99512
2944A2859211m7903j87113l80017l11638n4258k41430m44644j31060j11317J5695
2934A0965526j26785m11402k88852O120m09666j07710k70339m09235m7293k0281
$$ plain form
2924 8880083 8568511 8487762 8304375 8211423 8479239 8259517 8031409 7953219 7885860 7551289
2914 7551289 7273330 7101492 7193689 7170786 7095693 7034100 6920725 6844835 6857607 6668465 6578732
2903 6578732 6449349 6293539 6211059 6177757 6113074 6200950 6001506 5942252 5926967 5684646 5845261
2892 5845261 5852663 5834081 5748385 5420934 5418256 5301709 5261734 5256571 5248173 5215903 5135804 5050706
2880 5050706 5062720 4764054 4838779 4996846 5005582 4916274 4850670 4902246 4887154 4677561 4482633
2869 4482633 4667209 4597817 4480389 4355982 4311937 4423843 4536338 4348202 4134749 4323450
2859 4323450 4267436 4144058 3954076 4070785 4286176 4178917 4208073 4355579 4023296 3995346
2849 3995346 4132947 3963709 3962586 4141380 4084746 3951982 3883539 3846386 3941859 4045819 3896015
$$ packed form
2924H880083l11572q0749j83387r2952K67816k19722k28108p8190o7359l34571
2914G551289k77959j71838R2197k2903p5093o1593j13375p5890J2772j89142q9733
2903F578732j29383j55810q2480l3302o4683Q7876j99444n9254j5285k42321J60615
2892E845261P402j8582q5696l27451k678j16547l9975n163q398l2270q0099q5098
2880E050706J2014k98666P4725J58067Q736q9308o5604N1576j5092k09593j94928
2869D482633J84576o9392j17428j24407m4045J11906J12495j88136k13453J88701
2859D323450n6014j23378j89982J16709K15391j07259K9156J47506l32283k7950
2849C995346J37601j69238j123J78794n6634j32764o8443l7153R5473J03960j49804
$$ plain form
2838 3896015 3780483 3728054 3677329 3837385 3662116 3573320 3454917 3579624 3584964 3655263 3683302
2827 3683302 3547726 3514555 3523920 3548750 3509353 3554558 3512954 3447810 3504761 3434962 3510074
2816 3510074 3691432 3780850 3513655 3498092 3439381 3444562 3540362 3636533 3540350 3663050 3666045
2805 3666045 3596980 3600286 3530483 3551718 3364109 3469320 3280060 3298312 3395761 3057461 3063877
2794 3063877 3265164 3198963 3132625 3197706 3236757 3249674 2888986 2976371 3108630 3025785 3023351
2783 3023351 2954957 2844108 2837710 3056885 3127846 2945723 3111950 3135849 3279176 3014667
2773 3014667 2909129 2898525 2834180 2894042 2855304 2641630 2709935 2683810 2591086 2709157 2696802
2762 2696802 2594026 2641402 2416264 2392287 2370018 2526812 2509607 2432274 2258311 2288661 2455473
$$ packed form
2838C896015j15532n2429n0725J60056j75269q8796j18403J24707N340P0299K8039
2827C683302j35576l3171R365K4830l9397M5205m1604o5144N6951o9799P5112
2816C510074J81358Q9418k67195j5563n8711N181R5800R6171r6183J22700K995
2805C666045o9065L306o9803K1235j87609J05211j89260J8252R7449l38300O416
2794C063877K01287o6201o6338O5081L9051J2917l60688Q7385J32259q2845k434
2783C023351o8394j10849o398K19175P0961j82123J66227K3899J43327k64509
2773C014667j05538j0604o4345N9862l8738k13674O8305k6125r2724J18071j2355
2762B696802j02776M7376k25138k3977k2269J56794j7205p7333j73963L0350J66812
$$ plain form
2751 2455473 2302382 2220499 2182688 2250066 2049511 2245456 2296592 2236024 1997815 1990832 1987448
2740 1987448 2164452 2058297 1951201 1755006 1773575 1684926 1760790 1757208 1756310 1817700 1974205
2729 1974205 1851655 1869617 1885120 1859464 1886479 1832737 1890189 1729929 1636783 1758575 1898563
2718 1898563 1919972 1722561 1542075 1484520 1436882 1366867 1340762 1405041 1460668 1596108 1505889
2707 1505889 1557984 1673039 1584090 1551642 1705818 1679171 1530536 1414710 1612456 1543098
2697 1543098 1349490 1219585 1408379 1429975 1074389 1108305 1278514 1166075 1143046 1271334
2687 1271334 1220641 1149476 1194145 1223782 1019313 1095024 1050694 1063903 1034640 1068292 1201009
2676 1201009 1190533 1104707 1177945 1244681 1265755 1030999 1124336 1078002 971533 903798 914723
$$ packed form
2751B455473j53091q1883l7811O7378k00555J95945N1136o0568k38209o983l384
2740A987448J77004j06155j07096j96195J8569q8649P5864l582q98O1390J56505
2729A974205j22550J7962J5503k5656K7015n3742N7452j60260r3146J21792J39988
2718A898563K1409j97411j80486n7555m7638p0015k6105O4279N5627J35440r0219
2707A505889N2095J15055q8949l2448J54176k6647j48635j15826J97746o9358
2697A543098j93608j29905J88794K1596l55586L3916J70209j12439k3029J28288
2687A271334n0693p1165M4669K9637k04469P5711m4330J3209k9263L3652J32717
2676A201009j0476q5826P3238O6736K1074k34756R3337m6334j06469o7735J0925
$$ plain form
2665 914723 1065892 1189039 1218944 1068212 1105080 1014152 905845 933656 918473 1106163 1231747
2654 1231747 1217763 979198 982867 992748 915685 848698 802308 953521 1066627 1145214 797377
2643 797377 781911 790168 725522 685729 802814 994756 1168665 813562 695607 772943 493847
2632 493847 525171 585499 706442 754026 508194 488432 520633 410994 615875 548113 594843
2621 594843 617831 433972 529055 680636 573110 813298 673475 458771 495134 654352
2611 654352 629234 468236 543059 669866 578359 459026 329440 397018 592591 367736
2601 367736 405364 440445 559046 594155 480113 541921 655125 521291 527878 526422 432169
2590 432169 247607 291496 503007 437791 240233 281896 230627 391272 335933 267567 108050
$$ packed form
2665I14723J51169J23147K9905j50732L6868r0928j08307K7811j5183J87690J25584
2654A231747j3984k38565L669R881p7063o6987m6390J51213J13106P8587l47837
2643G97377j5466Q257o4646l9793J17085J91942J73909l55103j17955P7336k79096
2632D93847L1324O0328J20943M7584k45832j9762L2201j09639K04881o7762M6730
2621E94843K2988j83859R5083J51581j07526K40188j39823k14704L6363J59218
2611F54352k5118j60998P4823J26807r1507j19333j29586O7578J95573k24855
2601C67736L7628L5081J18601L5109j14042O1808J13204j33834O587j456r4253
2590D32169j84562M3889K11511o5216j97558M1663n1269J60645n5339o8366j59517
$$ plain form
2579 108050 203671 181380 242059 186381 141396 49203 60725 160308 350546 336534 186823
2568 186823 93164 224296 281710 241468 116317 218274 65873 16449 131079 221837 466129
2557 466129 323440 307672 203177 381490 512556 558371 438330 358063 322730 249469 100260
2546 100260 280151 344105 279398 385764 281601 274510 380704 372232 422102 149409 58537
2535 58537 -17999 -255154 -278184 -231305 -56145 67613 71952 -55767 139671 46218 -125332
2524 -125332 -130265 -11944 202111 254288 104255 51543 -84230 -104586 227514 395030 226860
2513 226860 106360 120208 -131978 -102621 -33951 111199 -24040 67594 231806 221232 172329
2502 172329 25412 62942 145991 150316 105996 119897 367259 266261 145402 -34225 -234502
$$ packed form
2579A08050R5621k2291O0679n5678m4985r2193J1522R9583J90238j4012j49711
2568A86823r3659J31132N7414m0242j25151J01957j52401m9424J14630R0758K44292
2557D66129j42689j5768j04495J78313J31066M5815j20041q0267l5333p3261j49209
2546A00260J79891O3954o4707J06366j04163p091J06194q472M9870k72693r0872
2535E8537p6536k37155k3030M6879J75160J23758M339j27719J95438r3453j71550
2524a25332m933J18321K14055N2177j50033n2712j35773k0356L32100J67516j68170
2513B26860j20500J3848k52186K9357O8670J45150j35239R1634J64212j0574m8903
2502A72329j46917L7530Q3049M325m4320J3901K47362j00998j20859j79627k00277
$$ plain form
2491 -234502 -172274 -70218 27761 223953 -35844 -53084 10969 -165874 -286206 -263833 -250473
2480 -250473 -89773 -55842 -84020 -124588 -225449 -99066 -73730 -40474 57668 -29182 161945
2469 161945 46365 140819 142946 76506 -85153 -79527 52096 36849 118304 98342 111504
2458 111504 123686 170818 286129 119064 13463 127620 -46647 -13172 31030 78765 179370
2447 179370 68807 -129414 109554 101571 78673 -136940 -157642 -152459 -155781 -66022 240106
2436 240106 315140 232944 34588 -16483 7040 90296 -123037 -66401 -63005 149669 151546
2425 151546 114006 86348 -6783 -67166 -144950 -98395 -114385 155230 173961 133394 89993
2414 89993 227414 200057 127057 246651 287752 97383 76152 222091 310277 400431 412526
$$ packed form
2491b34502O2228J02056R7979J96192k59797j7240O4053j76843j20332K2373J3360
2480b50473J60700L3931k8178m0568j00861J26383K5336L3256R8142q6850J91127
2469A61945j15580R4454K127o6440j61659N626J31623j5247Q1455j9962J3162
2458A11504J2182M7132J15311j67065j05601J14157j74267L3475M4202M7735J00605
2447A79370j10563j98221K38968p983k2898k15613k0702N183l322Q9759L06128
2436B40106P5034q2196j98356n1071K3523Q3256k13333N6636L396K12674J877
2425A51546l7540k7658r3131o0383p7784M6555j5990K69615J8731m0567m3401
2414H9993J37421k7357p3000J19594M1101j90369k1231J45939Q8186R0154J2095
$$ plain form
2403 412526 266502 193879 10200 -146265 55033 153391 24519 -63856 -36732 -5097 3457
2392 3457 32002 179827 208765 121832 350671 253424 317804 263718 280483 354390 469417
2381 469417 448824 402017 315911 280012 89807 185924 376046 263943 436675 605802 649283
2370 649283 520183 408716 475811 516025 292807 433174 608843 594891 404162 524951
2360 524951 565598 414340 579058 543678 516068 813725 734798 681941 750447 784533 1018315
2349 1018315 829496 651402 748125 882479 1089278 1150304 999789 1158054 1298590 1186985
2339 1186985 1377276 1363516 1406153 1459364 1535221 1578300 1444810 1459213 1414841 1647790 1718950
2328 1718950 1647265 1664181 1893325 1791683 1927561 2132661 2229628 2303458 2293207 2365382 2620653
$$ packed form
2403D12526j46024p2623j83679j56465K01298R8358j28872q8375K7124L1635Q554
2392C457K8545J47825K8938q6933K28839r7247O4380n4086J6765P3907J15027
2381D69417k0593m6807q6106l5899j90205R6117J90122j12103J72732J69127M3481
2370F49283j29100j11467O7095M0214k23218J40367J75669j3952j90729J20789
2360E24951M0647j51258J64718l5380k7610K97657p8927n2857O8506L4086K33782
2349A018315j88819j78094R6723J34354K06799O1026j50515J58265J40536j11605
2339A186985J90291j3760M2637N3211P5857M3079j33490J4403m4372K32949P1160
2328A718950p1685J6916K29144j01642J35878K05100R6967P3830j0251P2175K55271
$$ plain form
2317 2620653 2698320 2782510 2824840 3047614 3259008 3357491 3694541 3650143 3831217 3911698 4348834
2306 4348834 4812593 5466274 6144422 6412836 6584659 7342039 7905851 8751217 9835042
2297 9835042 11195501 12880314 14899813 17586098 21275399 25305846 30262752 33242486
2289 33242486 33164180 29542505 23890840 19812816 16312548 13640195 11437838 9725598
2281 9725598 8476391 7447815 6549067 5894545 5394614 4859543 4498402 4296130 4094568
2272 4094568 3667114 3297008 3184181 2969157 2566384 2229966 2150532 1743931 1840232 1679524
2262 1679524 1638006 1674706 1474544 1194552 1207133 1159801 999919 1126843 1111029 947772
2252 947772 1041433 1103993 1086534 1080566 1134633 1042788 1035680 904484 781779 669860 759977
$$ packed form
2317B620653P7667Q4190M2330K22774K11394R8483L37050m4398J81074Q0481M37136
2306D348834M63759O53681O78148K68414J71823P57380N63812Q45366J083825
2297I835042J360459J684813K019499K686285L689301M030447M956906K979734
2289C3242486p8306l621675n651665m078024l500268k672353k202357j712240
2281I725598j249207j028576q98748o54522m99931n35071l61141k02272k01562
2272D094568m27454l70106j12827k15024m02773l36418p9434m06601R6301j60708
2262A679524m1518L6700k00162k79992J2581m7332j59882J26924j5814j63257
2252I47772R3661O2560j7459n968N4067r1845p108j31196j22705j11919R0117
$$ plain form
2241 759977 748616 545801 630064 639809 592656 376369 468514 332952 299148 477527 477426
2230 477426 443412 472930 398493 492693 632854 424472 333742 317296 146522 211215 186718
2219 186718 197733 270315 225971 362032 544460 454471 280560 194557 177863 412217 189678
2208 189678 45136 -57896 -52597 107335 -15377 95969 -33961 102685 338518 358679
2198 358679 313886 184413 33365 15627 221159 235796 69841 28352 153200 48269
2188 48269 233626 176093 50084 101976 81877 -212781 -11654 13628 -224010 2187 -5412
2177 -5412 -55439 -28840 141583 227801 57362 108051 -52636 -207251 -134788 54520 117774
2166 117774 257373 125692 -44523 101132 -18422 -13962 -150455 -112767 -188509 -222289 20888
$$ packed form
2241G59977j1361k02815Q4263R745m7153k16287R2145j35562l3804J78379j01
2230D77426l4014K9518p4437R4200J40161k08382r0730j6446j70774O4693k4497
2219A86718J1015P2582m4344J36061J82428q9989j73911q6003j6694K34354k22539
2208A89678j44542j03032N299J59932j22712J11346j29930J36646K35833K0161
2198C58679m4793j29473j51048j7738K05532J4637j65955m1489J24848j04931
2188D8269J85357n7533j26009N1892k0099k94658K01127K5282k37638K26197p599
2177e412n0027K6599J70423Q6218j70439N0689j60687j54615P2463J89308O3254
2166A17774J39599j31681j70215J45655j19554M460j36493L7688p5742l3780K43177
$$ plain form
2155 20888 24126 -56727 -71611 -52854 -90778 -129594 -151851 -115269 9884 -133861 -221189 -265692
2143 -265692 -130637 -200448 -158652 -278203 -120693 -126164 -300075 -94049 -143990 -123171 -177140
2132 -177140 -346339 -130313 135550 5898 -213173 -155866 -71217 -145860 -57835 -47069 -90885
2121 -90885 -147894 -17359 84454 -165031 -211229 -262234 -141 -20259 -188128 -3693 -49783
2110 -49783 -113531 -131455 -7913 -32398 -49434 31306 -195862 -165496 -170339 -76086 -1126 -83624
2098 -83624 -22633 -63951 -156195 -185033 -15549 -108806 94783 266086 199468 117571 77751
2087 77751 1381 -151016 -62844 94423 52098 -173171 -38197 -106945 -179510 -158664 -233923
2076 -233923 -247515 32034 -88402 -223157 -242465 -301698 -99244 -175011 -267676 -153759 -152664
$$ packed form
2155B0888L238q0853j4884J8757l7924l8816k2257L6582J25153j43745q7328m4503
2143b65692J35055o9811M1796j19551J57510n471j73911K06026m9941K0819n3969
2132a77140j69199K16026K65863j29652k19071N7307Q4649p4643Q8025J0766m3816
2121i0885n7009J30535J01813k49485m6198n1005K62093k0118j67869J84435m6090
2110d9783o3748j7924J23542k4485j7036Q0740k27168L0366m843R4253P4960q2498
2098h3624O0991m1318r2244k8838J69484r3257K03589J71303o6618q1897l9820
2087G7751p6370j52397Q8172J57267m2325k25269J34974o8748p2565K0846p5259
2076b33923j3592K79549j20436j34755j9308n9233K02454p5767r2665J13917J095
$$ plain form
2065 -152664 -196010 -77550 -113645 -240763 -324100 -216197 -219171 -141145 -164361 12458 115364
2054 115364 67514 -155936 -200724 -107617 -205809 -1839 11659 41091 -120305 -281043 -218543
2043 -218543 -82804 -24803 -126086 129322 158465 1691 -103782 6149 116598 138530
2033 138530 12974 -12823 -2785 -95691 -37845 -104502 -136428 -10651 2166 38467 7334
2022 7334 -26053 125315 216974 323803 101089 -93785 -70735 91772 26798 -46184 -163
2011 -163 -126637 -43621 -77762 -113837 -241402 -189098 -270753 -224657 -153629 -116762 -26664 17186
1999 17186 118937 -119003 -233861 -246716 -173978 -224152 91260 56842 -20698 -22523 12179
1988 12179 -43755 17531 -38703 96476 120391 -93710 -130664 -302887 -249378 -178652 53018
$$ packed form
2065a52664m3346J18460l6095j27118q3337J07903k974P8026k3216J76819J02906
2054A15364m7850k23450m4788R3107r8192K03970J3498K9432j61396j60738O2500
2043b18543J35739N8001j01283K55408K9143j56774j05473J09931J10449K1932
2033A38530j25556k5797J0038r2906N7846o6657l1926J25777J2817L6301l1133
2022G334l3387J51368R1659J06829k22714j94874K3050J62507o4974p2982M6021
2011a63j26474Q3016l4141l6075j27565N2304q1655M6096P1028L6867R0098M3850
1999A7186J01751k37940j14858j2855P2738n0174L15412l4418p7540j825L4702
1988A2179n5934O1286n6234J35179K3915k14101l6954j72223N3509P0726K31670
$$ plain form
1977 53018 -56359 -64071 -156172 -133907 12664 187352 -38099 -156167 58282 88321 -115556
1966 -115556 -156812 -38489 -19290 -8200 -31968 -92535 -214598 -341005 -228292 -158154 -133527
1955 -133527 85706 2061 -234770 -204669 -169317 -158915 -327337 -402521 -302156 -248389 -202923
1944 -202923 -243921 -166942 -64320 -68432 -217037 -217745 -163994 34534 -47656 -114256 -51294 -152147
1932 -152147 -92862 61745 63276 -20397 -96122 -249440 -134724 -175643 -277445 -223892 -96827
1921 -96827 216271 328811 240138 132293 59821 118969 19302 -70076 -108525 81169 71271
1910 71271 -235158 -189469 34305 -83739 -44134 153246 143683 98043 45801 22114 -45219
1899 -45219 -48281 27433 -59103 42889 -52164 -57695 5116 -99165 -96281 -95537 -234839 -94306
$$ packed form
1977E3018j09377p712r2101K2265J46571J74688k25451j18068K14449L0039k03877
1966a15556m1256J18323J9199J1090k3768o0567j22063j26407J12713P0138K4627
1955a33527K19233q3645k36831L0101L5352J0402j68422p5184J00365N3767M5466
1944b02923m0998P6979J02622m112j48605p08N3751J98528q2190o6600O2962j00853
1932a52147N9285J54607J531q3673p5725j53318J14716m0919j01802N3553J27065
1921i6827L13098J12540q8673j07845p2472N9148r9667q9378l8449J89694r898
1910G1271l06429M5689K23774j18044L9605J97380r563m5640n2242k3687o7333
1899d5219l062P5714q6536J01992r5053n531O2811j04281K884P44j39302J40533
$$ plain form
1887 -94306 5988 -112208 -46905 -40812 47004 -261524 -247874 -117798 -210046 -307384 -276878
1876 -276878 -214514 -42640 1247 -68672 -134638 169977 201403 232269 55983 -10029 -41271
1865 -41271 -205109 -170557 -63912 -10388 -11520 -15885 -104559 -263094 -147936 -151845 -14365
1854 -14365 84295 119807 59951 -25088 -72618 -86092 -37582 -143690 5954 -80865 -40131
1843 -40131 -81284 -375733 -287145 -18955 -116913 61009 64051 -109020 -105087 -129658 -207792
1832 -207792 -168329 -8974 27085 -34403 47520 222386 8702 39 -179999 -184731 4784
1821 4784 -59390 -65219 66494 -13924 -253180 -180442 -212360 -201090 -117662 -107070 -50538 167848
1809 167848 -130598 -152000 -187335 -68079 -197811 -234543 -182836 -88666 -228675 -338757 -94471
$$ packed form
1887i4306J00294j18196O5303O093Q7816l08528J3650J30076r2248r7338L0506
1876b76878O2364J71874M3887o9919o5966L04615L1426L0866j76286o6012l1242
1865d1271j63838L4552J06645N3524j132m365q8674j58535J15158l909J37480
1854a4365R8660L5512n9856q5039m7530j3474M8510j06108J49644q6819M0734
1843d0131m1153k94449Q8588K68190r7958J77922L042j73071L933k4571p8134
1832b07792L9463J59355L6059o1488Q1923J74866k13684q663j80038m732J89515
1821D784o4174n829J31713q0418k39256P2738l1918J1270Q3428J0592N6532K18386
1809A67848k98446k1402l5335J19256j29732l6732N1707R4170j40009j10082K44286
$$ plain form
1798 -94471 -86679 -184779 -112984 -160103 -118015 -4722 -217622 -163728 -32364 -138004 -156867
1787 -156867 31591 53069 117787 -60314 -109759 -133033 -112397 -10983 -90620 -102174 -60170
1776 -60170 -203356 -161574 -56596 -149252 -54588 -118201 -191531 -103894 -45968 34548 -79372
1765 -79372 -178127 -175176 -214901 -197166 -66327 -245176 -206310 -238478 -171610 -114813 -100801 -79843
1753 -79843 -201644 -189141 3756 81384 137655 127381 70156 166411 218579 156337 240320
1742 240320 71610 -103582 -53977 -9364 190456 72958 13457 -119458 -117459 -87670 66576
1731 66576 -60713 -56789 -59054 -89624 -916 -190709 -265593 -144775 -77334 -82110 -127727 -56619
1719 -56619 107142 92721 -184738 -144708 -134076 -19724 -110124 -56251 -97864 -266463 -87654
$$ packed form
1798i4471P792r8100P1795m7119M2088J13293k12900N3894J31364j05640j8863
1787a56867J88458K1478O4718j78101m9445k3274K0636J01414p9637j1554M2004
1776f0170j43186M1782J04978r2656R4664o3613p3330Q7637N7926Q0516j13920
1765g9372r8755K951l9725J7735J30839j78849L8866l2168O6868N6797J4012K0958
1753g9843j21801J2503J92897P7628N6271j0274n7225R6255N2168o2242Q3983
1742B40320j68710j75192M9605M4613J99820j17498n9501j32915J999K9789J54246
1731F6576j27289L924k265l0570Q8708j89793p4884J20818O7441m776m5617P1108
1719e6619J63761j4421k77459M0030J0632J14352r0400N3873m1613j68599J78809
$$ plain form
1708 -87654 100857 38115 -250676 -452738 -386438 -130689 -270222 -206172 -1950 81570 60465
1697 60465 94511 139401 -57685 -38335 -79315 -279455 -101736 -225683 -103065 -33133 -106492
1686 -106492 -208286 -176931 -141208 -15233 56047 151989 120505 -29981 36841 -1436 78252
1675 78252 13193 -5730 -75961 -163060 -154158 6613 170663 112157 -20200 198558 124049
1664 124049 -53107 86070 82256 -77725 -97117 151135 -127111 -251576 -199567 -221196 113369
1653 113369 133450 -47915 -144840 -64545 -107768 -166371 1900 147753 193004 36718 15056
1642 15056 10321 -44956 48544 -124071 27938 161061 206172 170537 244570 228250 93547
1631 93547 35174 -243431 -144946 -139041 -113698 -128512 -63571 -198485 -63824 -167585 -76717
$$ packed form
1708h7654J88511o2742k88791k02062O6300K55749j39533O4050K04222Q3520k1105
1697F0465L4046M4890j97086J9350m0980k00140J77719j23947J22618O9932p3359
1686a06492j01794L1355L5723J25975P1280R5942l1484j50486O6822l8277P9688
1675G8252o5059j8923p0231q7099Q902J60771J64050n8506j32357K18758p4509
1664A24049j77156J39177l814j59981j9392K48252k78246j24465N2009k1629L34565
1653A13369K0081j81365r6925Q0295m3223n8603J68271J45853M5251j56286k1662
1642A5056m735n5277R3500j72615J52009J33123M5111l5635P4033j6320j34703
1631I3547n8373k78605R8485N905K5343j4814O4941j34914J34661j03761R0868
$$ plain form
1620 -76717 -85957 -75238 16971 -69663 -27296 1418 -84523 -177805 -58497 -113856 -233718 -10508
1608 -10508 -69567 -148940 -87436 -112363 -21006 -201962 -148624 -179693 -98657 -43379 -12377 -130178
1596 -130178 -379701 -150713 -171579 -310213 -260377 -439585 -332343 -19799 -115698 -60954
1586 -60954 36815 70725 -16771 -268 -136946 -360833 -170927 -219476 -239729 -290581 -306767
1575 -306767 -94992 -43930 64913 179317 127624 94014 169751 151296 95218 -12088 -26275
1564 -26275 73683 272729 181038 -125129 8793 -70110 -53324 33405 -22655 108380 215525
1553 215525 267070 150519 -12277 -49800 -152118 -89027 -219081 -85291 94026 57667
1543 57667 131579 38805 -79804 -189373 15966 123074 40334 -44045 -69788 35200 -4906
$$ packed form
1620g6717r240J0719R2209q6634M2367K8714q5941r3282J19308n5359j19862K23210
1608a0508n9059p9373O1504k4927R1357j80956N3338l1069Q1036N5278L1002j17801
1596a30178k49523K28988k0866j38634M9836j79208J07242L12544r5899N4744
1586f0954R7769L3910q7496J6503j36678k23887J89906m8549k0253n0852j6186
1575c06767K11775N1062J08843J14404n1693l3610P5737j8455n6078j07306j4187
1564b6275R9958J99046r1691l06167J33922p8903J6786Q6729n6060J31035J07145
1553B15525N1545j16551j62796l7523j02318O3091j30054J33790J79317l6359
1543E7667P3912r2774j18609j09569K05339J07108q2740q4379k5743J04988m0106
$$ plain form
1532 -4906 257875 325158 105746 18407 -96199 -169577 -133930 -171367 -91549 -205673 19702
1521 19702 40074 -127953 -81131 16413 93535 -90835 -77231 102909 142572 129936 129346 187856
1509 187856 127577 207269 197867 51445 -90405 59710 -49504 14314 122304 -193416 -313703
1498 -313703 -50365 -39110 -29470 55706 -221675 -225035 -45732 -74854 133568 69365 -67890
1487 -67890 699 -40033 -38454 -111953 -108532 -37304 -36803 -220274 -116937 -21895 11026 85902
1475 85902 97561 -41706 -82434 -35254 -740 -78421 -131544 -60265 237367 167632 60839
1464 60839 -142165 -194830 -54678 -65398 -69698 199086 182112 -202025 -80564 -102063 39357
1453 39357 31967 -114899 62 -148367 -233477 -197675 -82160 -55504 98146 143771 -40936
$$ packed form
1532d906K62781O7283k19412q7339j14606p3378L5647l7437P9818j14124K25375
1521A9702K0372j68027M6822R7544P7122j84370J3604J80140L9663j2636n90N8510
1509A87856o0279P9692r402j46422j41850J50115j09214O3818J07990l15720j20287
1498c13703K63338J1255R640Q5176k77381l360J79303k9122K08422o4203j37255
1487f7890O8589m0732J579p3499L421P1228N01j83471J03337R5042L2921P4876
1475H5902J1659j39267m0728M7180L4514p7681n3123P1279K97632o9735j06793
1464F0839k03004n2665J40152j0720m300K68784j6974l84137J21461k1499J41420
1453C9357p390j46866J14961j48429q5110L5802J15515K6656J53650M5625j84707
$$ plain form
1442 -40936 -129705 48253 90920 231544 140875 318017 180513 -113225 -89125 27409 -108454
1431 -108454 -321240 -191140 -34396 -16106 67071 -184018 -58993 119726 -127700 -68939
1421 -68939 -109371 -28061 209062 10749 -137553 -249441 -260600 -82942 -25897 -240085 -267464
1410 -267464 -164599 -200974 -112485 -145398 -42254 -81738 -74785 41013 244228 164415 25089
1399 25089 17223 238554 32251 32746 -172896 -300186 -110555 -302555 -127882 187281 -80339
1388 -80339 -230441 128793 178226 52855 24672 -140121 -221039 -76292 100364 7355 -33874
1377 -33874 -2764 -22953 -15946 -106899 -255842 -184670 146955 132148 173427 19951 -300890
1366 -300890 -112094 -26183 -113508 -150172 -46393 167631 117655 -47776 8550 -91635 -39638
$$ packed form
1442d0936q8769J77958M2667J40624r0669J77142j37504k93738K4100J16534j35863
1431a08454k12786J30100J56744J8290Q3177k51089J25025J78719k47426N8761
1421f8939m0432Q1310K37123j98313j48302j11888j1159J77658N7045k14188k7379
1410b67464J02865l6375Q8489l2913J03144l9484O953J15798K03215p9813j39326
1399B5089p866K21331k06303M95k05642j27290J89631j92000J74673L15163k67620
1388h0339j50102L59234M9433j25371k8183j64793q0918J44747J76656r3009m1229
1377c3874L1110k0189P007r0953j48943P1172L31625j4807M1279j53476l20841
1366c00890J88796Q5911q7325l6664J03779K14024m9976j65431N6326j00185N1997
$$ plain form
1355 -39638 113431 58951 215055 122012 -33441 263908 61767 -66863 50403 69910
1345 69910 -152815 -4889 -103114 -171976 10538 -153941 -11109 95673 82058 -116226
1335 -116226 -162354 117359 240903 72686 -109812 -12957 -32592 -157650 -46020 -196438
1325 -196438 -110483 9404 44934 179596 111326 133625 -51711 -179191 -14366 -54894 -104005
1314 -104005 -236288 -101416 -72058 23371 -37494 -14095 -130198 -226362 -65599 -157455 -304398
1303 -304398 -71664 -77201 -65358 -22914 -160959 -37051 -301 -87796 70325 -569 -17601
1292 -17601 -57711 -231498 -285311 -265629 -249341 -208245 -89486 -105981 -7323 57496 -124646
1281 -124646 -150433 46616 -190497 -134457 -76293 76783 -136037 -177488 -125879 -124402 -94248
$$ packed form
1355c9638J53069n4480J56104r3043j55453K97349k02141j28630J17266J9507
1345F9910k22725J47926r8225o8862J82514j64479J42832J06782j3615j98284
1335a16226m6128K79713J23544j68217j82498R6855j9635j25058J11630j50418
1325a96438Q5955J19887L5530J34662o8270K2299j85336j27480J64825m0528m9111
1314a04005j32283J34872K9358R5429o0865K3399j16103r6164J60763r1856j46943
1303c04398K32734n537J1843M2444j38045J23908L6750q7495J58121p0894j7032
1292a7601m0110j73787n3813J9682J6288M1096J18759j6495R8658O4819j82142
1281a24646k5787J97049k37113N6040N8164J53076k12820m1451N1609J477L0154
$$ plain form
1270 -94248 -23752 -161008 -223466 -241012 -153911 -147926 -152812 -95245 -182266 56127 37960 182366
1258 182366 -68465 -38009 -41685 -93673 92121 -29881 83315 17291 -50482 -97753 -6400
1247 -6400 32066 38532 448318 330249 199605 249177 11427 64448 -15991 -81619 48882
1236 48882 328475 292202 245161 267331 29419 25155 148036 301118 366048 280679 110647
1225 110647 -19442 107705 -11225 -272343 -408205 -232323 -173467 76598 132637 80771
1215 80771 -47251 -49874 -184660 -207983 -28854 138158 140522 89750 59678 15901 170099
1204 170099 172898 111931 -49859 -143516 -149274 84854 -2889 134632 202522 81638 -171792
1193 -171792 -225446 28108 -114166 -214556 -44256 -7285 167656 29035 -111907 -74190
$$ packed form
1270i4248P0496j37256o2458j7546Q7101N985m886N7567q7021K38393j8167J44406
1258A82366k50831L0456l676n1988J85794j22002J13196o6024o7773m7271R1353
1247f400L8466O466M09786j18069j30644M9572k37750N3021q0439o5628J30501
1236D8882K79593l6273m7041K2170k37912m264J22881J53082O4930q5369j70032
1225A10647j30089J27147j18930k61118j35862J75882N8856K50065N6039n1866
1215H0771j28022k623j34786k3323J79129J67012K364n0772l0072m3777J54198
1204A70099K799o0967j61790r3657n758K34128q7743J37521O7890j20884k53430
1193a71792n3654K53554j42274j00390J70300L6971J74941j38621j40942L7717
$$ plain form
1183 -74190 -48074 -54346 181648 216507 132066 100041 138990 14836 -27766 -174780 -174590 -76854
1171 -76854 -92200 -64861 71314 -74201 -158706 -36498 -12168 -57982 -394 85151 200223
1160 200223 10017 -114489 -22450 192924 273190 322181 369258 350863 71852 -364719 -189585
1149 -189585 90900 153025 -12952 -71605 69551 121199 43984 165378 34442 -121770
1139 -121770 -46092 -56842 25696 -110374 -61172 15286 -168660 -169649 -290801 37723 143466
1128 143466 -22909 -104564 -248457 -272465 -175044 -28599 10787 27616 91243 16008 78544
1117 78544 -127342 -203209 -73421 -108790 -90803 130333 -49555 14795 3914 -50454 220605
1106 220605 94635 -90475 -25469 104932 -28941 -51138 51549 29528 -75159 -116663
$$ packed form
1183g4190K6116o272K35994L4859q4441l2025L8949j24154m2602j47014J90R7736
1171g6854j5346K7339J36175j45515q4505J22208K4330m5814N7588Q5545J15072
1160B00223j90206j24506R2039K15374Q0266M8991M7077j8395k79011m36571J75134
1149a89585K80485O2125j65977n8653J41156N1648p7215J21394j30936j56212
1139a21770P5678j0750Q2538j36070M9202P6458j83946r89j21152L28524J05743
1128A43466j66375q1655j43893k4008R7421J46445L9386J6829O3627p5235O2536
1117G8544k05886p5867J29788l5369J7987K21136j79888O4350j0881n4368K71059
1106B20605j25970j85110O5006J30401j33873k2197J02687k2021j04687m1504
$$ plain form
1096 -116663 -133647 -70409 -27251 -152877 -424 43283 12927 -28753 25737 29515 11144
1085 11144 58094 33165 52502 -102063 -119495 32929 -26648 104511 281323 366121 297436
1074 297436 132498 157388 189514 194761 82352 -231258 -291154 -203245 -29726 86277 -119375
1063 -119375 -125721 155310 48023 -35095 105709 -36835 43108 -33896 -76739 -231413 -206301
1052 -206301 -61184 -117340 -105115 -118529 -72743 8686 -165041 -65804 -48229 -210318 58
1041 58 64838 -33377 92033 26638 130789 106930 170006 -37410 -124492 148330 182840 67315
1029 67315 39487 26146 56680 32328 -3097 220732 29180 97250 136771 163286 -72176
1018 -72176 -106429 -181293 -13999 52785 16002 -154609 85971 185411 40592 -170467 -85051
$$ packed form
1096a16663j6984O3238M3158j25626J52453M3707l0356m1680N4490L778j8371
1085A1144M6950k4929J9337j54565j7432J52424n9577J31159J76812Q4798o8685
1074B97436j64938K4890L2126N247j12409l13610n9896Q7909J73519J16003k05652
1063a19375o346K81031j07287q3118J40804j42544P9943p7004m2843j54674K5112
1052b06301J45117n6156J2225j3414M5786Q1429j73727R9237J7575j62089K10376
1041E8O4780r8215J25410o5395J04151k3859O3076k07416q7082K72822L4510j15525
1029F7315k7828j3341L0534k4352l5425K23829j91552O8070L9521K6515k35462
1018g2176l4253p4864J67294O6784l6783j70611K40580R9440j44819k11059Q5416
$$ plain form
1007 -85051 21467 61866 174749 233437 39831 -232572 -11334 -67503 -219514 -122189 -152970
996 -152970 -26928 -108465 -75128 -81014 -23477 238383 55420 136945 26268 63153 -175863
985 -175863 -74876 -66708 -171119 6334 546 33925 183818 120506 6961 -26507 22205
974 22205 -45551 -43576 -106093 -215555 130769 351454 150039 164405 149473 304389 225466
963 225466 98472 58419 -22367 -37748 14135 181697 297207 481634 242231 105282 143508
952 143508 55207 154460 -137578 -67986 195918 209740 114191 5753 -212983 -10157 240606
941 240606 1334 -64003 101323 53940 -62443 -13831 23132 51507 156826 75710 262431
930 262431 166299 -106650 -284085 -225891 -9655 110889 198183 97563 -113218 -50062 -53304
$$ packed form
1007h5051J06518M0399J12883N8688j93606k72403K21238n6169j52011R7325l0781
996a52970J26042q1537L3337n886N7537K61860j82963Q1525j10677L6885k39016
985a75863J00987Q168j04411J77453n788L3379J49893o3312j13545l3468M8712
974B2205o7756J975o2517j09462L46324K20685k01415J4366j4932J54916p8923
963B25466j26994m0053q0786j5381N1883J67562J15510J84427k39403j36949L8226
952A43508q8301R9253k92038O9592K63904J3822r5549j08438k18736K02826K50763
941B40606k39272o5337J65326m7383j16383M8612L6963K8375J05319q1116J86721
930B62431r6132k72949j77435N8194K16236J20544Q7294j00620k10781O3156l242
$$ plain form
919 -53304 -30842 -64482 81862 273841 222034 277540 104651 73002 89790 281644 375199
908 375199 225076 168773 31581 69583 104163 111348 106583 17515 -157746 -167161 -95785 -189997
896 -189997 -175699 -176006 -15881 118046 127337 -151739 -116777 -33509 118678 282880 216829
885 216829 48053 -53105 -189337 -60289 -28816 331778 228276 144140 188759 332392
875 332392 114877 -135775 46244 176552 306047 134370 63177 59623 197874 199182 129478
864 129478 -37188 -116035 -51201 -212499 87341 349687 84552 -161953 -293354 -65179
854 -65179 101074 -90311 -14076 182824 6568 -158434 -2397 -5866 -75838 -102880 49767
843 49767 -13819 56074 -18439 -911 143187 112806 67171 42501 132168 12253 14585 153065
$$ packed form
919e3304K2462l3640J46344J91979n1807N5506j72889l1649J6788J91854R3555
908C75199j50123n6303j37192L8002L4580P185m765q9068j75261r415P1376r4212
896a89997J4298l07J60125J33927R291k79076L4962Q3268J52187J64202o6051
885B16829j68776j01158j36232J29048L1473L60594j03502q4136M4619J43633
875C32392k17515k50652J82019J30308J29495j71677p1193l554J38251J308o9704
864A29478j66666p8847O4834j61298K99840K62346k65135k46505j31401K28175
854f5179J66253j91385P6235J96900j76256j65002J56037l469o9972k7042J52647
843D9767o3586O9893p4513J7528J44098l0381m5635k4670Q9667j19915K332J38480
$$ plain form
831 153065 11467 121997 175092 20067 187599 167722 42352 -46469 -88367 55997 14962
820 14962 -77569 -196455 -135239 82923 -17139 -194022 -130721 -69057 -11982 9155 -363924
809 -363924 -243263 -41142 -11062 172570 90448 45085 -205918 -115615 189889 236921 71750
798 71750 -55367 -58093 -129999 -20565 -81501 -268187 -449068 -174122 -157619 -35825 -1890
787 -1890 -5802 36353 65835 83559 48729 -2943 65405 281295 380890 177912 97553 -117310
775 -117310 -50107 -165020 -129159 -74014 -225558 -192728 -173600 -156428 -5723 12856 185942
764 185942 233804 171372 155066 -111164 -171845 190976 156943 121333 202058 -98872 -199409
753 -199409 -182116 -28771 -76968 -129318 -32758 187138 223661 139911 15455 89684 111858
$$ packed form
831A53065j41598J10530N3095j55025J67532j9877j25370q8821m1898J44364m1035
820A4962r2531j18886O1216K18162j00062j76883O3301O1664N7075K1137l73079
809c63924J20661K02121L0080J83632q2122m5363k51003R0303L05504M7032j65171
798G1750j27117k726p1906J09434o0936j86686j80881K74946J6503J21794L3935
787a890l912M2155K9482J7724l4830n1672O8348K15890R9595k02978q0359k14863
775a17310O7203j14913L5861N5145j51544L2830J9128J7172J50705J8579J73086
764A85942M7862o2432j6306k66230o0681L62821l4033l5610Q0725l00930j00537
753a99409J7293J53345m8197n2350R6560K19896L6523q3750j24456P4229K2174
$$ plain form
742 111858 -16029 -7476 -94149 -51137 -150947 -58360 17986 209302 439931 142771 80808
731 80808 225987 59899 65638 118152 225032 176428 85105 7106 -66660 -43156 -83499 -91003
719 -91003 -28811 86173 -148020 -215882 -318122 -137641 51476 -155225 -309872 -143064
709 -143064 -66797 29281 -59760 -97386 25894 84282 155119 90347 -54361 1907 -95139
698 -95139 5020 -47089 -49289 -21427 -54806 204777 161896 -58860 107453 -65978 -3628
687 -3628 205937 204534 195419 280722 41982 5510 -73755 89090 237972 282334 166476 227254
675 227254 157604 17348 32034 -53489 151316 -8690 4747 -47763 59961 39564 -3315
664 -3315 155301 84988 -143375 -14808 51452 130689 303454 132624 40198 -8293 -109695
$$ packed form
742A11858j27887Q553q6673M3012r9810R2587P6346J91316K30629k97160o1963
731H0808J45179j66088N739N2514J06880m8604r1323p7999p3766K3504m0343p504
719i1003O2192J14984k34193o7862j02240J80481J89117k06701j54647J66808
709a43064P6267R6078q9041l7626J23280N8388P0837o4772j44708N6268r7046
698i5139J00159n2109k200K7862l3379K59583m2881k20756J66313j73431O2350
687c628K09565j403r115Q5303k38740l6472p9265J62845J48882M4362j15858O0778
675B27254o9650j40256J4686q5523K04805j60006J3437n2510J07724k0397m2879
664c315J58616p0313k28363J28567O6260P9237J72765j70830r2426m8491j01402
$$ plain form
653 -109695 -45070 -14585 69293 4225 -125211 -292488 -236291 -13171 -6165 11072 78106
642 78106 133755 436572 264525 83820 -341424 -34007 154538 76608 107084 90966 28905
631 28905 16370 16233 -59191 258002 350927 247312 96218 73356 163133 197501 14240 -124821
619 -124821 226186 168162 -110124 -157192 -220400 -120520 73614 54679 238150 275543 219003
608 219003 127350 11019 -108768 -186521 -72798 -183904 -43777 146685 -24344 -69975
598 -69975 -109783 -7537 -177857 -197931 139180 48258 -20350 -37680 -15889 111830 205894
587 205894 119781 87894 -53428 -35898 -162886 -20597 25062 92251 101501 147115 116450
576 116450 -6174 38467 83275 154756 192777 -31850 123851 6217 34468 108746 152401
$$ packed form
653a09695O4625L0485Q3878o5068j29436j67277N6197K23120P006J7237O7034
642G8106N5649L02817j72047j80705m25244L07417J88545p7930L0476j6118o2061
631B8905j2535j37p5424L17193R2925j03615j51094k2862Q9777L4368j83261j39061
619a24821L51007n8024k78286m7068o3208R9880J94134j8935J83471L7393n6540
608B19003r1653j16331j19787p7753J13723j11106J40127J90462j71029m5631
598f9975l9808J02246j70320k0074L37111r0922o8608j7330K1791J27719R4064
587B05894q6113l1887j41322J7530j26988J42289M5659O7189R250M5614l0665
576A16450j22624M4641M4808P1481L8021k24627J55701j17634K8251P4278M3655
$$ plain form
565 152401 56072 51219 42060 514 36852 224236 367168 312106 77634 48138 -70853
554 -70853 48261 188840 39666 1602 28954 -99373 45842 226439 35499 -37675 -105575
543 -105575 86657 189424 97275 -89738 89187 174275 40714 -62719 54443 184177
533 184177 275500 264238 214908 -58349 -137794 50364 -4845 -30627 129989 -39116 -153965
522 -153965 -75634 987 -102417 8973 18599 106401 127103 -52808 -131176 3692 124860
511 124860 95558 30128 78113 162230 379485 260407 -61038 -72970 -8090 -121343 -15376
500 -15376 -154558 -8086 169458 -117610 -34725 -8161 73611 204313 24542 170165 260259
489 260259 109736 90425 182610 130142 -97040 -8053 78875 200391 79254 -13312 68141
$$ packed form
565A52401r6329m853r159m1546L6338J87384J42932n5062k34472k9496j18991
554g0853J19114J40579j49174l8064K7352j28327J45215J80597j90940p3174o7900
543a05575J92232J02767r2149j87013J78925Q5088j33561j03433J17162J29734
533A84177R1323j1262m9330k73257p9445J88158n5209k5782J60616j69105j14849
522a53965P8331P6621j03404J11390R626Q7802K0702j79911p8368J34868J21168
511A24860k9302o5430M7985Q4117K17255j19078l21445j1932O4880j13253J05967
500a5376j39182J46472J77544k87068Q2885K6564Q1772J30702j79771J45623R0094
489B60259j50523j9311R2185n2468k27182Q8987Q6928J21516j21137r2566Q1453
$$ plain form
478 68141 -6356 -193817 -165914 7087 74582 112859 -47329 -106722 -214363 22888 124422
467 124422 13103 43965 2840 -104672 -85130 -115083 -68034 -79538 19443 -41628 -61902
456 -61902 -53871 -2581 111570 79215 -22075 -72447 109310 41839 12020 230102 164127
445 164127 240000 96168 83300 165893 87066 142452 119981 179846 32654 92394 108017
434 108017 75481 100515 133805 95548 39297 -51366 135140 189613 248057 215701 323615
423 323615 3289 -78576 -73221 140931 -41709 -238479 -242446 -184092 -35807 67955 -63520
412 -63520 112120 289849 105128 -159978 20447 175699 112380 11447 -45011 24979 -194545
401 -194545 -199102 -80626 112489 -102384 -118194 75312 163169 61338 29110 64338 48669
$$ packed form
478F8141p4497j87461K7903J73001O7495L8277j60188n9393j07641K37251J01534
467A24422j11319L0862m1125j07512J9542k9953M7049j1504R8981o1071k0274
456f1902Q031N1290J14151l2355j01290n0372J81757o7471k9819K18082o5975
445A64127P5873j43832j2868Q2593p8827N5386k2471N9865j47192N9740J5623
434A08017l2536K5034L3290l8257n6251r0663J86506N4473N8444l2356J07914
423C23615l20326q1865N355K14152j82640j96770l967N8354J48285J03762j31475
412f3520J75640J77729j84721k65106J80425J55252o3319j00933n6458O9990k19524
401a94545m557J18476J93115k14873j5810J93506Q7857j01831l2228L5228j5669
$$ [...]
##END NTUPLES=NMR SPECTRUM
##END=
