##TITLE=1H_CG-1190-50
 CDCl3
 8 sc, 
 13.3.2024
##JCAMPDX= 6.0         $$ Bruker NMR JCAMP-DX V2.0
##DATA TYPE= NMR SPECTRUM
##DATA CLASS= NTUPLES
##ORIGIN= UXNMR, Bruker Analytische Messtechnik GmbH
##OWNER= root
$$ XWIN-NMR		Version 3.5
$$ Wed Mar 13 14:27:19 2024 Russian Standard Time (UT+4h)  she@DPX200
##.OBSERVE FREQUENCY= 200.1313
##.OBSERVE NUCLEUS= ^1H
##.ACQUISITION MODE= SIMULTANEOUS
##.ACQUISITION SCHEME= undefined
##.AVERAGES= 8
##.DIGITISER RES= 18
##SPECTROMETER/DATA SYSTEM= spect
##.PULSE SEQUENCE= zg30
##.SOLVENT NAME= CDCl3
##.SHIFT REFERENCE= (INTERNAL, CDCl3, 0, 15.4604)
##AUDIT TRAIL= $$ (NUMBER, WHEN, WHO, WHERE, WHAT)
$$ ##TITLE= Audit trail, XWIN-NMR		Version 3.5
$$ ##JCAMPDX= 5.01
$$ ##ORIGIN= Bruker BioSpin GmbH
$$ ##OWNER= she
$$ F:/spectra/data/she/nmr/H-F/1/pdata/1/auditp.txt
$$ ##AUDIT TRAIL=  $$ (NUMBER, WHEN, WHO, WHERE, WHAT)
(   1,<2024-03-13 14:26:08.18 +0400>,<she>,<DPX200>,
      <created by zg, POWCHK disabled, PULCHK disabled
       configuration hash MD5:
       00 E9 B6 7A A2 85 ED C7 34 08 36 98 17 FE 4E 26
       data hash MD5: 16K
       52 0C FD 55 B4 D5 14 8A C7 4D 45 AA C3 08 32 6E>)
(   2,<2024-03-13 14:26:10.10 +0400>,<she>,<DPX200>,
      <Start of raw data processing
       efp BC_mod = 2 LB = 0.24 FT_mod = 6 PKNL = 1 PHC0 = -25459.74 PHC1 = 9.187313 SI = 16K 
       data hash MD5: 16K
       09 36 76 13 45 79 8F E2 D4 42 48 28 71 D9 7C 52>)
(   3,<2024-03-13 14:26:34.59 +0400>,<she>,<DPX200>,
      <pk PHC0 = 158.6586 PHC1 = 0.8 
       data hash MD5: 16K
       18 7A 5A 56 53 E7 78 E2 C3 DF 04 FE 63 A9 07 28>)
(   4,<2024-03-13 14:26:38.23 +0400>,<she>,<DPX200>,
      <abs ABSG = 5 
       data hash MD5: 16K
       DA 3E BE 18 83 FE 88 82 B3 E3 74 16 A2 3A 84 3B>)
$$ ##END=
$$ 
$$ hash MD5
$$ 2D E1 B0 18 15 19 09 0A 60 1B 1E 3E C4 8D 45 0B
##$RELAX= 
##$RELAX= 
##$RELAX= 
##$RELAX= 
##$RELAX= 
##$RELAX= 
$$ Bruker specific parameters
$$ --------------------------
##$DU= <F:/spectra>
##$EXPNO= 1
##$NAME= <H-F>
##$PROCNO= 1
##$TYPE= <nmr>
##$USER= <she>
##$AMP= (0..31)
100 100 100 100 100 100 100 100 100 100 100 100 100 100 100 100 100 100 
100 100 100 100 100 100 100 100 100 100 100 100 100 100 
##$AQSEQ= 0
##$AQ_mod= 1
##$AUNM= <au_zg>
##$AUTOPOS= <>
##$BF1= 200.13
##$BF2= 200.13
##$BF3= 200.13
##$BF4= 200.13
##$BF5= 200.13
##$BF6= 200.13
##$BF7= 200.13
##$BF8= 200.13
##$BYTORDA= 1
##$CFDGTYP= 0
##$CFRGTYP= 5
##$CHEMSTR= <none>
##$CNST= (0..31)
1 1 145 1 1 1 1 1 1 1 1 1 1 1 1 1 1 1 1 1 1 1 1 1 1 1 1 1 1 1 1 1 
##$CPDPRG= <>
##$CPDPRG1= <>
##$CPDPRG2= <>
##$CPDPRG3= <>
##$CPDPRG4= <mlev>
##$CPDPRG5= <mlev>
##$CPDPRG6= <mlev>
##$CPDPRG7= <mlev>
##$CPDPRG8= <mlev>
##$CPDPRGB= <>
##$CPDPRGT= <>
##$D= (0..31)
0 1.2 0 0 0 0 0 0 0 0.06 0 0.03 0 0 0 0 0.0002 0 0 0 0 0 0 0 0 0 0 0 0 
0 0 0 
##$DATE= 1710325567
##$DBL= (0..7)
120 120 120 120 120 120 120 120 
##$DBP= (0..7)
150 150 150 150 150 150 150 150 
##$DBP07= 0
##$DBPNAM0= <>
##$DBPNAM1= <>
##$DBPNAM2= <>
##$DBPNAM3= <>
##$DBPNAM4= <>
$$ [...]
##$SUBNAM3= <"">
##$SUBNAM4= <"">
##$SUBNAM5= <"">
##$SUBNAM6= <"">
##$SUBNAM7= <"">
##$SUBNAM8= <"">
##$SUBNAM9= <"">
##$SW= 18.0517328524113
##$SWIBOX= (0..15)
0 0 2 0 0 0 0 0 0 0 0 0 0 0 0 0 
##$SW_h= 3612.71676300578
##$TD= 16384
##$TD0= 1
##$TE= 0
##$TE2= 300
##$TE3= 300
##$TEG= 300
##$TL= (0..7)
0 120 120 120 120 120 120 120 
##$TP= (0..7)
150 150 150 150 150 150 150 150 
##$TP07= 0
##$TPNAME0= <>
##$TPNAME1= <>
##$TPNAME2= <>
##$TPNAME3= <>
##$TPNAME4= <>
##$TPNAME5= <>
##$TPNAME6= <>
##$TPNAME7= <>
##$TPOAL= (0..7)
0.5 0.5 0.5 0.5 0.5 0.5 0.5 0.5 
##$TPOFFS= (0..7)
0 0 0 0 0 0 0 0 
##$TUNHIN= 0
##$TUNHOUT= 0
##$TUNXOUT= 0
##$USERA1= <user>
##$USERA2= <user>
##$USERA3= <user>
##$USERA4= <user>
##$USERA5= <user>
##$V9= 5
##$VALIST= <valist>
##$VCLIST= <CCCCCCCCCCCCCCC>
##$VD= 0
##$VDLIST= <DDDDDDDDDDDDDDD>
##$VPLIST= <PPPPPPPPPPPPPPP>
##$VTLIST= <TTTTTTTTTTTTTTT>
##$WBST= 1024
##$WBSW= 4
##$XGAIN= (0..3)
0 0 0 0 
##$XL= 0
##$YL= 0
##$YMAX_a= 45765
##$YMIN_a= -66440
##$ZGOPTNS= <>
##$ZL1= 120
##$ZL2= 120
##$ZL3= 120
##$ZL4= 120
##$ABSF1= 15.70172
##$ABSF2= -2.350133
##$ABSG= 5
##$ABSL= 3
##$ALPHA= 0
##$AQORDER= 0
##$ASSFAC= 0
##$ASSFACI= 0
##$ASSFACX= 0
##$ASSWID= 0
##$AUNMP= <proc_1d>
##$AZFE= 0.1
##$AZFW= 0.1
##$BCFW= 0
##$BC_mod= 2
##$BYTORDP= 0
##$COROFFS= 0
##$CY= -3
##$DATMOD= 1
##$DC= 0
##$DFILT= <>
##$DTYPP= 0
##$F1P= 0
##$F2P= 0
##$FCOR= 1
##$FTSIZE= 16384
##$FT_mod= 6
##$GAMMA= 0
##$GB= 0
##$INTBC= 1
##$INTSCL= 3.70164e-10
##$ISEN= 128
##$LB= 0.24
##$LEV0= 0
##$LPBIN= 0
##$MAXI= 10000
##$MC2= 0
##$MEAN= 0
##$ME_mod= 0
##$MI= 1.114404
##$NCOEF= 0
##$NC_proc= -10
##$NLEV= 6
##$NOISF1= 3.799351
##$NOISF2= 2.8
##$NSP= 0
##$NTH_PI= 0
##$NZP= 0
##$OFFSET= 15.46042
##$PC= 1
##$PHC0= -25301.08
##$PHC1= 9.987313
##$PH_mod= 1
##$PKNL= yes
##$PPARMOD= 0
##$PSCAL= 0
##$PSIGN= 0
##$REVERSE= no
##$SF= 200.130012264352
##$SI= 16384
##$SIGF1= 3
##$SIGF2= 2
##$SINO= 5.538805
##$SIOLD= 16384
##$SREGLST= <1H.CDCl3>
##$SSB= 0
##$STSI= 16384
##$STSR= 0
##$SW_p= 3612.71676300578
##$SYMM= 0
##$S_DEV= 0
##$TDeff= 16384
##$TDoff= 0
##$TI= <>
##$TILT= no
##$TM1= 0
##$TM2= 0
##$TOPLEV= 0
##$USERP1= <user>
##$USERP2= <user>
##$USERP3= <user>
##$USERP4= <user>
##$USERP5= <user>
##$WDW= 1
##$XDIM= 16384
##$YMAX_p= 457702792
##$YMIN_p= -4830630
$$ End of Bruker specific parameters
$$ ---------------------------------
##NTUPLES= NMR SPECTRUM
##VAR_NAME=  FREQUENCY,     SPECTRUM/REAL,   SPECTRUM/IMAG
##SYMBOL=    X,             R,               I
##VAR_TYPE=  INDEPENDENT,   DEPENDENT,       DEPENDENT
##VAR_FORM=  AFFN,          ASDF,            ASDF
##VAR_DIM=   16384,         16384,           16384
##UNITS=     HZ,            ARBITRARY UNITS, ARBITRARY UNITS
##FACTOR=    0.220516191357247, 1,           1
##FIRST=     3094.0939751364, 0,             0
##LAST=      -518.622787869384, 0,           0
##MIN=       -518.622787869384, -4830630,    0
##MAX=       3094.0939751364, 457702792,     0
$$ Real data points
##PAGE= N=1
##DATA TABLE= (X++(R..R)), XYDATA
$$ [...]
6621D133336k478352j293445l09822O2245N32712n68292M04008M68282J625004
6612B575676k123436o02431J268625N61439j256712o25429K400662p65199n14823
6603I18372m27719J278595P03894j190301r20758L90593J308453N00047j212583
6594A348593m23861n39331L49383J026990o63945R16190J434720j063261p69865
6585A615613j392977N1559J087549j913368J4798K3902J945371L67238j297826
6576E01859l7414R51142l34393r63758P5242r3062M62344j032462R54405l1939
6566D51964N31575K64592j473551K95540J583468L85573N0462q52769p20132L12829
6556H29551K61037j43886J47568N04113N21098r98328o80420o36697N68551N60582
$$ plain form
6621 4133336 1654984 361539 51717 113962 646674 78382 482390 950672 2575676
6612 2575676 452240 -150191 1118434 1679873 423161 -202268 2198394 1433195 918372
6603 918372 490653 1769248 2473142 1282841 362083 752676 2061129 2561176 1348593
6594 1348593 924732 385401 734784 1761774 1097829 2014019 3448739 2385478 1615613
6585 1615613 222636 274195 1361744 -551624 -536826 -512924 1432447 1799685 501859
6576 501859 464445 1415587 1081194 117436 192678 99616 561960 -470502 483903 451964
6566 451964 983539 1248131 -225420 70120 1653588 2039161 2089623 1236854 516722 829551
6556 829551 1090588 946702 1094270 1598383 2119481 1121153 440733 -195964 372587 933169
6546I33169M06832J009371j5944K49058j008813N42254N80084R10727N61518o73863
6536C494393q87743n00842r31018j74041m35341Q76206O61027j079214O76570
6527A699997r8747J451949p62291j016622p73501o12072J443635m59663N27632
6518A400317l89280J370159J033032j018887k57997l95698k51323M08952Q15595
6509B714870n3626k96907L71085o27503R06461R49702m42270m74884J016672j018854
6499C044746o47518O26453J138622j270672L086518J01143l290166K94679r50755
6490B133050J26200J489819j13715Q16194Q13767K47268P48699p85229r52282
6481D523771l45391M99083j632593J479842Q48040L54600j359710L68909J99845
$$ plain form
6546 933169 1340001 2349372 2333428 2582486 1573673 2115927 2696011 3606738 4168256 3494393
6536 3494393 2606650 2105808 1174790 1000749 565408 1441614 2102641 1023427 1699997
6527 1699997 1601250 3053199 2290908 1274286 500785 -111287 1332348 872685 1400317
6518 1400317 1011037 2381196 3414228 2395341 2137344 1741646 1490323 1899275 2714870
6509 2714870 2661244 2364337 2735422 2107919 3014380 3964082 3521812 3046928 4063600 3044746
6499 3044746 2397228 3023681 4162303 2891631 5978149 6079292 2789126 3083805 2133050
6490 2133050 2259250 3749069 3635354 4451548 5265315 5512583 6261282 5476053 4523771
6481 4523771 4178380 4677463 3044870 4524712 5372752 5727352 4367642 4736551 4936396
6472D936396n75574J52797K79911p58896j28002J607723r96208m42612R08057
6463D983592J155467J218130k291068j61589J796318m42111Q62524J239299j357270
6454G003292j743096k11887o08632J722022J099867O21055N4985o16578J988662
6445I309690L82502l008233p69552J09275K423470p30271R9854n30394L1435k81577
6435G036199J072475j021314j44398R55827l81166J073915m2254R93663R19767
6426A0462714m65783k185468L86976J195438J43740O83037J088815j296386m81535
6417I531548M85595Q31703m80579M90533Q73073n30242J484680m81096J16683
6408A2321898N85307r51987J647151r24708p02864R25664P31397j964610J287434
$$ plain form
6472 4936396 4360822 4513619 4793530 4034634 3906632 5514355 4518147 4075535 4983592
6463 4983592 6139059 7357189 5066121 4904532 6700850 6258739 7121263 8360562 7003292
6454 7003292 5260196 5048309 4439677 6161699 7261566 7882621 7937606 7321028 9309690
6445 9309690 9692192 6683959 5914407 6023682 8447152 7716881 7816735 7286341 7317776 7036199
6435 7036199 8108674 7087360 6942962 7898789 7517623 8591538 8549284 9542947 10462714
6426 10462714 9996931 7811463 8198439 9393877 9537617 10220654 11309469 10013083 9531548
6417 9531548 10017143 10848846 10368267 10858800 11731873 11201631 12686311 12205215 12321898
6408 12321898 12907205 11955218 13602369 12677661 11974797 12900461 13631858 11667248 12954682
6399A2954682O77636l64413K029142J496245M92113j328198J294902M92292M55590
6390A8199991O19629q2625o2606k9947J491341m26210K178263K74151R41468r42719
6380B2160736M28478K917967L08785L32226K83373j70696K423345K029048N01974
6371C1215236R16552J669443J826658P51251K135169J076510L049147L378948
6363D6018914K455557L869934M648580N744365O162566R803348J1055449J3777327
6355A03536040J4747780J2521913N934167p61164q007012j1446513r504616r313725
6347I7706870o255805o107394k350138j964008j992337j292876M79179L79599
6339G8603090J946245L237627M853041O723175N054673J0980807J4228688J5338723
$$ plain form
6399 12954682 13632318 13267905 15297047 16793292 17285405 15957207 17252109 17744401 18199991
6390 18199991 18819620 18736995 18674389 18644442 20135783 19709573 21887836 22161987 23103455 22160736
6380 22160736 22589214 25507181 25815966 26148192 26431565 26260869 28684214 30713262 31215236
6371 31215236 32131788 33801231 35627889 36379140 38514309 39590819 42639966 46018914
6363 46018914 48474471 52344405 56992985 62737350 68899916 78703264 89758713 103536040
6355 103536040 118283820 130805733 136739900 135978736 127971724 116525211 107020595 97706870
6347 97706870 91451065 85343671 82993533 81029525 79037188 77744312 78223491 78603090
6339 78603090 80549335 83786962 88640003 95363178 100417851 111398658 125627346 140966069
6331A40966069K1047711K9364100L1810292K7128144J9950517Q02318j9630318
6324B51438833k8659202k8797950k5998266k1908627j5717446j2513316r272449
6317A08571577r025327o755027m279087l10497p13172j62345R40474K003926K412551
6308I2683073L377242M831839M723896R753165J2928265J3046723J4163769P295806
6300A62803778j009491q240312j4952227j5052232j4168739r130910q352674r474321
6292H2422872q706071m284718m448469l533029l955639r66866K124305J094958
6284E9747343j919075Q72235m64887l381893l325133l603152k688566k083891
6276D3152981l256005j785571J197221j392294j744582O12999M00446j430280
$$ plain form
6331 140966069 162013780 191377880 223188172 250316316 270266833 271069151 251438833
6324 251438833 222779631 193981681 167983415 146074788 130357342 117844026 108571577
6317 108571577 99546250 92791223 88512136 88201639 87488467 87326122 88266596 90270522 92683073
6308 92683073 96060315 100892154 105616050 115369215 128297480 141344203 155507972 162803778
6300 162803778 161794287 153553975 138601748 123549516 109380777 100249867 91897193 82422872
6292 82422872 73716801 69432083 64983614 61450585 57494946 56528080 58652385 59747343
6284 59747343 57828268 58700503 58235616 54853723 51528590 47925438 45236872 43152981
6276 43152981 39896976 38111405 39308626 37916332 36171750 36784749 37185195 35754915
6268C5754915j140383M29707J57418J034853N29248j360292P79361R9926N8353
6259C6343106N57600k412216O45057N73287j872076l372274k035443j764971n26574
6250B6135496j720765j258235O95208L43680j212420J373420N1746o82735J355803
6241B5081198K335736K180031J363430J382992J279690J67846k727893l598873
6233B7464157k680709j300506k299861j408859R0290k890058j247983K38316j70246
6224A5794541o24712r70696J594117o61081j961485N32283K02763l28615K24253
6215A3801368J709403L480328R09629J15999K9790L35417j708547k955813r43144
6206A4774430j846854k142086j136299j843941P81102l13148R06132r52117n59146
$$ plain form
6268 35754915 34614532 35044239 35201657 36236510 36765758 35405466 36184827 36284753 36343106
6259 36343106 36900706 34488490 35133547 35706834 33834758 30462484 28427041 26662070 26135496
6250 26135496 24414731 23156496 23851704 24195384 22982964 24356384 24408130 23725395 25081198
6241 25081198 27416934 29596965 30960395 32343387 33623077 33790923 31063030 27464157
6233 27464157 24783448 23482942 21183081 19774222 19864512 16974454 15726471 15964787 15794541
6224 15794541 15169829 14199133 15793250 15132169 13170684 13702967 13905730 13577115 13801368
6215 13801368 15510771 18991099 19900728 20016727 20046517 20381934 18673387 15717574 14774430
6206 14774430 12927576 10785490 9649191 7805250 8586352 8273204 9179336 8227219 7668073
6197G668073q93585k20507K83049K97985r96593j97292n70467M33665o97976Q87719
6187E994071l33436K69818k81419J36215P24217k628165M70327o756q2512J878233
6177F140593P84802k24406j020440o9939p64909M77284P78454l10742L0103J175696
6167F996496j105510p58945q73787j56256J088975L13746o10692M43047O34662
6158E971736j31528K44492R9268M3541n79340o5094j067886j114739P59904J640263
6148E800617o95813k17373n20637o27811m60032O80982J218616K75975K70611
6139E725135l13601j875584J113921J219877J9103J372749j67626q24752q1890
6130F187332J38445r86362J779344K48178R66454q66546n09255N21420n02293
$$ plain form
6197 7668073 6774488 6553981 6837030 7135015 6138422 5941130 5370663 5804328 5106352 5994071
6187 5994071 5660635 5930453 5649034 5785249 6509466 3881301 4351628 4344872 4262360 6140593
6177 6140593 6925395 6700989 5680549 5610610 4845701 5322985 6101439 5790697 5820800 6996496
6167 6996496 5890986 5132041 4258254 4101998 5190973 5504719 4894027 5337074 5971736
6158 5971736 5840208 6084700 6183968 6227509 5648169 5583075 4515189 3400450 4160354 5800617
6148 5800617 5104804 4887431 4366794 3738983 3278951 3959933 5178549 5454524 5725135
6139 5725135 5411534 3535950 4649871 5869748 5888851 7261600 7093974 6269222 6187332
6130 6187332 6325777 5339415 7118759 7366937 8333391 7466845 6957590 7479010 6976717
6121F976717J29318J26613J455263j214683J53673M48348L56463J18858J003617
6112I554187j34996j312156r48672R54683K42065k79897l9467o19292K78154K332311
6102A0026920J330262K03166n60786j022597O02831N79136n10774o94748r28102
6093I025308J449652J393851J91846j691592J206788O47228k80025q68855L81705
6084A1455906l89024P0268J181883J74249m98873J118063L37855O99785K36391
6075A4386503J376452Q62966J896719k566486Q86011K600327M49721R36952J63832
6066B0992997K62726k96984R47434N29080M36651k76530j137231L96492L570592
6057B5425227K076794M87435K974878Q76658K807783K564277L386573M886944
$$ plain form
6121 6976717 7106035 7232648 8687911 7473228 7626901 8075249 8431712 8550570 9554187
6112 9554187 9419191 8107035 7158363 8113046 8355111 8075214 8035747 7416455 7694609 10026920
6102 10026920 11357182 11560348 10999562 9976965 10579796 11158932 10648158 9953410 9025308
6093 9025308 10474960 11868811 12060657 10369065 11575853 12223081 11943056 11074201 11455906
6084 11455906 11066882 11137150 12319033 12493282 11994409 13112472 13450327 14150112 14386503
6075 14386503 15762955 16625921 18522640 15956154 16842165 19442492 19892213 20829165 20992997
6066 20992997 21255723 20958739 21906173 22435253 22871904 22595374 21458143 21854635 25425227
6057 25425227 27502021 27989456 30964334 31840992 34648775 37213052 40599625 45486569
6049D5486569L858101N154367M916359L340017j448316k270673m671661l841277
6041E0523486j798477j297631l740371l26593r3796j134753O47062l81552n88764
6032D1808611K235219K623635L794006J074329L916397M876867L647454O523818
6024G0500336R389179Q750170J2301500J1232866P327585J502200n591989j0966465
6016A04445382r049888q225953p212395n568745k268409k677910l445706j9084
6008F5977292m14566R74654L01219J148699L374046L753150N304190O221837O353809
5999I2994330Q740240J1649860J4859683J8157826J9287391J5016153P046425
5992A87751908k283509j0157649j5629151j6847306j2694690j0461438r929323
$$ plain form
6049 45486569 49344670 54499037 59415396 62755413 61307097 59036424 54364763 50523486
6041 50523486 48725009 47427378 43687007 43360414 43266618 42131865 42778927 42397375 41808611
6032 41808611 44043830 46667465 50461471 51535800 55452197 60329064 63976518 70500336
6024 70500336 79889515 88639685 100941185 112174051 119501636 121003836 115411847 104445382
6016 104445382 95395494 87169541 79957146 74388401 72119992 69442082 65996376 65977292
6008 65977292 65562726 66537380 66838599 67987298 71361344 75114494 80418684 86640521 92994330
5999 92994330 101734570 113384430 128244113 146401939 165689330 180705483 187751908
5992 187751908 185468399 175310750 159681599 142834293 130139603 119678165 109748842
5985A09748842r052980n904322j492523j842640j078358j348151O42346L050906
5977I2723120M274679N038364P077056Q892936R649420J4447895J9123641K3874855
5969A85101966K6496364K6705751K3735485J2858052o188171k2340452l0361172
5962B16007823l2250264k4934245k0382631j4599315j2576127j2533982m381713
5955I4349546l471635m368763l359622r37655p10523p55970K379497J746847J712858
5946H6584580O408138P771800R641744J5184135J2117333J0078758Q090230j701006
5938A54175712r357737j6174381j7080851j5185969j3049428j0895830q525447
5931F3906069p048091n688972n170384k216170l075517j582991j966718l708870
$$ plain form
5985 109748842 100695862 94791540 93299017 91456377 90378019 89029868 89672214 92723120
5977 92723120 96997799 102036163 109113219 118006155 127655575 142103470 161227111 185101966
5969 185101966 211598330 238304081 262039566 274897618 268709447 246368995 216007823
5962 216007823 183757559 158823314 138440683 123841368 111265241 98731259 94349546
5955 94349546 90877911 86509148 83149526 82211871 81501348 80745378 83124875 84871722 86584580
5946 86584580 92992718 100764518 110406262 125590397 137707730 147786488 155876718 154175712
5938 154175712 144817975 128643594 111562743 96376774 83327346 72431516 63906069
5931 63906069 56857978 51169006 45998622 43782452 40706935 39123944 37157226 33448356
5923C3448356j203862k647657r19915l065546m61842k89961K63943j585197j221407
5914B2316912j839231j610886J78249j550230P98048q83142L4471r23924j039237
5905A5481030J348569n51310P10262j342551O24409n50108j546689o13916j34854
5896A3424842n63930N72333j129393k284495L73744N56134j520648p12541M8069
5887H764115J077538J727324n11775M25659p40709N46869m46798O48114n41184
5878A0949153j070741K03015J274402n28358R05550J93959j794356K99876P02904
5869A1135404j055230q82288J71907J259649k172256P5885N54541M69798m3460
5860I513950o98915o24964j98475k28902j05126J364556P81874J091588k23993
$$ plain form
5923 33448356 32244494 29596837 28676922 25611376 25149534 24859573 25123516 23538319 22316912
5914 22316912 20477681 18866795 19045044 17494814 18292862 17409720 17444191 16520267 15481030
5905 15481030 16829599 16278289 16988551 15646000 16270409 15720301 14173612 13559696 13424842
5896 13424842 12860912 13433245 12303852 10019357 10393101 10949235 9428587 8716046 8764115
5887 8764115 9841653 11568977 11057202 11482861 10742152 11289021 10842223 11490337 10949153
5878 10949153 9878412 10081427 11355829 10827471 11733021 11926980 10132624 10432500 11135404
5869 11135404 10080174 9197886 9369793 10629442 8457186 8533071 9087612 9557410 9513950
5860 9513950 8815035 8190071 7991596 7762694 7657568 9022124 9803998 10895586 10671593
5851A0671593j168372m35091K98523r31003J219891m98892J066536r04711j089474
5842H229000P84026J424310j856819J77261Q26593k25389P12721K057091K03521
5833A2332315k475394o67825J646744L2540P27301j76N45049m94465O69138r59543
5823A1355684K111684J62004j297213j332611J035341l7956Q34625J821030j05488
5814A4547100J93309j708261J202417J576320j76421k73098o22999m66298J598016
5805A5870085m30998J108709n71751J147868P08528j249009q70298J466667j21139
5796A7058662R4274M69696J296665J060514R07798L57709P99505k75168J363627
5787B3133282P64202J919445m28553o26777M71341K054280k02844J324169J850841
$$ plain form
5851 10671593 9503221 9068130 9366653 8435650 9655541 9156649 10223185 9318474 8229000
5842 8229000 9013026 10437336 8580517 8757778 9584371 9358982 10071703 12128794 12332315
5833 12332315 9856921 9189096 10835840 10868380 11595681 11595505 12140554 11646089 12315227 11355684
5823 11355684 13467368 13629372 12332159 10999548 12034889 11996933 12831558 14652588 14547100
5814 14547100 14740409 13032148 14234565 15810885 15634464 15361366 14738367 14272069 15870085
5805 15870085 15439087 16547796 15976045 17123913 17832441 16583432 15713134 17179801 17058662
5796 17058662 17152936 17622632 18919297 19979811 20887609 21245318 22044823 21769655 23133282
5787 23133282 23897484 25816929 25388376 24761599 25232940 27287220 27084376 28408545 30259386
5778C0259386r12733K042487J355489J935176k89224j66103K65542J757992J298828
5769C7546840J989013J541962O93615L886949K716108J700218K260135N603442
5761E7938282O834720M856860M892192J0990669Q940910J1691116J4932889J8282316
5753A39359954J8325622J0223257J083583r178874j4064958j4333827j3631572
5746A17783185q196845o705727m124817k502863q69928K1636R63317Q21255L223966
5737A00413179J375755K239852L761031N795279J0523477J0156540J5488935K2785499
5729A72539547L1827925L5430844L7698660K4030897k149145k5034584l6262427
5722B38081717l4403085k6357141k1811711j5020881j1761595p700052n593581
$$ plain form
5778 30259386 29346653 31389140 32744629 34679805 34390581 34224478 34490020 36248012 37546840
5769 37546840 39535853 41077815 41771430 45658379 48374487 50074705 52334840 57938282
5761 57938282 64773002 69629862 74522054 85512723 94453633 106144749 121077638 139359954
5753 139359954 157685576 167908833 168992416 159813542 145748584 131414757 117783185
5746 117783185 109586340 102880613 98755796 96252933 95383005 95404641 96367958 97189213 100413179
5737 100413179 101788934 104028786 107789817 113585096 124108573 134265113 149754048 172539547
5729 172539547 204367472 239798316 277496976 301527873 299378728 274344144 238081717
5722 238081717 203678632 177321491 155509780 140488899 128727304 121027252 115433671
5715A15433671k743064j076682o56608j212859l213234k618889j517245n25628
5707A01869462K432741N338646P171686R397523J2000215J1778156J0851072P266236
5699A68105737J1372j2165414j7670154j6704727j4431687j1305754q775430p560151
5691G9503792m965255l768369l296939k009671m67100q31859k221069j690747
5683F0252783k54346j016083j861390n74055K238309K283334J771259j719620
5675F1120191n742135m614807l897523l944699l159476j916010k377787k406883
5667C3060871K12419K51271k227146o85966p63748j569910Q24238l53682o82069
5658B8066278K49539K74378k97099Q85515J251975P0999J658710p2615l002649
$$ plain form
5715 115433671 112690607 111613925 110957317 109744458 106531224 103912335 102395090 101869462
5707 101869462 104302203 109640849 116812535 126210058 138210273 149988429 160839501 168105737
5699 168105737 168117109 155951695 138281541 121576814 107145127 95839373 87063943 79503792
5691 79503792 74538537 70770168 67473229 65463558 64996458 64164599 61943530 60252783
5683 60252783 59998437 58982354 57120964 56546909 58785218 61068552 62839811 61120191
5675 61120191 55378056 50763249 46865726 42921027 39761551 37845541 35467754 33060871
5667 33060871 33273290 33524561 31297415 30611449 29847701 28277791 29102029 28748347 28066278
5658 28066278 28315817 28590195 28293096 29178611 30430586 30501585 32160295 32087680 29085031
5649B9085031k021275j55035k109638k916464j031874N19454r99705m98121Q74079
5640B0746452o79876r91427J25159K132570J51468j899202L84305j43071n4675
5631A9771703Q60840q21856r3812n65405R53960M82695K23237K43494k14663K36882
5621B1077075k21680J606693M64795R70547q13635M55529p52483K173761J759104
5612B6719706n74152J17156K69697O77759o69714R09336L32332Q20233N25568
5603B9127921J483866J162980J995253O01527j315675K63069O01122K800022K323800
5594C9043885J492522n68600J997441J128743K770453L072665J058J171999K413640
5585E2523806M491941L981836M486412N197674M757892P050482P042702P132947
$$ plain form
5649 29085031 27063756 26908721 24799083 21882619 20850745 21370199 20370494 19872373 20746452
5640 20746452 20066576 19075149 19200308 21332878 21484346 19585144 19969449 19826378 19771703
5631 19771703 20632543 19810687 19716875 19151470 20105430 20588125 20811362 21054856 20840193 21077075
5621 21077075 20855395 22462088 22926883 23897430 23083795 23539324 22786841 24960602 26719706
5612 26719706 26145554 26262710 26532407 27210166 26540452 27449788 27782120 28602353 29127921
5603 29127921 30611787 31774767 33770020 34371547 33055872 33318941 33920063 36720085 39043885
5594 39043885 40536407 39967807 41965248 43093991 45864444 48937109 48938167 50110166 52523806
5585 52523806 57015747 60997583 65483995 70681669 75439561 82490043 89532745 96665692
5577I6665692O608064J553266k737611J51301j47908J181419J398594L710808
5569A08383625J0185518J2023255J3967897J8005253J8928526J4684463N557630
5562B01736167m624504j3181592j4680650j1598621r526043m014985j421502K498958
5554A45187228R203025P689464J0245501Q961279K16316p357101r029675o501516
5546A58614521m913394k542385L892157J0525061J4640589K2205954K8383598
5539B30806101L7226931K9862743J0302617j0975671k6298240l2491008l0943814
5532B07489659k4591379j9375713j5054924j2171899o564833l953341l662156
5525A22115414M46687m188472k571158n128798o772715n030760l679948k125506
$$ plain form
5577 96665692 103273756 104827022 102089411 102240712 102092804 103274223 104672817 108383625
5569 108383625 118569143 130592398 144560295 162565548 181494074 196178537 201736167
5562 201736167 197111663 183930071 169249421 157650800 148124757 144109772 142688270 145187228
5554 145187228 154390253 162079717 172325218 181286497 181502813 174145712 165116037 158614521
5546 158614521 153701127 151158742 155050899 165575960 180216549 202422503 230806101
5539 230806101 268033032 297895775 308198392 297222721 270924481 238433473 207489659
5532 207489659 182898280 163522567 148467643 136295744 129730911 125777570 122115414
5525 122115414 122562101 118373629 115802471 110673673 103900958 98870198 95190250 93064744
5517I3064744J741977M616779L278821P184869Q942747J0391294P631979J157839
5509A38011049o670361j3444007j4926024j4925806r915043j0123737q577880
5502E9428191o316529n271697l143289l684369k516622l289821m000548p43088
5494C0462228K80376j248745j490828j511780j773815j583623j940613j632888
5486A9560312K33766m04635p20148j058143r02163k455173J252628q67383j266884
5477A3372177J093112j210289j686434L083R57351l263329L8971k05725n76943
5468H521974J658806J238351j772219k117329K13185N12607O56349P68550j092148
5459H588126K46324q46020o81071k11744j475698Q94231n91393L69574m2402l75982
$$ plain form
5517 93064744 94806721 99423500 102702321 109887190 118829937 129221231 136853210 138011049
5509 138011049 131340688 117896681 102970657 88044851 78129808 68006071 59428191
5502 59428191 53111662 47839965 44696676 41012307 38495685 35205864 31205316 30462228
5494 30462228 30742604 29493859 28003031 26491251 24717436 23133813 21193200 19560312
5486 19560312 19794078 19389443 18669295 17611152 16708989 14253816 15506444 14639061 13372177
5477 13372177 14465289 13255000 11568566 11571649 12529000 9265671 9304642 9098917 8521974
5468 8521974 10180780 11419131 9646912 7529583 7742768 8255375 8911724 9680274 8588126
5459 8588126 8834450 7988430 7307359 7095615 5619917 6514148 5922755 6292329 6249927 5873945
5449E873945J105942Q22222r412J9590j892668J54401j012136m71543m42793O8928
5439D216476J355119j211101j416030J847575j006703N21944J39440j71320k27032
5430D048368R69788j91473o57225j049620o36597L1079l85876J463746J019085
5421D611275Q99124k007006j240752J219639j191488L64824k37877J882857j453525
5412B847071p93042R22629r67619J210155Q22281P34098j016801o49036L16645
5403C426381M92327K13231l54303j227237K02422m18613j77704j073056K003446
5394C086894j896181k26898J719808M03034m83726n35019k67245M74618J194503
5385C469788n03192N62430n07423j227590J248106o66496p72786O6177M93865
$$ plain form
5449 5873945 6979887 7802109 7792697 7812287 5919619 6074020 5061884 4590341 4147548 4216476
5439 4216476 5571595 4360494 2944464 4792039 3785336 4307280 4446720 4275400 4048368
5430 4048368 5018156 4826683 4169458 3119838 2483241 2514320 2128444 3592190 4611275
5421 4611275 5510399 3503393 2262641 3482280 2290792 2655616 2417739 4300596 2847071
5412 2847071 2054029 2976658 2009039 3219194 4041475 4775573 3758772 3109736 3426381
5403 3426381 3918708 4131939 3777636 2550399 2752821 2334208 2156504 1083448 3086894
5394 3086894 1190713 963815 2683623 3086657 2602931 2067912 1800667 2275285 3469788
5385 3469788 2966596 3529026 3021603 1794013 3042119 2375623 1602837 1669014 2162879
5376B162879J312797r07673O60493q07228k190J102869Q22626j267403o18364
5367B458806R01939o98733k70297j491766R38136J541359K07272j763840J418629
5358C241505j670430k04700L621378q69120p17213j867162k37942J030701k39293
5349B087724K55314k220620p93792J324021J295531p70160l35458n49273P927
5340C01214J313263Q63745l81313j005841k91851N43669l62435L22734m53957
5331H49228q35978M49159N60790J329231J466046k725947k019965p7268K189945
5322A185241J64795M15219j73211k92524l72221j784619K163603K52258M51754
5313B010295p20254K99612k75597J071113l38667o86875P80579p42719o21373
$$ plain form
5376 2162879 3475676 2568003 3228496 2421268 2419078 3521947 4344573 3077170 2458806
5367 2458806 3360745 2662012 2391715 899949 1838085 3379444 3586716 1822876 3241505
5358 3241505 1571075 1366375 4987753 4118633 3401420 1534258 1296316 2327017 2087724
5349 2087724 2343038 122418 -671374 652647 1948178 1178018 842560 293287 301214
5340 301214 1614477 2478222 2096909 1091068 799217 1342886 980451 1303185 849228
5331 849228 13250 462409 1023199 2352430 3818476 1092529 -927436 -1004704 1185241
5322 1185241 1350036 1765255 1592044 1299520 927299 -857320 1306283 1558541 2010295
5313 2010295 1290041 1589653 1314056 2385169 2046502 1359627 2140206 1397487 776114
5304G76114K03093o73222J91388N45774l33539o60878N6085r84529K019597o59763
5294D80120j379958R29178J747280m64651j040826L3893J142999L80288o18227
5285A210096J074354m2789N21994j186024j496160n74907L5151j386541O13083
5276a231743N12325L71597n48791L40099J902929j53107l11747j948925l43323
5267a410686J265691K178430O3454j846888l55364R53478p82476K055950j685100
5258D36489M94256n9212m14416J308703j62934j351978O67896K573548j02371
5249C389981j126535j479329P61650k8155l66135m60160Q41967m13340J06740
5240A226684M57079J583769p1639k026166O78245R8678J07022n89217N10684Q87262
$$ plain form
5304 776114 979207 305985 497373 1043147 709608 48730 104815 -879714 1139883 480120
5294 480120 -899838 29340 1776620 1311969 271143 305036 1448035 1828323 1210096
5285 1210096 2284450 2241661 2763655 1577631 81471 -493436 -458285 -1844826 -1231743
5276 -1231743 -719418 -347821 -896612 -556513 1346416 1193309 881562 -1067363 -1410686
5267 -1410686 -144995 2033435 2096889 250001 -105363 848115 65639 2121589 436489
5258 436489 930745 871533 457117 1765820 1602886 250908 918804 3492352 3389981
5249 3389981 2263446 784117 1545767 1517612 1151477 691317 1533284 1119944 1226684
5240 1226684 1683763 3267532 3195893 1169727 1847972 1946650 2053672 1464455 1975139 2862401
5230B862401k310679L8980Q37125j590605J154934l34991N4813l43618p86248
5221d17888N69579P54934K286149O52958r89221M34503m6256r06581P94885j322301
5211A810761n68664o52356q72655L97394K245883q78764J283051o18677l68575
5202A777398o53305j084929k57557j329323J492310K05210m29148p19049k81735
5193a280128K194497o18488M27182J886581K72662Q14758k19907j662901j01886
5184A712370j256318k46037Q20876Q80880L37959o52555j008307j139734J96884
5175c53982M17732R17660K06895o01827N08288r08397N46308J843658R3945R5120
5165B765400j652420N27161j151643r23475M83724L99135L21841P05417n86929
$$ plain form
5230 2862401 551722 590702 1427827 -162778 992156 657165 711978 368360 -417888
5221 -417888 151691 906625 3192774 3845732 2856511 3291014 3244758 2338177 3133062 1810761
5211 1810761 1242097 589741 -282914 114480 2360363 1481599 2764650 2145973 1777398
5202 1777398 1124093 39164 -218393 -1547716 -55406 149804 -279344 -998393 -1280128
5193 -1280128 914369 295881 723063 2609644 2882306 3697064 3477157 1814256 1712370
5184 1712370 456052 210015 1030891 1911771 2249730 1597175 588868 -550866 -353982
5175 -353982 63750 981410 1188305 586478 1094766 186369 732677 2576335 2670280 2765400
5165 2765400 1112980 1640141 488498 -434977 48747 447882 769723 1475140 888211
5156H88211m68697l95125q73976O49069M85833p11399O99703L41053J430298o22887
5146A422083k267113L61367p96677J073011j084059J577114R87579n7588n4518
5137A161199j901795Q337O6503O14965M17114o22589K348547o27124j885429K4426
5127c95846J290691l51992n64370q9237j61068Q91525O45462N55058m06624l64340
5117A049259N08919L50560P12756n47447n97592J180571j592701k23305k76257
5108E64763k19070l74934P28941L81603j4721M86250L7265j091990J063350j158455
5098D03002k32612l57552L020K77940P78302j959k38853j0033j48858r05593O22494
5087A89298l12884J512357n50137k81247J002042q65402k08361j74547J583071
$$ plain form
5156 888211 419514 24389 -849587 -200518 285315 -426084 273619 614672 2044970 1422083
5146 1422083 -845030 -483663 -1280340 -207329 -1291388 285726 1273305 1215717 1161199
5137 1161199 -740596 -732259 -665756 -50791 366323 -256266 2092281 1465157 -420272 -395846
5127 -395846 894845 542853 -21517 -110754 -271822 619703 1265165 1820223 1413599 1049259
5117 1049259 1558178 1908738 2621494 2074047 1476455 2657026 1064325 841020 564763
5108 564763 345693 -29241 699700 1081303 1066582 1552832 1590097 498107 1561457 403002
5098 403002 170390 -187162 -184142 93798 872100 870141 631288 621255 472397 -433196 189298
5087 189298 -123586 1388771 838634 557387 1559429 694027 485666 311119 1894190
5078A894190j80963R18206o65175p91173N97330J302133r98373J34559m02782
5069A807952o79082j335238J75440R93679N17719j10435n92203J49787j49041
5060G78578K198224k039161m30367K120624o60909J456260L03076o51376r91618
5051B083331M7900O11021j60522j573198K012562J684711n30464j657295j601750
5042I16296Q52625j71685k70109j101560Q73306J742804J771351o75595o86385
5033C251048P4043l03726M89969K67365P49934p7476n81112k52791Q52162J398561
5023E867977M81808j986190j38169M7964K05396J304196k08731r79194m23899
5014D171158L64911O65175J140517j526446j830035K277592Q76604k596778j214494
$$ plain form
5078 1894190 1713227 2631433 1966258 1175085 1772415 3074548 2076175 2210734 1807952
5069 1807952 1128870 -206368 -30928 962751 1480470 1370035 777832 927619 778578
5060 778578 2976802 937641 507274 2627898 1966989 3423249 3726325 3074949 2083331
5051 2083331 2131231 2742252 2581730 1008532 3021094 4705805 4175341 2518046 916296
5042 916296 1768921 1597236 1327127 225567 1098873 2841677 4613028 3937433 3251048
5033 3251048 3325091 3021365 3511334 3778699 4528633 4451157 3870045 3617254 4469416 5867977
5023 5867977 6349785 4363595 4225426 4273390 4478786 5782982 5574251 4595057 4171158
5014 4171158 4536069 5201244 6341761 4815315 2985280 5262872 6139476 3542698 2328204
5005B328204Q11971k00699J232303N05185K28157r38909M17621K94577j272977
4996C405433J222406R6699k311492Q10790P84999n93423j84305N21030J474125
4987E226262j375706j254271k86604L127514L19711r95308K017469k246458j801399
4978B731210J337242r7708p64909n931J055344J482561l09353j339335n28210
4969C560911L22237J258078l9767q10430k07367R93554k096463m64970O20510
4960C136293k08290j260530J211862J360440J16621j154694j57763n85412j7658
4951B440869J204645K31739K58771Q13339N88460J12701j778404j396645Q05623
4942C281098L75499Q18668J081870j83410o09886M80825L48823r54659L7866l24926
$$ plain form
5005 2328204 3140175 2939476 4171779 4676964 4905121 3966212 4383833 4678410 3405433
4996 3405433 4627839 4724538 2413046 3223836 4008835 3415412 3231107 3752137 5226262
4987 5226262 3850556 2596285 2309681 5437195 5756906 4761598 6779067 4532609 2731210
4978 2731210 4068452 3970744 3205835 3199904 4255248 5737809 5428456 4089121 3560911
4969 3560911 3883148 5141226 5101459 4291029 4083662 5077216 2980753 2515783 3136293
4960 3136293 2928003 1667473 2879335 4239775 4356396 3201702 3043939 2458527 2440869
4951 2440869 3645514 3877253 4136024 4949363 5537823 5650524 3872120 2475475 3281098
4942 3281098 3656597 4475265 5557135 5373725 4763839 5244664 5593487 4638828 4676694 4351768
4932D351768j856517M94184q50401J568629k079043J139085Q07670K090996q0599
4923E585772k103549J473275J003865r32480m62791P4639j4575p14613j23438
4914C786105P67259N18285M71678J090838J586208k984535j70384M23014Q36329
4905F324797m8763L51850O1647j050209J07139o62318m16186J174562J203786
4896G046305r96705P95672K15243N1939J42067O03010q32208j948158J741635
4887F818800O70256o62313J283163l04824O32072l68648q56969K5326K85634L60997
4877G883494l80160N60983j353612p82599J95069O77630J204503m5274J078172
4868I038206j86466P02170J3375j733213o53633R02038J366736r04230L52805
$$ plain form
4932 4351768 2495251 2989435 2139034 3707663 1628620 2767705 3575375 5666371 5585772
4923 5585772 3482223 4955498 5959363 5026883 4564092 4638731 4624156 3909543 3786105
4914 3786105 4553364 5071649 5543327 6634165 8220373 5235838 5065454 5488468 6324797
4905 6324797 6276034 6627884 6689531 5639322 5746461 5084143 4667957 5842519 7046305
4896 7046305 6049600 6845272 7060515 7112454 7254521 7857531 7025323 5077165 6818800
4887 6818800 7489056 6826743 8109906 7805082 8437154 8068506 7211537 7236863 7522497 7883494
4877 7883494 7503334 8064317 6710705 5928106 6123175 6800805 8005308 7960034 9038206
4868 9038206 8851740 9553910 9567285 7834072 7180439 8082477 9449213 8544983 8897788
4859H897788j411937J183269O68247j090152J298852j35807j014709J361197J749522
4850A1506270m18767n84531O46335j347260Q56154J258297k69891j180647J067381
4841A1533341K04299k29730l19024l9409n1315Q52250J581873N61343m99475L21026
4831A3915179J57993j386061J128041J062516J0615j065068m4211K236621J082059
4822A7097684l13451J76951o98684J375684N5371M75512J082486J357596O52800
4813B1261949K10982J231056j100862K69458j71462Q09238J011545P70924l14027
4804B3978801O73647K858125J80223r82809J649037L90733r14321n10339K094403
4795B9417500M71752J704049K028053m48857J099349J064177N72438K101105K268461
$$ plain form
4859 8897788 7485851 8669120 9337367 8247215 9546067 9410260 8395551 9756748 11506270
4850 11506270 11087503 10502972 11149307 9802047 10658201 11916498 11646607 10465960 11533341
4841 11533341 11737640 11507910 11188886 11149477 11098162 11950412 13532285 14093628 13594153 13915179
4831 13915179 14073172 12687111 13815152 14877668 14888283 13823215 13779004 16015625 17097684
4822 17097684 16784233 16961184 16262500 17638184 17693555 18169067 19251553 20609149 21261949
4813 21261949 21472931 22703987 21603125 21872583 21701121 22510359 23521904 24292828 23978801
4804 23978801 24652448 27510573 27690796 26707987 28357024 28747757 27833436 27323097 29417500
4795 29417500 29889252 31593301 33621354 33172497 34271846 35336023 35908461 38009566 40278027
4786D0278027J793178K616193O72754j29627J906589L156367K976363L414796
4778E6684640J754047L833124K085145L191695L179504K074882K717018M113427
4770G9633482L319484L460487L672560K856462J969918K769430M031763N121059
4762A06834645L763649L411624L120611M395731K975337M238333O658021N300208
4754A40698159L778631M546291M213931K377528J414463q33676J42250L012926
4746A59350503L159809K960846J582468M755684L508551M083543N228102N357806
4738A89987312N826014N758836O609288L471152K298745J888690J408813M448385
4730B21697235L219237M927033N31629k893172j935488m873589j905705k225164
$$ plain form
4786 40278027 42071205 44687398 45360152 45230525 47137114 50293481 53269844 56684640
4778 56684640 58438687 62271811 64356956 67548651 70728155 72803037 75520055 79633482
4770 79633482 82952966 86413453 90086013 92942475 94912393 97681823 101713586 106834645
4762 106834645 110598294 114009918 117130529 121526260 124501597 128739930 135397951 140698159
4754 140698159 144476790 149023081 153237012 155614540 157029003 156195327 156337577 159350503
4746 159350503 162510312 165471158 167053626 171809310 175317861 179401404 184629506 189987312
4738 189987312 195813326 201572162 208181450 211652602 213951347 215840037 217248850 221697235
4730 221697235 224916472 229843505 230375134 227481962 225546474 220672885 218767180 216542016
4722B16542016l438241n323560l699545k745385l295571n147525n192368l715039
4714A83984782k46150p62839n5321J52344m99248r72992K02969l496750j420072
4705A76886723k827319m242650o708152o147638n488938m784799o247160o917547
4697A33522520m832065l421280k728357j583738l324586j183694L87785j079442
4689A15757143q07530J272082N0160j205775R4963k974336n90723l44390m308787
4680A06942807j702583j722011l687196l033584j004442l331423l357474k230670
4672H6873424k135970p82056k648195P31524R77707J049502p96834K527673K218336
4663H8015111K720263J724263K275583J390991K446276L030927J258925J350914
$$ plain form
4722 216542016 213103775 207780215 204080670 201335285 198039714 192892189 187699821 183984782
4714 183984782 183738632 182975793 182920472 183072816 182573568 181600576 181803545 178306795 176886723
4705 176886723 174059404 169816754 163108602 156960964 151472026 146687227 140440067 133522520
4697 133522520 128690455 125269175 122540818 120957080 117632494 116448800 116836585 115757143
4689 115757143 114949613 116221695 116271855 115066080 115161043 112186707 111595984 111251594 106942807
4680 106942807 105240224 103518213 99831017 96797433 95792991 92461568 89104094 86873424
4672 86873424 84737454 83955398 81307203 82038727 83016434 84065936 83269102 85796775 88015111
4663 88015111 90735374 92459637 94735220 96126211 98572487 101603414 102862339 104213253
4655A04213253L084275K129077L491551K958531M050305J272782K456585R63569
4647A24619928J307145J431797J67841j066402j691160J201324k94643k53356
4639A25422474r41081J12885j920654J147383L365855M102703N709541K847585
4631A39846691M371374M408865K526031K522881M521073L885526L646500M059437
4623A69788378L827291k26247l260697j603320l801649k382711l268879n743425
4615A53328741p779813q751282q108745n642701n852570n856235n093200j807413
4607A04436782k506954j307924j389296O07692K99866M71527L98973k12582J334276
4598A02132360j244241k342807j287751k783571k040801l990656n344703k688386
$$ plain form
4655 104213253 107297528 109426605 112918156 115876687 119926992 121199774 123656359 124619928
4647 124619928 125927073 127358870 127526711 126460309 124769149 125970473 125675830 125422474
4639 125422474 124481393 124594278 122673624 123821007 127186862 131289565 136999106 139846691
4631 139846691 144218065 148626930 151152961 153675842 158196915 162082441 165728941 169788378
4623 169788378 173615669 173389422 170128725 168525405 164723756 162341045 159072166 153328741
4615 153328741 145548928 136797646 128688901 123046200 117193630 111337395 106244195 104436782
4607 104436782 101929828 100621904 99232608 99840300 100140166 100611693 101010666 100798084 102132360
4598 102132360 100888119 98545312 97257561 94473990 92433189 88442533 83097830 80409444
4590H0409444m733555n571579l924951m297454l961954l987843l052466k789531
4582D8090111k128642l862308l768039k312653l070869m17536l583536j870363
4574B7076165n48314o79062j377915O09278o65481k663974j239071k039818j45004
4565A8326804M28950o10504j948881K34956k292199n71206Q51628m28291K12054
4556A4203311j279928L64653q09412m12875K83477j262671q88133K039154J926410
4547A4163986r62527j253934j29248j80865j542820m98925J284186l154837k79069
4538G445947M40352J95280j18106q56769M62886p14412j020409j2254J430915
4529G253430J62502k85328j427457k36320J008309k42019N27768J73090r25000
$$ plain form
4590 80409444 75675889 70104310 66179359 61881905 57919951 53932108 50879642 48090111
4582 48090111 45961469 42099161 38331122 36018469 32947600 32530064 28946528 27076165
4574 27076165 26527851 25848789 24470874 25080152 24414671 21750697 20511626 18471808 18326804
4565 18326804 18755754 18145250 16196369 16431325 14139126 13567920 14419548 13991257 14203311
4556 14203311 12923383 13288036 12478624 12065749 12349226 11086555 10198422 12237576 14163986
4547 14163986 13201459 11947525 11818277 11637412 10094592 9595667 10879853 7725016 7445947
4538 7445947 7886299 8081579 7963473 7106704 7569590 6855178 5834769 5822515 7253430
4529 7253430 7415932 7130604 5703147 5466827 6475136 6233117 6760885 6933975 6008975
4520F008975M8210j687356n76044l38207K016372L47093j213995j752122o7811
4511B785115K456828j575395l549n5605k02738P23920J068893J910343Q0516j500402
4501E687926r96512p3340j099121o48390J516183K5012j563651O12904R31039
4492D392050P22M55853K06468r76185o97882r55621J81888J862205J992j165879
4482C305611l13656k99812r70605q6893Q13515n52301J14708j196420P85323J776496
4472C375966J481857j089266n98279J08861k205387l06738R17371J666421m87301
4463B863505J93950o2127J306379J23529K8313j711671p90758L52177K043934
4454D347231j48894k168173R53480P8973k41877L18847j017947M95323R4573o36132
$$ plain form
4520 6008975 6057185 4369829 3793785 3455578 5471950 5819043 4605048 2852926 2785115
4511 2785115 5241943 3666548 3662999 3607394 3404656 4128576 5197469 7107812 7188328 5687926
4501 5687926 4691414 4618074 3518953 2870563 4386746 4411758 2848107 3461011 4392050
4492 4392050 4392772 4848625 5055093 4078908 3381026 2425405 2607293 4469498 4471490 3305611
4482 3305611 2991955 2692143 1721538 1634645 2448160 1895859 2010567 814147 1599470 3375966
4472 3375966 4857823 3768557 3170278 3279139 1073752 767014 1684385 3350806 2863505
4463 2863505 3057455 2995328 4301707 4425236 4453549 2741878 1951120 2303297 4347231
4454 4347231 4198337 2030164 2983644 3062617 2820740 3139587 2121640 2616963 2711536 2075404
4444B075404J209217q33211q91730N67403k50828O8167K813026m21795j170474
4435C165179j78367k8430r24850o68083L68433O7515K265554J170720o20619k44174
4425D372878j701761o73642J333355n19660J310283N55797J027290j037628j211300
4416C455612M85563j134621J28301L43441j27662j247317K90641Q40750L79136
4407C413844j486428j354817P79755J64776n40876J580478R11736K224q97979
4398B572713K080380Q77069j660317j249954k38811R09544Q48457j841134j098201
4389A199746J865845M37100j208719Q34323O50143o78666L3528n02740l12298
4380B318262o83353K626590p19741l73915M4557q54182k20695r17827O06844M00282
$$ plain form
4444 2075404 3284621 2451410 1559680 2127083 1876255 1944422 4757448 4335653 3165179
4435 3165179 2986812 2958382 2033532 1365449 1733882 1801397 4066951 5237671 4617052 4372878
4425 4372878 2671117 1997475 3330830 2811170 4121453 4677250 5704540 4666912 3455612
4416 3455612 3941175 2806554 2934855 3278296 3150634 1903317 2193958 3034708 3413844
4407 3413844 1927416 572599 1352354 1517130 976254 2556732 3468468 3470692 2572713
4398 2572713 4653093 5530162 3869845 2619891 2381080 3290624 4139081 2297947 1199746
4389 1199746 3065591 3502691 2293972 3128295 3778438 3099772 3133300 2630560 2318262
4380 2318262 1634909 4261499 3541758 3167843 3212400 2358218 2137523 1219696 1826540 2226822
4370B226822N25065J086825j442827l21976r8024N01369Q32861p14157K36822
4361B832780M89448R27382Q08426M67249M4390r00061M42805M05057j543165J052925
4351E027236P06994J86713j904388j302429k30508m05908J573996p33507L31219
4342C249418J476320q6043M34788o67501j780882J736037J32964q07420J357655
4333E045336r49922p0486J185602l62731m05194n17717K19306j245515q54513
4324B044166L211933J491743o37235n92686J2232N87083Q12611K66581j010115
4315F186313j732971R31148j01976k73486J8579q3783j678198j160359K068148
4306D173415J336991j117316J087227R90449k039635K49048L91092r17220m6372
$$ plain form
4370 2226822 2751887 3838712 2395885 2073909 1975885 2477254 3310115 2595958 2832780
4361 2832780 3322228 4249610 5058036 5525285 5569675 4669614 5112419 5517476 3974311 5027236
4351 5027236 5734230 5920943 4016555 2714126 2483618 2077710 3651706 2918199 3249418
4342 3249418 4725738 4639695 5074483 4406982 2626100 4362137 4495101 3687681 5045336
4333 5045336 4095414 4024928 5210530 4847799 4442605 3924888 4144194 2898679 2044166
4324 2044166 5256099 6747842 6110607 5517921 5530153 6117236 6929847 7196428 6186313
4315 6186313 4453342 5384490 5282514 5009028 5027607 4943824 3265626 2105267 4173415
4306 4173415 5510406 4393090 5480317 6470766 4431131 4680179 5071271 4154051 4107679
4297D107679J086325j183266L21461O61258J78180J638161l049333K079508L04702
4288F144675k143384J26327k409752O22043J766648N06830l95733m20027l56431
4279C441196j389042K005829J620634l08820j413122J017449R16524n17799p96206
4270D576643q33955O07428j396025J167410J857360Q4584r79274j117968J52623
4261D118826J000238J30035K55083k150154m07764J180629k8898j026239p03065
4252B368691K208820K232183j136811j722191n43051j568540k93022J612518J353975
4243D512572J701793m26083p23384j995716n33356J498780J373090j388304p80923
4234C238469j341283L46178k6419J404107J144615N67830q98643q7383J599823
$$ plain form
4297 4107679 5194004 4010738 4332199 4993457 5171637 6809798 3760465 5839973 6144675
4288 6144675 4001291 4127618 1717866 2339909 4106557 4613387 4217654 3797627 3441196
4279 3441196 2052154 4057983 5678617 5369797 3956675 4974124 5890648 5372849 4576643
4270 4576643 3742688 4350116 2954091 4121501 5978861 6063445 5084171 3966203 4118826
4261 4118826 5119064 5249099 5504182 3354028 2946264 4126893 4097995 3071756 2368691
4252 2368691 4577511 6809694 5672883 3950692 3407641 1839101 1546079 3158597 4512572
4243 4512572 6214365 5788282 5064898 3069182 2535826 4034606 5407696 4019392 3238469
4234 3238469 1897186 2243364 2216945 3621052 4765667 5333497 4434854 4347471 5947294
4225E947294k04447N18876L98489j487980j469953J649379r40641k40005J238210
4216E409222O12824j051252j016613K08890R47712M42929j338215j468760J809307
4207D556044J995484j705262J23608J862696j222113p06467m48719J014457J46204
4198E615932q09936N15357N52191J068449l93124q69179O01093l87304J428339
4189G321818L25892O27964J633582r31083k688388J7471Q50387M70954K67069
4180G895666p0540m89240j6456Q04489j988844M13443J525423P13100N56507p84635
4170H558913p87675K59257m00841k42756J254468j76667j408530J095175l37746
4161G813598J461869K40341M49101J33109r3585q9329j989520J072960Q61056
$$ plain form
4225 5947294 5742847 6261723 6660212 5172232 3702279 5351658 4411017 4171012 5409222
4216 5409222 6022046 4970794 3954181 4163071 5110783 5553712 4215497 2746737 4556044
4207 4556044 6551528 4846266 4969874 6832570 5610457 4903990 4455271 5469728 5615932
4198 5615932 4805996 5321353 5873544 6941993 6548869 5679690 6280783 5893479 7321818
4189 7321818 7647710 8275674 9909256 8978173 6289785 6307256 7157643 7628597 7895666
4180 7895666 7825126 7335886 7319430 8123919 6135075 6548518 8073941 8787041 9343548 8558913
4170 8558913 7771238 8030495 7629654 7386898 8641366 8464699 7056169 8151344 7813598
4161 7813598 9275467 9515808 9964909 10098018 10004433 9915104 7925584 8998544 9859600
4152I859600k69153R99087l051j102242J373695q82896m43636J784485o45856
4143A0670033j064183J235172L23572K15893O66800N77254K18434r4197j199636
4134A1549142q44736J229702K18245M57157J430275J428616P32795j504212p18392
4125A3978592j19456K3300R15544J500189J795234n35028K45061O62335n40000
4116A7925771J522283o50576O6680O25019K067797n16622J207631J167768j007334
4107B2408417J009047K495202J034382P06347l3137J159644J349164J318189J404772
4098C2852027j075469J507126J90507j082288l37574J285354K790137L67882p31304
4089C5766398J274289R10398J663901N61562N48108K090786J668750J27259J784576
$$ plain form
4152 9859600 9590447 10589534 10586483 9484241 10857936 9975040 9531404 11315889 10670033
4143 10670033 9605850 10841022 11164594 11380487 12047287 12624541 12842975 12748778 11549142
4134 11549142 10704406 11934108 12152353 12609510 14039785 15468401 16201196 14696984 13978592
4125 13978592 13859136 13882436 14797980 16298169 18093403 17558375 17803436 18465771 17925771
4116 17925771 19448054 18797478 18864158 19489177 21556974 21040352 22247983 23415751 22408417
4107 22408417 23417464 25912666 26947048 27653395 27620258 28779902 30129066 31447255 32852027
4098 32852027 31776558 33283684 33474191 32391903 32054329 33339683 36129820 36497702 35766398
4089 35766398 37040687 37951085 39614986 40176548 40724656 42815442 44484192 44611451 46396027
4080D6396027J605941J465363L416365J719934R21052K066950J004094J494147
4072F0089873Q94243K401544J784403J759938M121702L381403Q54669N78768K159647
4063G8026190K470611J609268M055436J235727J251786K518652J734771L828342
4055I6730783L15916J249969J685406R16939K768317p51813r7306K259340L478099
4046A08555650L306467J232386K215979J837752K769915K863940M694839L842449
4038A31319377L279160N468448P250518P165219M476394N174220N494955N277227
4030A74905518N838033O710020M888823M100901L786110R39899J391664P19546
4022B03280514j002764q67161J011036J924507J834655J088042J338815K736551
$$ plain form
4080 46396027 48001968 49467331 52883696 54603630 55524682 57591632 58595726 60089873
4072 60089873 60984116 63385660 65170063 66930001 71051703 74433106 75287775 75866543 78026190
4063 78026190 80496801 82106069 86161505 87397232 88649018 91167670 92902441 96730783
4055 96730783 97046699 98296668 99982074 100899013 103667330 102915517 102818211 105077551 108555650
4046 108555650 111862117 113094503 115310482 117148234 119918149 122782089 127476928 131319377
4038 131319377 134598537 140066985 147317503 154482722 158959116 164133336 169628291 174905518
4030 174905518 180743551 187453571 192342394 196443295 200229405 201169304 202560968 203280514
4022 203280514 202277750 201410589 202421625 204346132 206180787 207268829 208607644 211344195
4014B11344195L036551L653512M229220L987298N661905P326763P438797Q513749
4006B55191990R960744J2267562J1735752J2668323J0134669O962569L011691
3999C21933300q1579k915350o205260o670174o751525l487067m679749l310292
3991B87832304K30548K9131q88094r60676j055345o94029l832866k878153k609105
3982B75173715l973911j563044j276373K27476J672810K555987Q86058J67990
3974B73870708k061432n621757j0147561j2592210j2310911j1236695j1090707
3967B08809435r683841q195864r540005q024740o717533m747403n342408o159470
3959A50398171l658598k561446l583100n498672k018598l360506m195506j787481
$$ plain form
4014 211344195 214380746 218034258 222263478 226250776 231912681 239239444 246678241 255191990
4006 255191990 265152734 277420296 289156048 301824371 311959040 318921609 321933300
3999 321933300 321851721 318936371 312731111 306060937 299309412 295822345 291142596 287832304
3991 287832304 288062852 288091983 287203889 286243213 285187868 284493839 280660973 277782820 275173715
3982 275173715 271199804 269636760 268360387 268587863 270260673 272816660 273702718 273870708
3974 273870708 271809276 266187519 256039958 243447748 231136837 219900142 208809435
3967 208809435 199125594 190929730 181389725 173364985 166647452 161900049 156557641 150398171
3959 150398171 146739573 144178127 140595027 135096355 133077757 129717251 125521745 123734264
3951A23734264l081842j778014j120786j573976m223835m750860l905443n130998
3943I8168510m280491l986533m273135k751007j611159j844002l356810l329042
3935G2736331k736341k696298k716568j387752j118482k146362k882246j622757
3927E5429525M09631j908082q17315m11563q90260l441776k366013k46960j757629
3918D3999558r99868k30487l522057l599980J57523k538836l5259M2786j524198
3909C1749182k013222j066759j793724n32042O53028j909905j376455O80110j096971
3900B3293242o06972k220222o09510Q70977l038338j346679k37408q80495k781463
3891A2443132N53752K231142j060442j030545j53509l49115J161632n31560k278014
$$ plain form
3951 123734264 120652422 118874408 117753622 116179646 111955811 107204951 103299508 98168510
3943 98168510 93888019 89901486 85628351 82877344 81266185 79422183 76065373 72736331
3935 72736331 69999990 67303692 64587124 63199372 62080890 59934528 57052282 55429525
3927 55429525 55839156 53931074 53113759 52702196 51811936 48370160 46004147 45757187 43999558
3918 43999558 42999690 42769203 39247146 35647166 35804689 33265853 33230594 33273380 31749182
3909 31749182 29735960 28669201 26875477 26343435 26996463 25086558 23710103 24390213 23293242
3900 23293242 22686270 20466048 19856538 20727515 17689177 16342498 16105090 15224595 12443132
3891 12443132 12996884 15228026 14167584 13137039 12983530 12634415 13796047 13264487 10986473
3882A0986473m86868L20540o71372p47211L89737J312312K25018r15925j584150
3873H828554J279653R71515m21131j39359k50453l08601n78307J93651O46646
3864A0222168m76312j921907j226646R73955r72018l22957K064948j143124j910942
3855E287165L20704K582293j740777j279094J312031J508577p01684j416129r84636
3846D888450m07909J761810K253705j879999n33129J084088l20689k221904o7831
3837D556592J886413J28908q10004j066720J235359j2463L2016K45659K02585
3828F398345J83024R10932O06533j441278q51118J11873q10466J828913K484907
3819I421665l41195j019294k107064o64134P27709R93594j521846L59549k24894
$$ plain form
3882 10986473 10499605 10820145 10148773 9401562 9791299 11103611 11328629 10412704 8828554
3873 8828554 10108207 11079722 10658591 10519232 10268779 9960178 9381871 9575522 10222168
3864 10222168 9745856 7823949 6597303 7571258 6599240 6276283 8341231 7198107 5287165
3855 5287165 5607869 8190162 6449385 5170291 6482322 7990899 7289215 5873086 4888450
3846 4888450 4480541 6242351 8496056 6616057 6082928 7167016 6846327 4624423 4556592
3837 4556592 6443005 6571913 5761909 4695189 5930548 5918085 5950101 6195760 6398345
3828 6398345 6581369 7492301 8098834 6657556 5806438 5918311 5107845 6936758 9421665
3819 9421665 9080470 8061176 5954112 5289978 6017687 7011281 5489435 5848984 5624090
3810E624090k10503P31502l94437L69155N92510M69539j632740L83987k161888
3801C771215O96710J889118K43595Q18307j78428M46199L03281p91345q28767
3792F369885P40144J58100j535666J651094J099386r7739L75678K945674j47054
3783A1559502l27972O59034j544999j723337J439429K487771N83971l41281k765561
3774A0026557J421913K296778L51363o54700n1348K356305O23993J499706o10493
3765A7260074J86381L53420m99355J918975J021498R63547K113934K576824R35881
3756B6831179Q59589L521593N065006M459389P662261R680231J5970680K0806173
3748I4856101K5777993K5435195Q411984j2382754k4808768k4961732j7807137
$$ plain form
3810 5624090 5413587 6145089 5750652 6119807 6712317 7181856 5549116 5933103 3771215
3801 3771215 4467925 6357043 6600638 7418945 7240517 7686716 7989997 7198652 6369885
3792 6369885 7110029 7268129 5732463 7383557 8482943 8385204 8760882 11706556 11559502
3783 11559502 11231530 11890564 10345565 8622228 10061657 12549428 13133399 12792118 10026557
3774 10026557 11448470 13745248 14096611 13441911 13390563 15746868 16370861 17870567 17260074
3765 17260074 17446455 17799875 17300520 19219495 20240993 21204540 23318474 25895298 26831179
3756 26831179 27690768 31212361 36277367 40736756 48399017 58079248 74049928 94856101
3748 94856101 120634094 146069289 154481273 142098519 117289751 92328019 74520882
3741G4520882j2306435r990688q416898n955104n804248l639115k712207l181329
3733B2514858Q61730k590530j425545j574232j051196p65361j430170k65335J285884
3724A5560103j443609n32876m44280m87521J31170j519363j084891j46481j609188
3715H423064j41697J443100K79980n43380j634076M33921K68058J111145j043199
3706H596916p55371j045331m43655J273285M42382j020498m85661j62949R29303
3697G328421j398417n75686r61389J240290q5300P4019O60525p39194j579728
3688C963541p44917j85654J312099N1216j97923R94472p37249m47061j060230
3679B948294l32229J677782K69813M43681k9301j63704M31947j602453Q55552
$$ plain form
3741 74520882 62214447 52223759 43806861 37851757 32047509 28408394 25696187 22514858
3733 22514858 23376588 20786058 19360513 17786281 16735085 15969724 14539554 14274219 15560103
3724 15560103 14116494 13583618 13139338 12651817 12782987 11263624 10178733 10032252 8423064
3715 8423064 8281367 9724467 10004447 9461067 7826991 8260912 8528970 9640115 8596916
3706 8596916 7841545 6796214 6352559 7625844 8068226 7047728 6562067 6399118 7328421
3697 7328421 5930004 5354318 4392929 5633219 5547919 5621938 6282463 5543269 3963541
3688 3963541 3218624 3032970 4345069 4396285 4198362 5192834 4455585 4008524 2948294
3679 2948294 2616065 4293847 4563660 5007341 4978040 4814336 5246283 3643830 4499382
3670D499382n38734q21333O35609K94641j67211L12548L13432k634943R59974
3661B853365O99175R8137n59472q14964p74946m69281L44311J376495L39469l409
3651C088880J578253p0965j193303J35525L54136Q27805J090100j82543l7675
3642E590213j859601r27286L67661J628282r77565p61582p84168N55431o7679
3633B763706J30155Q15865P07275q56051n99411R03358Q59148j327612L10909
3624C707342k80547K08548k21771R67303J41542j491434j15800j239969K463145
3615D138359j27927J88178M08539j550140k90511N72458Q78546o25655J010833
3606D602680j505978K31556J380584n12051J035455k82914j075455K86707J197082
$$ plain form
3670 4499382 3960648 3139315 3774924 4069565 3902354 4214902 4528334 1893391 2853365
3661 2853365 3552540 3650677 3091205 2276241 1501295 1032014 1376325 2752820 3092289 3088880
3651 3088880 4667133 4596168 3402865 3538390 3892526 4720331 5810431 5627888 5590213
3642 5590213 3730612 2803326 3170987 4799269 3821704 3060122 2275954 2831385 2763706
3633 2763706 2893861 3709726 4417001 3560950 2961539 3864897 4724045 3396433 3707342
3624 3707342 3426795 3635343 3413572 4380875 4522417 3030983 2915183 1675214 4138359
3615 4138359 4010432 4198610 4607149 3057009 2766498 3338956 4217502 3591847 4602680
3606 4602680 3096702 3328258 4708842 4196791 5232246 4949332 3873877 4160584 5357666
3597E357666O43335q95687j90971p31306J562521L07718j778769N98701M6403
3588D919611l03112M25420J259271J42320J347894j742002r47518N25201n2430
3579E574655Q75967p53914L62643K534554k87924J65678R6047L86935j017074
3570G937567J295153n9900l35100K17770j503N69462J58218M49858j106007o56780
3560H468738P37258R95972J04501J657851n17082K05318O93704j99554q11362
3551A1335344l70636K08201J969829R08666l87076j249282J680815J170420J62624
3542A5428905R2651n89144N99511K68118M69868R21856k59637Q7496J483684J73524
3532A8676832n50624P67737R18709O15378o98246q84446J599852O15180Q9939
$$ plain form
3597 5357666 6001001 5105314 4914343 4183037 5745558 6053276 4274507 4873208 4919611
3588 4919611 4616499 5041919 6301190 6443510 7791404 6049402 5101884 5627085 5574655
3579 5574655 6450622 5696708 6059351 8593905 8305981 8471659 8567706 8954641 7937567
3570 7937567 9232720 9172820 8837720 9055490 9053987 9623449 9781667 10231525 9125518 8468738
3560 8468738 9205996 10201968 10306469 11964320 11447238 11652556 12346260 12146706 11335344
3551 11335344 10964708 11172909 13142738 14051404 13664328 12415046 14095861 15266281 15428905
3542 15428905 15521556 14932412 15531923 15800041 16269909 17191765 16932128 17019624 18503308 18676832
3532 18676832 18126208 18893945 19812654 20428032 19729786 18845340 20445192 21060372 21150311
3523B1150311J708276J288838O73365n81102r4277K028346J013329N8624R02868
3514B8148578P04202n32054K580548K587059J651397M175745L473856K354248
3506D5143579J278408K756014L110562P01576o1457l98702j011468K4599J097874
3497E2640985o22664l884339m750901j854511k810104m55673l78303k167606l311501
3488C2405383j685675K82968k518986k397795q05225l72363p38833m65312k859381
3479B0844781r18794k11734q71769j414116k492178j090810n53840r37903q99146
3470A1454491J647811j675091r52271j72397p16298p13129n7863r2800k225112
3461F497341Q42395j46255o25759o87388j22669R53445m42038M18164n73061M67983
$$ plain form
3523 21150311 22858587 24147425 24820790 24239688 24145411 26173757 27187086 27245710 28148578
3514 28148578 28852780 28320726 30901274 33488333 35139730 39315475 42789331 45143579
3506 45143579 46421987 49178001 52288563 52990139 52928682 52529980 51518512 51543111 52640985
3497 52640985 52018321 48133982 43383081 41528570 38718466 38262793 37884490 35716884 32405383
3488 32405383 30719708 31002676 28483690 26085895 25280670 24908307 24169474 23704162 20844781
3479 20844781 19925987 19714253 18842484 17428368 14936190 13845380 13291540 12353637 11454491
3470 11454491 13102302 11427211 10474940 10302543 9586245 8873116 8815253 8722453 6497341
3461 6497341 7339736 7193481 6567722 5880334 5757665 6711110 6269072 6687236 6114175 6582158
3451F582158R05096q17330k223757k41474J730100q98879J95257J6318l34291
3442D913198J637253l435498p40348K182613K09076p06120q8378J50165k16388
3433C905573n02799M28859j331519p34670l50974Q1406J358617N30294q89172
3424B495615n99531r88167L04317P99284l22330J08870j140893n71063L90455
3415D76557J226862L93295n11262J080639n52866J27078l76989O3964J24814j255700
3405G96392k24119n1722J497529n12584L28968j071822J540875J56609j324130
3396A135996j958575J499805M30043q07192J520437p67610n63151J684182r92167
3387A181768K479822Q76607j625588j164814j653248p8493J561529M19524j819309
$$ plain form
3451 6582158 7487254 6669924 4446167 4204693 5934793 5035914 5231171 5247489 4913198
3442 4913198 6550451 3114953 2374605 4557218 4766294 4060174 3971796 4121961 3905573
3433 3905573 3402774 3831633 2500114 1765444 1414470 1495876 2854493 3384787 2495615
3424 2495615 1896084 907917 1212234 2011518 1689188 1798058 657165 86102 476557
3415 476557 1703419 2096714 1585452 2666091 2113225 2240303 1863314 1927278 2052092 796392
3405 796392 572273 520551 2018080 1505496 1834464 762642 2303517 2460126 1135996
3396 1135996 -822579 677226 1107269 300077 1820514 1052904 489753 2173935 1181768
3387 1181768 3661590 4538197 2912609 1747795 94547 16054 1577583 1997107 177798
3378A77798q81608J296159J80549j34475o72031j786034R89755k08597K77041
3369g61443K73606O25799J593656j056161m69862J228696k36653k252689N09511
3360e45540P29718J571418P14170j014968n0231j712745m77937Q08826N79014
3351F01725n725r0351J059689m65957Q1300J10715j200032K06162r11213L95204
3341b18483p79924K138411j98305l17007M97023l61657j373015M89929L58998
3332B35970r97087j70111n20075k93903J329773J003740O74257Q0468q39786o61791
3322a58545J1893N63852j060966l82073P79395p64731J875382R25282O28128j716496
3312G01121L7435o26547M55119P35911l04127q09220l80151k57734j6520N02863
$$ plain form
3378 177798 -703810 592349 772898 638423 -33608 -1819642 -829887 -1038484 -761443
3369 -761443 -487837 137962 1731618 675457 205595 1434291 1197638 -1055051 -545540
3360 -545540 184178 1755596 2469766 1454798 1404567 -308178 -786115 22711 601725
3351 601725 596000 505649 1565338 1099381 1180681 1291396 91364 297526 -613687 -218483
3341 -218483 -998407 1140004 941699 624692 1121715 760058 -612957 -123028 235970
3332 235970 -761117 -931228 -1451303 -1745206 -415433 588307 1262564 1343032 503246 -158545
3322 -158545 -146652 417200 -643766 -1025839 -246444 -1011175 864207 1789489 2417617 701121
3312 701121 738556 112009 567128 1303039 998912 189692 -190459 -448193 -464713 38150
3302C8150J39642N0776Q47119N12559k041264L63192J58501l32843j49035J796956
3292A383753K65781l81239n09828O64395j101466O48046o16471J767647k9146
3283B091472j614838J097439M44337J51650j9150o96873O63018j222503P55034
3274A649586k17871M29088J7425k52035j179642P9927K72579n20063J420225o93491
3264A005728m67512J283366O64703J024579k292767J23371k54879Q97848n51161
3255A433276j362676O02258M34627K672841J06075m79753j114792K75001j59918
3246B406939q32322J634681M9477J414023J05775j325550j161854m16551M36897
3237B311515l52046J411332k33762J033711m21217Q59050o20727l151856Q9942
$$ plain form
3302 38150 177792 228568 1075687 1588246 -453018 -89826 68675 -264168 -413203 1383753
3292 1383753 1649534 1268295 758467 1422862 321396 969442 352971 2120618 2091472
3283 2091472 476634 1574073 2018410 2170060 2150910 1454037 2117055 894552 1649586
3274 1649586 1431715 1860803 1878228 1626193 446551 526478 799057 278994 1699219 1005728
3264 1005728 538216 1821582 2486285 3510864 1218097 1341468 1086589 1984437 1433276
3255 1433276 70600 672858 1107485 3780326 3886401 3406648 2291856 2566857 2406939
3246 2406939 1574617 3209298 3258775 4672798 4778573 3453023 2291169 1874618 2311515
3237 2311515 1959469 3370801 3137039 4170750 3749533 4608583 3987856 836000 925942
3228I25942K609540k43728Q19804m60513J342578L44502p42998o28241J238903
3219E205789m64746r98065j50754L65584J120528J628738Q27972j353130m41900
3210E740016J485875J999361n74696j148792R8868j211940k61537J496943Q39024
3201H463122m91122J443155j060127J252074Q43115j319693J407132l11765K84645
3192A0510536K373999J979341r69021j496630J900178J357327M95621M19535J264034
3183A7834920L397406K64156j265192L65435m53373p75476m8108m44749n046J034781
3173A9904754q21598J393235p47340K17758K50924j01412K85611j399494J124203
3164B0106641R01986Q63169j958616K49218L048310J830570J661464K508150M234646
$$ plain form
3228 925942 3535482 3291754 4111558 3651045 4993623 5338125 4595127 3966886 5205789
3219 5205789 4741043 3742978 3592224 3957808 5078336 6707074 7535046 6181916 5740016
3210 5740016 7225891 9225252 8650556 7501764 7600632 6388692 6127155 7624098 8463122
3201 8463122 7972000 9415155 8355028 9607102 10450217 9130524 10537656 10225891 10510536
3192 10510536 12884535 14863876 13894855 12398225 14298403 15655730 16151351 16570886 17834920
3183 17834920 21232326 21496482 20231290 20596725 20143352 19367876 19319768 18875019 18869973 19904754
3173 19904754 19083156 20476391 19729051 19946809 20197733 20096321 20381932 18982438 20106641
3164 20106641 21008627 21871796 19913180 20162398 23210708 25041278 26702742 29210892 33445538
3155C3445538N226766M870904R58895l280557l736271m590865m628565l320335
3147B4945510m41052j182609k360802j622202q45599j836129j522224K00019J89972
3138A5524884J675740r90988k612679j570285K73978K116669N08686J060120j867727
3129A4118398j174427n15953J793303l47884J151247O88968R24585j04240j044628
3120A5489369p63332K2374j350918l6578j289062j286309j13485k531844j054536
3111G085679l918157K231654L02281l92423J171290j701810m62964j898625q5058
3102B331867j13312Q7427J614643n1832j230418j16159P25963J468757M14994
3093E131930j299612r91067j385306j026605R01198J16542K5091l43788N48916
$$ plain form
3155 33445538 38672304 43543208 44502103 41221546 37485275 32894410 28265845 24945510
3147 24945510 24504458 23321849 20961047 19338845 18493246 16657117 15134893 15334912 15524884
3138 15524884 17200624 16209636 13596957 12026672 12300650 14417319 14926005 15986125 14118398
3129 14118398 12943971 12428018 14221321 13873437 15024684 15713652 16638237 16533997 15489369
3120 15489369 14726037 14748411 13397493 13360915 12071853 10785544 10672059 8140215 7085679
3111 7085679 3167522 5399176 5701457 5309034 6480324 4778514 4315550 2416925 2331867
3102 2331867 2218555 2305982 3920625 3868793 2638375 2522216 3248179 4716936 5131930
3093 5131930 3832318 2841251 1455945 429340 1330538 1447080 1472171 1128383 1677299
3084A677299M67638r49395o30582R72101j02363n12067J97229q80795j152655
3075i13590O58917j179658J783109j17963K07008J161561n03610k02978J416253
3066B309049P9716j581891o70822m4302M68374k089628L65529J914229J397777
3057B148031p71642o82461o73553j79248o15335m84952k79610P90650Q03416P16007
3047G71303n8424L63100q96423j367064P69838j42721j234370j185J193050K698151
3037B095255k211931j62689K37942o06397N55016J46883k73944Q60159p21517
3028h1223q65134R7180J114730J354168o38417p01886p42881m99299P94639p12684
3018h80807K56764L41368q08405L52146j82223q73841J510434N34322P78943L53350
$$ plain form
3084 1677299 2144937 1195542 564960 1537061 1434698 922631 1119860 239065 -913590
3075 -913590 -254673 -1434331 348778 230815 437823 1599384 1095774 892796 2309049
3066 2309049 2388765 806874 136052 91750 560124 -1529504 -1163975 750254 2148031
3057 2148031 1376389 693928 20375 -158873 -774208 -1259160 -1538770 -748120 55296 771303
3047 771303 712879 1075979 179556 -1187508 -417670 -560391 -1794761 -1795946 -602896 2095255
3037 2095255 -116676 -279365 -41423 -647820 -92804 54079 -219865 640294 -81223
3028 -81223 -946357 -849177 265553 1619721 981304 279418 -463463 -962762 -168123 -880807
3018 -880807 -624043 -282675 -1091080 -738934 -921157 -1794998 -284564 249758 1028701 1382051
3008A382051J81627m46181m50125K001073j721582j107091J601503J89732j184725
2999D46282k80653j811897n07130J281396j620119J183614J342721k16015q26213
2990a008014P02129k30252Q04019K06148j18644L68923j056026M73204N73307
2981G14794K2828O20037R88213k91782J328688j644375j061859j92001M60245
2972I44788L75448M2668L5472j745107j70634k16032o26744L546Q56949l77187
2962h76833P63050n1510j181224P5713m61999J474511K382532o12118j247393
2953B64729O86380n38471Q94434n65843l55355p32127n19659L66275J435345Q56829
2943A792537j909352q25277K085132q75395o2432P03201j583684N30090J973541
$$ plain form
3008 1382051 1563678 1117497 667372 2668445 946863 -160228 1441275 1631007 446282
2999 446282 165629 -1646268 -2153398 -872002 -2492121 -1308507 34214 -181801 -1008014
2990 -1008014 -305885 -536137 267882 474030 355386 724309 -331717 141487 714794
2981 714794 737622 1357659 2345872 2054090 3382778 1738403 676544 484543 944788
2972 944788 1320236 1362904 1398376 -346731 -517365 -733397 -1360141 -1356595 -499646 -876833
2962 -876833 -113783 -165293 -1346517 -1270804 -1732803 -258292 2124240 1512122 264729
2953 264729 951109 412638 1307072 741229 385874 -346253 -865912 -499637 935708 1792537
2943 1792537 -116815 -942092 1143040 267645 205213 908414 -675270 -145180 1828361
2934A828361j203457r53080p02463k65778J837554K38689j705006m23060Q96577
2925d51663q59124p46568J72887R43972J031238J013J635681l63734j391516K70913
2915B43099j67149q63394J957974O74534r33514n34342K25828M4521J496370o07199
2905A536728j694222m71173Q9828l55061k93956R48q29909J128334R59414P67798
2895H38729p1669k09142m39623j75153N86989k067175Q2302J533801q13400N31671
2885b02670Q18051J684900r06477N0940o36093k34889Q39147k881799l88420K078528
2875B21218l00029p70268j547110J187289J506013j186910j123456M73196P55467
2866g84590k80893J222512r64765L2978J281735j029442J07628k81734o07830
$$ plain form
2934 1828361 624904 -328176 -1030639 -1296417 541137 779826 -925180 -1348240 -451663
2925 -451663 -1310787 -2057355 -1884468 -940496 90742 91755 1727436 1363702 -27814 243099
2915 243099 75950 -787444 1170530 1845064 911550 377208 603036 647557 2143927 1536728
2905 1536728 -157494 -628667 -538839 -893900 -1187856 -1186908 -2016817 -888483 70931 838729
2895 838729 767060 557918 118295 -56858 530131 -1537044 -1454742 79059 -734341 -202670
2885 -202670 615381 2300281 1393804 1444744 808651 573762 1412909 -1468890 -1857310 221218
2875 221218 -78811 -849079 -2396189 -1208900 297113 -889797 -2013253 -1540057 -784590
2866 -784590 -1065483 157029 -807736 -774758 506977 -522465 -414837 -696571 -1304401
2857a304401n48391j97272J039619r96914l40075m12568j70324J359216J362328
2848b08782j267262j178323J238212J639017q80091n9558j08103J51683M67174
2839b06033j079187O82565j38921j43500M02347J605257Q3470M59681k819112
2830a153433k261481J554886K82894o87508J325035O42341k76923L69040N75142
2821C69993P7921N88900j061571R80981J75132j55225M91399l93516l11197j349729
2811e86912j47465R5546o97569l82370K68756O47386k06756J258089n57513j465603
2801a774411Q3223L47852M44450J372194o66766P45228k46610r2941Q38187j206860
2791a56454n80847l97529J198490J582154o60424M09492j246628o27198P35588
$$ plain form
2857 -1304401 -1852792 -2050064 -1010445 -2007359 -2347434 -2760002 -2930326 -1571110 -208782
2848 -208782 -1476044 -2654367 -1416155 222862 -657229 -716787 -824890 -673207 -206033
2839 -206033 -1285220 -602655 -741576 -885076 -482729 1122528 1205998 1665679 -1153433
2830 -1153433 -3414914 -1860028 -1577134 -2264642 -939607 -297266 -574189 -205149 369993
2821 369993 447914 1036814 -24757 956224 1131356 976131 1467530 1074014 762817 -586912
2811 -586912 -734377 -638831 -1336400 -1718770 -1450014 -802628 -1009384 248705 -308808 -1774411
2801 -1774411 -1691188 -1343336 -898886 473308 -193458 551770 305160 212219 1050406 -156454
2791 -156454 -737301 -1134830 63660 1645814 985390 1394882 148254 -478944 256644
2782B56644j84700Q80638p50947n67476j258393K030364J275138k199855k28017
2773g46604N3090m97017J021077l07043m62133O46473m59327k591065J166324
2764b176225P24944P79502m13374l80399J192199j23791m51617r40424l22836
2755b112021J118976J894141r11311L49535J413476j942766j059964R27134K368791
2746B045991p19786j707025j17223j10841n01870J56876J63741J200847L09029
2737G19739j677194r24340N79769J63025J849148k49176k64836p64170J144422
2728E76387j08693j083210J00642n28387M5044o29432J671856M53417k03269n64458
2718b70103p62028K051785J756616q96673q09750k033732L45860J452611k294072
$$ plain form
2782 256644 71944 952582 201635 -365841 -1624234 406130 1681268 -518587 -746604
2773 -746604 -693514 -1190531 -169454 -476497 -938630 -292157 -751484 -3342549 -2176225
2764 -2176225 -1451281 -671779 -1085153 -1465552 -273353 -397144 -848761 -1789185 -2112021
2755 -2112021 -993045 901096 -10215 339320 1752796 -189970 -1249934 -322800 2045991
2746 2045991 1326205 -380820 -498043 -608884 -1110754 -953878 -790137 410710 719739
2737 719739 -957455 -1881795 -1302026 -1139001 710147 460971 196135 -568035 576387
2728 576387 467694 -615516 -514874 -1043261 -998217 -1627649 44207 497624 294355 -270103
2718 -270103 -1032131 1019654 2776270 1879597 1069847 -963885 -618025 834586 -1459486
2709a459486j81308J877263P73081J335962j018499k117166K8024K4399o25121
2700a362851O81647Q10509R90720M65079j091124J17792J16028j080057J456110
2691A103853Q04685j109649O16315j888500j208685P53434j447458J695544R9929
2682e80532K4956P65060J97697j299480L7930p78418J140745r17131o98081J026521
2672a080733J357837K439135k028485O96751r72071M3243M9189J57983N38928
2663A201777q95540n94150r38418n63496j43607N62937j463634K024098J828669
2654A018636j85155j695205j821169K182454K274393k073963j634350O46461R3720
2645a194178J14943R682K162023N63073r45895j103750M33682J65762j614922
$$ plain form
2709 -1459486 -1640794 236469 1009550 2345512 1327013 -790153 -762129 -737730 -1362851
2700 -1362851 -681204 129305 1120025 1585104 493980 611772 727800 -352257 1103853
2691 1103853 1908538 798889 1415204 -473296 -1681981 -928547 -2376005 -680461 -580532
2682 -580532 -555576 209484 407181 -892299 -854369 -1632787 -492042 -1409173 -2107254 -1080733
2672 -1080733 277104 2716239 687754 1384505 412434 455677 504866 662849 1201777
2663 1201777 306237 -287913 -1226331 -1789827 -1933434 -1370497 -2834131 -810033 1018636
2654 1018636 833481 -861724 -2682893 -500439 1773954 -300009 -1934359 -1287898 -1194178
2645 -1194178 -1079235 -1069553 1092470 1655543 709648 -394102 39580 205342 -1409580
2636a409580l78581J618654L37724L70070l20628q30351J762053L65471o85625
2627H29207q99757K73384J38391j236802N27284J87658P23870J283935P53884
2618B581054m0722p81146j096197M95757k57035r35826P5626m8823N54657J712082
2608B259427j721089n13784m5405j25611J211306r46228p3908L08763J915293
2599B268764O165j189714k50668k91174o01884P47489k50771j452778j084480
2590b099051J020036O06483r39563J926366J164800q06024j790098P95608Q8152
2581c3291n32109n56946O63283K255505j614897n42838J27517O16730O25811M32125
2571A440890m79232J78061p98442j575961O60323j08026r38745M47776o65778
$$ plain form
2636 -1409580 -1788161 -169507 168217 538287 217659 -612692 1149361 1514832 829207
2627 829207 -70550 202834 341225 -895577 -368293 -180635 543235 1827170 2581054
2618 2581054 2540332 1759186 662989 1158746 901711 -34115 41511 -7312 547345 2259427
2608 2259427 538338 24554 -20851 -146462 1064844 118616 44708 353471 2268764
2599 2268764 2274929 1085215 834547 543373 -58511 688978 438207 -1014571 -2099051
2590 -2099051 -1079015 -472532 -1412095 514271 1679071 873047 -917051 -121443 -33291
2581 -33291 -565400 -1122346 -459063 1796442 181545 -361293 -233776 382954 1008765 1440890
2571 1440890 961658 1139719 341277 -1234684 -574361 -682387 -1621132 -1173356 -1839134
2562a839134L87300O15683R0680J711165k38213j708925N8680O21826J317589
2553A016651l62238q83029N11312j637781R6080M52125m91389K012083j07316
2544F06498j161821r8797o2810N26913J3760J162172K86513j710820J456469J072762
2534B090839j635320J00235K55353O57767J16788o72653j655271j191708M83931
2525a450039R59545J028681m15073L04509j55362o33103j668777K567670K5027
2516E63078r83987N56745j677922K125310Q10670p16872m72200O23413J124780
2507A953015j659111K21546P7940j265462m42088n8953O92266J68013J252798
2498I39964j982032L84781Q99890J675457P60712j14669n37558m69610O51014
$$ plain form
2562 -1839134 -1451834 -836151 -745471 965694 727481 -981444 -922764 -300938 1016651
2553 1016651 654413 -228616 282696 -1355085 -1259005 -806880 -1298269 713814 606498
2544 606498 -555323 -654120 -716930 -190017 -176257 985915 1272428 -438392 1018077 2090839
2534 2090839 455519 555754 811107 1468874 1585662 913009 -742262 -1933970 -1450039
2525 -1450039 -490494 538187 123114 427623 272261 -360842 -2029619 538051 563078
2516 563078 -420909 135836 -1542086 583224 1393894 677022 204822 828235 1953015
2507 1953015 293904 515450 593390 -672072 -1114160 -1173113 -480847 -312834 939964
2498 939964 -1042068 -657287 242603 1918060 2678772 2564103 2026545 1556935 2207949
2489B207949p13679j394848o65650J295068Q86015o06092M05561n12254j83998
2480G18072M02792m66551j094251J356784J530838j588946q29063P14112r61121
2471b17334k95414J05272P86754J541137K70850m049n31323J137822L76082J481096
2461D650893j281935k013595J648286m02997r24759J108544j62187j314564O15527
2452A923213m29103p29927j203247k21311J208725K152251k59414j037106N42758
2443A946839N73019o71630L22192j74427O98814K535670l26335o55245P42024
2434D990921M65018R31382j73456l446023M09555K10052J69618j56470R09665
2425D310262L69704R27162n07712J167722q04981j039422J129466k2780O0508
$$ plain form
2489 2207949 1494270 99422 -566228 728840 1614855 1008763 1414324 902070 718072
2480 718072 1120864 654313 -439938 916846 2447684 858738 29675 743787 -217334
2471 -217334 -512748 -407476 379278 1920415 2191265 2187216 1655893 2793715 3169797 4650893
2461 4650893 3368958 1355363 3003649 2600652 1675893 2784437 2622250 1307686 1923213
2452 1923213 1494110 764183 -439064 -660375 548350 2700601 2441187 1404081 1946839
2443 1946839 2519858 1848228 2170420 1995993 2694807 5230477 4904142 4248897 4990921
2434 4990921 5455939 6387321 6213865 2767842 3177397 3387449 3557067 3400597 4310262
2425 4310262 4679966 5607128 5099416 6267138 5462157 4422735 5552201 5529421 5589929
2416E589929P59809K51543J155067P63514M2144k474420m22790j026711M61069
2407E099154R23351k85032J636773n16905N65793o2916R83777P12060j028965
2398H027090k337974J027415K013188K426078l17184P9729N15021L89618O08631
2389A2431612O66467R23347K623680j327984k052111K52333K553374J447277L35809
2380A7853804Q20286R19228J630031K66478O25821n42228K968114J223329J260491
2371B7025354L700642J998969K745491L076823K226813P45076J236522Q29445
2363D3585135J092689L595498P345939Q289468Q862837J4865953K3917196L2885743
2355A44440458M8574843O6753433O1601621K7045449k8974194o4438594o4612351
$$ plain form
2416 5589929 6349738 6601281 7756348 8519862 8562006 6087586 5664796 4638085 5099154
2407 5099154 6022505 5737473 7374246 6857341 7423134 7360218 8343995 9056055 8027090
2398 8027090 5689116 6716531 8729719 11155797 10838613 10918342 11433363 11822981 12431612
2389 12431612 13098079 14021426 16645106 15317122 13265011 13517344 16070718 17517995 17853804
2380 17853804 18674090 19593318 21223349 21489827 22115648 21573420 24541534 25764863 27025354
2371 27025354 30725996 32724965 35470456 38547279 40774092 41519168 42755690 43585135
2363 43585135 44677824 48273322 55619261 63908729 72771566 87637519 111554715 144440458
2355 144440458 193015301 259768734 321370355 348415804 319441610 255003016 190390665
2348A90390665m6900919k9260253k2347426j6747830j0770756r588692o644471
2341D8130318l302498k842734j693998m00262k194142k694439l165267l845023
2333B7991955m059425j516845j966101k548916r56529j145017j902739Q39808
2325A4736191k12119j619574m81688k050565N91808j426739j225224j6804P12820
2316I008106j515536J591546l15009k312295R12968n67462N03989j810442Q49756
2307F345621J104333j362909j89204N77717Q19879j148261p27664J84234K10093
2298E813839r09933n97852j07589p14790o74121Q61772j857314k182789R96425
2289F27648J871572Q34478j08387O5442p65951j77525P35300J017968j07792j179608
$$ plain form
2348 190390665 143489746 114229493 91882067 75134237 64363481 54774789 48130318
2341 48130318 44827820 41985086 40291088 39890826 37696684 35002245 31836978 27991955
2333 27991955 23932530 22415685 20449584 17900668 16944139 15799122 13896383 14736191
2325 14736191 14524072 12904498 12422810 10372245 10964053 9537314 8312090 8295286 9008106
2316 9008106 7492570 9084116 8769107 6456812 7369780 6802318 7306307 5495865 6345621
2307 6345621 7449954 6087045 5897841 6475558 7295437 6147176 5419512 5603746 5813839
2298 5813839 4903906 4306054 4198465 3483675 2809554 3671326 1814012 -368777 627648
2289 627648 2499220 3333698 3225311 3290753 2524802 2347277 3082577 4100545 3992753 2813145
2279B813145l76778r5839p46101o49113k40482J007210m65045p44236K11591k98431
2269D15921J475132l16526o51733k34836l33174n59088J047034l05016J387981
2260A925695q42827k95593k30762L32832n12428k2305J164573j769694J883934
2251A633425P01562j600403j88882L85246p40972J643834j031148j296225M29879
2242f3684J79606j401170r47778o4420K236262J126631j066066p71451o65089
2233a437159n49114J859887O81382j63263j631715R91626J334339j841480K215815
2224A460318k87485j569j241167j350793J749595J256411N78508r94920n26068
2215F42830J22082k024192q23534L60441n92810R83068J76680N94744J375117
$$ plain form
2279 2813145 2436367 2340528 1594427 945314 704832 1712042 1246997 502761 714352 415921
2269 415921 1891053 1574527 922794 687958 354784 -204304 842730 537714 1925695
2260 1925695 1082868 787275 556513 889345 376917 354612 1519185 -250509 1633425
2251 1633425 2334987 734584 545702 930948 189976 1833810 802662 -493563 -63684
2242 -63684 115922 -1285248 -2233026 -2297446 -61184 1065447 -619 -772070 -1437159
2233 -1437159 -1986273 -126386 554996 391733 -1239982 -248356 1085983 -755497 1460318
2224 1460318 1172833 1171264 -69903 -1420696 328899 1585310 2163818 1168898 642830
2215 642830 764912 -1259280 -2082814 -1722373 -2315183 -1332115 -1155435 -560691 814426
2206H14426k58953j070742J345403n95590r19764J576099j006783j179316K033858
2197G38638J64755M81294p76977r95211j13736L95311k76032J538919J44037j463927
2187a62929j49586p76704L037835j8962j449420m27756K04016N31194p2344P73760
2177A489104j051839r69347j239200O3330J481302j366061p7583J40455J169075
2168c60764M27654l05368j156922l66341N78447j504724N64572J960384o91010
2159h54072J21085j008322Q73372K07824k175768J217546L51016j266398J974233
2150e59484R44388J583069N23240l249709K25811q1380R44308j191901j010973
2141a872631M75302J689078l38561O97379K61601n56439l26215j092243L61614
$$ plain form
2206 814426 555473 -515269 830134 234544 -685220 890879 -115904 -1295220 738638
2197 738638 903393 1384687 607710 -387501 -501237 -105926 -381958 1156961 1300998 -162929
2187 -162929 -312515 -1089219 1948616 1929654 480234 52478 256494 787688 715344 1489104
2177 1489104 437265 -532082 -1771282 -1707952 -226650 -1592711 -1670294 -1529839 -360764
2168 -360764 66890 -238478 -1395400 -1761741 -1183294 -2688018 -2123446 -163062 -854072
2159 -854072 -732987 -1741309 -867937 -660113 -2835881 -1618335 -1267319 -2533717 -559484
2150 -559484 384904 1967973 2491213 -758496 -532685 -614065 330243 -861658 -1872631
2141 -1872631 -1397329 291749 -46812 650567 912168 355729 29514 -1062729 -701115
2132g01115o35885J276508m54818j149595N51216R07190M98963q58257K16799
2123c48994Q35868j247225R5695J646855j29933N96421n41040j739189N82432
2114b49110p3127J259341Q67733l04861j949002L31818K18217p9404m67708j757862
2104b203965O82812L152472K23346o42406k80865p49076O68842R45654j503238
2095B93576r38973L59659k11596J231042j401837N00520o4260j089655k22253
2086a543777R14297N63604j32726J940148j558649j11796R95285R57170j24163
2077A899393j376246j88868o34489n07756L97216r81284N84634k59407L63493
2068g03314m84094N79867J593890j313439m50494m93489O71755P80581L993r68782
$$ plain form
2132 -701115 -1337000 -60492 -515310 -1664905 -1113689 -206499 292464 -565793 -348994
2123 -348994 486874 -760351 -664656 982199 852266 1448687 907647 -831542 -249110
2114 -249110 -322237 937104 1804837 1499976 -449026 -117208 101009 21605 -446103 -2203965
2104 -2203965 -1521153 1631319 1854665 1212259 931394 182318 851160 1796814 293576
2095 293576 -645397 -285738 -497334 733708 -668129 -167609 -231869 -1321524 -1543777
2086 -1543777 -629480 -65876 -198602 1741546 182897 71101 1066386 2023556 1899393
2077 1899393 523147 334279 -300210 -807966 -410750 -1392034 -807400 -1066807 -703314
2068 -703314 -1187408 -607541 986349 -327090 -777584 -1271073 -599318 181263 185256 -783526
2058g83526O91671m04269n59223r2193L43962Q84361L86039k366020l22412J102645
2048a118965L16494r40971K690921P34756k052088j865345k47907K113532P72911
2039D03338J123169R72232r12879o83162m61682Q01063j625963k7239J205017
2030G93894k42552o08878L66548k94129r32366j26854r58870N10376J122489j377182
2020a747524Q21299J059183r39190P0642N0038j084929r76694P30163R3804J144311
2010g78897o13703K00995K78413N60922q42057m22316J159461O4447r57769J412212
2000F1708j180585J192656l88008l40080o783p50112o53080J254813J27518j595462
1990b277415J469504n90607J185578L81933q30907K39265j242759K499636j453047
$$ plain form
2058 -783526 -91855 -496124 -1055347 -1147540 -803578 80783 466822 -1899198 -2221610 -1118965
2048 -1118965 -802471 -1743442 947479 1682235 -369853 -2235198 -2483105 -369573 403338
2039 403338 1526507 2498739 1585860 902698 441016 1242079 -383884 -411123 793894
2030 793894 551342 -57536 309012 14883 -917483 -1044337 -2003207 -1492831 -370342 -1747524
2020 -1747524 -926225 132958 -806232 -735590 -685552 -1770481 -2747175 -2017012 -1923208 -778897
2010 -778897 -1392600 -1191605 -913192 -352270 -1194327 -1616643 -457182 -392735 -1350504 61708
2000 61708 -1118877 73779 -314229 -654309 -661092 -1411204 -2064284 -809471 -681953 -2277415
1990 -2277415 -807911 -1398518 -212940 168993 -661914 -422649 -1665408 834228 -618819
1981f18819j204061J133785m5301j10601j126943l50546J316519J013069j82588
1972a75486J064950p06320k53374j626532J849794j108686l7252J82513J48530
1963f61863J181784m99245J66154k10010r77901J246955j626797j25449J385758
1954a20614n50938m87777J89389J155336m23846j72744l82989N04631O26089l1622
1944C04915j3575j57850O27290l00501P47913m67792q6830l49221j194045Q71661
1934a8035O62491P84208r98204j396305p3410J054428j018749J12925P77435j256046
1924a369262l97399J558381R16067j227889r63695O84820N99410n81558m79434
1915a260559M49758L11346M55934k24924M82670J280316j242064m78609K54208
$$ plain form
1981 -618819 -1822880 -689095 -734396 -844997 -1971940 -2322486 -1005967 7102 -175486
1972 -175486 889464 183144 -70230 -1696762 153032 -955654 -992906 -810393 -661863
1963 -661863 519921 20676 186830 -23180 -1001081 245874 -1380923 -1506372 -120614
1954 -120614 -671552 -1159329 -969940 185396 -238450 -411194 -794183 -289552 336537 304915
1944 304915 291340 133490 760780 460279 1208192 740400 653570 304349 -889696 -18035
1934 -18035 644456 1428664 430460 -965845 -1039255 15173 -1003576 -890651 -113216 -1369262
1924 -1369262 -1766661 -208280 707787 -520102 -1483797 -798977 -199567 -781125 -1260559
1915 -1260559 -810801 -499455 -43521 -268445 214225 1494541 252477 -226132 28076
1906B8076j450108L99863r10420J73883J129686J23042l81082K241184q95438
1897D58686R19085j213280k115183n99702j21612K428231p67204p79154N48553
1888a241580j91659P50708J31301N38352j38477J49408m82306j096387J912366
1879C31726j604571J300322l3008N57805o05848j099857R99278M3707q49324Q8066
1869h71704M39365r126j88300k66742J113316R31310r30041J70742O09440J84631
1859A182891K46735k426788L45472l09546j035209J332502J872121J521685L14101
1850C043964j051308l303045p88894K67911P63338J408777q9554j227962Q56034
1841a20739J342606k84440k219572k26398K435925j57437p93002M79991R3104
$$ plain form
1906 28076 -1422032 -1022169 -1932589 -1758706 -629020 -505978 -887060 1354124 458686
1897 458686 1377771 164491 -1950692 -2550394 -2672006 -243775 -1010979 -1790133 -1241580
1888 -1241580 -1433239 -682531 -551230 -12878 -151355 -1947 -484253 -1580640 331726
1879 331726 -1272845 27477 -5531 552274 -53574 -1153431 -154153 -110446 -959770 -871704
1869 -871704 -432339 -441465 -629765 -896507 216809 1148119 218078 388820 998260 1182891
1859 1182891 1429626 -997162 -651690 -961236 -1996445 -663943 1208178 2729863 3043964
1850 3043964 1992656 -1310389 -2099283 -1831372 -1068034 340743 251189 -976773 -120739
1841 -120739 1221867 937427 -1282145 -1508543 927382 769945 -23057 456934 550038
1832E50038r64836j595694K58008N25337o68530j33600N17685Q75792k80475P57333
1822a58942j50482J038564j13080o55501j181867m08256J042650l91399n54004
1813a532317j358226J68374N42481K212953K420069j801763k001866R05657O63413
1804B18775j606494L54860m88646K143266R74769j74626j201548n3108O65684
1795H32932j608408J64537p50701K58912R35211m96414l47927J247033r14847
1786f79672j1799N1053j848271Q57575K095789N36380j474208J20679N64187j362921
1776a151208L24441r42177k36977N03082M93993R77672k95049j298080L59432
1767a264871j466098j60967J720378J726862k20110n29759j661202Q33888P03525
$$ plain form
1832 550038 -414798 -2010492 -1752484 -1227147 -1895677 -2029277 -1511592 -635800 -916275 -158942
1822 -158942 -309424 729140 616060 -39441 -1221308 -1629564 -586914 -978313 -1532317
1813 -1532317 -2890543 -2722169 -2179688 33265 2453334 651571 -1350295 -444638 218775
1804 218775 -1387719 -1032859 -1521505 621761 1596530 1421904 220356 167248 832932
1795 832932 -775476 -610939 -1361640 -1102728 -167517 -663931 -1011858 235175 -679672
1786 -679672 -691471 -640418 -2488689 -1631114 464675 1001055 -473153 -352474 211713 -1151208
1776 -1151208 -826767 -1768944 -2005921 -1502839 -1008846 -31174 -326223 -1624303 -1264871
1767 -1264871 -2730969 -2891936 -1171558 555304 335194 -194565 -1855767 -1021879 -318354
1758c18354J8325n29594L23746M17327K91672p8587Q9002M06413j026499M13117
1748F568k25851J210256m99589k239711m42064Q97714Q14219N34035j234693p32701
1738a911817J085805L14934k74733o97578j76220J03253L65966J042713j503757
1729a651434L9003J003847R24566R82801o20389p94805o47858M11448L22334j087853
1719a118340j193142K61795L58817N97675j25644J126711Q59655R2850O08332
1710A468709l46671N00677k268654L07812L47774K63152Q493M23002m55530R64498
1700A213262O15473k071367m03033O77716J016458l92793m09484O62764j161824
1691b52828J459213J541405j908644k41936k94619k80827m74315J86249J538089
$$ plain form
1758 -318354 -300029 -829623 -505877 -88550 203122 124535 213537 619950 -406549 6568
1748 6568 -219283 990973 491384 -1748327 -2190391 -1292677 -478458 55577 -1179116 -1911817
1738 -1911817 -826012 -511078 -785811 -1483389 -1659609 -1556356 -1190390 -147677 -1651434
1729 -1651434 -1612431 -608584 315982 1298783 678394 -116411 -764269 -352821 -30487 -1118340
1719 -1118340 -2311482 -2049687 -1690870 -1093195 -1218839 -92128 767527 860377 1468709
1710 1468709 1122038 1622715 -645939 -338127 9647 272799 281292 704294 248764 1213262
1700 1213262 1828735 -242632 -645665 32051 1048509 655716 246232 908996 -252828
1691 -252828 1206385 2747790 839146 597210 302591 21764 -452551 -266302 1271787
1682A271787L46194r61506O09625K51549j153606j544792j455024J221351J330780
1673h3642J034563r79582P52725o8469R37740r49866o56979J535678J334295n67611
1663B288852k238594Q95523K09307m91979J52349r93262j079072O56589j073061
1654a673348j51579J450434n35289j85505R12352P51257j186473j129797L51527
1645a396421J832391M10822j225081Q15346j92672k47066j050963O59930J515647
1636A121933J198189j042198m41720r58568q16178J46270Q47190j19509j108114
1627a172705K463104J254345k489860n73282m73991Q0698o99673M75256o66320
1618a802428K48501P00686J044307j300970N0428R94032J471314N75969k615185
$$ plain form
1682 1271787 1617981 656475 1266100 1517649 364043 -1180749 -2635773 -1414422 -83642
1673 -83642 950921 -28661 724064 655595 1593335 643469 -13510 1522168 2856463 2288852
1663 2288852 50258 945781 1155088 663109 815458 -177804 -1256876 -600287 -1673348
1654 -1673348 -1824927 -374493 -909782 -1095287 -182935 568322 -618151 -1747948 -1396421
1645 -1396421 435970 846792 -378289 437057 244385 -2681 -1053644 -393714 1121933
1636 1121933 2320122 1277924 836204 -122364 -938542 -792272 54918 -64591 -1172705
1627 -1172705 1290399 2544744 54884 -518398 -992389 -911691 -1611364 -1136108 -1802428
1618 -1802428 -1553927 -853241 191066 -1109904 -1059476 -65444 1405870 1981839 -633346
1609f33346P104M74639j199633J83256n84813J49399j09493k302725L055475M20974
1599e39163j80116o69435J061185l43109j15625j063093O71497J885872j435093
1590g27080J22984l85169L51999M48984r09754K42704L53178o73416O66567J880226
1580A371223j645777N16634M14971k10773m67812R94324l54882j209266O64616
1571G3258j819729K53633R9796n03850n3200l26661J456647N94039j042994M45411
1561h23650j57983J408542j245290K117414q25380j012871p13171o22637Q13063
1552a061963J8175L17223o31294l2785Q76395J027166j87724o93716J71653l70918
1542e67788J357643n73485J62082l60626j32750j109454n91366J948073j902765
$$ plain form
1609 -633346 -626242 -151603 -1351236 -1167980 -1752793 -1603394 -1712887 -4015612 -960137 -539163
1599 -539163 -719279 -1388714 -327529 -670638 -786263 -1849356 -1177859 708013 -727080
1590 -727080 -604096 -989265 -637266 -188282 -1098036 -855332 -502154 -1175570 -509003 1371223
1580 1371223 -274554 242080 657051 446278 -21534 972790 617908 -591358 73258
1571 73258 -1746471 -1492838 -1393042 -1896892 -1950092 -2276753 -820106 -226067 -1269061 -823650
1561 -823650 -981633 426909 -818381 1299033 473653 -539218 -1252389 -1875026 -1061963
1552 -1061963 -1043788 -726565 -1357859 -1390644 -514249 512917 325193 -368523 -196870 -567788
1542 -567788 789855 216370 378452 17826 -114924 -1224378 -1815744 132329 -1770436
1533a770436K03888O75070K38103O80076n49345Q50245Q255j474874J74407L11076
1523f53535R99742q37615q88791k439721J608422p6596J962359k5243j227992
1514a578970o39065j071486K327911q5378N02661j61602P24642r95824M13699
1505e63412L434456j666480j82349J25167k278604j019081j38673J152280P68986
1496c67710p91603O66500J371279O94307j470745K48036j042341p56011K83339
1487a164949J956537o96218k09294M43161l65216O63455o6409Q99962o48478p21499
1477I1052j055942R47679K66393j349332n66765J158887N29733j188311j62164
1468a328770J2942P0052J312763k23613M73047p54092m85525M74615j097410K15492
$$ plain form
1533 -1770436 -1566548 -891478 -653375 26701 -522644 327601 335856 -1139018 -964611 -653535
1523 -653535 346207 -491408 -1380199 -3819920 -2211498 -2288094 -325735 -350978 -1578970
1514 -1578970 -2218035 -3289521 -961610 -1046988 -544327 -705929 18713 -977111 -563412
1505 -563412 2871044 1204564 1022215 1147382 -1131222 -2150303 -2288976 -1136696 -367710
1496 -367710 -1159313 -492813 878466 1572773 102028 350064 -692277 -1448288 -1164949
1487 -1164949 791588 95370 -113924 329237 -35979 627476 561067 1461029 812551 91052
1477 91052 -964890 -17211 249182 -1100150 -1666915 -508028 21705 -1166606 -1328770
1468 -1328770 -1315828 -1245776 66987 -156626 316421 -437671 -923196 -448581 -1545991 -1330499
1458a330499J445412J402607j557628j590094P40342p50950k31352Q26420M29606
1449f16136J496578l19776j95888J072597j126086j092458R94411q89338j524756
1440b200852K423673J000040N68250m81122j931255M84573K87103J029604O03952
1431A783966o61386P5795l76857j481803O87939j296462k8845Q3162n84534J711435
1421h7590n33159l66091j444656N17389P9067J182391q31700r36974K479489q31074
1411g72908P5778J164068K33593l37650j54437M04485M86818p65665l04566M77951
1401E07467k73780R73313N95453j018895j006516J096660j31248o33733p43244
1392f34523J08722K94841R83144j271036N30981q19776N38537J32880R07134m56224
$$ plain form
1458 -1330499 114913 1517520 -40108 -1630202 -889860 -1640810 -1872162 -1045742 -616136
1449 -616136 880442 560666 364778 1437375 311289 -781169 213242 -676096 -2200852
1440 -2200852 222821 1222861 1791111 1309989 -621266 -136693 150410 1180014 1783966
1431 1783966 1122580 1198375 821518 -660285 27654 -1268808 -1297653 -1214491 -1799025 -87590
1421 -87590 -620749 -986840 -2431496 -1914107 -1835040 -652649 -1484349 -2421323 58166 -772908
1411 -772908 -697130 466938 700531 362881 208444 612929 1099747 334082 29516 507467
1401 507467 233687 1207000 1802453 783558 -222958 873702 742454 108721 -634523
1392 -634523 -525801 -230960 752184 -518852 12129 -807647 -269110 -136230 770904 314680
1382C14680k514099j494850P99124K315915N28890n39550Q658m23260K03770M87961
1372c12761R05536J155919j585570r24840j38407j617069J4591K618083l55464
1363b39982q01732j476845J504496J720737J3024O23492p02375j719556J09388
1354i69353J000512J932482j171512j092988O80222J076681M26379R44295L77989
1345C204707j695524j390270r66154P94194O10010j255091R65586l75611j762078
1336a870231R25898N62559J638612J72797J87870k79375j634111J159623r5643
1327G67999k6680l81022k98523k541614P64622K160000R42510j249066K14087
1318C52313J056015m31657l55325O9547p28571j504463R07527J958791j473277
$$ plain form
1382 314680 -2199419 -3694269 -2895145 -579230 -50340 -589890 -581232 -1004492 -800722 -312761
1372 -312761 592775 1748694 163124 -761716 -900123 -2517192 -2502601 115482 -239982
1363 -239982 -1041714 -2518559 -1014063 706674 719698 1343190 640815 -1078741 -969353
1354 -969353 31159 1963641 792129 -300859 379363 1456044 1882423 2826718 3204707
1345 3204707 1509183 118913 -847241 -53047 556963 -698128 267458 -108153 -1870231
1336 -1870231 -944333 -381774 1256838 1429635 1617505 1338130 -295981 863642 767999
1327 767999 741319 360297 61774 -2479840 -1715218 444782 1387292 138226 352313
1318 352313 1408328 976671 621346 690893 -37678 -1542141 -634614 1324177 -149100
1309a49100p23638J394852m08307R99029p23714j871493P89930j34006O72574
1300a53873J157491R7678m48412l29342l14536J190406m49086j460273J38062
1291e71885K26367j146732R92216L05204k76900l35280O13156J101746j442126
1282e34234j85973L97462N61313j746241k75038P53831K730050j075700l66971
1273B58499q10697M16276K42221N43810k12286N50930o04273k13317o94877j299251
$$ plain form
1309 -149100 -872738 522114 113807 1112836 389122 -1482371 -692441 -826447 -153873
1300 -153873 1003618 1101296 652884 323542 9006 1199412 750326 -709947 -571885
1291 -571885 -345518 -1492250 -500034 -194830 -471730 -807010 -193854 907892 -534234
1282 -534234 -720207 -322745 238568 -1507673 -1782711 -1028880 1701170 625470 258499
1273 258499 -552198 -135922 106299 650109 437823 988753 384480 171163 -523714 -1822965
$$ [...]
##END NTUPLES=NMR SPECTRUM
##END=
