##TITLE=1H_CG-1189-b1
 CDCl3
 8 sc, 
 1.4.2024
##JCAMPDX= 6.0         $$ Bruker NMR JCAMP-DX V2.0
##DATA TYPE= NMR SPECTRUM
##DATA CLASS= NTUPLES
##ORIGIN= UXNMR, Bruker Analytische Messtechnik GmbH
##OWNER= root
$$ XWIN-NMR		Version 3.5
$$ Mon Apr  1 16:17:17 2024 Russian Standard Time (UT+4h)  she@DPX200
##.OBSERVE FREQUENCY= 200.1311
##.OBSERVE NUCLEUS= ^1H
##.ACQUISITION MODE= SIMULTANEOUS
##.ACQUISITION SCHEME= undefined
##.AVERAGES= 8
##.DIGITISER RES= 18
##SPECTROMETER/DATA SYSTEM= spect
##.PULSE SEQUENCE= zg30
##.SOLVENT NAME= D2O
##.SHIFT REFERENCE= (INTERNAL, D2O, 0, 16.7903)
##AUDIT TRAIL= $$ (NUMBER, WHEN, WHO, WHERE, WHAT)
$$ ##TITLE= Audit trail, XWIN-NMR		Version 3.5
$$ ##JCAMPDX= 5.01
$$ ##ORIGIN= Bruker BioSpin GmbH
$$ ##OWNER= she
$$ F:/spectra/data/she/nmr/H-F/1/pdata/1/auditp.txt
$$ ##AUDIT TRAIL=  $$ (NUMBER, WHEN, WHO, WHERE, WHAT)
(   1,<2024-04-01 16:16:20.17 +0400>,<she>,<DPX200>,
      <created by zg, POWCHK disabled, PULCHK disabled
       configuration hash MD5:
       00 E9 B6 7A A2 85 ED C7 34 08 36 98 17 FE 4E 26
       data hash MD5: 16K
       F5 17 65 44 C9 6C AB 8C AF 88 43 08 29 90 3D D0>)
(   2,<2024-04-01 16:16:22.87 +0400>,<she>,<DPX200>,
      <Start of raw data processing
       efp BC_mod = 2 LB = 0.24 FT_mod = 6 PKNL = 1 PHC0 = -25297.98 PHC1 = 8.187312 SI = 16K 
       data hash MD5: 16K
       F2 1E 93 DA 14 A6 67 C2 5B 02 10 94 AC ED DA 51>)
(   3,<2024-04-01 16:16:35.62 +0400>,<she>,<DPX200>,
      <pk PHC0 = 0.3525986 PHC1 = 0 
       data hash MD5: 16K
       2F 65 F1 3A 3B A3 24 71 33 97 BC 7C C5 D9 21 53>)
(   4,<2024-04-01 16:16:38.67 +0400>,<she>,<DPX200>,
      <abs ABSG = 5 
       data hash MD5: 16K
       52 67 2B 60 4D CC 61 64 2B BA BC D7 1A 39 B7 08>)
$$ ##END=
$$ 
$$ hash MD5
$$ 34 7B B2 74 06 44 E6 BF AA C8 C8 08 9E FF 80 CA
##$RELAX= 
##$RELAX= 
##$RELAX= 
##$RELAX= 
##$RELAX= 
##$RELAX= 
$$ Bruker specific parameters
$$ --------------------------
##$DU= <F:/spectra>
##$EXPNO= 1
##$NAME= <H-F>
##$PROCNO= 1
##$TYPE= <nmr>
##$USER= <she>
##$AMP= (0..31)
100 100 100 100 100 100 100 100 100 100 100 100 100 100 100 100 100 100 
100 100 100 100 100 100 100 100 100 100 100 100 100 100 
##$AQSEQ= 0
##$AQ_mod= 1
##$AUNM= <au_zg>
##$AUTOPOS= <>
##$BF1= 200.13
##$BF2= 200.13
##$BF3= 200.13
##$BF4= 200.13
##$BF5= 200.13
##$BF6= 200.13
##$BF7= 200.13
##$BF8= 200.13
##$BYTORDA= 1
##$CFDGTYP= 0
##$CFRGTYP= 5
##$CHEMSTR= <none>
##$CNST= (0..31)
1 1 145 1 1 1 1 1 1 1 1 1 1 1 1 1 1 1 1 1 1 1 1 1 1 1 1 1 1 1 1 1 
##$CPDPRG= <>
##$CPDPRG1= <>
##$CPDPRG2= <>
##$CPDPRG3= <>
##$CPDPRG4= <mlev>
##$CPDPRG5= <mlev>
##$CPDPRG6= <mlev>
##$CPDPRG7= <mlev>
##$CPDPRG8= <mlev>
##$CPDPRGB= <>
##$CPDPRGT= <>
##$D= (0..31)
0 1.2 0 0 0 0 0 0 0 0.06 0 0.03 0 0 0 0 0.0002 0 0 0 0 0 0 0 0 0 0 0 0 
0 0 0 
##$DATE= 1711973779
##$DBL= (0..7)
120 120 120 120 120 120 120 120 
##$DBP= (0..7)
150 150 150 150 150 150 150 150 
##$DBP07= 0
##$DBPNAM0= <>
##$DBPNAM1= <>
##$DBPNAM2= <>
##$DBPNAM3= <>
##$DBPNAM4= <>
##$DBPNAM5= <>
$$ [...]
##$SUBNAM3= <"">
##$SUBNAM4= <"">
##$SUBNAM5= <"">
##$SUBNAM6= <"">
##$SUBNAM7= <"">
##$SUBNAM8= <"">
##$SUBNAM9= <"">
##$SW= 18.051750892319
##$SWIBOX= (0..15)
0 0 2 0 0 0 0 0 0 0 0 0 0 0 0 0 
##$SW_h= 3612.71676300578
##$TD= 16384
##$TD0= 1
##$TE= 0
##$TE2= 300
##$TE3= 300
##$TEG= 300
##$TL= (0..7)
0 120 120 120 120 120 120 120 
##$TP= (0..7)
150 150 150 150 150 150 150 150 
##$TP07= 0
##$TPNAME0= <>
##$TPNAME1= <>
##$TPNAME2= <>
##$TPNAME3= <>
##$TPNAME4= <>
##$TPNAME5= <>
##$TPNAME6= <>
##$TPNAME7= <>
##$TPOAL= (0..7)
0.5 0.5 0.5 0.5 0.5 0.5 0.5 0.5 
##$TPOFFS= (0..7)
0 0 0 0 0 0 0 0 
##$TUNHIN= 0
##$TUNHOUT= 0
##$TUNXOUT= 0
##$USERA1= <user>
##$USERA2= <user>
##$USERA3= <user>
##$USERA4= <user>
##$USERA5= <user>
##$V9= 5
##$VALIST= <valist>
##$VCLIST= <CCCCCCCCCCCCCCC>
##$VD= 0
##$VDLIST= <DDDDDDDDDDDDDDD>
##$VPLIST= <PPPPPPPPPPPPPPP>
##$VTLIST= <TTTTTTTTTTTTTTT>
##$WBST= 1024
##$WBSW= 4
##$XGAIN= (0..3)
0 0 0 0 
##$XL= 0
##$YL= 0
##$YMAX_a= 719587
##$YMIN_a= -976283
##$ZGOPTNS= <>
##$ZL1= 120
##$ZL2= 120
##$ZL3= 120
##$ZL4= 120
##$ABSF1= 16.90712
##$ABSF2= -1.144773
##$ABSG= 5
##$ABSL= 3
##$ALPHA= 0
##$AQORDER= 0
##$ASSFAC= 0
##$ASSFACI= 0
##$ASSFACX= 0
##$ASSWID= 0
##$AUNMP= <proc_1d>
##$AZFE= 0.1
##$AZFW= 0.1
##$BCFW= 0
##$BC_mod= 2
##$BYTORDP= 0
##$COROFFS= 0
##$CY= -3
##$DATMOD= 1
##$DC= 0
##$DFILT= <>
##$DTYPP= 0
##$F1P= 0
##$F2P= 0
##$FCOR= 1
##$FTSIZE= 16384
##$FT_mod= 6
##$GAMMA= 0
##$GB= 0
##$INTBC= 1
##$INTSCL= 3.70164e-10
##$ISEN= 128
##$LB= 0.24
##$LEV0= 0
##$LPBIN= 0
##$MAXI= 10000
##$MC2= 0
##$MEAN= 0
##$ME_mod= 0
##$MI= 1.114404
##$NCOEF= 0
##$NC_proc= -5
##$NLEV= 6
##$NOISF1= 3.799351
##$NOISF2= 2.8
##$NSP= 0
##$NTH_PI= 0
##$NZP= 0
##$OFFSET= 16.79033
##$PC= 1
##$PHC0= -25297.63
##$PHC1= 8.187312
##$PH_mod= 1
##$PKNL= yes
##$PPARMOD= 0
##$PSCAL= 0
##$PSIGN= 0
##$REVERSE= no
##$SF= 200.129546116935
##$SI= 16384
##$SIGF1= 3
##$SIGF2= 2
##$SINO= 5.538805
##$SIOLD= 16384
##$SREGLST= <1H.CDCl3>
##$SSB= 0
##$STSI= 16384
##$STSR= 0
##$SW_p= 3612.71676300578
##$SYMM= 0
##$S_DEV= 0
##$TDeff= 16384
##$TDoff= 0
##$TI= <>
##$TILT= no
##$TM1= 0
##$TM2= 0
##$TOPLEV= 0
##$USERP1= <user>
##$USERP2= <user>
##$USERP3= <user>
##$USERP4= <user>
##$USERP5= <user>
##$WDW= 1
##$XDIM= 16384
##$YMAX_p= 357796387
##$YMIN_p= -302734
$$ End of Bruker specific parameters
$$ ---------------------------------
##NTUPLES= NMR SPECTRUM
##VAR_NAME=  FREQUENCY,     SPECTRUM/REAL,   SPECTRUM/IMAG
##SYMBOL=    X,             R,               I
##VAR_TYPE=  INDEPENDENT,   DEPENDENT,       DEPENDENT
##VAR_FORM=  AFFN,          ASDF,            ASDF
##VAR_DIM=   16384,         16384,           16384
##UNITS=     HZ,            ARBITRARY UNITS, ARBITRARY UNITS
##FACTOR=    0.220516191357247, 1,           1
##FIRST=     3360.24129953661, 0,            0
##LAST=      -252.475463469172, 0,           0
##MIN=       -252.475463469172, -302734,     0
##MAX=       3360.24129953661, 357796387,    0
$$ Real data points
##PAGE= N=1
##DATA TABLE= (X++(R..R)), XYDATA
$$ [...]
6710e1167J806R036J8439K704n9032K4414R149j8041l2022J6572j9880j5250q962
6697a22234j7523M6524J286K2706K8967k0062j3512L6577o7006Q97M4081O2898
6685C599M9045M408J3840J3246J8513j7236L1223K0797o0572p1141Q657n4405
6673d0026J3413Q9607N8253j6604p5072M9070j6093J5208R178J9824m1177j5579
6661E0002L392m3765l9789O2587O035j5286m2289L3956L8412k065m9695N4102
6649E5597k0331l950J6783N909k5454j6676K8681l1450L7005K8667j3755k7045
6637C3981M829N9267M0484j7954k8139j3891O307J327m6429J4797j4506L1577
6625G1650k5045n5300r721K4969n480L1930k153k8871O0401K0344P20j8508j5187
$$ y = [-51167, -49361, -40325, -21886, -19182, -78214, -53800, -44651, -62692, -94714, -78142, -98022, -113272, -122234, -139757, -93233, -91947, -69241, -40274, -60336, -73848, -37271, -104277, -103380, -59299, 3599, 52644, 57052, 70892, 84138, 102651, 85415, 116638, 137435, 76863, 5722, 14379, -40026, -26613, 62994, 121247, 104643, 29571, 78641, 62548, 77756, 86934, 106758, 65581, 50002, 53394, 9629, -30160, 32427, 38462, 23176, -19113, 14843, 53255, 51190, 1495, 55597, 35266, 31316, 48099, 54008, 28554, 11878, 40559, 9109, 46114, 74781, 61026, 33981, 38810, 98077, 138561, 120607, 92468, 78577, 84884, 86211, 39782, 54579, 40073, 71650, 46605, -8695, -18416, 6553, 1073, 33003, 30850, 1979, 62380, 82724, 83444, 64936, 49749]
6612D9749p338j6926M9890k7652m6781Q4973J2403j02363q52R697m3798R7075
6600E8077k8635p0361m3340O7245K3066k0461k3894J05365j5942k6957K685m16
6588B6432l1610J3878N9407l7915q6769l8347M5117j9574M1353N2602J1457R371
6576D5402o2317K85L5913N3268r759k5116N6886j1015n3293M7295K9129n7297
6564D9381J0365k0012J2167M1995o1326q474M0212L1002J609o0860o2305l103
6552b9349L0753L1239l3503J7600j7121K0058J1151j7874q930m1204j6317L5508
6540a7989K4735p683m7322m1679J6566R442L6342k0395j1819m6032J2475L019
6528i0340J3724J4248N2240m0978K3886P678J6667j7477l3481J309Q881M0004
$$ y = [49749, 42411, 25485, 75375, 47723, 942, 85915, 98318, -4045, -4897, 4800, -38998, 58077, 29442, -40919, -84259, -17014, 6052, -14409, -38303, 67062, 51120, 24163, 26848, 26432, -5178, 8700, 68107, 30192, -56577, -94924, -49807, -69381, -28028, 24574, 36031, 45402, -16915, -16630, 19283, 72551, 62792, 37676, 94562, 83547, 30254, 77549, 106678, 49381, 59746, 39734, 51901, 93896, 32570, 24096, 64308, 95310, 96919, 36059, -26246, -29349, 1404, 32643, -860, 16740, -381, 19677, 30828, 12954, 4024, -37180, -53497, -17989, 6746, -937, -48259, -89938, -73372, -63930, -27588, -47983, -59802, -105834, -93359, -90340, -76616, -62368, -10128, -51106, -27220, -19542, -2875, -20352, -53833, -52524, -43643, -3639]
6516c639l4832N286j6428L4057K947j832J3370m8239j2865J03416J5059o9624
6504a3324l3196o7283K8222Q2856j6322o7010J639J7406m077L2867L4429m402
6492h195r1686P2425Q8000r9100J9065J2295m9444M5900m4399j12067M8145J6601
6480a02460k0935M1590L0272m920r32l6552j2630M707M5711j7057K1245K0971
6468c0990k2559j0466j3778J5039k7310K4486l8538m2238n0058Q2454j2424O8076
6456e8306K5107j3934K0300n2013l580m6958N0937M7973J3551m143k5185J2092
6444c4159l4186k5204K6617N3264m8203j0931l6184m0335P7244L4399K735j6770
6432e1713j4023N1424n1266K155M7792J3266o660o3526j8305K0819K4177k9189
$$ y = [-3639, -38471, -33185, -49613, -15556, -12609, -14441, -1071, -49310, -62175, 41241, 56300, -13324, -46520, -113803, -85581, -2725, -19047, -86057, -84418, -67012, -71089, -38222, -3793, -8195, -99881, -27456, 60544, -38556, -19491, -7196, -56640, -10740, -55139, -167206, -119061, -102460, -123395, -81805, -51533, -56453, -57385, -93937, -106567, -101860, -56149, -73206, -51961, -30990, -53549, -64015, -77793, -62754, -90064, -65578, -104116, -146354, -196412, -113958, -126382, -58306, -33199, -47133, -26833, -78846, -82426, -129384, -78447, -30474, -16923, -21066, -46251, -34159, -68345, -93549, -66932, -13668, -61871, -72802, -108986, -149321, -72077, -37678, -34943, -51713, -65736, -14312, -65578, -63423, -15631, -2365, -9025, -72551, -90856, -70037, -45860, -75049]
6420g5049O2358p082k0126P722R561j7620J2648m0890j1001L0199j2201J8360
6408d3121Q917k1887l392m0614J648K194M0606k6108n1732K4929J7441l6608R743
6395a17984Q7778L7301o2593L4333p4579m8305O9518l6105L5080O6441K6886l8066
6383b0295n0058J6255M7721l8645n5188L378L7366j296k4564k6615M5044P8903
6371A2006K3339k1447k1783O3116o7649K1414K9712r1288M9580M81M4512L9553
6359H1546r1828j6652J621L3671k4644j2752R877Q431l1901J6650N6727k542j04307
6346g6103L7580M0279J3291m7454j9059M8524N180L3806o8037N483l7340J50184
6334H6334q304j446n8684J210N1858k5809L1048M412j1645L2618o5536l0051O4908
$$ y = [-75049, -12691, -19773, -39899, -32177, -22616, -40236, -27588, -68478, -79479, -49280, -61481, -43121, -34204, -56091, -59483, -100097, -98449, -96255, -55649, -81757, -133489, -108560, -91119, -127727, -117984, -30206, 7095, -55498, -21165, -95744, -144049, -74531, -110636, -75556, -9115, 17771, -20295, -70353, -54098, -6377, -45022, -100210, -96832, -59466, -60762, -85326, -111941, -66897, 12006, 35345, 13898, -7885, 55231, -12418, 8996, 38708, -52580, -3000, -2519, 41993, 81546, -10282, -26934, -25313, 8358, -16286, -29038, -19161, -10730, -42631, -25981, 30746, 28204, -76103, -38523, 1756, 15047, -32407, -51466, -2942, 2238, 36044, -31993, -26510, -63850, 86334, 78030, 76584, 17900, 19110, 70968, 45159, 76207, 80619, 68974, 101592, 36056, 6005, 70913]
6321G0913j7094l5918k2329k2430K6026l9225P6701j6470M3708p8037L156l3074
6309d4073n1873N4730L7730k545k1998L6754j10491o462K7327N7715O2350j4149
6297B5015M0196j8188l6311K4160k4459m5984k2383L5647j0484j8268k6895K7333
6285e0621l7977Q660K4465J5204L7173j7491l8922J963o2080L4715R040l9928
6273a15799r914J2480o629O6667r32K887L3875K0331J763k5127K632O324p6332
6260h7774J2979M0402l344j8602L4645K8127j3164k4500N930m8656M0600L6473
6248C116n9117j6501L0708q802n0874J3074R786L6213l1471O0005P999R274J2251
6235A5661K851K8842r4484l8757P2747M1464r610m6498P7285k7227n4796O9443
$$ y = [70913, 53819, 17901, -4428, -26858, -832, -40057, 36644, 20174, 63882, -14155, -10999, -44073, -95946, -41216, -3486, -6031, -28029, 8725, -101766, -108228, -80901, -23186, 39164, 25015, 65211, 47023, 10712, 34872, 10413, -35571, -57954, -22307, -32791, -51059, -77954, -50621, -88598, -79938, -55473, -40269, -3096, -20587, -59509, -57546, -119626, -84911, -75871, -115799, -125713, -113233, -119862, -53195, -54127, -51240, -17365, 2966, 4729, -20398, -17766, -11442, -87774, -74795, -34393, -37737, -56339, -21694, 6433, -6731, -31231, -25301, -73957, -33357, 3116, -56001, -72502, -41794, -50596, -101470, -88396, -78610, -42397, -73868, -13863, -5864, 3410, 15661, 18512, 47354, -47130, -85887, -13140, 28324, 18714, -27784, 49501, 22274, -32522, 36921]
6223C6921L1686j587m8301L8915j06308j862J8227K4548M8319j2618k7098P625
6211H467m848o234J9742j3309L9096l5344K0276J8592L9347l6893n4367Q4328
6199G8853L7157j8246j1684m330l7710j9897K6431m7009J2045l6478K5190R371
6187A3693K7225m3323j4036m5125N015O7446j1412M2153k4638j9322l8769n6401
6175i7494M9431K9239k590P97n3417O6949N0180m2696j0023q8610N1363L8528
6163h343L242M953r4821n996P345k2047N1246J6490m3984j6815M8893L7206L1245
6150H614k6338n4444j9469k289M4553r16J6711l7065j3138j0728k5237L5694M133
6137g9919K2652Q700n1810N1881j5124j6914m2130K1830j7194k4980L3291M7283
$$ y = [36921, 68607, 67020, 18719, 57634, -48674, -50536, -32309, -7761, 40558, 27940, 842, 8467, 3619, -2615, 17127, 3818, 42914, 7570, 27846, 46438, 85785, 48892, -5475, 78853, 116010, 97764, 86080, 81750, 44040, 24143, 50574, 3565, 15610, -20868, 4322, 13693, 40918, -2405, -16441, -61566, -56551, 10895, -517, 41636, 16998, -2324, -41093, -97494, -48063, -18824, -21414, -20617, -74034, -7085, 43095, 399, -9624, -98234, -46871, -8343, -5101, -148, -94969, -100965, -93620, -115667, -64421, -47931, -91915, -108730, -59837, -22631, 8614, -17724, -72168, -91637, -93926, -49373, -50289, -33578, -70643, -83781, -94509, -119746, -84052, -79919, -57267, -48567, -100377, -48496, -63620, -80534, -122664, -100834, -118028, -143008, -109717, -62434]
6125f2434j6441m8122J2278K6876Q795l729o1142K9334L1127K1345n3754J806
6113a14061Q8351q0976J1464J9267k5009M5932m0929J3554Q3497l2260k2859j2324
6101f6353J343j9176n9201N9977L9937m8288k3405M0915J4068j3612K1381k6618
6089g9032k9969J4184L9942K5599q825n3473l7182J09882O630k0484o3153l115
6077i8996M3064l8279o9956m9860J25575p179J2033N395M2364n882K6520o136
6065b1337m8755L9629p3648o8414R3272k4638P113M9582k1080j0662K5908J393
6053e1637J994n8224M1907l8324J3409J4413o726J0321J7913n620j9237n7805
6041a37616J7199M9820Q692j4366j1525k1240M4892L0995L905j5267J3074M5103
$$ y = [-62434, -78875, -126997, -114719, -87843, -79048, -82777, -143919, -114585, -83458, -62113, -115867, -114061, -25710, -106686, -95222, -75955, -100964, -55032, -95961, -82407, 1090, -31170, -54029, -66353, -65010, -84186, -143387, -83410, -43473, -91761, -115166, -74251, -60183, -73795, -52414, -79032, -109001, -94817, -54875, -29276, -38101, -91574, -128756, -18874, -12244, -32728, -95881, -98996, -55932, -94211, -164167, -214027, -88452, -95631, -83598, -78203, -35839, -41721, -15201, -21337, -70092, -30463, -104111, -172525, -79253, -103891, -96778, -47196, -68276, -78938, -53030, -51637, -49643, -107867, -65960, -104284, -90875, -76462, -83188, -72867, -54954, -60574, -79811, -137616, -120417, -70597, -61905, -76271, -87796, -109036, -64144, -33149, -29244, -44511, -31437, 13666]
6029A3666o8763l2955l610k2771L8026j2568k1725J9550k2981k3371N0608M5027
6017d1867n9346J7169J7047O1893m1577k093p0797R787l594k4211M3800J1324
6005h2465l4178M420K1969p850K0677M9550k9891L389k2872O973O2217L291m6663
5992e1433j7089j3069j2909j8165N4149n9120j0700J3749M4260M0517j1887m8061
5980h9758q348m4290K9832L1918k3036j1322l173K0564k6616K4472J1511J8222
5968g0024M1092n2005L8762J996o3817J2351J9966l3560k5489K3256R860o103
5956a03715K3718J7859o0297P0042L457l0607k079o3758K509O747L1289n2006
5944a56841q291O5084k782m0358L82L6001K5698k2628K2945M6851j6014k3701
$$ y = [13666, -55097, -88052, -91662, -114433, -76407, -88975, -110700, -91150, -114131, -137502, -86894, -41867, -101213, -84044, -66997, -5104, -46681, -48774, -119571, -109784, -113378, -137589, -93789, -82465, -116643, -112223, -90254, -98104, -77427, -27877, -57768, -54379, -77251, -70278, -8061, -4770, -51433, -68522, -81591, -94500, -112665, -58516, -117636, -128336, -114587, -70327, -29810, -41697, -89758, -98106, -142396, -112564, -80646, -103682, -115004, -118177, -97613, -124229, -99757, -88246, -70024, -28932, -80937, -42175, -40179, -103996, -91645, -71679, -105239, -130728, -107472, -97612, -103715, -79997, -62138, -122435, -52393, -48936, -79543, -81622, -145380, -142871, -136124, -104835, -156841, -165132, -100048, -102830, -143188, -142806, -106805, -81107, -103735, -80790, -33939, -49953, -73654]
5932g3654k6717R381k7242J4909K822j892k431L8872m7845M0895O4287m5596O3203
5919H992j9861p6734k8927n3492N0360m0195K4406j1586J31033q377r6557K2899
5907i8039M8477L1385l5674J1292O834m896q495n774o399K9165j9616K7560L0095
5894E915n5145l973k8485l6296j1604L8697o7142L4749L3843L2076j6659l0649
5882a04673J8824p0575p040K7523L613j5054J8855K2905k0326m175J4350l432
5870a19205L9446M1335m2252L283M0015L3976o0830j2905K2605j9292l839K8072
5858d9591p720k5607K6310o334J2894J0356J3046j3585k2500L9471q165J9976
5846a1449k8736K0849m2860o9589o397M6773Q5883l7954L4954o880L391l9497
$$ y = [-73654, -100371, -90990, -118232, -103323, -100501, -102393, -104824, -65952, -113797, -72902, -8615, -54211, 8992, -10869, -87603, -116530, -170022, -119662, -159857, -135451, -147037, -16004, -24381, -120938, -98039, -49562, -18177, -53851, -42559, -35725, -40621, -49116, -54890, -61289, -32124, -51740, -24180, 5915, -49230, -53203, -81688, -117984, -129588, -90891, -158033, -123284, -89441, -57365, -74024, -104673, -85849, -156424, -163464, -135941, -132328, -147382, -128527, -105622, -125948, -130123, -115773, -119205, -79759, -38424, -80676, -77393, -37378, -3402, -64232, -77137, -54532, -73824, -77663, -49591, -57311, -82918, -56608, -62942, -50048, -39692, -26646, -40231, -62731, -23260, -31425, -11449, -40185, -19336, -62196, -131785, -138182, -91409, -5526, -43480, -8526, -15406, -12015, -51512]
5834e1512p641j3183k3802l5975M1540j2765N9364L2731o2262L1791k697q462
5822e2873r058J6471L8601R319l9562j1869N2353k7167k8008n411j9822p1096
5810a48122N2529r754P4270K5068n0507R360N1477M029o363o2239k5566J4222
5798g1596K7843L4166n026P8689o361J0807M4056j6133o158N1197l2600k7950
5786H0934l6065k2030j9312o7766M0912K5624l6204l212L1656l945K8276k8186
5774i318l0118o903L0184o0626O9118O960p5688O4601m7642L7500O234m4986L1060
5761b9624K8405O419L7621p0600k5005k0393k1645J262L3437Q3094j6204k6579
5749a9812O462r770N6527J2292j6248l872L7642N167m7935K0316K6218K6852M9981
$$ y = [-51512, -59153, -72336, -96138, -132113, -90573, -103338, -43974, -11243, -73505, -41714, -44411, -52873, -61931, -45460, -6859, 2460, -37102, -48971, 3382, -23785, -51793, -57204, -77026, -148122, -95593, -105347, -31077, -6009, -56516, -47156, 4321, 8350, 1987, -60252, -85818, -71596, -43753, -9587, -14613, 64076, 57715, 68522, 112578, 96445, 90287, 141484, 108884, 80934, 44869, 22839, 3527, -64239, -23327, 2297, -33907, -37119, -5463, -9408, 18868, -9318, -39436, -46339, -16155, -76781, -7663, -703, -76391, -11790, -59432, -21932, -15698, -60684, -29624, -1219, 5200, 42821, -27779, -52784, -73177, -94822, -93560, -60123, 22971, 6767, -19812, -13350, -23120, 33407, 45699, 29451, 25579, 63221, 68388, 20453, 40769, 66987, 93839, 143820]
5736A43820L2415o9523n2989L3325Q6653l0019j4588p214L8904k0167j1585k7814
5724A01218j5782P7519l08m9818k5298M0990k0123p332N8306j8060q1140M3202
5712A03374k6631j3740n0631N5600J8633l9834p0006J5447P0145q849o3972J7653
5700G189Q235p154P018M6135l0164k6041L771l8389N2356K144n2189l4422M1855
5687a9656j7610N9292n2008o7089P931O9120Q2491O473m3079n2674N5048j6717
5675A1522k9012m8416L5216k405J0084n6856o570O1250j7313l16M5474o5388M6265
5662a6465R7466k2732J6756k9925n2780k7509k0530Q6516l3377k3926P660m1915
5650f0761O3721K560n17K997n260j6327k0918l270o8766N3300M7036M196l0097
$$ y = [143820, 176235, 106712, 53723, 87048, 173701, 143682, 129094, 121880, 160784, 140617, 129032, 101218, 85436, 162955, 162647, 112829, 87531, 128521, 108398, 101066, 159372, 141312, 60172, 103374, 76743, 63003, 12372, 67972, 86605, 46771, -23235, -7788, 62357, 53508, -10464, 7189, 15424, 8270, 15288, 61423, 31259, 5218, 8989, -29400, 22956, 25100, -27089, -61511, -19656, -37266, 22026, -29982, -97071, -89140, -20020, 62471, 68944, 25865, -26809, 28239, 11522, -17490, -65906, -30690, -33095, -23011, -79867, -86437, -25187, -42500, -42816, 2658, -62730, -16465, 81001, 58269, 75025, 45100, -7680, -35189, -55719, 30797, -2580, -26506, -18846, -60761, 2960, 5520, 5003, 8000, 2740, -13587, -34505, -37775, -106541, -53241, -6205, -2009, -32106]
5637c2106N303M3709J9642l4203n9064K764M857Q4395k9319j6267K5907j9872
5625d254k6814n306k2210K0700j6435P9892k8216J8904K7076n511l6590l4798
5613c3562M984L1144K6238N886r7344o242P9001k292J5596j3201p4428O6453K1016
5600B3249K463M0666p4460l0782N9250m2979L16J0750o7193O1822N6629l7684
5588B047l9557P1877k2708q9378M7502M6531O4807p4232l7728r661j3873Q0490
5576B6117R506K0761kk2870j7966l036M003k3279L1257o7265j6758M2536J3791
5563c205O893k1502m7253P0282p201L5088l600j7992J5798j3414P0323l3137k3444
5550B7636N1273K7422p2100n7091R574J2224m3589J9595j2493M2839N4603L1130
$$ y = [-32106, -26803, 16906, 36548, 2345, -56719, -53955, -49098, 35297, 5978, -10289, 15618, -4254, -31068, -36374, -58584, -37884, -54319, 25573, -2643, 16261, 43337, 37826, 1236, -33562, -28578, 2566, 28804, 34690, -62654, -68896, 10105, 7813, 23409, 10208, -64220, 2233, 23249, 25712, 66378, -8082, -38864, 20386, -22593, -22277, -11527, -78720, -16898, 39731, 2047, -37510, 34367, 11659, -77719, -30217, 16314, 81121, 6889, -30839, -40500, -54373, 26117, 35623, 56384, 56382, 33512, 15546, 12510, 16513, -6766, 24491, -42774, -59532, -16996, -3205, 3688, -17814, -65067, 5215, -1986, 33102, 29502, 11510, 27308, 13894, 84217, 51080, 27636, 78909, 106331, 34231, -22860, -13286, -1062, -44651, -25056, -37549, 5290, 59893, 91023]
5538I1023j47295j807P1314J7026m8548L6088Q406M293K0311M5461N2177j4401
5526A34048q5875j6668M9212j8895n1765J8706K2876k0195K5130L0786p7942L4422
5514D3840M6448j5794l612J7609N274J0280m6647p6627K2396J07817J5132m0849
5502H5267L238n1173J3029L2584j7538K015P594L947j5131k262R397j6290L4986
5489H9663m096l745k112L2802J9331k5740k4864Q833l5792l2886J1393L5396J6490
5476H4673l7923J0222M8247r6549j8870Q3130q502l1921K7731O5501o500l9436
5464G9803J0343n1405L0502L2837L1034o606K733N4885k4323n3491O3283M4253
5452B13848M136j9286n7510k8531K0646l3287j7706Q439L8956k5806m197M3089
$$ y = [91023, -56272, -58079, 13235, 30261, -18287, 17801, 26207, 30500, 50811, 96272, 148449, 134048, 48173, 31505, 80717, 61822, 10057, 28763, 51639, 31444, 56574, 87360, 9418, 43840, 90288, 74494, 70882, 88491, 93765, 104045, 57398, -19229, 3167, 110984, 126116, 85267, 88505, 37332, 50361, 82945, 65407, 67422, 75016, 78963, 63832, 61570, 70967, 54677, 89663, 85567, 81822, 79710, 112512, 131843, 106103, 81239, 90072, 54280, 21394, 32787, 68183, 84673, 46750, 56972, 105219, 8670, -10200, 72930, 64428, 32507, 60238, 125739, 119239, 79803, 90146, 38741, 69243, 102080, 133114, 126508, 129241, 184126, 159803, 106312, 169595, 213848, 217984, 198698, 141188, 112657, 133303, 100016, 82310, 90749, 129705, 103899, 99702, 142791]
5440A42791K9617j2114L4827L7906q3767M6417j046m9083J4533J9287j0496n6946
5428A11926j4017O2887K6589K7289k3316q096O512M6931p43j4160K8904q6020
5416A64686k5087j0122N3375j7460j1156N1459m746Q505L5809K8390p20J4392
5404B87325o0941m1349M1346N4080m2554l6437l5376O6397P6667P688l5887P359
5392B88318o8429o9794K3690L3623M6955l125o3056j0044L7116J05975m835K7173
5380C43567L1806l1959k7321L2702O1174j4922l0323J5484K4297j6097l07p1014
5368C17087M0396k8403n320L1429o9263Q622K6685O4449lj5052k4741m321L6048
5355C77613j7005J0882k044J9933J3115l2457J4153L7455j5136R616j9858o2187
$$ y = [142791, 172408, 160294, 195121, 233027, 149260, 195677, 194631, 145548, 160081, 179368, 168872, 111926, 97909, 160796, 187385, 214674, 191358, 183262, 189774, 236705, 235962, 221802, 250706, 164686, 139599, 129477, 182852, 165392, 154236, 205695, 200949, 209454, 245263, 273653, 272933, 287325, 226384, 185035, 226381, 280461, 237907, 201470, 166094, 232491, 309158, 316846, 280959, 288318, 219889, 150095, 173785, 207408, 254363, 251238, 188182, 178138, 215254, 321229, 316394, 343567, 375373, 343414, 316093, 348795, 409969, 395047, 364724, 380208, 404505, 388408, 388101, 317087, 357483, 329080, 323760, 355189, 285926, 294548, 321233, 385682, 385679, 370627, 345886, 341565, 377613, 360608, 371490, 369446, 389379, 402494, 370037, 384190, 421645, 406509, 416125, 396267, 334080]
5343C34080K4428P2922k2850Q96n5047o1327M7487K3101j2226K6651P7411k8919
5331D26607l4505M3317N0304O239m2139l1416K729N8858m2695O7371M1795M2005
5319E88470j8m7997j6375P0649R6551J2396r649p737J0792O7327Rr798P2082j6512
5305H10190p9686K8476M1951N3835j4671L995R2944m1934n5610K8631K3378M4384
5293I35883M0520M043J9910K8832k8989M0449k75M1178o103n1601J9292n3259
5281I89880K1496k3826j8115M6790l5623m5209j3260N0663O87K281J3519J876
5269I91159j1986J4374P0346m4879l038Q944M6933l5130n59m4291K827k5116k7022
5256I42562o558K5115l9612P0349k1897n186O7484K4881K1296j8147m8693j8239
$$ y = [334080, 358508, 431430, 408580, 409476, 354429, 293102, 340589, 363690, 351464, 378115, 455526, 426607, 392102, 435419, 485723, 491962, 449823, 418407, 421136, 479994, 437299, 504670, 546465, 588470, 588452, 540455, 524080, 594729, 691280, 703676, 694027, 686290, 697082, 764409, 764418, 754620, 826702, 810190, 730504, 758980, 800931, 854766, 840095, 844090, 937034, 895100, 839490, 868121, 891499, 935883, 976403, 980446, 1000356, 1029188, 1000199, 1040648, 1040373, 1081551, 1075448, 1023847, 1043139, 989880, 1011376, 987550, 969435, 1016225, 980602, 935393, 922133, 972796, 973483, 975764, 989283, 991159, 979173, 993547, 1063893, 1019014, 1015976, 1024920, 1071853, 1036723, 1036164, 991873, 994700, 969584, 942562, 936004, 961119, 921507, 991856, 969959, 964773, 1032257, 1057138, 1078434, 1060287, 1011594, 993355]
5244I93355m305k0040Q351O5913r646o2467L0454k8426K6012Q1449K0190l2656
5232A068184L4236O2530k6327K1589M9963J3071N0550J04926J5238j4670j3374
5221A365916k2441M0288k6516j9912l8046l5274J6381M0371n3433l8565m587N1006
5209A275188K5955k0984P615P5534N6705R3773K6269j0687J31422M2373l9669
5198A663494P8755P4894m0124L043m1466l9983l1326k9462j4473L6441k2578n9104
5186A578111J4730j5146o782M0572j9407M3984O7308J02049M0170Q2021L9377
5175A966987J5481J09073J4365M7666n21O300M6345K6578j46938j12542J5701
5164A988495k9018m2865j431N969N6543M9508L1872K6927k0533j0429O1074j8874
$$ y = [993355, 989050, 969010, 977361, 1043274, 1033628, 971161, 1001615, 973189, 999201, 1080650, 1100840, 1068184, 1102420, 1164950, 1138623, 1160212, 1210175, 1223246, 1273796, 1378722, 1393960, 1379290, 1365916, 1343475, 1383763, 1357247, 1337335, 1299289, 1264015, 1280396, 1320767, 1267334, 1228769, 1224182, 1275188, 1301143, 1280159, 1287774, 1363308, 1420013, 1513786, 1540055, 1529368, 1660790, 1703163, 1663494, 1742249, 1817143, 1777019, 1780062, 1738596, 1698613, 1667287, 1637825, 1623352, 1659793, 1637215, 1578111, 1592841, 1577695, 1570913, 1611485, 1592078, 1636062, 1703370, 1805419, 1845589, 1927610, 1966987, 1982468, 2091541, 2105906, 2153572, 2153051, 2159351, 2205696, 2232274, 2085336, 1972794, 1988495, 1959477, 1916612, 1915181, 1921150, 1977693, 2027201, 2059073, 2086000, 2065467, 2055038, 2116112, 2097238]
5152B097238M0109J11601M4199M5665M0564L8092K5986M7173O764p1838K6621
5141B452174k3488n8317L7355k1089j2573K4268O484K5528r38j7262r713J2575
5129B415004m1496M3708P3931j0946n613R3086O3988P5875K6258P2836m6976n347
5117B754308J12806k4264j1879O9564P0488J02394K326O7503J18679J59486K3859
5106C445270K1971M5524p8866n2342K8992k7431K5497J5235Q5854J48166J067
5095C658937O7534O8688k1747K5206Q2833J15281J45159O1064l1766m7745P334
5084D130778m0065R494K9318P0554L1167J51083M8287l6960L6003N4427l0518
5073D453568K4200P7677J16314J16445J08061J13930J21055l8414K0258k7709
$$ y = [2097238, 2137347, 2248948, 2293147, 2338812, 2379376, 2417468, 2443454, 2490627, 2497391, 2425553, 2452174, 2428686, 2370369, 2407724, 2386635, 2374062, 2398330, 2404814, 2430342, 2429404, 2412142, 2402429, 2415004, 2373508, 2417216, 2491147, 2480201, 2474588, 2567674, 2631662, 2707537, 2733795, 2806631, 2759655, 2754308, 2867114, 2842850, 2830971, 2900535, 2971023, 3073417, 3075743, 3143246, 3261925, 3421411, 3445270, 3467241, 3512765, 3433899, 3381557, 3410549, 3383118, 3408615, 3423850, 3509704, 3657870, 3658937, 3726471, 3795159, 3773412, 3798618, 3881451, 3996732, 4141891, 4202955, 4171189, 4123444, 4130778, 4090713, 4100207, 4129525, 4200079, 4231246, 4382329, 4430616, 4393656, 4429659, 4484086, 4453568, 4477768, 4555445, 4671759, 4788204, 4896265, 5010195, 5131250, 5092836, 5113094, 5085385]
5063E085385m4380j3265k0387R5127R8337J14829J23656N5516J42842P3593P4279
5052E785532R0220J07313J18539J21659O8206J25191O2788J24100J92837J35067
5042F931452J66259J31378J85298K26274J99477J68809J22790J79794J67407J55693
5032H634631J60916K03171J12812J97134K59567J62405K08358K64780K54085J63124
5022A0620983K02028L00260K84190K81059K02478K77642L41028L31264L22470
5013A3163402K81103M27292L33949L85429M37321M29954M17658M02807M88885
5004A6767800L76808L52443L79244L69953M66138M30861N26257N25627N84892
4995B0780023N57088P29042O70020O96784Q41155Q83306R05643R35388J046620
$$ y = [5085385, 5041005, 5027740, 5007353, 5102480, 5200817, 5315646, 5439302, 5494818, 5637660, 5711253, 5785532, 5875752, 5983065, 6101604, 6223263, 6291469, 6416660, 6479448, 6603548, 6796385, 6931452, 7097711, 7229089, 7414387, 7640661, 7840138, 8008947, 8131737, 8311531, 8478938, 8634631, 8795547, 8998718, 9111530, 9308664, 9568231, 9730636, 9938994, 10203774, 10457859, 10620983, 10823011, 11123271, 11407461, 11688520, 11890998, 12168640, 12509668, 12840932, 13163402, 13444505, 13871797, 14205746, 14591175, 15028496, 15458450, 15876108, 16278915, 16767800, 17144608, 17497051, 17876295, 18246248, 18712386, 19143247, 19669504, 20195131, 20780023, 21337111, 22066153, 22736173, 23432957, 24274112, 25157418, 26063061, 26998449, 28045069]
4986B8045069J182478J262115J431724J542984J659227J956214K257283K515194
4978D1852288K897513L389792M040339M785415N756744O232147N767362L887906
4970G8609506P51398k118556l430755l165357k125793r76710P8594J236005K445222
4961G1303554L688434M211520L834752K516972R73019O25242J611968L210921
4953I1976382M191905L994491K403771J05724j760276k264365j395333K79518
4945I7531817K190926L618749M069522L315003J417968n83004j782078k333916
4937A07444987k520861k197743j186380K47859J826626K220211Q61288k022028
4929A04673959n119607o754377o238123m659485l081511j704558n32950P12970
$$ y = [28045069, 29227547, 30489662, 31921386, 33464370, 35123597, 37079811, 39337094, 41852288, 44749801, 48139593, 52179932, 56965347, 62722091, 68954238, 74721600, 78609506, 79360904, 77242348, 73811593, 70646236, 68520443, 67543733, 67622327, 68858332, 71303554, 74991988, 79203508, 83038260, 85555232, 86528251, 87153493, 88765461, 91976382, 96168287, 100162778, 102566549, 102672273, 100911997, 98647632, 97252299, 97531817, 99722743, 103341492, 107411014, 110726017, 112143985, 111560981, 109778903, 107444987, 104924126, 102726383, 101540003, 101787862, 103614488, 105834699, 106695987, 104673959, 99554352, 92799975, 86561852, 81902367, 78820856, 77116298, 76583348, 77296318]
4921G7296318J880610L015145M209449N330271O280267O583242N654985L098093
4913A13348380q02629n043879q237594r422440r013523p795017o580780n380084
4905F1072434m429239l417709k564958j998552j278677o40779j22230K30566P20554
4896D7571410J264550J793405K298470K849355L393921L598780L136485J842463
4888F7748839k44052k514073m340876n207159n305200m900090m405894l842770
4880C6988725l289009k840380k359737k078239j844698j483694j228660j157417
4872B0706891r52109q46600o93457n59721m43126m27262l99709k75714j99425
4863A5909768j27524k62400k11267j78640j75017k54951k63287j92038k68456
$$ y = [77296318, 79176928, 82192073, 86401522, 91731793, 98012060, 104595302, 110250287, 113348380, 112545751, 107501872, 99264278, 89841838, 80828315, 73033298, 66452518, 61072434, 56643195, 53225486, 50660528, 48661976, 47383299, 46742520, 46620290, 46850856, 47571410, 48835960, 50629365, 52927835, 55777190, 59171111, 62769891, 65906376, 67748839, 67504787, 64990714, 60649838, 55442679, 50137479, 45237389, 40831495, 36988725, 33699716, 30859336, 28499599, 26421360, 24576662, 23092968, 21864308, 20706891, 19754782, 18908182, 18214725, 17655004, 17211878, 16784616, 16384907, 16109193, 15909768, 15782244, 15519844, 15308577, 15129937, 14954920, 14699969, 14436682, 14244644, 13976188]
4854A3976188l12214l23376k82325k42807k56391j05126o8635q9571q2370j15171
4844A2098202j31432K1146k8247J611J8252P0633N8497J13849Q7805M4942K1399
4833A2376657k4836n5173n1302l893R8295J29804K01248K57448K95107K87068
4823A3510423M19362N85476N11177P22960P84542O91248N96087K98142J8280k56830
4813A7880867n12473n58361m77040m27474m04789k53431k60737J1064Q0205L3558
4803A5111389J68926J33404K41959M30979M85923O94450Q59520J017078J172752
4794B0316380J448611J612256J691914J426484Q50703O0153q80894j615607j974392
4785B2935608k030042j792782j607054j240882j076335q40383o64905n15655l48391
$$ y = [13976188, 13663974, 13340598, 13058273, 12815466, 12559075, 12453949, 12385314, 12295743, 12213373, 12098202, 11966770, 11987916, 11959669, 11961280, 11979532, 12050165, 12108662, 12222511, 12310316, 12355258, 12376657, 12351821, 12296648, 12245346, 12241453, 12339748, 12469552, 12670800, 12928248, 13223355, 13510423, 13929785, 14515261, 15026438, 15749398, 16533940, 17225188, 17821275, 18119417, 18137697, 17880867, 17368394, 16810033, 16332993, 15905519, 15500730, 15247299, 14986562, 14997626, 15077831, 15111389, 15280315, 15413719, 15655678, 16086657, 16572580, 17267030, 18126550, 19143628, 20316380, 21764991, 23377247, 25069161, 26495645, 27346348, 27406501, 26525607, 24910000, 22935608, 20905566, 19112784, 17505730, 16264848, 15188513, 14348130, 13683225, 13167570, 12819179]
4776A2819179j95537q312O1101K25917K89134L89351M30478M32882N13790N47930
4766A5505913N47865M92506J95467j44210n77596r69689j087663j146676j147582
4757A1668335j035048q98723o52497n86322o40432m68600m04825l51858l21725
4748F308305k69470k06137k23094j21595q6701j49749j02766p0277J5027m1459
4738E052084j16721q9474m713r4899j05418k4371r8776p3797j22079o593m8337
4727D266906j71826j30338k1985n4690k662q4693j07773M1212j6738l5575m5556
4716C636282P194M611n8267R8056J0959J9696K0966j1701J9130P4100R5036m8429
4704C867633p3073k666j4715n5510K2031N1836n7291M519J4603N7434N59k8388
$$ y = [12819179, 12623642, 12615330, 12676431, 12902348, 13191482, 13580833, 14011311, 14444193, 14957983, 15505913, 16053778, 16546284, 16741751, 16597541, 16019945, 15050256, 13962593, 12815917, 11668335, 10633287, 9734564, 9082067, 8495745, 7855313, 7386713, 6981888, 6630030, 6308305, 6038835, 5832698, 5609604, 5488009, 5401308, 5251559, 5148793, 5078516, 5093543, 5052084, 4935363, 4845889, 4841176, 4746277, 4640859, 4616488, 4517712, 4443915, 4321836, 4315243, 4266906, 4095080, 3964742, 3942757, 3888067, 3885405, 3800712, 3692939, 3734151, 3717413, 3681838, 3636282, 3643476, 3648087, 3589820, 3687876, 3698835, 3718531, 3739497, 3727796, 3746926, 3821026, 3916062, 3867633, 3794560, 3791894, 3777179, 3721669, 3743700, 3795536, 3738245, 3742764, 3757367, 3814801, 3815360, 3786972]
4692C786972k3054r8431n0579K0203q877k8960k0328M9205O0207n2758r978Q2271
4680C705893K9839k7254J3371K5020o2020R7416R6345P4855k2826O4465R7880
4669D092984P0060O7319j0372J1175m4676n7305m9305p0105o1665o3556r131k4930
4657C850493p5107K3504Q3171Q1375k7141J6072Q0439O4793K2305O9947N7355
4646D247206M0606O9358J50674J40839R2994J3131Q7643n3583j05060o9593o81
4635D613534j0527j263m2382K7572J00397J02756N9841P7952M3155P8718K0802
4624E070555O2818O3461O1182Q5235J07641J39901J35641R9005J06514R6139J5368
4613F043460J932Q2844O5997L7471J19701N1476J03110O2992J38048J14933J85989
$$ y = [3786972, 3763918, 3665487, 3614908, 3635111, 3626234, 3597274, 3576946, 3626151, 3686358, 3633600, 3623622, 3705893, 3735732, 3708478, 3721849, 3746869, 3684849, 3782265, 3878610, 3953465, 3930639, 3995104, 4092984, 4163044, 4230363, 4219991, 4231166, 4186490, 4129185, 4079880, 4009775, 3948110, 3884554, 3875423, 3850493, 3775386, 3798890, 3882061, 3963436, 3936295, 3952367, 4032806, 4097599, 4119904, 4189851, 4247206, 4287812, 4357170, 4507844, 4648683, 4741677, 4754808, 4842451, 4788868, 4683808, 4614215, 4613534, 4603007, 4601744, 4559362, 4586934, 4687331, 4790087, 4849928, 4927880, 4971035, 5049753, 5070555, 5133373, 5196834, 5258016, 5343251, 5450892, 5590793, 5726434, 5825439, 5931953, 6028092, 6043460, 6045392, 6128236, 6194233, 6231704, 6351405, 6402881, 6505991, 6568983, 6707031, 6821964, 7007953]
4602G007953J47436N9270N0221Q7661J19841R0125J16080J27181Q7708K33986
4592H127462K11147J51899J78699J90780J17283J05957K08798J92490R6680J84675
4582I765870J37165J75105K34039K00675J66596K05602J94060J90890J81634J71167
4572A1622803J64578K25317L16132K67012L72269L17409L83690L54555L22613
4563A4346378L04294M20050M50024L37235L43904M75457M72421M88050N51884
4554A8189697M19564M77109M84729N63896N57234O80469Q31429R43267J021069
4545B4168463J169218J290951J498517J701801J822151K061165K416782K703816
4537C8832864L047253L531836M067930M688579N002623M904861L962230J964710
$$ y = [7007953, 7155389, 7214659, 7264880, 7352541, 7472382, 7562507, 7678587, 7805768, 7893476, 8127462, 8338609, 8490508, 8669207, 8859987, 8977270, 9083227, 9292025, 9484515, 9581195, 9765870, 9903035, 10078140, 10312179, 10512854, 10679450, 10885052, 11079112, 11270002, 11451636, 11622803, 11787381, 12012698, 12328830, 12595842, 12968111, 13285520, 13669210, 14023765, 14346378, 14650672, 15070722, 15520746, 15857981, 16201885, 16677342, 17149763, 17637813, 18189697, 18609261, 19086370, 19571099, 20134995, 20692229, 21372698, 22204127, 23147394, 24168463, 25337681, 26628632, 28127149, 29828950, 31651101, 33712266, 36129048, 38832864, 41880117, 45411953, 49479883, 54168462, 59171085, 64075946, 68038176, 70002886]
4529G0002886n33129k785128m156039m332798l862353l273589k492178j850027
4521D6717645j203025n57681j0644O42006J160278J629234K225161K718187L246088
4512E6567249M069955M849250N918711P125337Q285330Q659824P119734L417691
4504A06013081j608100o258826q908241r383462q568983p435105o365035n292186
4496E2193143m255832l344006k536641j895428j297686q14774l51046K9733N08226
4487C8235689R35896J255907J668216K205728K646836K854600K459828J446490
4479E3709190j84913k024681l528018m259010m101285l677572l084737k609730
4471C0239244k267958j959512j609300j473517j311959j072989r93083q36403
$$ y = [70002886, 69469757, 66684629, 62528590, 58195792, 54333439, 51059850, 48567672, 46717645, 45514620, 44956939, 44946295, 45588301, 46748579, 48377813, 50602974, 53321161, 56567249, 60637204, 65486454, 71405165, 78530502, 86815832, 95475656, 102595390, 106013081, 104404981, 98146155, 89237914, 79854452, 71285469, 63850364, 57485329, 52193143, 47937311, 44593305, 42056664, 40161236, 38863550, 38048776, 37697730, 37727463, 38235689, 39171585, 40427492, 42095708, 44301436, 46948272, 49802872, 52262700, 53709190, 53524277, 51499596, 47971578, 43712568, 39611283, 35933711, 32848974, 30239244, 27971286, 26011774, 24402474, 22928957, 21616998, 20544009, 19550926, 18714523]
4463A8714523p73402n89661m56780m68501m31236l33911k15391j73762o1345p1324
4453A5139210q0040P7623L6800J36063K54334K80621L63231L31679L08258J43838
4443A6991617J02411n0717k48973l11107l41318l15234j77223j60872q0164n681
4433A5402739J6829O9991J28899J49028K07450K70247K57063K91022L22369L03110
4423A7418747L21843L94207M08449M79588M35472M34093L41484L13860L40777
4414B0888520K25574J06645J17708P7354J75801L30994K77437M01340M29255N85327
4404B3615955N95041N98544P50394R10665R09896J022410J202424J265522J499146
4395C2369997J732564J848070K215948K478133K859347L359061L973050M700996
$$ y = [18714523, 17941121, 17351460, 16894680, 16426179, 15994943, 15661032, 15445641, 15271879, 15210534, 15139210, 15059170, 15136793, 15173593, 15309656, 15563990, 15844611, 16207842, 16539521, 16847779, 16991617, 17094028, 17043311, 16794338, 16483231, 16141913, 15826679, 15649456, 15488584, 15408420, 15402739, 15419568, 15489559, 15618458, 15767486, 15974936, 16245183, 16502246, 16793268, 17115637, 17418747, 17740590, 18134797, 18543246, 19022834, 19458306, 19892399, 20233883, 20547743, 20888520, 21114094, 21220739, 21338447, 21415801, 21591602, 21922596, 22200033, 22601373, 23030628, 23615955, 24210996, 24809540, 25559934, 26470599, 27380495, 28402905, 29605329, 30870851, 32369997, 34102561, 35950631, 38166579, 40644712, 43504059, 46863120, 50836170, 55537166]
4387E5537166N485510O387028O665296N443767K756116q77602l764073m593528
4379G3039680l724524k465486j329680q3037J195087K474340L223125K804884
4371G5134389J322658j87146q55789k8734J522462L068613M000684L886485K527795
4362I0391417J57928k152970l065147k538847j111260J73872L99731n05548k260201
4353G9488975l731672m098244l347667k360683j351443k28643R77636K157399
4345F7505658K922136K526452O28476k328952n032366o087296n697911m675824
4337D9760373l700559k913234k180954j473590q03689l933M88383Q46470Q76831
4328D0896098L74542n85068j788420k558482k732012k645722k386185k198573
$$ y = [55537166, 61022676, 67409704, 74075000, 79518767, 82274883, 81397281, 77633208, 73039680, 69315156, 66849670, 65519990, 65436953, 66632040, 69106380, 72329505, 75134389, 76457047, 76269901, 75414112, 75385378, 76907840, 79976453, 83977137, 87863622, 90391417, 90549345, 88396375, 85331228, 82792381, 81681121, 81854993, 82254724, 81749176, 79488975, 75757303, 71659059, 68311392, 65950709, 64599266, 64370623, 65348259, 67505658, 70427794, 72954246, 73582722, 71253770, 66221404, 60134108, 54436197, 49760373, 46059814, 43146580, 40965626, 39492036, 38688347, 38684414, 39172797, 40019267, 40896098, 41270640, 40685572, 38897152, 36338670, 33606658, 30960936, 28574751, 26376178]
4320B6376178j853252j636525j275787r94464q80446o27907n06154l69892k17701
4311A8014050j14872r5217l9126O8413J72121K53577L38765M67250M88584L21331
4301A9874876j28748m64506q79188j147918j137091j113325j062926q75019p46159
4292A2319996o70219n53824n41854l88906l91620l10985k93117k74807k90768
4283H603896k49922j47579j43823j39702j61592p4280r7213j41134o6252j6115
4273G366284m9746p2106L7071j1900o3861o434J34947P7886Q0921J4830K5414
4262G533306K8143N7764Q8574J18550K16054L56023L66621L93442N13384N65657
4252A0237518O13744O41887P33895O42957N78016M23813J40705l21089n83514
$$ y = [26376178, 24522926, 22886401, 21610614, 20616150, 19735704, 19107797, 18601643, 18231751, 18014050, 17899178, 17803961, 17764835, 17833248, 18005369, 18258946, 18597711, 19064961, 19553545, 19874876, 19746128, 19281622, 18402434, 17254516, 16117425, 15004100, 13941174, 13066155, 12319996, 11649777, 11095953, 10554099, 10165193, 9773573, 9462588, 9169471, 8894664, 8603896, 8353974, 8206395, 8062572, 7922870, 7761278, 7686998, 7589785, 7448651, 7382399, 7366284, 7316538, 7244432, 7281503, 7269603, 7205742, 7199308, 7334255, 7412141, 7493062, 7507892, 7533306, 7561449, 7619213, 7707787, 7826337, 8042391, 8398414, 8765035, 9158477, 9671861, 10237518, 10851262, 11493149, 12227044, 12870001, 13448017, 13871830, 14012535, 13691446, 13107932]
4243A3107932p72127q09660q22517q40824q17733p92941o12800m85013m49253
4234F705064l48287k85002k31320j77050j76915p9200j51063j12750j48296j28620
4224D866561o8872j20581m8264n1122m8212r037p0232l014k5660K330P1128O0423
4212D555448P7410J00510Q1044J68005K07505L03874K97415L27190K14479m1816
4202F291064k65141m37253m79364l75723k81949k66019k59252k62929j45697j31990
4192C385747q6751p6398m9215o6641n0901R714P2M55L3253K4882o6092m9315J0239
4179C019049l3025p5465m8441m0454k4798k8390n9530q1285m4036K7641l1627
4168B579639k0109q795K7970J185p3309M4839M8894k0592O7159N456K8209K0022
$$ y = [13107932, 12335805, 11526145, 10703628, 9862804, 9045071, 8252130, 7639330, 7154317, 6705064, 6356777, 6071775, 5840455, 5663405, 5486490, 5407290, 5256227, 5143477, 4995181, 4866561, 4797689, 4677108, 4628844, 4577722, 4529510, 4520473, 4450241, 4447227, 4421567, 4423897, 4495025, 4555448, 4632858, 4733368, 4814412, 4982417, 5189922, 5493796, 5791211, 6118401, 6332880, 6291064, 6025923, 5588670, 5109306, 4733583, 4451634, 4185615, 3926363, 3663434, 3517737, 3385747, 3298996, 3222598, 3173383, 3106742, 3055841, 3065555, 3065627, 3066082, 3099335, 3124217, 3058125, 3008810, 3019049, 2986024, 2910559, 2862118, 2821664, 2796866, 2768476, 2708946, 2627661, 2583625, 2611266, 2579639, 2559530, 2550735, 2578705, 2579890, 2506581, 2551420, 2600314, 2579722, 2646881, 2652337, 2680546, 2700568]
4156B700568p5771J2479L8389k7821J4427N6749J25491K4819l2178P4992J64502
4145C076646J01226J14260J18175Q4527k4558p1582j10652j04653q7230r5296
4135C000863j56231o1605l8550m2984Q511K0803N201l3770m4416k3920P1018K2255
4123B727175j732J17429Q4119O1269J93159R8597J48790K27545K20990J91579
4113D068920L69574L50416M18954L56602J42748j03200l54264m84314l91579l36690
4103D037167l06732k15504j96783j37566r4027q0336n4100j09682n3140O3784
4093B853081R065k0351N2675L3010o758J50781J09697J65099K22366J61227J46758
4082C876650J94309K30445M02428M10479L50764K02246l4848l06204n28501m85759
$$ y = [2700568, 2624797, 2637276, 2675665, 2647844, 2662271, 2719020, 2844511, 2869330, 2837152, 2912144, 3076646, 3177872, 3292132, 3410307, 3494834, 3470276, 3398694, 3288042, 3183389, 3096159, 3000863, 2844632, 2783027, 2744477, 2701493, 2710004, 2730807, 2736008, 2702238, 2657822, 2633902, 2704920, 2727175, 2725443, 2842872, 2926991, 2988260, 3181419, 3280016, 3428806, 3656351, 3877341, 4068920, 4438494, 4788910, 5207864, 5564466, 5707214, 5604014, 5249750, 4765436, 4373857, 4037167, 3730435, 3514931, 3318148, 3180582, 3086555, 3006219, 2952119, 2842437, 2789297, 2853081, 2862146, 2841795, 2894470, 2927480, 2920722, 3071503, 3181200, 3346299, 3568665, 3729892, 3876650, 4070959, 4301404, 4703832, 5114311, 5465075, 5667321, 5632473, 5326269, 4797768, 4312009]
4072D312009l91950l39889l38374j81737j31136j51845p1284o5927m7501n6993
4062B535373P782k1725J3592O107O630j998L8715K7710m4519J5802K3994j3325
4050B594138N5311Q8089O5496J31273Q9032P3674M1526l4961j51048p6005j03539
4039B772986r1030p7903j7017J1083n3171j08328q9171m6421j41159q2240K5812
4028B103441k7544p379l2053K0824n0713k7910K7609j3157J4844j6753K6526l3894
4016A983841l6905l7024M0943L0292N284j0217L9382L3252M1262m3705O1327J18033
4004B225765M6705J18294J3718l3728K3188k6822n1954K7838m4253n5945k4616
3993B218190k7316q7375L8621J481m8246P8343K5329m4840M3976j1433K0704O9357
$$ y = [4312009, 3920059, 3580170, 3241796, 3060059, 2928923, 2777078, 2705794, 2639867, 2592366, 2535373, 2543155, 2521430, 2535022, 2541129, 2547759, 2545761, 2584476, 2612186, 2567667, 2583469, 2607463, 2594138, 2649449, 2737538, 2803034, 2934307, 3023339, 3097013, 3138539, 3103578, 2952530, 2876525, 2772986, 2681956, 2604053, 2587036, 2598119, 2544948, 2436620, 2347449, 2301028, 2159869, 2077629, 2103441, 2075897, 2068518, 2036465, 2057289, 2006576, 1978666, 2006275, 1993118, 2007962, 1991209, 2017735, 1983841, 1946936, 1909912, 1950855, 1981147, 1986431, 1976214, 2015596, 2048848, 2090110, 2046405, 2107732, 2225765, 2272470, 2390764, 2404482, 2370754, 2393942, 2367120, 2315166, 2343004, 2298751, 2242806, 2218190, 2190874, 2103499, 2142120, 2143601, 2095355, 2173698, 2199027, 2154187, 2198163, 2186730, 2207434, 2276791]
3981B276791L2198P8891Q3227Q5672J23323J04551P0801J69791J90759K77985
3971C493989J93096J58817K0536j95327k87844k31338j23961j81440j27193j39582
3961B579753j69819j63901r4237j5287n173k9257o2097n8866M048K6510j210l4420
3949A976044q318J0509k6562o9478K1753l8571L1515L6814k8252J3297K846M5024
3937A966621O3995N9423K5932K6455n1384j9665L6570j6737L4951k0026j2819
3926B093316O4269K9206k5421L1071L7599j6945R3573P0969J09557J53491P1330
3915B712015O1290J15356J58725J74127J73980K52562K47510L30374M69747N70965
3905E266651O11781M24584J71204l84354p10009n36930m08674k68089k57220k11325
$$ y = [2276791, 2308989, 2387880, 2471107, 2556779, 2680102, 2784653, 2855454, 3025245, 3216004, 3493989, 3687085, 3845902, 3866438, 3671111, 3383267, 3151929, 3027968, 2846528, 2719335, 2579753, 2409934, 2246033, 2151796, 2136509, 2131336, 2102079, 2039982, 1981116, 1985164, 2011674, 2010464, 1976044, 1967726, 1978235, 1951673, 1882195, 1903948, 1865377, 1896892, 1933706, 1905454, 1918751, 1921597, 1966621, 2030616, 2090039, 2115971, 2142426, 2091042, 2071377, 2107947, 2091210, 2126161, 2106135, 2093316, 2157585, 2186791, 2161370, 2192441, 2230040, 2213095, 2306668, 2377637, 2487194, 2640685, 2712015, 2773305, 2888661, 3047386, 3221513, 3395493, 3648055, 3895565, 4225939, 4695686, 5266651, 5878432, 6303016, 6474220, 6089866, 5379857, 4842927, 4434253, 4166164, 3908944, 3697619]
3895C697619j07241j25385r3659l7632r3385l9220O1704P4733P4581J30717J11681
3884C654513O9634J6452j01702k04085j51436j15816q6042p2632n9537N039m5502
3873B908886j2826N0159N192M503J3530L8459J768J5592l3000P2927L5444L61
3861C100995J3947L4258k1158K8504P0770K6805K6617M4808L7138Q801M0296J7759
3849C429540O5382K2488P1689L7719J1952L9098N353P9040R6791J13128J12512
3838D084692J90447L16526K62522K34871L52918J56955l9456j68287k48769j89086
3828D953333m6545m6050j01735k821p4419M9806J9268j2350l4305K3863j4870
3817D713175Q1253L9176O416j1252Q6188K4950O533R3737J05724J23335O1916
$$ y = [3697619, 3590378, 3464993, 3371334, 3333702, 3240317, 3201097, 3262801, 3337534, 3412115, 3542832, 3654513, 3724147, 3740599, 3638897, 3434812, 3283376, 3167560, 3081518, 3008886, 2949349, 2954388, 2908886, 2896060, 2946219, 2951411, 2955914, 2969444, 3007903, 3009671, 3025263, 2992263, 3065190, 3100634, 3100995, 3114942, 3149200, 3128042, 3156546, 3227316, 3254121, 3280738, 3325546, 3362684, 3371485, 3411781, 3429540, 3494922, 3517410, 3589099, 3626818, 3638770, 3677868, 3683221, 3762261, 3859052, 3972180, 4084692, 4275139, 4591665, 4854187, 5089058, 5441976, 5598931, 5559475, 5391188, 5142419, 4953333, 4906788, 4860738, 4759003, 4756182, 4681763, 4731569, 4750837, 4738487, 4704182, 4728045, 4713175, 4794428, 4833604, 4840020, 4828768, 4914956, 4939906, 4946439, 5040176, 5145900, 5269235, 5331151]
3806E331151R2450J62794J26462J30397K14315K96144Q7143K6350n8370j52152
3796F256684r8151j05920m3729q0879R834J7930l5134O921k042M1100P5700N1416
3784F093730N8761N0107m2069K0306R5889O3889J0661j543j7425J06835J24052
3773F563193K3838O0851K3055K2920P4651J37701J18753J04635J45759N0218L7414
3762G362988J52828J10645J43779J51570J65039J50660J26424Q3059J32305J84003
3752H763300K69140J62490J78279J98152K48748L06361K52350K54278J99712K80919
3742A1113729L17315K19365K94669J81203J42981K89088K93325J77813K74406
3733A3303894L03410J67099K70162K68948K23833K64173K70982K56754K67691
$$ y = [5331151, 5423601, 5586395, 5712857, 5843254, 6057569, 6353713, 6440856, 6467206, 6408836, 6256684, 6158533, 6052613, 6008884, 5928005, 5937839, 5955769, 5920635, 5927556, 5925514, 5966614, 6042314, 6093730, 6152491, 6202598, 6160529, 6180835, 6276724, 6340613, 6351274, 6349731, 6332306, 6439141, 6563193, 6587031, 6647882, 6670937, 6693857, 6768508, 6906209, 7024962, 7129597, 7275356, 7325574, 7362988, 7515816, 7626461, 7770240, 7921810, 8086849, 8237509, 8363933, 8446992, 8579297, 8763300, 9032440, 9194930, 9373209, 9571361, 9820109, 10126470, 10378820, 10633098, 10832810, 11113729, 11431044, 11650409, 11945078, 12126281, 12269262, 12558350, 12851675, 13029488, 13303894, 13607304, 13774403, 14044565, 14313513, 14537346, 14801519, 15072501, 15329255, 15596946]
3724A5596946L10666L29838L69616L27554L89147M20296M70172N28763M35219
3715A9178217M34850M25443M01567M16489N37709N49438N33134M75580M70075
3706B3422502O05607N62947N08946O04109O45595N63450O12878O43666O70080
3697B8839780P45853Q32976Q68981J056687J046063J026256J009954J059086J075303
3688C7560939J083488J147716J364327J452450J700061J887492K160879K465712
3680E0823064K704202K908118K707214K120720J487376J177194J606700K301050
3672F7835638L058134L748095M548825N676336O889151Q201985R640597J0945391
3664A20544152J2858723J5479859J9296427K4394444L1580281M1168010M6440503
$$ y = [15596946, 15907612, 16237450, 16607066, 16934620, 17323767, 17744063, 18214235, 18742998, 19178217, 19613067, 20038510, 20440077, 20856566, 21394275, 21943713, 22476847, 22952427, 23422502, 24028109, 24591056, 25100002, 25704111, 26349706, 26913156, 27526034, 28169700, 28839780, 29585633, 30418609, 31287590, 32344277, 33390340, 34416596, 35426550, 36485636, 37560939, 38644427, 39792143, 41156470, 42608920, 44308981, 46196473, 48357352, 50823064, 53527266, 56435384, 59142598, 61263318, 62750694, 63927888, 65534588, 67835638, 70893772, 74641867, 79190692, 84867028, 91756179, 99958164, 109598761, 120544152, 133402875, 148882734, 168179161, 192573605, 224153886, 265321896, 311762399]
3657C11762399L6837272R196716k7110765n2614112n0707806l7956303k8250954
3650A61156447k2663111j9678004j5406156j1361171q790825p008567n741827
3643G0506786m659259l795008l107719k393143j880404j354400j008223o46133
3635E1662497l73749q8384J87928M48528N98289Q30890R10804J132572J209412
3626E6518787J331348J360667J466843J466696J284740J123436Q92690O66585
3618F6111792M71084K78260K12421J39007L0522K4515j9500J7194K21555K98097
3608F7784947O61091R43133J223309J551792J893624K169943K387144K545301
3600H1160284K572361K647499K662111K477009K193653J712259R94766J23532
$$ y = [311762399, 348599671, 357796387, 330685622, 278071510, 227363704, 189407401, 161156447, 138493336, 118815332, 103409176, 92048005, 83257180, 76248613, 70506786, 65847527, 62052519, 58944800, 56551657, 54671253, 53316853, 52308630, 51662497, 51288748, 51200364, 51388292, 51836820, 52435109, 53265999, 54176803, 55309375, 56518787, 57850135, 59210802, 60677645, 62144341, 63429081, 64552517, 65445207, 66111792, 66582876, 66861136, 67073557, 67212564, 67243086, 67267601, 67248101, 67265295, 67486850, 67784947, 68446038, 69389171, 70612480, 72164272, 74057896, 76227839, 78614983, 81160284, 83732645, 86380144, 89042255, 91519264, 93712917, 95425176, 96419942, 96543474]
3592I6543474p31105j228700j617847j908037k066606k299744k479657k479190
3584H1732588k260964j886575j498501j041635m68455m8792L94715P91262J275553
3575G6989196J550074J844678K222604K431627K592810K781907K713259K412950
3567I5539105K023458J486959Q99526J56880o42149j340322j900440k223389k393084
3558I1606544k378567k098272j881780j565216j209969o37077l70631O398N17549
3549H1988979P80956J213988J528918J961883K407161K614726K684441K535270
3541I7716322J996788J521527J018689R14289P61984L25586k37610j044972j730524
3532A01242079k132739k323101k338312k231084k161579k026040j925372j633162
$$ y = [96543474, 95812369, 94583669, 92965822, 91057785, 88991179, 86691435, 84211778, 81732588, 79471624, 77585049, 76086548, 75044913, 74576458, 74527666, 74922381, 75713643, 76989196, 78539270, 80383948, 82606552, 85038179, 87630989, 90412896, 93126155, 95539105, 97562563, 99049522, 99949048, 100105928, 99463779, 98123457, 96223017, 93999628, 91606544, 89227977, 87129705, 85247925, 83682709, 82472740, 81835663, 81465032, 81471430, 81988979, 82769935, 83983923, 85512841, 87474724, 89881885, 92496611, 95181052, 97716322, 99713110, 101234637, 102253326, 103167615, 103929599, 104255185, 104017575, 102972603, 101242079, 99109340, 96786239, 94447927, 92216843, 90055264, 88029224, 86103852, 84470690]
3524H4470690j451436j234025j062063r67821q08531p93033o25244n60670o92821
3515G6275046o72903p58520r73358j079811j204445j430876j620801j884684k079864
3506F4569784k317279k441492k375446k202140k113010j962023j865658j801755
3498D7490981j617358j652124j593695j383486j348292j307432j213655j209371
3490C6165568j093281j072341r24464q99212r57292p87873o68327o45572n73703
3481B8543503m12580l89001k95774k35889k14174m9991n0179R2257J05481J22669
3471B7216322J18234M3011p086L7028r3310k59273l28411n64828n93032p57906
3461B4810749p49204q41221q33240p56505q44571q19100p94856o98466o04882
$$ y = [84470690, 83019254, 81785229, 80723166, 79755345, 78946814, 78153781, 77528537, 76967867, 76275046, 75602143, 74843623, 73870265, 72790454, 71586009, 70155133, 68534332, 66649648, 64569784, 62252505, 59811013, 57435567, 55233427, 53120417, 51158394, 49292736, 47490981, 45873623, 44221499, 42627804, 41244318, 39896026, 38588594, 37374939, 36165568, 35072287, 33999946, 33075482, 32176270, 31218978, 30431105, 29762778, 29117206, 28543503, 28130923, 27741922, 27446148, 27210259, 26996085, 26946094, 26895915, 26988172, 27093653, 27216322, 27334556, 27377567, 27370481, 27407509, 27314199, 27054926, 26726515, 26161687, 25568655, 24810749, 24061545, 23220324, 22387084, 21630579, 20786008, 19966908, 19172052, 18473586, 17868704]
3452A7868704n43323m93935l77069k81723k55352j84433j44546p2376k04454q8575
3442A5222918o5381k48218k38687k44327m07832m43423m28951m08284m82061n43446
3432A1712308n00710n10961m91291n55642m60808m00105m49048l82662l23998
3423G637083l42542l42124k06470k54149k88243k11567k16219j61593p2608k28504
3413E313064j87684l3216j34739j50947n3933j26311l9323j40994j31290l9288
3403D275339q5565n2283r7782r7428l8424k2479q3547q7746j28332p9421k2249
3392C480083l8390p1124n438k5340m5403o5821q2375q1619J2045j6885p5766m3824
3380B940143j2521j11395j7268P57o5392m839q6243k2804l880n5248L021o2995
$$ y = [17868704, 17325381, 16831446, 16454377, 16172654, 15917302, 15732869, 15588323, 15515947, 15311493, 15222918, 15157537, 14909319, 14670632, 14426305, 14018473, 13575050, 13146099, 12737815, 12255754, 11712308, 11211598, 10700637, 10209346, 9653704, 9192896, 8792791, 8343743, 7961081, 7637083, 7294541, 6952417, 6745947, 6491798, 6203555, 5991988, 5775769, 5614176, 5541568, 5313064, 5125380, 5092164, 4957425, 4806478, 4752545, 4626234, 4586911, 4445917, 4314627, 4275339, 4189774, 4137491, 4039709, 3942281, 3903857, 3881378, 3797831, 3710085, 3581753, 3502332, 3480083, 3441693, 3370569, 3365131, 3339791, 3294388, 3228567, 3146192, 3064573, 3076618, 3059733, 2983967, 2940143, 2927622, 2816227, 2798959, 2799716, 2734324, 2729485, 2643242, 2620438, 2616558, 2561310, 2564331, 2501336]
3368B501336k2185K5542P170j01142l8614p2862M6862J1490p6792j3871R939L2036
3356B308909J327l9458j9375M0409L0387M2037O5832P728j1231j9378R2127J15277
3344B614591l811J83926K72077J62960J87483O5290r9189l07908k52073j72446
3334B650900k38451j49072m6095j14991p6970n9227p0876k0538j21934M8266N361
3323A806373j9498M456m0188m8363L5388j3256r6676o66L9064r963o7651L1326
3311A620346J9808J4802o848k3176r1767k829N6869J327K9860J6359m1489n4336
3299A538926l2175n4889J7603k9581l7498J3823k7148o905K0933K2211K3183l3101
3287A415382J9958n2111l672K673K4688L5561N7597l9168m529J3691N191j5148
$$ y = [2501336, 2479151, 2504693, 2511863, 2410721, 2372107, 2299245, 2346107, 2357597, 2280805, 2266934, 2276873, 2308909, 2310236, 2270778, 2251403, 2291812, 2322199, 2364236, 2430068, 2437796, 2426565, 2407187, 2499314, 2614591, 2610780, 2794706, 3066783, 3229743, 3417226, 3482516, 3383327, 3075419, 2823346, 2650900, 2412449, 2263377, 2217282, 2102291, 2025321, 1966094, 1895218, 1874680, 1752746, 1801012, 1806373, 1786875, 1791331, 1751143, 1702780, 1738168, 1724912, 1628236, 1627570, 1666634, 1656671, 1589020, 1620346, 1640154, 1654956, 1648108, 1624932, 1533165, 1530336, 1587205, 1588532, 1618392, 1634751, 1593262, 1538926, 1506751, 1451862, 1469465, 1439884, 1402386, 1416209, 1389061, 1382156, 1403089, 1425300, 1448483, 1415382, 1435340, 1383229, 1379557, 1382230, 1406918, 1442479, 1500076, 1460908, 1456379, 1470070, 1475261, 1460113]
3275A460113K118k1546J3598P592L7581R994o7062m4312k8655N215m109K2428
3263A392955L2491M7944k0147q127J5430l209J5628j822L3672l966N215P3783
3251A579847J7035P7107k8195j10336O1492O7673l4834K046L2579j5126o0553
3240A588735j7148J7188k5708l1680J4896P367r026M0605N1323k5517k3202M5119
3228A632952M8939R366k636n670k9170N555R2051J8486m5801n4384q069J2615
3216A674234k532K0485o6605l16L5135n308l2634M0751K8426P2995K0631n8156
3204A727106j0869Q5506J08755L5620m3018J8921Q5829o673n4585L7597J2517
3193A996706L5929M5375j6751N7044P2047L6135M0870O1078J6927L7961M4271
$$ y = [1460113, 1462231, 1440685, 1454283, 1461875, 1499456, 1509450, 1442388, 1398076, 1369421, 1374636, 1370527, 1392955, 1425446, 1473390, 1453243, 1445116, 1460546, 1457337, 1472965, 1471143, 1504815, 1500849, 1506064, 1579847, 1596882, 1673989, 1645794, 1535458, 1596950, 1664623, 1629789, 1631835, 1664414, 1649288, 1588735, 1571587, 1588775, 1563067, 1531387, 1546283, 1553650, 1544624, 1585229, 1636552, 1611035, 1587833, 1632952, 1681891, 1691257, 1688621, 1682951, 1653781, 1659336, 1751387, 1769873, 1724072, 1669688, 1661619, 1674234, 1671702, 1692187, 1625582, 1625266, 1660401, 1655093, 1622459, 1663210, 1691636, 1764631, 1785262, 1727106, 1716237, 1801743, 1910498, 1946118, 1903100, 1922021, 2007850, 2001177, 1946592, 1984189, 1996706, 2032635, 2078010, 2061259, 2118303, 2190350, 2226485, 2267355, 2328433, 2345360, 2383321, 2427592]
3182B427592l4591j32593K0527m487j04817m5216j0261j7643P3971M9569k777
3171B219274p6434M5474K9086k5810j3338n5586L8936O4350o7119M0637n0691
3160B148779N082r309j2734Q8103L5374l4544L2924N2523K4410K3584k8755M8261
3148B373698M3887l3411K6707l8449Q8203N207n0958K0812M3257J009j140j3604
3136B465218J2768J842r384M4119j09434O5928P2240p352L140L2667J6864J03173
3124B691789k37k6675L39P3346l6370q3757n510j060p1086p892o0812k109k8886
3111B441080O4994L1422o1489K011R11J7301l4492K8086L5916P9462r5767M5670
3099B555105M9032O637k324M2167K2747M5254j1860l1967p366m6732k3335l1380
$$ y = [2427592, 2393001, 2260408, 2280935, 2276448, 2171631, 2126415, 2116154, 2098511, 2172482, 2222051, 2219274, 2142840, 2188314, 2217400, 2191590, 2178252, 2122666, 2161602, 2225952, 2158833, 2199470, 2148779, 2153861, 2144552, 2131818, 2219921, 2255295, 2220751, 2253675, 2306198, 2330608, 2354192, 2325437, 2373698, 2417585, 2384174, 2410881, 2372432, 2460635, 2465842, 2414884, 2435696, 2478953, 2479962, 2478822, 2465218, 2477986, 2479828, 2470444, 2514563, 2405129, 2471057, 2543297, 2535945, 2539085, 2571752, 2588616, 2691789, 2691552, 2664877, 2665216, 2738562, 2702192, 2618435, 2612925, 2611865, 2540779, 2532887, 2472075, 2469966, 2441080, 2506074, 2537496, 2476007, 2478018, 2478929, 2496230, 2461738, 2489824, 2525740, 2605202, 2509435, 2555105, 2604137, 2610774, 2608450, 2650617, 2673364, 2718618, 2706758, 2674791, 2667425, 2620693, 2597358, 2565978]
3087B565978J2899p473N4928k9342k1147K9217P1076j919M7138K5823K1724L3422
3075B802324l6641m0881O5319P5209q7841q022J2062j3853Q8325J5228K906n1240
3063B822895P540J8414M3903Q4501J1589J0169K1141k7151l6712n0079J11005
3052C017215O3789L2519j1433M4871k942J4130K9317l07J10886k414j5351L6675
3040C316955r792P5996O4649J9356N3442L2289k0543j0644M0637R1288R8074K8536
3028C780243M9940O4754L9459k6930L0904K6150O3627M9885R1621j8194M5072
3017D196531R1731J12308P9656J4264N3175Q0573L0289N4616L1268J11906M1842
3006D898159Q9928J28329J11879K4546P7431Q0959O9141J03926L2533O5705J60022
$$ y = [2565978, 2578877, 2571404, 2626332, 2596990, 2575843, 2605060, 2676136, 2674217, 2721355, 2747178, 2768902, 2802324, 2765683, 2724802, 2790121, 2865330, 2777489, 2769467, 2781529, 2767676, 2856001, 2871229, 2874135, 2822895, 2830435, 2848849, 2892752, 2977253, 2988842, 2999011, 3020152, 2993001, 2956289, 2906210, 3017215, 3081004, 3113523, 3102090, 3146961, 3144019, 3158149, 3187466, 3187159, 3298045, 3295631, 3280280, 3316955, 3307163, 3383159, 3447808, 3467164, 3520606, 3552895, 3532352, 3521708, 3562345, 3653633, 3751707, 3780243, 3830183, 3894937, 3934396, 3907466, 3938370, 3964520, 4028147, 4078032, 4169653, 4151459, 4196531, 4288262, 4400570, 4480226, 4494490, 4547665, 4628238, 4658527, 4713143, 4744411, 4856317, 4898159, 4988087, 5116416, 5228295, 5252841, 5330272, 5411231, 5480372, 5584298, 5616831, 5682536, 5842558]
2995E842558P7059P3799J41748Q4190R9810J30313J50423R3306O2217Q2507J61110
2984F999040J03954J54508J07332J09763J30156Q9859J27353J04744J97707K10240
2974H334656J60258J45006J32418J83530J13316K03447J70753J81279K11866K49640
2964A0086169K27004K52313K69637K67340K53877K70225K53937K93050L65869
2955A2539421M48900M04327M06662M84180M59939M56258N80651N95291N92296
2946A6967925O39377O97736O40502O13797O42845N53512N46704M28583M48209
2937B2179190M33113N08694M93067N16414O52025O05960P24829Q57704Q85450
2928B7856446R33323J028252Q68356Q01675P24095O40400P05010P37505P74601
$$ y = [5842558, 5919617, 5993416, 6135164, 6219354, 6319164, 6449477, 6599900, 6693206, 6755423, 6837930, 6999040, 7102994, 7257502, 7364834, 7474597, 7604753, 7694612, 7821965, 7926709, 8124416, 8334656, 8494914, 8639920, 8772338, 8955868, 9069184, 9272631, 9443384, 9624663, 9836529, 10086169, 10313173, 10565486, 10835123, 11102463, 11356340, 11626565, 11880502, 12173552, 12539421, 12988321, 13392648, 13799310, 14283490, 14743429, 15199687, 15780338, 16375629, 16967925, 17607302, 18305038, 18945540, 19559337, 20202182, 20755694, 21302398, 21730981, 22179190, 22612303, 23120997, 23614064, 24130478, 24782503, 25388463, 26113292, 26970996, 27856446, 28789769, 29818021, 30686377, 31488052, 32212147, 32852547, 33557557, 34295062, 35069663]
2919C5069663P34069P87467P10580Q30796P97607Q21833P46544P40715P58742
2910D1998016P49801O94889P18172O65252P41806R50534J203396J432336J593076
2901E0747278J857183J735939J459456J126780O82940M46802L21931L23060L66963
2892E9068332M11456M42666M48220M71253M35385M97961O07903O48929O49962
2883F3682067P00229N66357L89119L91539M25108N61105Q32458J075398J496007
2874G0119387J842315K024985K201504K086388J807019J490409J209508J105601
2866H3887116J154843J055525P73602O00337N50953N10835M22860L47613K42486
2857H9546170J80214J55663N0510J28678K71703K86767M23632O89755R08896R74706
$$ y = [35069663, 35803732, 36591199, 37301779, 38132575, 38930182, 39752015, 40498559, 41239274, 41998016, 42747817, 43442706, 44160878, 44826130, 45567936, 46518470, 47721866, 49154202, 50747278, 52604461, 54340400, 55799856, 56926636, 57609576, 58056378, 58378309, 58701369, 59068332, 59479788, 59922454, 60370674, 60841927, 61277312, 61775273, 62383176, 63032105, 63682067, 64382296, 64948653, 65337772, 65729311, 66154419, 66715524, 67547982, 68623380, 70119387, 71961702, 73986687, 76188191, 78274579, 80081598, 81572007, 82781515, 83887116, 85041959, 86097484, 86871086, 87471423, 88022376, 88533211, 88956071, 89303684, 89546170, 89726384, 89882047, 89932557, 90061235, 90332938, 90619705, 91043337, 91733092, 92641988, 93616694]
2847I3616694J041179Q22444O19924K33126j67466m77510n56143n00979k35760
2838I4395509n2957O8961J53795K16692J64419Q4594P0467j10040j33159j84007
2828I4674274j76617k02547k90235m52737n68831o42363n23741n19919n95363
2819I0701921p88972j144773j338375j436949j318472r98842q00192n57997l54691
2810H1962658k93721k58451k64245m28050o52704p39876q79287r05311q41924
2801G6699089p88687q65512q96195q54531p72018n54084l37273j79572j35829
2792G1315388l66482o79264j235373j612726j773520j723441j704867j527372
2784F0692343j427867j398374j383039j422297j504752j581379j649610j638287
$$ y = [93616694, 94657873, 95480317, 96100241, 96333367, 96165901, 95688391, 95132248, 94631269, 94395509, 94342552, 94411513, 94565308, 94782000, 94946419, 95031013, 95101480, 94991440, 94858281, 94674274, 94497657, 94295110, 94004875, 93552138, 92983307, 92340944, 91817203, 91297284, 90701921, 89912949, 88768176, 87429801, 85992852, 84674380, 83675538, 82875346, 82317349, 81962658, 81668937, 81410486, 81146241, 80718191, 80065487, 79325611, 78446324, 77541013, 76699089, 75910402, 75044890, 74148695, 73294164, 72522146, 71968062, 71630789, 71451217, 71315388, 70948906, 70269642, 69034269, 67421543, 65648023, 63924582, 62219715, 60692343, 59264476, 57866102, 56483063, 55060766, 53556014, 51974635, 50325025, 48686738]
2776D8686738j529812j356479j316734j158055j058804j091585r32985r44079
2768C9298205q69131q37856p95652q75334q83226r20129j128404j183461j018565
2759C0786447r47896q75353p84872o73232o95831p17018p38746p42787q14705
2750B3796007p17062o31111o60788n87616o60217p30535p90843p76635o98448
2741A7542752o85884o86545o12515n13100m99194m80470m46216l79885l47102
2732A2891841k92755k69129k80568l55194l07375k72002k54296l90645k58219
2723A0211658k95569l09521l10683j95418j61746k33981j89645j32477k52397
2714H130221k44206j55723j71053k01240j49850j15491j52176r5486j29705j77083
$$ y = [48686738, 47156926, 45800447, 44483713, 43325658, 42266854, 41175269, 40242284, 39298205, 38429074, 37591218, 36795566, 35920232, 35037006, 34116877, 32988473, 31805012, 30786447, 29838551, 28963198, 28178326, 27505094, 26809263, 26092245, 25353499, 24610712, 23796007, 23078945, 22447834, 21787046, 21199430, 20539213, 19808678, 19017835, 18241200, 17542752, 16856868, 16170323, 15557808, 15044708, 14545514, 14065044, 13618828, 13238943, 12891841, 12599086, 12329957, 12049389, 11694195, 11386820, 11114818, 10860522, 10469877, 10211658, 9916089, 9606568, 9295885, 9100467, 8938721, 8704740, 8515095, 8382618, 8130221, 7886015, 7730292, 7559239, 7357999, 7208149, 7092658, 6940482, 6844996, 6715291, 6538208]
2704F538208q9463j72684j50692m5336j82389o9085q5294j32190r6268m7776o2618
2693E404413j00238j10499o6548l6256j13026n3792l0626J2360o3775o2939l0810
2682D748264l8393n962p0515L8672m6649l8208l3641M070j6359j5414o0447M7501
2670D512919L9179n3036j154O2123k7711j91N088J364M5688L9126O9817K3952
2658D717164r4434K5626N5138R0822N6047N546P2780J08539Q7031J01037J51617
2647E376913J00129J83295J77258K39729L08314M25474L81934L53633M66110O39070
2637H651859P54487P60505O21356L15988l6091m81569p74864q75300p99920p10210
2627G426241n95611n02655m21628l47434k99330j77362k32913j66472r6720j87782
$$ y = [6538208, 6448745, 6276061, 6125369, 6080033, 5897644, 5828559, 5743265, 5611075, 5514807, 5467031, 5404413, 5304175, 5193676, 5127128, 5090872, 4977846, 4924054, 4893428, 4905788, 4842013, 4779074, 4748264, 4709871, 4703909, 4633394, 4672066, 4625417, 4587209, 4553568, 4557638, 4541279, 4525865, 4465418, 4512919, 4552098, 4499062, 4497908, 4560031, 4532320, 4532129, 4537217, 4538581, 4584269, 4623395, 4693212, 4717164, 4622730, 4648356, 4703494, 4794316, 4850363, 4855909, 4928689, 5037228, 5124259, 5225296, 5376913, 5477042, 5660337, 5837595, 6077324, 6385638, 6811112, 7193046, 7546679, 8012789, 8651859, 9406346, 10166851, 10788207, 11104195, 11068104, 10586535, 9811671, 8936371, 8136451, 7426241, 6830630, 6327975, 5906347, 5558913, 5259583, 5082221, 4849308, 4682836, 4586116, 4398334]
2617D398334j22070j42299j35045m8408j7493l6639l8230o6282p3726j8556n7178
2606C642408m1403M005K810J9779o3524N207m7388M522j9170o4833o6389J6732
2594C392756K9560k8805O5599m2375k0353m7392L3601K7043n879J1328q064m9705
2582C357314q2818N2237m4544j6826m279r094K821l6745L7513o3040J8077O0902
2570C271518J9564Q839K432o6251j2371j3691p6466P8143j339K7964O45j502l2927
2557C204558l5676J9064r5282j0362n917K7669r088N3655j336m2703K5617N7938
2545C188137m5820o6549k4246J5575J0350J2037P6933J0837j4559o530j4638K294
2533C143821m369K978K986j7682l8342p8263K1531J8832M4093j7864n0471m7038
$$ y = [4398334, 4276264, 4133965, 3998920, 3950512, 3933019, 3896380, 3858150, 3791868, 3718142, 3699586, 3642408, 3601005, 3605010, 3607820, 3627599, 3564075, 3569282, 3521894, 3526416, 3507246, 3442413, 3376024, 3392756, 3422316, 3393511, 3459110, 3416735, 3396382, 3348990, 3382591, 3409634, 3403755, 3415083, 3407019, 3357314, 3274496, 3326733, 3282189, 3265363, 3261084, 3251990, 3254811, 3218066, 3255579, 3192539, 3210616, 3271518, 3291082, 3299921, 3302353, 3236102, 3223731, 3210040, 3133574, 3211717, 3210378, 3238342, 3238987, 3237485, 3204558, 3168882, 3187946, 3092664, 3082302, 3076385, 3104054, 3094966, 3148621, 3147285, 3104582, 3130199, 3188137, 3142317, 3075768, 3051522, 3067097, 3077447, 3089484, 3166417, 3177254, 3162695, 3156165, 3141527, 3143821, 3139452, 3142430, 3145416, 3127734, 3089392, 3011129, 3032660, 3051492, 3095585, 3077721, 3027250, 2980212]
2521B980212m150K1899l7177m4413J6903j7701O256N6681m0908m6048m8138l638
2509B839778J8307o6565k5749L7878j2189M536L3239L9568j1980j9653l748n7794
2497B775628J3828q363m6909K3794l5J5932n2125L4290Q793m2256M1578j2332
2485B751823l2708j5221k7096K1211m5474j6173M7155J3329m6118L8187O4263
2474B753178o9324j7328M2929j6811Q012J8183j8626k0715J2238j0495l906j4921
2462B662414O6336o7461K1765j9612n719O1337k2343J2676N2230p715r746J2418
2450B756580L3669N4177q614N4193Q7110M8733J15901K0625o5214K3977j18867
2439C002270k5401M7256K167L6653Q497m7350L6382j5388j8595J7183N4718N014
$$ y = [2980212, 2976062, 2997961, 2960784, 2916371, 2933274, 2915573, 2921829, 2978510, 2937602, 2891554, 2843416, 2839778, 2858085, 2791520, 2765771, 2803649, 2791460, 2795996, 2829235, 2868803, 2856823, 2837170, 2833422, 2775628, 2789456, 2781093, 2734184, 2757978, 2757943, 2773875, 2721750, 2756040, 2764833, 2722577, 2764155, 2751823, 2719115, 2703894, 2676798, 2698009, 2652535, 2636362, 2683517, 2696846, 2650728, 2688915, 2753178, 2683854, 2666526, 2709455, 2692644, 2700656, 2718839, 2700213, 2679498, 2691736, 2681241, 2677335, 2662414, 2728750, 2661289, 2683054, 2663442, 2657723, 2719060, 2696717, 2709393, 2761623, 2753908, 2744162, 2756580, 2790249, 2844426, 2835812, 2890005, 2977115, 3025848, 3141749, 3162374, 3097160, 3121137, 3002270, 2976869, 3024125, 3026292, 3062945, 3071442, 3024092, 3060474, 3045086, 3026491, 3043674, 3098392, 3103406]
2427C103406J5654k300O8771l313J4478N9059J7084P7929Q4417J4644K9359L9873
2415C519061R6305N9919J32579J38037J48337K7037l2950j25195j06749J43k5759
2404C830765k2296k6808J0783N3326j1387J4296p0433K667Q6883L5932J2225N3198
2392C969151Q982J26960K3848L1598J10070O0351M3488l9058J87022J24429J37176
2381D784017P2325N3604J08737J33236o754l1529Q27O1343J47312J2429N6394
2370E391941J13053N0052O9846N1993M424J04630M4040Q1305J63562R1398O7087
2359F233331N4220R1606J14458P2025M8700J70168J39443J30034P9231J75701
2349G308917K00941J73478J55413J88578K15898K51762K86520L24187J53830N1371
$$ y = [3103406, 3119060, 3116760, 3185531, 3182218, 3196696, 3255755, 3272839, 3350768, 3435185, 3449829, 3479188, 3519061, 3615366, 3675285, 3807864, 3945901, 4094238, 4121275, 4088325, 3963130, 3856381, 3856524, 3830765, 3808469, 3781661, 3792444, 3845770, 3834383, 3848679, 3778246, 3780913, 3867796, 3903728, 3915953, 3969151, 3978133, 4105093, 4128941, 4160539, 4270609, 4330960, 4374448, 4335390, 4522412, 4646841, 4784017, 4856342, 4909946, 5018683, 5151919, 5145165, 5113636, 5114463, 5175806, 5323118, 5335547, 5391941, 5504994, 5555046, 5624892, 5676885, 5681309, 5785939, 5829979, 5911284, 6074846, 6166244, 6233331, 6287551, 6379157, 6493615, 6565640, 6614340, 6784508, 6923951, 7053985, 7133216, 7308917, 7509858, 7683336, 7838749, 8027327, 8243225, 8494987, 8781507, 9105694, 9259524, 9310895]
2339I310895m581O1038L1880O6037J9779Q8912J29533J35461J17453R6027J15267
2328A0167701J22853K33020J74158K11271J92326J82161J85470K57448K92933
2319A2019341K78429K74224K57375L57672L94805M37261M53404N09337N57110
2310A5538958N19712N12766M02870K58293J74798K19981K84707M71204M89638
2301A8872927N68274O37594P06312P70737Q64683R60516R57998J048433J068617
2292B6456091J039583R85616R46266Q81294O72349M32211J14418k04299m67024
2283C0856505q14800j048668j166841j152469j032016j005823r63484q20130q26231
2274B2026043p83045p72040o41056o58279o02361m21054l52989k68590l80355
$$ y = [9310895, 9306314, 9367352, 9399232, 9465269, 9485048, 9573960, 9703493, 9838954, 9956407, 10052434, 10167701, 10290554, 10523574, 10697732, 10909003, 11101329, 11283490, 11468960, 11726408, 12019341, 12297770, 12571994, 12829369, 13187041, 13581846, 14019107, 14472511, 14981848, 15538958, 16058670, 16571436, 16974306, 17232599, 17407397, 17627378, 17912085, 18383289, 18872927, 19441201, 20078795, 20785107, 21555844, 22420527, 23381043, 24339041, 25387474, 26456091, 27495674, 28481290, 29427556, 30308850, 30981199, 31413410, 31527828, 31323529, 30856505, 30041705, 28993037, 27826196, 26673727, 25641711, 24635888, 23672404, 22852274, 22026043, 21242998, 20470958, 19829902, 19171623, 18569262, 18148208, 17795219, 17526629, 17146274]
2265A7146274k20380j32509p3849L9113J38136J82508J40712j46759l74383n43562
2255A6155301p10214n60170n46071n25043m59186l93090m03665l60422k55282
2246A1942158l36902k66808k33112j82061j45209j70545j44402p8630M042k001
2236A0386530j97J40242J76592J57169K16456L39156M98521P35323P68611N94440
2226A4012843K78521k34187p99350r81991r23389q60316p32579n46730m84884
2217H727938m55080l49665k51849k19407k50744j87545j51911j43531j00988r1795
2207F525423o0055K5892p4384N3545R5204N1980L2652J09184J33126K10560J98167
2196G301294L27298L16456J17604l7911l56044l84285m18300m61242m27902k84366
$$ y = [17146274, 16925894, 16793385, 16719536, 16758649, 16896785, 17079293, 17220005, 17073246, 16698863, 16155301, 15445087, 14884917, 14338846, 13813803, 13354617, 12961527, 12557862, 12197440, 11942158, 11605256, 11338448, 11105336, 10923275, 10778066, 10607521, 10463119, 10384489, 10388531, 10386530, 10386333, 10526575, 10703167, 10860336, 11076792, 11415948, 11914469, 12649792, 13418403, 14012843, 14291364, 14057177, 13257827, 12275836, 11352447, 10492131, 9759552, 9212822, 8727938, 8272858, 7923193, 7671344, 7451937, 7201193, 7013648, 6861737, 6718206, 6617218, 6525423, 6465368, 6491260, 6416876, 6470421, 6565625, 6617605, 6650257, 6759441, 6892567, 7103127, 7301294, 7628592, 7945048, 8062652, 8024741, 7668697, 7284412, 6866112, 6404870, 5976968, 5692602]
2186E692602k46326k41929j97471j72360j09485j12390n5128k7895j36556m7743
2176D345319j12795n5069o8788o0902r1577q3352r585m6450m0338o2678o8275
2165C645510m6045o6697j36076L4005L4078n0830l0513j3528m2675k6726n7736
2154C242767J3065j1605n1017j8714K6807m7008o0554j9633j95j9153L4K5226
2142C080020k2518j898m6619J9686j8566m0934j0146k5321o656M8453n3461q8172
2130B833868k8077J1522m3431m2081L2731J9679l4075m1033N2880j749p0505L3407
2118B723136M9836q6741k1037O4224n7975l0089l0260k9254J9465k297l6520m4988
2106B517500J9592m5925L1966k3882l3521J8898r333m7168m3079J2052p1607k8802
$$ y = [5692602, 5446276, 5204347, 5006876, 4834516, 4725031, 4612641, 4557513, 4529618, 4393062, 4345319, 4232524, 4177455, 4108667, 4047765, 3956188, 3872836, 3863251, 3816801, 3776463, 3713785, 3645510, 3599465, 3532768, 3396692, 3430697, 3464775, 3413945, 3383432, 3369904, 3327229, 3300503, 3242767, 3255832, 3244227, 3193210, 3174496, 3201303, 3154295, 3093741, 3074108, 3073913, 3054760, 3054794, 3080020, 3057502, 3055604, 3008985, 3028671, 3010105, 2969171, 2959025, 2933704, 2927048, 2975501, 2922040, 2833868, 2805791, 2817313, 2773882, 2731801, 2764532, 2784211, 2750136, 2709103, 2761983, 2760234, 2689729, 2723136, 2772972, 2686231, 2665194, 2729418, 2671443, 2641354, 2611094, 2581840, 2601305, 2599008, 2562488, 2517500, 2537092, 2491167, 2523133, 2499251, 2465730, 2484628, 2475295, 2428127, 2385048, 2397100, 2325493, 2296691]
2094B296691l7928K2388J898L5100j5240j1387k5584m1414J4509K0859j7318k8678
2082B213896L4192l6393M2018j564m3955K2717j8378r4623N1886j1405n6848j9987
2070B081556k6172q086J8685K3609J5885J5667k798L5216J12011n5739n5138O7287
2058B221983Q2998k6747k8863K7870q7411K5614R4179M1188M2393K3323R32n3571
2046B363888K92O8165O7863K6080J3349J3028p354M0733P2007M8565L8009J26686
2034B871311J6296O6398N4065M5821J2502P7150P0735j507J29848J15194J04337
2023C562150J5884j3212l7049J233N3606J17014J4730J4877R5990Q8956O3486
2012C977665J02240J23337j843J4896m9919o0888Q3382j1420P6383M6871P1556
$$ y = [2296691, 2258763, 2281151, 2283049, 2318149, 2302909, 2291522, 2265938, 2224524, 2239033, 2259892, 2242574, 2213896, 2248088, 2211695, 2253713, 2252149, 2208194, 2230911, 2212533, 2117910, 2169796, 2158391, 2101543, 2081556, 2055384, 2047298, 2065983, 2089592, 2105477, 2121144, 2118346, 2153562, 2265573, 2209834, 2154696, 2221983, 2304981, 2278234, 2249371, 2277241, 2189830, 2215444, 2309623, 2350811, 2393204, 2416527, 2417459, 2363888, 2364180, 2432345, 2500208, 2526288, 2539637, 2552665, 2545311, 2586044, 2658051, 2706616, 2744625, 2871311, 2887607, 2954005, 3008070, 3053891, 3066393, 3143543, 3214278, 3212771, 3342619, 3457813, 3562150, 3578034, 3564822, 3527773, 3529006, 3582612, 3699626, 3714356, 3729233, 3825223, 3914179, 3977665, 4079905, 4203242, 4201399, 4216295, 4166376, 4105488, 4188870, 4177450, 4253833, 4300704, 4372260]
2001D372260M2050Q7696J78936Q6593O8478J00538J80376J51983J88176J11897
1991E568983J78415J18786l379m0742P4674Q6588J53882J62637J73547K12023
1981F685414K46860K67565K07715J37944J15080J36521J06362P6967M6748M0958
1971H068134L5362j4214K9840O5788P5377M6286J30067P4180J07235J41527J54843
1960H914425J41664J58890J17717K15316K73339K62384K61337K22483L12014L61286
1950A1240855M18553M05083M49572M50552L70530K82769R3877q2908k86796m38358
1940A2903729m19318m73197m36047l59546k08883k16676k24632n4653K1183m952
1930A0527008Q8178J21615J38374J92755J29914J16565J86057K43705J88338J28383
$$ y = [4372260, 4414310, 4502006, 4680942, 4767535, 4836013, 4936551, 5116927, 5268910, 5457086, 5568983, 5747398, 5866184, 5862805, 5822063, 5896737, 5983325, 6137207, 6299844, 6473391, 6685414, 6932274, 7199839, 7407554, 7545498, 7660578, 7797099, 7903461, 7980428, 8027176, 8068134, 8103496, 8089282, 8119122, 8184910, 8260287, 8306573, 8436640, 8510820, 8618055, 8759582, 8914425, 9056089, 9214979, 9332696, 9548012, 9821351, 10083735, 10345072, 10567555, 10879569, 11240855, 11659408, 12064491, 12514063, 12964615, 13335145, 13617914, 13711791, 13628883, 13342087, 12903729, 12484411, 12011214, 11575167, 11215621, 11006738, 10790062, 10565430, 10510777, 10531960, 10527008, 10615186, 10736801, 10875175, 11067930, 11197844, 11314409, 11500466, 11744171, 11932509, 12060892]
1920A2060892R9804N3983K9930n7844j0143k77241k50076k66585l79190l52531
1910A0650999l83360m48498l41416l51750k92317j52849j25663j85297j12765
1901H257084q2383j13943p4100k22J4231o2500j20582j74969j66477j32560j38225
1890G205354k03438k08198l49070l19189k99254l02651k69724k34827j55535j73763
1880D689705k79685k22752j81085j30499j34274q1526j35666l4137l8600q5207
1870C366274j32807l7483m4667j36012j09682j11711j08045p7560q0253o4458
1860B463596k5719j37007n1132l8613r2512p4060m2505n2427n3987q4227k8357
1849A783050q6035o564j2665p8076l3038l0738l1773k2289n7758j04595L421M43
$$ y = [12060892, 12160696, 12214679, 12244609, 12186765, 12176622, 11899381, 11649305, 11382720, 11003530, 10650999, 10267639, 9819141, 9477725, 9125975, 8833658, 8680809, 8555146, 8369849, 8257084, 8174701, 8060758, 7986658, 7986436, 8000667, 7938167, 7817585, 7642616, 7476139, 7343579, 7205354, 7001916, 6793718, 6444648, 6125459, 5826205, 5523554, 5253830, 5019003, 4863468, 4689705, 4410020, 4187268, 4006183, 3875684, 3741410, 3659884, 3524218, 3490081, 3451481, 3366274, 3233467, 3195984, 3151317, 3015305, 2905623, 2793912, 2685867, 2608307, 2528054, 2463596, 2437877, 2300870, 2249738, 2211125, 2118613, 2044553, 2002048, 1949621, 1895634, 1811407, 1783050, 1697015, 1690451, 1677786, 1599710, 1566672, 1535934, 1504161, 1481872, 1424114, 1319519, 1322940, 1323383]
1837A323383k3289j9381J10L2350j404m4358k0702l5026J963n0256j12182j7010
1825A034198J2170m5816n0046N352k6675j6566j2323l7285n2099J3610n9734j6338
1813G48448M3215j7081k5075l2835K963l0084K6784J9526k1387M5177k3522m7854
1801F88275J4530q8434k9525j6030o691j1195k9389n4072J7890K0182o3473l4849
1789D07219N523K5307p2375k0698M3954m9304l338M5958o0378l5835N963K6781
1777C18777J9143j6371m8864J8468Q81n7822k2602r661O4470k0444r318Q119N6584
1764C01360m225j25978K4304m5110n029P1222j9515o6084M8673R762Q928J1584
1752B09892q5800M4866j03K7834N0686J4477m8624R327p0433m2416M3399j3174
$$ y = [1323383, 1300094, 1280713, 1280823, 1313173, 1311769, 1267411, 1246709, 1211683, 1213646, 1163390, 1051208, 1034198, 1046368, 1000552, 950506, 955858, 929183, 912617, 900294, 863009, 810910, 824520, 764786, 748448, 791663, 774582, 749507, 716672, 719635, 689551, 716335, 735861, 714474, 759651, 736129, 688275, 702805, 614371, 584846, 568816, 562125, 550930, 521541, 467469, 485359, 505541, 442068, 407219, 412742, 438049, 365674, 344976, 388930, 339626, 336288, 382246, 321868, 286033, 291996, 318777, 337920, 321549, 272685, 291153, 292034, 234212, 211610, 201949, 266419, 245975, 236657, 244776, 301360, 297135, 171157, 195461, 150351, 145322, 216544, 197029, 130945, 179618, 189380, 198308, 209892, 124092, 168958, 168855, 196689, 247375, 261852, 213228, 222555, 152122, 109706, 153105, 139931]
1740A39931K119k5911O3430L4602k4464o7348m0196K9495K3137k1935l4276K4289
1728A02873N8274m7221p257r364L8621p772m8135K8531N0728j636M500p1460l1017
1715E9665K03m156j7976J4919k4570j4839O5235p852j0450m4610L1467N691q865
1702D3862k7349M1847Q065j3704n8928n006L0058R830K9555l7534K7787L5090
1690H3573n6443J1268m023P0097l7933q0512r891J9637P3717l9204j0949l7450
1678a8113J058J396j3479O861J7566R232j2480p703m7673K3403L9839N724j5923
1665a0292M7014m9206j747k1541k7175M9808j387J9652p12J9772j0895J9891k7918
1652E264K9566j6382K8398l5842m2919m6324k034k2024M7429J4333j5166Q4905
$$ y = [139931, 142050, 116139, 179569, 214171, 189707, 122359, 82163, 111658, 134795, 112860, 78584, 102873, 161147, 113926, 106669, 97305, 135926, 128154, 80019, 108550, 159278, 157642, 162142, 90682, 59665, 59868, 55712, 37736, 52655, 28085, 13246, 78481, 70629, 60179, 15569, 47036, 52727, 43862, 16513, 58360, 66425, 52721, -6207, -11213, 18845, 28675, 58230, 20696, 48483, 83573, 27130, 38398, 34375, 104472, 66539, -13973, -23864, -4227, 69490, 30286, 19337, -18113, -17055, -15659, -29138, -22277, -4711, 4521, -7959, -15662, -63335, -39932, -93, 5631, -10292, 36722, -12484, -14231, -35772, -62947, -13139, -14526, 5126, 4414, 24186, 13291, 33182, 5264, 34830, 18448, 46846, 11004, -31915, -78239, -80273, -102297, -54868, -40535, -55701, 29204]
1640B9204M275n012J5569l6476j3149J0387n7913K2736O099R454o6322j0806L8450
1627e3504L7864r5341L0916M471k5322K0728j6260R376k7059J1015n181J400K423
1614a04474m6326M6111K1188k1182k6729M9274O1045m2727o5615N976K4294M1999
1602e7166J1285k3347J8160n2883N1240j2331o8687L3162p325j0136K1409k8681
1590a25300K2583L0212K5573r413k6517p8366M1119O974k1018R73J4269Q887m1715
1577a51739R209J0389L437K6361j0855N302n5164o3903O8187K547j0060J8037
1565a48252J1613j5751J1896K4712O709R4009k5976q7483K0872m9181K2724J385
1553a32723n4546J3951l9698N4439k7623k5937M2574j187j9312O6099J7006L2674
$$ y = [29204, 33479, 28467, 44036, 7560, -5589, 4798, -53115, -30379, -24280, -14826, -81148, -91954, -53504, -15640, -110981, -80065, -75594, -100916, -80188, -96448, -87072, -114131, -103116, -108297, -106897, -104474, -150800, -104689, -83501, -104683, -131412, -82138, -21093, -63820, -129435, -123459, -99165, -57166, -45881, -69228, -51068, -103951, -52711, -65042, -133729, -100567, -107892, -118028, -96619, -125300, -102717, -72505, -46932, -56345, -82862, -161228, -120109, -113135, -134153, -133180, -118911, -110024, -151739, -142530, -132141, -128704, -102343, -113198, -107896, -163060, -226963, -158776, -156229, -166289, -148252, -136639, -152390, -140494, -115782, -109073, -15064, -41040, -128523, -107651, -156832, -134108, -132723, -187269, -173318, -213016, -158577, -186200, -212137, -169563, -170750, -190062, -123963, -106957, -74283]
1541g4283J9014p2043o4867l2403Q1993k9193r082m3155N0476n0m12L9069J0251
1528a24685l1382j2836o602m341m6221R240R4774k4677N178l8363J963L4210k7683
1515a71425L1202L1030M3850l5887o0511M8360j5454N4108k8466J5611r284l8608
1503a35474p397J9307J1802k8406L1965r818J6304j09378j306L0898k1884M6769
1491a56618O5408p788n5890n628j1293L9785J2280o0939k2064P5132K2550k8641
1479a33706J7762J3475j2951m8743J5231M22J9737J8367m6234J9871J4137m0502
1467a63134L4653M3781l5339k6921l556l0007l2069J5287j9678j657l01J5187
1455b03754N7090p604K390K1065k1714M366k1855J8708L0803p1558l30j0827J2433
$$ y = [-74283, -55269, -127312, -192179, -224582, -142589, -171782, -180864, -224019, -173543, -173593, -174005, -134936, -124685, -156067, -168903, -175505, -179846, -226067, -216827, -122053, -146730, -141552, -179915, -177952, -143742, -171425, -140223, -109193, -65343, -101230, -161741, -113381, -128835, -74727, -103193, -87582, -96866, -135474, -142871, -123564, -111762, -140168, -108203, -118021, -101717, -211095, -212401, -181503, -203387, -156618, -91210, -98998, -154888, -160516, -171809, -132024, -119744, -180683, -202747, -127615, -105065, -133706, -115944, -102469, -115420, -164163, -148932, -148510, -128773, -110406, -156640, -136769, -122632, -163134, -128481, -84700, -120039, -146960, -150516, -180523, -212592, -197305, -216983, -218640, -218941, -203754, -146664, -154268, -151878, -130813, -152527, -148161, -170016, -151308, -120505, -192063, -192393, -203220, -190787]
1442a90787K3798l2590j3975J17323M836n0920n4278m3197m495J2527O5038j4061
1430a80781L6158L2361m2274n5966L722J1832N031Q8495L2913m6335k270o9642
1418a86756M7819j7870J9487l0080m6129Q3192m471j7303O035j4861l56L4936
1406a26357r6305J4268Q2628m4353o216P413L038p3235K5134O1559n743N81l2654
1393a90242k4574K070L0302L00q7891P473J01774j6568k8686k8022J01399M6220
1381h6445j05156l4601J9940L6808L1306k1103j7249J1868j570j7113M3811n707
1369a45211j792l6613K5844L0037m5462K9435j4500K7682j3558k6592m3503k0695
1357b34928k2884N3156p229q582L1366L1900J2155j7937O288M4299p2678j0646
$$ y = [-190787, -166989, -199579, -213554, -96231, -91395, -142315, -196593, -239790, -244285, -231758, -166720, -180781, -144623, -112262, -154536, -210502, -206780, -194948, -189917, -101422, -68509, -114844, -117114, -186756, -138937, -156807, -137320, -167400, -213529, -130337, -134808, -152111, -146076, -160937, -161293, -126357, -222662, -208394, -125766, -170119, -176335, -168922, -165884, -239119, -213985, -152426, -158169, -157588, -190242, -214816, -212746, -182444, -182144, -270035, -262562, -160788, -177356, -206042, -234064, -132665, -86445, -191601, -226202, -206262, -169454, -138148, -159251, -176500, -164632, -166202, -183315, -139504, -145211, -147003, -183616, -157772, -127735, -173197, -143762, -158262, -130580, -144138, -170730, -214233, -234928, -257812, -204656, -211885, -220467, -189101, -157201, -145046, -162983, -156695, -112396, -185074, -195720]
1345a95720J9797j2441P552n0855O8721o4514K9376J3066M83l6498K740l212k6304
1332b47809N025L9814L3470o500m8869m4067l3798Q6689L9573M3742m4597l7276
1320b14603P0001n7362J7808L4769M9088n4855k4321k0248K6413N9375j030k3932
1308a38897P731n494l0673j2772P1765j2857k6002J0101J7811K7254m7201m7884
1296a87118L6641R419p101o3063O683J1977O4621L7348m8583k0837n2951Q7839
1284a25125L413k5639P935j3461K581l3943l871O1899m8448M3103M1943m0217
1272a29830m0073m2996L2084m880k1863L3493J8561J0540K7424J6354l2425J6543
1260a17068K6469j1164M8081l6481J2310j6838l5261L6146J659n4018N813Q3614
$$ y = [-195720, -175923, -188364, -180812, -231667, -162946, -227460, -198084, -185018, -184535, -221033, -218293, -221505, -247809, -242784, -202970, -169500, -176000, -224869, -268936, -302734, -216045, -176472, -132730, -177327, -214603, -144602, -201964, -184156, -149387, -100299, -155154, -179475, -199723, -173310, -113935, -114965, -138897, -131166, -136660, -167333, -180105, -108340, -121197, -147199, -137098, -119287, -92033, -139234, -187118, -150477, -141058, -148159, -211222, -204539, -192562, -127941, -90593, -139176, -160013, -212964, -125125, -121712, -147351, -139416, -152877, -150296, -184239, -188110, -126211, -174659, -131556, -89613, -129830, -169903, -212899, -180815, -185695, -207558, -174065, -155504, -144964, -117540, -101186, -133611, -117068, -90599, -101763, -53682, -90163, -77853, -94691, -129952, -93806, -92147, -146165, -140352, -56738]
1248e6738j0429j1519N1745R269L4465J901o811q371k1J8463J5228J4775n3798
1235a841K8974q748J2385J3110o0341P13K3152L2951L8495K6862l0530m328k2433
1222D8421K6247L2089L7515Q058O8142n7621k1646J939j6633N1234K979N3737
1210B34461m8498M2366k3781J2734M7021K2406L6057p707J497J3315M3637K1184
1198C94692m686P3268L5751o2165j6362L4021j605M3076J344j9307O6224L4634
1186E78885q1780N7313P1004P4501j3861J3225j4393K9515Q5513M5463L1581k4604
1174H52362O7257Q1093J4787Q9466P2073o207J28055J55016J2528J19750J21243
1163A707423J79725J66758J24570K30641J25217J72995K73607L10175M00761N02192
$$ y = [-56738, -67167, -78686, -26941, -17672, 16793, 18694, 11883, 3512, 3491, 21954, 37182, 51957, -1841, 27133, 18385, 30770, 43880, -16461, -15748, 7404, 40355, 78850, 105712, 75182, 70854, 48421, 74668, 106757, 144272, 152330, 220472, 162851, 141205, 143144, 126511, 177745, 180724, 234461, 185963, 228329, 204548, 217282, 264303, 286709, 322766, 315059, 316556, 329871, 373508, 394692, 390006, 463274, 499025, 436860, 420498, 454519, 452914, 495990, 497334, 478027, 544251, 578885, 497105, 554418, 625422, 699923, 686062, 699287, 684894, 714409, 799922, 845385, 876966, 852362, 919619, 1000712, 1015499, 1104965, 1177038, 1170831, 1298886, 1453902, 1466430, 1586180, 1707423, 1887148, 2053906, 2178476, 2409117, 2534334, 2707329, 2980936, 3291111, 3691872, 4194064]
1153D194064N71327P12701Q77265J130659J470356J835322J500411M07165j136738
1144A1562532k194643k008440j378398r76942q05529q14107n74077l39079k62215
1135B209102l04673j82716r1344r1160k22925r6813r6893j49870j56046o2917
1125G53745p2507l4164o4405p6713l9324m5626J9634o7523m7101R833J6869j3635
1113C39083m5359n5622j2446k682k0968o4601J2602j0716p10k512j5977o2265
1101E7827J9957O909n5183j4238N0806O1623k2693k2230m3323o6356J3149K9196
1089A5444L8007k6126L7088j2652m8451J1664k2326o371q980L3133n6974n9654
1077a06198l0089l7870J4384O6725P2029l5908n7432k0922O2717k0775m5917K6277
$$ y = [4194064, 4765391, 5478092, 6355357, 7486016, 8956372, 10791694, 12292105, 12699270, 11562532, 9367889, 7359449, 5981051, 5004109, 4198580, 3384473, 2810396, 2471317, 2209102, 1904429, 1721713, 1630369, 1539209, 1316284, 1219471, 1122578, 972708, 816662, 753745, 681238, 647074, 582669, 505956, 466632, 421006, 440640, 373117, 326016, 335849, 352718, 339083, 293724, 238102, 225656, 222974, 202006, 137405, 150007, 139291, 138581, 136069, 120092, 57827, 77784, 84693, 29510, 15272, 66078, 127701, 105008, 82778, 39455, -26901, -13752, 15444, 53451, 27325, 64413, 51761, 3310, 14974, -7352, -13723, -22703, 10430, -46544, -106198, -136287, -174157, -159773, -93048, -21019, -56927, -114359, -135281, -72564, -93339, -139256, -112979]
1065a12979k212K9652P534M5357k9004o3646Q438k2194J0561J1417M326j3240
1053a25990j307M9772m3357k7398Q275L4544J4263L9420J1550r1068l513N8677
1041g6132L4602j04670l2432K3401L9828k4284P99q1461n209P2781n983R4411
1029f4349K2111j6393J5567k9375k6063K6529p0327J9248l8124j692k3891L1075
1017a55684J1135N3842L30o7254M1219n0989K609R213m496l8770J2745O7373L7368
1004h1359m2762j7907n2702J1736N9493K6928k6390j3831j0691M0664K2401J0667
992g3753n0496M1505o1676p5328l0235J04933N8815o0704L2431k6911o573O631
980a41361n223N4783J1260k4382K0407P673l8171k0460K1528j2300K203L76L4828
$$ y = [-112979, -115191, -85539, -78005, -32648, -61652, -125298, -116860, -139054, -128493, -117076, -112750, -125990, -127297, -77525, -120882, -148280, -140005, -105461, -91198, -51778, -40228, -131296, -134809, -76132, -41530, -146200, -178632, -155231, -115403, -139687, -138888, -220349, -225558, -152777, -158760, -64349, -42238, -58631, -43064, -72439, -98502, -71973, -142300, -123052, -161176, -162868, -186759, -155684, -144549, -90707, -90377, -157631, -116412, -167401, -164792, -155579, -160075, -198845, -186100, -118727, -81359, -124121, -142028, -194730, -182994, -123501, -96573, -122963, -136794, -147485, -106821, -84420, -73753, -124249, -82744, -144420, -219748, -249983, -145050, -86235, -146939, -114508, -141419, -147992, -141361, -146584, -91801, -80541, -104923, -84516, -76843, -115014, -135474, -113946, -126246, -124043, -123667, -88839]
967h8839k8000P358p1584M100M0983M3975n7970o260K1442l715L4535M2383L5695
954b5897j4691k6226o230r0562K1915O7397q618n7379m8938j5105k612P4463j6366
941a48849m294J4325O120m0706n046P7298r236l2437j3711J3281M6214N5705l0734
928g2070n5819m78l1882O0443K1626m3618l2143M22l9333J6329P8615J231k0431
915a17108K2673K7357k4370k2503J5393Q1072n588j04179j3582P452J7623J9200
903i6560K4528J9602R439M288K1673L2049M7903l8304l1376Q487p9928n001j3159
890i6359k4311Q972J3080l6306m824K5932k22M452K5747k4510J0028M2516j5458
877g1263o0850Q3917m3569k1625Q239L7856l3547n8569n418k7614J6754n909R7960
$$ y = [-88839, -116839, -109481, -181065, -176965, -135982, -92007, -149977, -156237, -134795, -138510, -103975, -61592, -25897, -40588, -66814, -73044, -163606, -141691, -74294, -82912, -140291, -189229, -204334, -206946, -132483, -148849, -153143, -138818, -132698, -173404, -178450, -101152, -110388, -142825, -156536, -143255, -97041, -41336, -72070, -127889, -128367, -160249, -99806, -78180, -121798, -153941, -153519, -192852, -176523, -97908, -96677, -117108, -94435, -67078, -91448, -113951, -98558, -17486, -23074, -127253, -140835, -133383, -115760, -96560, -72032, -52430, -42991, -38703, -17030, 15019, 62922, 24618, -6758, 1729, -78199, -83200, -96359, -120670, -111698, -98618, -134924, -139748, -113816, -114038, -109586, -83839, -108349, -98321, -55805, -71263, -132113, -48196, -91765, -113390, -105151, -67295, -100842, -159411, -164829, -192443, -175689, -181598, -83638]
864h3638K2095m5774l1854J7663j1497k2631M0227J8190j9208L038O318J7093
852h9978m0372l2044O9456k635j0280R724l142N6302j3038q2758l8541K7002q918
839a59222L6199P6160J3020j6799K143p200J2179P365j4065p7590Q024n8K4775
826i5069R163J1694o2887J3626M9751R737o4660k1818O2345j8999M215n827M8866
813e9863O99p4353q869J8671M4762j4999o6055O035K6110k1646K1633J197j3393
800a40071R275K9965M3820o726K6265r657o8273Q361J6801j1889k9178j0299j0896
787a52502M7321K560n0124m2822q690R2510J01875o7128j5143o414m2347R4452
775d6452l2737o1n2275p510K2391N483M7327J5436k9326j153J5030K9678K0763
$$ y = [-83638, -61543, -107317, -139171, -121508, -133005, -155636, -115409, -97219, -116427, -113389, -107071, -89978, -130350, -162394, -92938, -95573, -105853, -96129, -99271, -42969, -56007, -138765, -177306, -150304, -159222, -123023, -46863, -33843, -50642, -48499, -55699, -43520, -36155, -50220, -127810, -119786, -119844, -95069, -85906, -74212, -137099, -123473, -73722, -63985, -128645, -150463, -88118, -107117, -102902, -108729, -59863, -59164, -133517, -142386, -123715, -78953, -93952, -160007, -153972, -127862, -149508, -127875, -126678, -140071, -130796, -100831, -57011, -63737, -37472, -47129, -115402, -107041, -90240, -102129, -131307, -141606, -152502, -105181, -102621, -152745, -195567, -204257, -111747, -9872, -77000, -92143, -98557, -140904, -46452, -79189, -79250, -131525, -139035, -116644, -111161, -63834, -48398, -77724, -78877, -63847, -34169, -13406]
762a3406j8370K38p9433n404L5669J5611R584j2190J2799k6156N8918l4961r578
749f6679k6887J6726k9170l2237M3310o890N394r157K8316L6735p8968L3329M4592
736d1586k2488n3235J1247J6530O0010K8322m4769j9886l7279o469K1225O1818
724b6560J7274j3839k7303P114o1024o3180O0721M2526M6472l4535r32j7688q154
711g9108j0977J9401n1930n1662N4936J5021M9145O9190j4778k7837K7946l0120
699c0773k6677O351K9296k9511O1773p2461n9946L8973L0706j7019R023N4372
687e893K9506k7611j8842n3389n1132n9232R3903P0054k4870l2419J0999M382
675f4544r197M684n82M779L7705J2818k1291m5558P7354K262K201J8108q4486
$$ y = [-13406, -31776, -31538, -110971, -116375, -80706, -65095, -55511, -67701, -54902, -81058, -22140, -57101, -66679, -93566, -76840, -106010, -138247, -94937, -101827, -96433, -105590, -77274, -40539, -119507, -86178, -41586, -64074, -117309, -106062, -89532, -29522, -1200, -45969, -65855, -103134, -109603, -88378, -26560, -9286, -23125, -50428, -43314, -104338, -167518, -106797, -64271, -17799, -52334, -53266, -70954, -79108, -90085, -70684, -122614, -174276, -119340, -104319, -55174, 14016, -762, -28599, -653, -30773, -57450, -51099, -21803, -51314, 10459, -62002, -121948, -82975, -52269, -69288, -60265, -5893, 23613, -3998, -22840, -76229, -127361, -186593, -92690, -22636, -47506, -79925, -68926, -64544, -73741, -69057, -69639, -64860, -27155, -14337, -35628, -81186, -3832, -1570, 631, 18739, -65747]
662f5747M0737J4429k5235J3335J103J8908l3509j2588l9388r24P7743k2529n3698
649h7363k8462j582j6311O0765K7195J3230J6086O582J4794L2917m8728L6166
637B5289l0547m0659J3740k8701P86L5668N5820K7055m5382p6932O1767p562o5783
624g5441l1227n996M4263P5368n680m9574k1863K8700J7277m3062O172j5757J9843
611e6977n8890j2203M5680j6468K1584K4905K6176J023l714O618k5831m5120r1578
598a84795O3065N7628L6547M3273o2801K3971L9826o321j0061l8396m6822q391
586i3277l835Q8578j2836q6245O5521M5603k4755l7997P594M368J7171O469L892
573a9749J5855l6064l0617J3115L9908O6492j4562p747k1116L6668l5763k7917
$$ y = [-65747, -25010, -10581, -35816, -22481, -21378, -2470, -35979, -48567, -87955, -88879, -11136, -33665, -87363, -115825, -117407, -133718, -72953, -45758, -32528, -16442, -9860, 4934, 37851, -10877, 25289, -5258, -45917, -32177, -60878, -60092, -24424, 31396, 58451, 13069, -63863, -2096, -9658, -75441, -106668, -112664, -68401, 6967, 1287, -48287, -70150, -41450, -24173, -67235, -61063, -76820, -56977, -115867, -128070, -82390, -98858, -77274, -52369, -26193, -25170, -28884, -22266, -48097, -93217, -184795, -121730, -64102, -27555, 15718, -47083, -23112, 16714, 10393, 332, -38064, -84886, -93277, -97112, -8534, -21370, -107615, -42094, 3509, -21246, -59243, -51649, -47281, -30110, -23641, -19749, -3894, -39958, -70575, -57460, -17552, 48940, 34378, 26631, 5515, 42183, 6420, -21497]
561b1497P367l7602n4510N2690L556J2857J8114k2314K102R848M9891L3451l3309
548B0644q4161K5640J9118K4942K7340q5860m69N8l976N5169L2760L0915l0538
$$ y = [-21497, -14130, -51732, -106242, -53552, -49996, -37139, -19025, -41339, -39237, -29389, 20502, 53953, 20644, -63517, -37877, -18759, 6183, 33523, -52337, -52806, -52748, -56724, -1555, 31205, 62120, 31582]
$$ [...]
##END NTUPLES=NMR SPECTRUM
##END=
