##TITLE=1H_CG-1189-C
 CDCl3
 8 sc, 
 28.5.2024
##JCAMPDX= 6.0         $$ Bruker NMR JCAMP-DX V2.0
##DATA TYPE= NMR SPECTRUM
##DATA CLASS= NTUPLES
##ORIGIN= UXNMR, Bruker Analytische Messtechnik GmbH
##OWNER= root
$$ XWIN-NMR		Version 3.5
$$ Tue May 28 13:46:49 2024 Russian Standard Time (UT+4h)  she@DPX200
##.OBSERVE FREQUENCY= 200.1309
##.OBSERVE NUCLEUS= ^1H
##.ACQUISITION MODE= SIMULTANEOUS
##.ACQUISITION SCHEME= undefined
##.AVERAGES= 8
##.DIGITISER RES= 18
##SPECTROMETER/DATA SYSTEM= spect
##.PULSE SEQUENCE= zg30
##.SOLVENT NAME= CDCl3
##.SHIFT REFERENCE= (INTERNAL, CDCl3, 0, 15.802)
##AUDIT TRAIL= $$ (NUMBER, WHEN, WHO, WHERE, WHAT)
$$ ##TITLE= Audit trail, XWIN-NMR		Version 3.5
$$ ##JCAMPDX= 5.01
$$ ##ORIGIN= Bruker BioSpin GmbH
$$ ##OWNER= she
$$ F:/spectra/data/she/nmr/H-F/1/pdata/1/auditp.txt
$$ ##AUDIT TRAIL=  $$ (NUMBER, WHEN, WHO, WHERE, WHAT)
(   1,<2024-05-28 13:45:35.51 +0400>,<she>,<DPX200>,
      <created by zg, POWCHK disabled, PULCHK disabled
       configuration hash MD5:
       00 E9 B6 7A A2 85 ED C7 34 08 36 98 17 FE 4E 26
       data hash MD5: 16K
       2D 1B FD 48 DB 81 3B 88 46 99 DE 34 2B 5B C6 2D>)
(   2,<2024-05-28 13:45:38.10 +0400>,<she>,<DPX200>,
      <Start of raw data processing
       efp BC_mod = 2 LB = 0.24 FT_mod = 6 PKNL = 1 PHC0 = -25312.45 PHC1 = 8.787481 SI = 16K 
       data hash MD5: 16K
       68 C4 4A AD CD 42 FF 47 5E 6C 20 E8 F0 D9 24 DC>)
(   3,<2024-05-28 13:45:53.51 +0400>,<she>,<DPX200>,
      <pk PHC0 = 2.643061 PHC1 = -3.6 
       data hash MD5: 16K
       FB 90 D6 79 CC 17 DC 50 7C A1 29 7E 18 9D 73 41>)
(   4,<2024-05-28 13:45:57.10 +0400>,<she>,<DPX200>,
      <abs ABSG = 5 
       data hash MD5: 16K
       36 BC FE 47 7E A6 25 E6 33 BF C3 6F 1A 20 D0 23>)
$$ ##END=
$$ 
$$ hash MD5
$$ 71 2D D0 82 06 F3 85 DD 0A 4B 35 CE BB 9D 96 1E
##$RELAX= 
##$RELAX= 
##$RELAX= 
##$RELAX= 
##$RELAX= 
##$RELAX= 
$$ Bruker specific parameters
$$ --------------------------
##$DU= <F:/spectra>
##$EXPNO= 1
##$NAME= <H-F>
##$PROCNO= 1
##$TYPE= <nmr>
##$USER= <she>
##$AMP= (0..31)
100 100 100 100 100 100 100 100 100 100 100 100 100 100 100 100 100 100 
100 100 100 100 100 100 100 100 100 100 100 100 100 100 
##$AQSEQ= 0
##$AQ_mod= 1
##$AUNM= <au_zg>
##$AUTOPOS= <>
##$BF1= 200.13
##$BF2= 200.13
##$BF3= 200.13
##$BF4= 200.13
##$BF5= 200.13
##$BF6= 200.13
##$BF7= 200.13
##$BF8= 200.13
##$BYTORDA= 1
##$CFDGTYP= 0
##$CFRGTYP= 5
##$CHEMSTR= <none>
##$CNST= (0..31)
1 1 145 1 1 1 1 1 1 1 1 1 1 1 1 1 1 1 1 1 1 1 1 1 1 1 1 1 1 1 1 1 
##$CPDPRG= <>
##$CPDPRG1= <>
##$CPDPRG2= <>
##$CPDPRG3= <>
##$CPDPRG4= <mlev>
##$CPDPRG5= <mlev>
##$CPDPRG6= <mlev>
##$CPDPRG7= <mlev>
##$CPDPRG8= <mlev>
##$CPDPRGB= <>
##$CPDPRGT= <>
##$D= (0..31)
0 1.2 0 0 0 0 0 0 0 0.06 0 0.03 0 0 0 0 0.0002 0 0 0 0 0 0 0 0 0 0 0 0 
0 0 0 
##$DATE= 1716889534
##$DBL= (0..7)
120 120 120 120 120 120 120 120 
##$DBP= (0..7)
150 150 150 150 150 150 150 150 
##$DBP07= 0
##$DBPNAM0= <>
##$DBPNAM1= <>
##$DBPNAM2= <>
##$DBPNAM3= <>
##$DBPNAM4= <>
$$ [...]
##$SUBNAM3= <"">
##$SUBNAM4= <"">
##$SUBNAM5= <"">
##$SUBNAM6= <"">
##$SUBNAM7= <"">
##$SUBNAM8= <"">
##$SUBNAM9= <"">
##$SW= 18.0517689322627
##$SWIBOX= (0..15)
0 0 2 0 0 0 0 0 0 0 0 0 0 0 0 0 
##$SW_h= 3612.71676300578
##$TD= 16384
##$TD0= 1
##$TE= 0
##$TE2= 300
##$TE3= 300
##$TEG= 300
##$TL= (0..7)
0 120 120 120 120 120 120 120 
##$TP= (0..7)
150 150 150 150 150 150 150 150 
##$TP07= 0
##$TPNAME0= <>
##$TPNAME1= <>
##$TPNAME2= <>
##$TPNAME3= <>
##$TPNAME4= <>
##$TPNAME5= <>
##$TPNAME6= <>
##$TPNAME7= <>
##$TPOAL= (0..7)
0.5 0.5 0.5 0.5 0.5 0.5 0.5 0.5 
##$TPOFFS= (0..7)
0 0 0 0 0 0 0 0 
##$TUNHIN= 0
##$TUNHOUT= 0
##$TUNXOUT= 0
##$USERA1= <user>
##$USERA2= <user>
##$USERA3= <user>
##$USERA4= <user>
##$USERA5= <user>
##$V9= 5
##$VALIST= <valist>
##$VCLIST= <CCCCCCCCCCCCCCC>
##$VD= 0
##$VDLIST= <DDDDDDDDDDDDDDD>
##$VPLIST= <PPPPPPPPPPPPPPP>
##$VTLIST= <TTTTTTTTTTTTTTT>
##$WBST= 1024
##$WBSW= 4
##$XGAIN= (0..3)
0 0 0 0 
##$XL= 0
##$YL= 0
##$YMAX_a= 604981
##$YMIN_a= -851396
##$ZGOPTNS= <>
##$ZL1= 120
##$ZL2= 120
##$ZL3= 120
##$ZL4= 120
##$ABSF1= 15.92653
##$ABSF2= -2.125363
##$ABSG= 5
##$ABSL= 3
##$ALPHA= 0
##$AQORDER= 0
##$ASSFAC= 0
##$ASSFACI= 0
##$ASSFACX= 0
##$ASSWID= 0
##$AUNMP= <proc_1d>
##$AZFE= 0.1
##$AZFW= 0.1
##$BCFW= 0
##$BC_mod= 2
##$BYTORDP= 0
##$COROFFS= 0
##$CY= -3
##$DATMOD= 1
##$DC= 0
##$DFILT= <>
##$DTYPP= 0
##$F1P= 0
##$F2P= 0
##$FCOR= 1
##$FTSIZE= 16384
##$FT_mod= 6
##$GAMMA= 0
##$GB= 0
##$INTBC= 1
##$INTSCL= 3.70164e-10
##$ISEN= 128
##$LB= 0.24
##$LEV0= 0
##$LPBIN= 0
##$MAXI= 10000
##$MC2= 0
##$MEAN= 0
##$ME_mod= 0
##$MI= 1.114404
##$NCOEF= 0
##$NC_proc= -6
##$NLEV= 6
##$NOISF1= 3.799351
##$NOISF2= 2.8
##$NSP= 0
##$NTH_PI= 0
##$NZP= 0
##$OFFSET= 15.80202
##$PC= 1
##$PHC0= -25309.81
##$PHC1= 5.187481
##$PH_mod= 1
##$PKNL= yes
##$PPARMOD= 0
##$PSCAL= 0
##$PSIGN= 0
##$REVERSE= no
##$SF= 200.129543908978
##$SI= 16384
##$SIGF1= 3
##$SIGF2= 2
##$SINO= 5.538805
##$SIOLD= 16384
##$SREGLST= <1H.CDCl3>
##$SSB= 0
##$STSI= 16384
##$STSR= 0
##$SW_p= 3612.71676300577
##$SYMM= 0
##$S_DEV= 0
##$TDeff= 16384
##$TDoff= 0
##$TI= <>
##$TILT= no
##$TM1= 0
##$TM2= 0
##$TOPLEV= 0
##$USERP1= <user>
##$USERP2= <user>
##$USERP3= <user>
##$USERP4= <user>
##$USERP5= <user>
##$WDW= 1
##$XDIM= 16384
##$YMAX_p= 490722514
##$YMIN_p= -364363
$$ End of Bruker specific parameters
$$ ---------------------------------
##NTUPLES= NMR SPECTRUM
##VAR_NAME=  FREQUENCY,     SPECTRUM/REAL,   SPECTRUM/IMAG
##SYMBOL=    X,             R,               I
##VAR_TYPE=  INDEPENDENT,   DEPENDENT,       DEPENDENT
##VAR_FORM=  AFFN,          ASDF,            ASDF
##VAR_DIM=   16384,         16384,           16384
##UNITS=     HZ,            ARBITRARY UNITS, ARBITRARY UNITS
##FACTOR=    0.220516191357247, 1,           1
##FIRST=     3162.4510700374, 0,             0
##LAST=      -450.265692968371, 0,           0
##MIN=       -450.265692968371, -364363,     0
##MAX=       3162.4510700374, 490722514,     0
$$ Real data points
##PAGE= N=1
##DATA TABLE= (X++(R..R)), XYDATA
$$ [...]
7556A96411l392j06833k6152O762k3105n5351J55007J33881j57180J3902R7418
$$ 196411 193019 86186 60034 66796 43691 -11660 143347 277228 120048 133950 231368
7545B31368j87568l2913J10901R3972j8062l860O898K4719r4572p0178J29748
$$ 231368 43800 10887 121788 215760 197698 193838 200736 225455 130883 60705 190453
7534A90453M8582k4008J0090j11578R8383l6315k5419M835L9028M3174j735j5277
$$ 190453 239035 215027 225117 113539 211922 175607 150188 155023 194051 237225 235490 220213
7522B20213j31202j0780R1724Q4433p3426M2930j0260k9419n3089O9112k157j43688
$$ 220213 89011 78231 169955 254388 180962 223892 213632 184213 131124 200236 198079 54391
7510E4391p3166J4819R425J04842m0465l8851k9354m2872j0998P5609N055J9692
$$ 54391 -18775 -3956 5469 110311 69846 30995 1641 -41231 -52229 23380 28435 48127
7498D8127K0028j26193m092M3511L5955J6881k2203O7020k0116m9023l427k5797
$$ 48127 68155 -58038 -62130 -18619 17336 34217 12014 79034 58918 9895 6468 -19329
7486a9329M1498J9963M6387r2073K5031R8678n1484l6566j8282m3763N1195j39935
$$ -19329 22169 42132 88519 -3554 21477 120155 68671 32105 13823 -29940 21255 -118680
7474a18680k0332R6244K5544K6023K6259L9600q193j821q1487j921O2165l8962
$$ -118680 -139012 -42768 -17224 8799 35058 74658 66465 64644 -16843 -18764 43401 4439
7462D439M4541L1264m1491n7223M8896n9767J09300J2801J6272L788m7360n2753
$$ 4439 48980 80244 38753 -18470 30426 -29341 79959 92760 109032 112820 65460 12707
7450A2707K5833O2199K8299o0587n4858p165L0124N9604N9278l3535j5544l7166
$$ 12707 38540 100739 129038 68451 13593 6428 36552 96156 155434 121899 106355 69189
7438F9189o4118L6845n3693Q0274j18516J21926o8242M7929o6710J0923J01350
$$ 69189 5071 41916 -11777 68497 -50019 71907 3665 51594 -15116 -4193 97157
7427I7157l4831o2112o5714m291L3844K9131K5325L7317j04988m8837L7699Q881
$$ 97157 62326 214 -65500 -69791 -35947 -6816 18509 55826 -49162 -97999 -60300 -51419
7415e1419M8800l8113q1311O0150P0724k3313q113J82634R9463j93381q0249J912
$$ -51419 -2619 -40732 -122043 -61893 8831 -14482 -22595 160039 259502 66121 -14128 -12216
7403a2216L1907N754P763J2187N7697o2030r4561O9715L9902J10730o1303n7764
$$ -12216 19691 25445 33208 45395 103092 41062 -53499 16216 56118 166848 105545 47781
7391D7781N7055o5684j03385m1179J64222J7854m7549l3570m6913M6750p8714
$$ 47781 104836 39152 -64233 -105412 58810 76664 29115 -4455 -51368 -4618 -83332
7380h3332P8032j05524L9184R1176N2723q320q7519M4980O615j0408K1288p7204
$$ -83332 -5300 -110824 -71640 19536 72259 63939 -23580 21400 28015 17607 38895 -38309
7368c8309R4402L5682p9505j0008J8796J9936K1864l4677O6122l1114j2420L8352
$$ -38309 56093 91775 12270 2262 21058 40994 62858 28181 94303 63189 50769 89121
7356H9121j04712K605J0930m8572N2327N4149n1544k9750j1622N9703q7411P0381
$$ 89121 -15591 -12986 -2056 -50628 1699 55848 4304 -25446 -37068 22635 -64776 5605
7344E605m0027J05005L7430n8312J28678j27455o0090M4389k4202j00465k6743
$$ 5605 -34422 70583 108013 49701 178379 50924 -9166 35223 11021 -89444 -116187
7333a16187O9953Q7995k590j14988l553k4970j4362Q1798J31736m1153k5680q06
$$ -116187 -46234 41761 39171 -75817 -79370 -104340 -118702 -36904 94832 53679 27999 27193
7321B7193j03045J7497k9464r4439J05471M3051k5872Q9646k0014k5732M8577
$$ 27193 -75852 -58355 -87819 -182258 -76787 -33736 -59608 30038 10024 -15708 32869
7310C2869J6253K2311m0479n3175o4509p151k3464j6787J17162n5678p5756J04069
$$ 32869 49122 71433 30954 -22221 -86730 -93881 -117345 -134132 -16970 -72648 -148404 -44335
7298d4335J112p74Q7823K0057k8417m1326p2830j84204J97793K3106k1718m9134
$$ -44335 -43223 -43997 43826 63883 35466 -5860 -78690 -262894 -65101 -41995 -63713 -112847
7286a12847O1452L4231J179k0841m6910j1544N0475K2906j17254J2881p0064J12749
$$ -112847 -51395 -17164 -15985 -36826 -83736 -95280 -44805 -21899 -139153 -126272 -196336 -83587
7274h3587m3428l1468P5705J28996j6534r1165O4140L5423j9396k9995l2097n593
$$ -83587 -127015 -158483 -82778 46218 29684 -61481 2659 38082 18686 -11309 -43406 -48999
7262d8999j00773Q5017J7699n1989N9679n014n3068L6128O8405q0079m5586O7990
$$ -48999 -149772 -64755 -47056 -99045 -39366 -44380 -97448 -61320 7085 -72994 -118580 -50590
7250e0590O6207n5389Q0907q9848o7809P9590O3654M4584o2043j0987J10975j0551
$$ -50590 15617 -39772 41135 -48713 -116522 -36932 26722 71306 9263 -1724 109251 98700
7238I8700L4681q7302m8755j04302m3847N8292Q4587J05688j21658N6726k7761
$$ 98700 133381 46079 -2676 -106978 -150825 -92533 -7946 97742 -23916 32810 5049
7227E049J415n1397J1264k928L8911n794p842k1918q1421p2655L2538M6782J29339
$$ 5049 6464 -44933 -33669 -36597 2314 -3480 -11322 -33240 -114661 -187316 -154778 -107996 21343
7214B1343J0179j88774M6171N5380N3240L2131m0434j4631J20564P51q1787j00254
$$ 21343 31522 -157252 -111081 -55701 -2461 29670 -10764 -25395 95169 95920 14133 -86121
7202h6121j5427J91207J600j22074K4380K5955J3181p8515P1057J5835p6370m298
$$ -86121 -101548 89659 91259 -30815 -6435 19520 32701 -45814 25243 41078 -35292 -39590
7190c9590M7989j4644j30365p0145N5197P0178J55776M8268j49931l8878N0674
$$ -39590 8399 -6245 -136610 -206755 -151558 -81380 74396 122664 -27267 -66145 -15471
7179a5471J06704J2016q0791L967O942l4030J67869p0850j27966J14631l9944
$$ -15471 91233 103249 22458 26425 33367 -663 167206 96356 -31610 83021 43077
7168D3077J987Q1748l6784O025j2430N8443K772k0682j0185j2523K1647j15077
$$ 43077 45064 126812 90028 96053 83623 142066 144838 124156 113971 101448 123095 8018
7156H018p9087q9092J15833N5122j1111J03687m9771P2604L5693l7954L8636q6952
$$ 8018 -71069 -160161 -44328 10794 -317 103370 53599 126203 161896 123942 162578 75626
7144G5626l2033O8473n9541Q693N294m6411m0776J02421L7667J4889O9878K5095
$$ 75626 43593 112066 52525 61218 66512 20101 -20675 81746 119413 134302 204180 229275
7132B29275j34531p839J04995N168j28377L9051l7598J1729L8070j54487J48307
$$ 229275 94744 86905 191900 197068 68691 107742 70144 81873 119943 -34544 113763
7121A13763P961L7885j03036O3417J04823j41018R71Q3031N6999j9531L6795N5589
$$ 113763 121724 159609 56573 119990 224813 83795 84766 167797 224796 205265 242060 297649
7109B97649p3241j08772n0281k3448k260P7785j300K1135m0103p4815K9210O5831
$$ 297649 224408 115636 65355 41907 39647 117432 116132 137267 97164 22349 51559 117390
7097A17390p6417O218j6868l7519J07699p528k5154O6656k2117L2993K599j64144
$$ 117390 40973 47191 30323 -7196 100503 92975 67821 134477 112360 145353 147952 -16192
7085a6192Q511n5089O3801n32J57260l1102j49322J7069j1787m1485J7436J7232
$$ -16192 -7681 -62770 1031 499 157759 126657 -22665 -5596 -17383 -58868 -41432 -24200
7073b4200K8293L3392o8658O2011r296l3339m8282K9491k9787m8520K6395N0330
$$ -24200 4093 37485 -31173 30838 21542 -11797 -60079 -30588 -60375 -108895 -82500 -32170
7061c2170j30506J57086P826j46217m487Q5585j6343n7135N8863K4343K2726o8405
$$ -32170 -162676 -5590 2236 -143981 -148468 -62883 -79226 -136361 -77498 -53155 -30429 -98834
7049i8834p3149J4090J43061J3642j07206J3433R8642j07668m9238m2589M3954
$$ -98834 -171983 -157893 -14832 -1190 -108396 -94963 3679 -103989 -153227 -195816 -151862
7038a51862L2472q8312m9300P1679J02264P4512m4533l997L4915q0218l578K1757
$$ -151862 -119390 -207702 -257002 -185323 -83059 -8547 -53080 -57077 -22162 -102380 -105958 -84201
7026h4201m3007l5693N154O4632j6047j2785Q2790p2164o0082j8312J19375L2541
$$ -84201 -127208 -162901 -157747 -93115 -109162 -121947 -39157 -111321 -171403 -189715 -70340 -37799
7014c7799k7045N7233M2853o4869p704k8396L5715n7438j11158l579J22333L6205
$$ -37799 -64844 -7611 35242 -29627 -37331 -65727 -30012 -87450 -198608 -202187 -79854 -43649
7002d3649J7033n6241m6815R3599p6823l4675Q957m6899J35181k2386k553J18041
$$ -43649 -26616 -82857 -129672 -36073 -112896 -147571 -138614 -185513 -50332 -72718 -75271 42770
6990D2770o9129n2542O8847o6459r026l4958j26724J23871j0035P1203k0091l2710
$$ 42770 -26359 -78901 -10054 -76513 -85539 -120497 -247221 -123350 -133385 -62182 -82273 -114983
6978a14983k6791K0367N9241J5786J8015m5955j9476N6823l7264k2754j27842
$$ -114983 -141774 -121407 -62166 -46380 -28365 -74320 -93796 -36973 -74237 -96991 -224833
6967b24833q418M6210J28181O4371O23K8931J4999j46145m769M9145M231R0313
$$ -224833 -233251 -187041 -58860 5511 6134 35065 50064 -96081 -100850 -51705 -47474 42839
6955D2839q4122N2988N6774m0394j08702j0011J00563j3953q1470n6037J04084
$$ 42839 -41283 11705 68479 28085 -80617 -90628 9935 -4018 -85488 -141525 -37441
6944c7441n4065k5402l214Q4976l4808k8671l319k673L3649L0150l8469k0955
$$ -37441 -91506 -116908 -120122 -35146 -69954 -98625 -101944 -104617 -70968 -40818 -79287 -100242
6932a00242K6450l6519p0729l1107M2393O0325M6011l1643K4510j09648J8927
$$ -100242 -73792 -110311 -181040 -212147 -169754 -109429 -63418 -95061 -70551 -180199 -161272
6921a61272J03972P30k9590o1264k0175P1837j0013Q8554O8569r6566q0434m3262
$$ -161272 -57300 -56570 -86160 -147424 -167599 -95762 -105775 -17221 51348 -45218 -125652 -168914
6909a68914M4885j02855k0147K14732o0807L0015n7909K84N9961M3139k9601R7881
$$ -168914 -124029 -226884 -247031 -32299 -93106 -63091 -121000 -120716 -60755 -17616 -47217 50664
6897E0664n0966r5606m2468J3707o0037m2104j5860O1648J81138N0766r6022j28339
$$ 50664 -302 -95908 -138376 -124669 -184706 -226810 -242670 -181022 116 50882 -45140 -173479
6885a73479o4870J06814J03766n320J1156L4752j8221q1084p7399N6897L5465
$$ -173479 -238349 -131535 -27769 -33089 -21933 12819 -5402 -86486 -163885 -106988 -71523
6874g1523k1369L2041J0916L1017j57962M680R230J6312L697p561K4751Q9968
$$ -71523 -92892 -60851 -49935 -18918 -176880 -172200 -162970 -146658 -142961 -150522 -125771 -35803
6862c5803K7393r9876m2909n9753N9126M5325M7157k8766m5735O5666q0926l5936
$$ -35803 -8410 -108286 -151195 -210948 -151822 -106497 -59340 -88106 -133841 -68175 -149101 -185037
6850a85037L7479o1116K2934J78325l9572J5151o292k0989k9098o554N5283k063
$$ -185037 -147558 -208674 -185740 -7415 -46987 -31836 -38128 -59117 -88215 -94769 -39486 -41549
6838d1549n4984L8445k8848L7770L0042l4142o8594k7024P0114p9078J3213j451
$$ -41549 -96533 -58088 -86936 -49166 -19124 -53266 -121860 -148884 -78770 -157848 -144635 -146086
6826a46086n9459j675N0073J8337L1967L6389n9711m8027J0727N6921J7840P706
$$ -146086 -205545 -207220 -157147 -138810 -106843 -70454 -130165 -178192 -167465 -110544 -92704 -84998
6814h4998O1185q9357o0690O8680K2646P553P2172j3521P439k4336P8986o8988
$$ -84998 -23813 -113170 -173860 -105180 -82534 -74981 -2809 -16330 -8891 -33227 45759 -23229
6802b3229k03012L2088M8077O2288R370n7804P048L1271L8016q8672J031Q1156
$$ -23229 -226241 -194153 -146076 -83788 -74418 -132222 -125174 -93903 -55887 -144559 -143528 -62372
6790f2372R7403l6780p8440M6674K2675K367M6311J5953q2339M7087j28243K4606
$$ -62372 35031 -1749 -80189 -33515 -10840 -8473 37838 53791 -28548 18539 -109704 -85098
6778h5098R5476P721J02031m3067j33489l959n8811k3961k9815M1991K8063Q0044
$$ -85098 10378 18099 120130 77063 -56426 -60385 -119196 -143157 -172972 -130981 -102918 -22874
6766b2874l5242j15303J8518M4080R8248n338M7421j8696m351j4439l3297M8427
$$ -22874 -58116 -173419 -154901 -110821 -12573 -17911 29510 10814 6463 -7976 -41273 7154
6754G154n0672m2587j9321l335M4396m427o6881J6335J07979r4230P9974O511
$$ 7154 -43518 -86105 -105426 -108761 -64365 -68792 -135673 -119338 -11359 -105589 -25615 -19104
6742a9104K3463L6736l1517P9361k5573j78522M9840N3098l4284L6025m056J3562
$$ -19104 4359 41095 9578 88939 63366 -115156 -65316 -12218 -46502 -10477 -14533 -971
6730i71k2416K3003O6317p3613n1943O9611o7722r1809K4812j3516o3806l5211
$$ -971 -23387 -384 65933 -7680 -59623 9988 -57734 -149543 -124731 -138247 -202053 -237264
6718b37264J8176J61698M9839k1281M5811P6136j06429l4222Q8129l8290J00007
$$ -237264 -219088 -57390 -7551 -28832 16979 93115 -13314 -47536 40593 2303 102310
6707A02310j62757k8691J32190O8450L9549j40020J19944L9478J48768K0566O865
$$ 102310 -60447 -89138 43052 111502 151051 11031 130975 170453 319221 339787 346652
6696C46652j45368p7438k7042m4480o9727q6012k336O5262J4000l227M5871l9688
$$ 346652 201284 123846 96804 52324 -17403 -103415 -105751 -40489 -26489 -29716 16155 -23533
6684b3533o8876M6572Q4899p5433L8702N561j6817R4471K7638j10144N1356r5699
$$ -23533 -92409 -45837 39062 -36371 2331 7892 -8925 85546 113184 3040 54396 -41303
6672d1303L5721N6318n9209q6986K0371j3731J5555L9634K481m6141k8848M8317
$$ -41303 -5582 50736 -8473 -95459 -75088 -88819 -73264 -33630 -31149 -77290 -106138 -57821
6660e7821K897j8941O039L2995r220J05644o4989K4430N690J05790j1299m4192
$$ -57821 -54924 -73865 -67826 -34831 -44051 61593 -3396 21034 26724 132514 121215 77023
6648G7023N4410P3314k8316p6501j9998k483M2586o1447L1282k6992m0036J02402
$$ 77023 131433 204747 176431 99930 79932 77449 120035 58588 89870 62878 22842 125244
6636A25244N6174j78956m7496R2236j6237p0655O5942O8694n413M7559j1197j33888
$$ 125244 181418 2462 -45034 47202 30965 -39690 26252 94946 89533 137092 125895 -7993
6624g993k0864n270k894K6099L9899j6690M4366k5973m8965M9396n306l7611N3974
$$ -7993 -28857 -34127 -37021 -10922 28977 12287 56653 30680 -18285 31111 25805 -11806 42168
6611D2168q1637K029P7907L5235Q2497n2017o8596n2716m4035J9271Q7513K596
$$ 42168 -39469 -37440 40467 75702 158199 106182 37586 -15130 -59165 -39894 47619 50215
6599E0215L0809q7633o0812J15798j2453P0846Q628q7456j1235r4835n2555Q8124
$$ 50215 81024 -6609 -67421 48377 35924 106770 115398 27942 16707 -78128 -130683 -42559
6587d2559l0183L5650K1250m3261q3754R8033j5074n4077J14934k1166P6759j08300
$$ -42559 -72742 -37092 -15842 -59103 -142857 -44824 -59898 -113975 959 -20207 56552 -51748
6575e1748j1226K3778l1057l8315p3018q3000M7561J54036k4997M951J4056M1112
$$ -51748 -62974 -39196 -70253 -108568 -181586 -264586 -217025 -62989 -87986 -83035 -68979 -27867
6563b7867O8726k9694p522n0345n331M2035o1487Q2083O8795K6376l6742m4058
$$ -27867 40859 11165 3643 -46702 -52033 -9998 -71485 10598 79393 105769 69027 24969
6551B4969k2975p8638o0377J8898N2110J17073J2443j11432J37428m2542j59056
$$ 24969 1994 -76644 -137021 -118123 -66013 51060 63503 -47929 89499 46957 -112099
6540a12099o0393m3439J52062J00419p2425k6840L4958M377K7060O7841k5181
$$ -112099 -172492 -215931 -63869 36550 -35875 -62715 -27757 -23380 3680 71521 46340
6529D6340K5960r9118n1069R6722m8604q207l7432P7959J10477j64183L2145M3225
$$ 46340 72300 -26818 -77887 18835 -29769 -37976 -75408 2551 113028 -51155 -19010 24215
6517B4215L6759l741k0605p5581K9634J4413L8727l2440q9531o2160K7558R0350
$$ 24215 60974 57233 36628 -38953 -9319 5094 43821 11381 -78150 -140310 -112752 -22402
6505b2402l5371M692O6510K1315j08562J6212j00654N2627N9800M2418q628J5321
$$ -22402 -57773 -53081 13429 34744 -73818 -57606 -158260 -105633 -45833 -3415 -12043 3278
6493C278k5137j35932P9862O6452j09305j0112J86173O1373P5075l9693k26351
$$ 3278 -21859 -157791 -77929 -11477 -120782 -130894 55279 116652 191727 152034 -74317
6482g4317P038M5514K9827Q7746Q8069j37008J235q097j14877R0403m3726K2888
$$ -74317 -67279 -21765 8062 95808 183877 46869 48104 40007 -74870 15533 -28193 -5305
6470e305N2284m8144J1565Q1985m4208L7038r3604n4635O6198l6503p838j1940
$$ -5305 46979 -1165 10400 92385 48177 85215 -8389 -63024 3174 -33329 -41167 -53107
6458e3107q6565K9036n298P3886O8192N3109O0845j06095j1442N2683j5363n369
$$ -53107 -139672 -110636 -115934 -42048 26144 79253 140098 34003 22561 75244 59881 54512
6446E4512p3517P0584j02584k3539J08993r467p281p0641K7813Q1374M3614J7406
$$ 54512 -19005 51579 -51005 -74544 34449 24982 17701 -52940 -25127 56247 99861 117267
6434A17267l8838K5971R3068L4758j10115r0031Q842n6718K3586R0666j08447
$$ 117267 78429 104400 197468 232226 122111 32080 40922 -15796 7790 98456 -9991
6423i991j2171M1448o6360P8970K5405O8794q4214P3847p1424p8602J49015P9118
$$ -9991 -22162 19286 -47074 31896 57301 126095 41881 115728 44304 -34298 114717 193835
6411A93835p0026n7208K2707k1415J0880P0183O1642n2651p1609Q9894K1083O8529
$$ 193835 123809 66601 89308 67893 78773 148956 210598 157947 86338 176232 197315 265844
6399B65844r4084J915k2310N0082m9616j01015M4974M752L6053n6258m5556l3862
$$ 265844 171760 173675 151365 201447 151831 50816 95790 100542 136595 80337 34781 919
6387I19J06008J15461k0211M706l4549j19013K1727j2202K9454M5366K8184J6332
$$ 919 106927 222388 202177 206883 172334 53321 75048 62846 92300 137666 165850 182182
6375A82182j8971n196m2983k7275j24878N4035O7070L0904M6015M3338j19974
$$ 182182 163211 158015 115032 87757 -37121 16914 83984 114888 160903 204241 84267
6364H4267n5898O0772J07409o3997M2597J46233o0117j7868K57P2671j5338o5177
$$ 84267 28369 89141 196550 132553 175150 321383 261266 243398 243655 316326 300988 235811
6352B35811j6387L1517j14973P2627p8062k9578L2442K9840M327k8716J11476
$$ 235811 219424 250941 135968 208595 130533 100955 133397 163237 167564 138848 250324
6341B50324p4092j8190p861P6463J0518l4998K2946J06805k5433l7229m7925m4365
$$ 250324 176232 158042 150181 226644 237162 202164 225110 331915 306482 269253 221328 176963
6329A76963J17015q7132l9870R3506Q616r0189j0360O2167O0436M0156K1022j7783
$$ 176963 293978 206846 166976 260482 269098 178909 168549 230716 291152 331308 352330 334547
6317C34547p0403k7330l2820N1139r2264k5921N4056M1425M1874m0057K8331j45131
$$ 334547 264144 236814 203994 255133 162869 136948 191004 232429 274303 234246 262577 117446
6305A17446J01440J18970q4671m5777L8059m1395K2044P7972P1990q0993Q6768
$$ 117446 218886 337856 253185 207408 245467 204072 226116 304088 376078 295085 381853
6294C81853j1392k6414n0953J1337J02241M7893n7081m914J36776n1629q8698
$$ 381853 370461 344047 293094 304431 406672 454565 397484 392570 529346 477717 389019
6283C89019J9136l1891r7301q7997L8936R5698R5217N5041L511j5647n6409n8157
$$ 389019 408155 376264 278963 190966 229902 325600 420817 475858 479369 463722 407313 349156
6271C49156L6175R760N1396l7640K8218k4623J1557k474J9331l4951J7665J14815
$$ 349156 385331 395091 446487 408847 437065 412442 423999 421525 440856 405905 423570 538385
6259E38385J7805n6835j36196M7514n9766k3016M7910J04411K4524J2667o2400
$$ 538385 556190 499355 363159 410673 350907 327891 375801 480212 504736 517403 455003
6248D55003l3801P2650j2157O1057O5006K5350j46827n3993j8199O7668J29262
$$ 455003 421202 493852 481695 542752 607758 633108 486281 432288 414089 481757 611019
6237F11019q3016n2089L2719J70232P0205p8082p3397L7002N9657K347p5673o1818
$$ 611019 528003 475914 508633 678865 749070 670988 597591 634593 694250 696597 620924 559106
6225E59106O8847K08834J9515j7036j3045N0778Q1358N6458K6189N9781K380n5257
$$ 559106 627953 836787 856302 839266 826221 876999 958357 1014815 1041004 1100785 1103165 1047908
6213A047908l9065m715M3227N208k1343j2491k6402J18543J32034K0190m2073
$$ 1047908 1008843 1004128 1047355 1052563 1031220 1018729 992327 1110870 1242904 1263094 1221021
6202A221021J9976m8728Q3562j6653K9035k5019J4519j8718r5501R9356L8027
$$ 1221021 1240997 1192269 1275831 1259178 1288213 1263194 1277713 1258995 1163494 1262850 1300877
6191A300877o144O6155r907J0965q8606j29229J06653K16117P074j34151K645
$$ 1300877 1294733 1360888 1350981 1361946 1273340 1144111 1250764 1466881 1473955 1339804 1342449
6180A342449O9550j8191M2873L1981n7418j97466L8157J89782O461j8294l1916
$$ 1342449 1411999 1393808 1436681 1468662 1411244 1213778 1251935 1441717 1448178 1429884 1397968
6169A397968m105K9487j17781Q4409N4460l6410K8389n1633K8379o7214O1035
$$ 1397968 1393863 1423350 1305569 1389978 1444438 1408028 1436417 1384784 1413163 1345949 1406984
6158A406984n6329l181J14267p4469m9106O0834j0075l9896K9121j1914R0529
$$ 1406984 1350655 1347474 1461741 1387272 1338166 1399000 1388925 1349029 1378150 1366236 1456765
6147A456765l3568j12273Q8040O815J24730J0889K635k0556j4495R932p267O2780
$$ 1456765 1423197 1310924 1398964 1405779 1530509 1541398 1544033 1523477 1508982 1518914 1511647 1574427
6135A574427j5651J30311L1940O6127N4608o519Q2582j52092L74O135j2667j14187
$$ 1574427 1558776 1689087 1721027 1787154 1841762 1835243 1917825 1765733 1766107 1772242 1759575 1645388
6123A645388p6429J08005R5254P4673q1428j88194M9357J3620J25884M5238r2458
$$ 1645388 1568959 1676964 1772218 1846891 1765463 1577269 1626626 1640246 1766130 1811368 1718910
6112A718910j8345M7873P3803L5407M5706O3113n8472j00332j8775N498M8175
$$ 1718910 1700565 1748438 1822241 1857648 1903354 1966467 1907995 1807663 1788888 1794386 1842561
6101A842561R2672l1493K2859P9884j08251j02500P9652k0013p4768J43654M1617
$$ 1842561 1935233 1903740 1926599 2006483 1898232 1795732 1875384 1855371 1780603 1924257 1965874
6090A965874l2965k586M9876K8510J48401j0368j2642K7907k7283L3338O5681
$$ 1965874 1932909 1930323 1980199 2008709 2157110 2146742 2134100 2162007 2134724 2168062 2233743
6079B233743K0819N881J26742M5911R7467l584P3423q6488R1781M2134j58667
$$ 2233743 2254562 2260443 2387185 2433096 2530563 2526979 2600402 2513914 2605695 2647829 2489162
6068B489162k5370K4033M404K7459R0942N3759k6239j64870R5664J87904M222
$$ 2489162 2463792 2487825 2492229 2519688 2610630 2664389 2638150 2473280 2568944 2756848 2761070
6057B761070Q1154K7433P5659p4664L7480P3083r7475j8433J4136N3221j2374
$$ 2761070 2842224 2869657 2945316 2870652 2908132 2981215 2883740 2865307 2879443 2932664 2920290
6046B920290l199K1548N7103J6736L8215L9039L3786j7112j3017L3825Q6755M3028
$$ 2920290 2917091 2938639 2995742 3012478 3050693 3089732 3123518 3106406 3093389 3127214 3213969 3256997
6034C256997O3254J01260R9406q1279p8528J43586M1317O4651j05394K6349Q1452
$$ 3256997 3320251 3421511 3520917 3439638 3361110 3504696 3546013 3610664 3505270 3531619 3613071
6023C613071K9085K03961k6892N6506J62706R5883k3444p7025m4867j5609Q4517
$$ 3613071 3642156 3846117 3819225 3875731 4038437 4134320 4110876 4033851 3988984 3973375 4057892
6012D057892j0605J6284M2893P9609J43895N5579K44570o4600L5634N8686k4189
$$ 4057892 4047287 4063571 4106464 4186073 4329968 4385547 4630117 4565517 4601151 4659837 4635648
6001D635648K2004J49209O5330J8916k3582j50996J7530P3329n8087J62179J77848
$$ 4635648 4657652 4806861 4872191 4891107 4867525 4716529 4734059 4807388 4749301 4911480 5089328
5990E089328J75121N1083o7984k5868L0216P8162R6768K5373R2939J09785P1820
$$ 5089328 5264449 5315532 5247548 5221680 5251896 5330058 5426826 5452199 5545138 5654923 5726743
5979E726743K37070J56736L9104n9935j10274K8853O9224k2576Q2834R6487J27086
$$ 5726743 5963813 6120549 6159653 6099718 5989444 6018297 6087521 6064945 6147779 6244266 6371352
5968F371352J87829J40149J35110M2291J42352K20604j2935J56117J00449J61504
$$ 6371352 6559181 6699330 6834440 6876731 7019083 7239687 7226752 7382869 7483318 7644822
5958G644822J91806J41461J7992J40618K11948K03734K45892J41633J75731K53345
$$ 7644822 7836628 7978089 7996081 8136699 8348647 8552381 8798273 8939906 9115637 9368982
5948I368982J75717K35296K64475K09559K73228K11332K79314K45171J63711J91796
$$ 9368982 9544699 9779995 10044470 10254029 10527257 10738589 11017903 11263074 11426785 11618581
5938A1618581L24944J77018K05609J55125K69789K91311L06591L61726K49282
$$ 11618581 11943525 12120543 12326152 12481277 12751066 13042377 13348968 13710694 13959976
5929A3959976L71662L25633L22717M02131M39625K95758L73961L88960M25003
$$ 13959976 14331638 14657271 14979988 15382119 15821744 16117502 16491463 16880423 17305426
5920A7305426N80931M90256N10912M43205L10454L76778L44522M64015N34579
$$ 17305426 17886357 18376613 18887525 19330730 19641184 20017962 20362484 20826499 21361078
5911B1361078N99854N01051M49315O08210Q77979P33051O73805P87604P11534
$$ 21361078 21960932 22461983 22911298 23519508 24397487 25130538 25804343 26591947 27303481
5902B7303481R83399R36959J049426J173075J289982J427146J584009J657787
$$ 27303481 28286880 29223839 30273265 31446340 32736322 34163468 35747477 37405264
5894C7405264J997150K037693K134387K490816K753149K884702L374891L882893
$$ 37405264 39402414 41440107 43574494 46065310 48818459 51703161 55078052 58960945
5886E8960945M462636N395406N915049O921932Q027550Q150665N103846n59421
$$ 58960945 63423581 68818987 74734036 81655968 89683518 97834183 102938029 102378608
5878A02378608m446630m728402l513333j813960k66068J155413K396082L576943
$$ 102378608 97931978 93203576 89690243 87876283 87610215 88765628 91161710 94738653
5870I4738653N080465O333510N304629J978856p1382O25238K513946M386855N773464
$$ 94738653 99819118 106152628 111457257 113436113 113364731 113989969 116503915 120890770 126664234
5861A26664234N591905K634227j151038l446443l215045j465446O85716L058766
$$ 126664234 132256139 134890366 133739328 130292885 127077840 125612394 126298110 129356876
5853A29356876N378173O484644M134321P06178l69695o52052r98299j787621k067978
$$ 129356876 134735049 141219693 145354014 146060192 145690497 145038445 144040146 142252525 140184547
5844A40184547j579508N4420K141655L254008Q24539n090238r318224r538546
$$ 140184547 138605039 138659459 140801114 144055122 144879661 139789423 130471199 120932653
5836A20932653p816847n635240l611669j887369m21289Q27903K332562L503842
$$ 120932653 113115806 107480566 103868897 101981528 101560239 102388142 104720704 108224546
5828A08224546M756102N919281P084095Q125088Q255090O845893K606647l646913
$$ 108224546 112980648 118899929 125984024 134109112 142364202 149210095 151816742 148169829
5820A48169829r327348j2393386j2359246j0667511q814225p144373n659018m752571
$$ 148169829 138842481 126449095 114089849 103422338 94608113 87463740 81804722 77052151
5812G7052151l706398k909860k132625j452010p67469k01344N88301J166136J786218
$$ 77052151 73345753 70435893 68303268 66851258 66083789 65882445 66470746 67636882 69423100
5803F9423100K314817K947846L558719L976067M336210L673578J397732j975603
$$ 69423100 71737917 74685763 78244482 82220549 86556759 90230337 91628069 89652466
5795H9652466m883156o641175o943302o315106n490542m797849m188441l871996
$$ 89652466 84769310 78128135 71184833 64869727 59379185 54581336 50392895 46520899
5787D6520899l607132l042370k676583k181497k047904j842928j521074j305250
$$ 46520899 42913767 39871397 37194814 35013317 32965413 31122485 29601411 28296161
5779B8296161j100179r92232p72435p63042p22071n32360o03508m99436k87816
$$ 28296161 27195982 26203750 25431315 24668273 23946202 23413842 22810334 22310898 22023082
5770B2023082l79697k77766k41974j91949k23301l33559m52878o06752n90575
$$ 22023082 21643385 21365619 21123645 20931696 20708395 20374836 19921958 19315206 18724631
5761A8724631n27963m45017l71218l08957k43611k27520l12587k96306j99196
$$ 18724631 18196668 17751651 17380433 17071476 16827865 16600345 16287758 15991452 15792256
5752A5792256o9744j51653p9878j90903q8936j778j71J77912J05431J13710J25546
$$ 15792256 15722512 15570859 15490981 15300078 15211142 15209364 15209193 15387105 15492536 15606246 15731792
5741A5731792j2027k1345j17458j42868l13205r8021n4998L826K4353J71120J39124
$$ 15731792 15719765 15698420 15580962 15438094 15124889 15026868 14971870 14975696 15000049 15171169 15310293
5730A5310293J92546L97705L53408L66125L85089O30526L42358R1699j42460l61128
$$ 15310293 15502839 15900544 16253952 16620077 17005166 17635692 17978050 18069749 17927289 17566161
5720A7566161m41399m56096l43411l21986k23001j43942j37349k84j01595J07006
$$ 17566161 17124762 16668666 16325255 16003269 15780268 15636326 15498977 15498693 15397098 15504104
5710A5504104J16399J87382R9696K97309M15505N14435O81246P55905R35966J027355
$$ 15504104 15620503 15807885 15907581 16204890 16620395 17134830 17816076 18571981 19507947 20535302
5700B0535302J144264J116238Q83957M82523j78544r00571j505953j583550j543989
$$ 20535302 21679566 22795804 23679761 24162284 23983740 23083169 21577216 19993666 18449677
5691A8449677j322144j170270r22401o33429n20371m45595l94892k45351j96679
$$ 18449677 17127533 15957263 15034862 14401433 13881062 13435467 13040575 12795224 12598545
5682A2598545r9108m1632Q6785L10745L24737K54597L04759M03999M57076N78639
$$ 12598545 12499437 12457805 12544590 12855335 13180072 13434669 13739428 14143427 14600503 15179142
5672A5179142L04972K31445j81486o71490q93703j006379q60885p46143p91937
$$ 15179142 15484114 15715559 15534073 14862583 13968880 12962501 12101616 11355473 10563536
5663A0563536n89940n17028m34369m74768m84687k41170l52945k74314j97232
$$ 10563536 9973596 9456568 9022199 8547431 8062744 7821574 7468629 7194315 6997083
5654F997083k02353k06824k08821j47954k4970j97644p3411m0374n3583o3917
$$ 6997083 6794730 6587906 6379085 6231131 6206161 6008517 5935106 5894732 5841149 5777232
5644E777232j05593n402j9820j29882O463m2932r7428L6452J00177l670j12483
$$ 5777232 5671639 5666237 5646417 5516535 5522998 5480066 5382638 5419090 5519267 5515597 5403114
5633E403114k11916k25946J3222J27847l071N3862k9328j1835p4157j04054R4447
$$ 5403114 5191198 4965252 4978474 5106321 5103250 5157112 5127784 5115949 5041792 4937738 5032185
5622E032185m4741M498J09839o785M3883j13138o9467R4780N1971N4133L0454
$$ 5032185 4987444 4991942 5101781 5094996 5138879 5025741 4956274 5051054 5103025 5157158 5187612
5611E187612R301k3820M508m7652L1294o7905p2138J37820R382P1903J20686N559
$$ 5187612 5196913 5173093 5177601 5129949 5161243 5093338 5021200 5159020 5168402 5240305 5360991 5366550
5599E366550K8936n032m4617J11395j14965K0788k3695j3214K0840o88j22967
$$ 5366550 5395486 5390454 5345837 5457232 5342267 5363055 5339360 5326146 5346986 5346298 5223331
5588E223331n1610P7871L6607q360r7862N1439m0229K9568K8392R5822N4243J08472
$$ 5223331 5171721 5249592 5286199 5277839 5179977 5231416 5191187 5220755 5249147 5344969 5399212 5507684
5576E507684J3922j17301L2571J12915J22633p9425j03207J03036q3473r7419
$$ 5507684 5521606 5404305 5436876 5549791 5672424 5592999 5489792 5592828 5509355 5411936
5566E411936n6422m5283J7686J19987p5000J21825k6243n7150J04925r770K6480
$$ 5411936 5355514 5310231 5327917 5447904 5372904 5494729 5468486 5411336 5516261 5506491 5532971
5555E532971P0803M2325M0502O3583P6074P1806M7260J09742r793L2576J06013
$$ 5532971 5603774 5646099 5686601 5750184 5826258 5898064 5945324 6055066 6045273 6077849 6183862
5544F183862n8880M1728J87848j8463j6258J5043M2749J41433N7635K4135N8202
$$ 6183862 6124982 6166710 6354558 6336095 6319837 6334880 6377629 6519062 6576697 6600832 6659034
5533F659034L5443J43689P2232M1112N3341J26038P9239L1972J59732R5467J43177
$$ 6659034 6694477 6838166 6910398 6951510 7004851 7130889 7210128 7242100 7401832 7497299 7640476
5522G640476M8597J64776J94103J69354J16066N7518K05258Q9565R5314R4678
$$ 7640476 7689073 7853849 8047952 8217306 8333372 8390890 8596148 8685713 8781027 8875705
5512H875705J67398K24476P7064J46805K36267N0503P1803J12911J21550L7977
$$ 8875705 9043103 9267579 9344643 9491448 9727715 9778218 9850021 9962932 10084482 10122459
5502A0122459J11769K44872P8173J55323K65899K33664J15317J03490K01512K86901
$$ 10122459 10234228 10479100 10557273 10712596 10978495 11212159 11327476 11430966 11632478 11919379
5492A1919379K87640J86200L05881K48739K42515K78990K87804K92016K14550
$$ 11919379 12207019 12393219 12699100 12947839 13190354 13469344 13757148 14049164 14263714
5483A4263714L35599J70950L01400K96536K69727M63992K44785K35634L02959
$$ 14263714 14599313 14770263 15071663 15368199 15637926 16101918 16346703 16582337 16885296
5474A6885296M27309L11006L77746L66678N52670N23607N20970N41297N82536
$$ 16885296 17312605 17623611 18001357 18368035 18920705 19444312 19965282 20506579 21089115
5465B1089115P34418O21239N48209N56002M85218O75786P16573Q24422Q46161
$$ 21089115 21823533 22444772 22992981 23548983 24034201 24709987 25426560 26250982 27097143
5456B7097143J036619J068421J312799J440768J560351J700690J926846K020813
$$ 27097143 28133762 29202183 30514982 31955750 33516101 35216791 37143637 39164450
5448C9164450K323356K707372L031263L432596L766278M258958M637754N449720
$$ 39164450 41487806 44195178 47226441 50659037 54425315 58684273 63322027 68771747
5440F8771747N951751O498333O250908M637412J366589k538486n083836n483371
$$ 68771747 74723498 81221831 87472739 92110151 93476740 90938254 85854418 80371047
5432H0371047n210292m411105l313605k274396j520883o85574J0889P66960J447450
$$ 80371047 75160755 70749650 67436045 65161649 63640766 62955192 62966081 63733041 65180491
5423F5180491J887216K340693L150665L768453M918828N830291O761673Q020335
$$ 65180491 67067707 69408400 72559065 76327518 81246346 87076637 93838310 101858645
5415A01858645R394699J0702410J0896774Q197369J188679o479920j1396500j2721565
$$ 101858645 111253344 121955754 132852528 141049897 142238576 135758656 124362156 111640591
5407A11640591j1579025r940047q198708o643832n352579m352211l569630k695970
$$ 111640591 100061566 90121519 81922811 75278979 69926400 65574189 62004559 59308589
5399E9308589j946111j349847p70423k58311K44607O92428J301149J991886K221495
$$ 59308589 57362478 56012631 55242208 54983897 55228504 55920932 57222081 59213967 61435462
5390F1435462K783858L270557L356773K640380R19397j766689m277289n711308
$$ 61435462 64219320 67489877 70846650 73487030 74406427 72639738 68362449 62651141
5382F2651141o096216n244312m241567l645478l053436k571588k215592j824476
$$ 62651141 56554925 51310613 47069046 43423568 40370132 37798544 35582952 33758476
5374C3758476j565537j244844j180848j102393j012690j063188q25025p79846
$$ 33758476 32192939 30948095 29767247 28664854 27652164 26588976 25763951 24984105
5366B4984105p16082p02075m51994k70726l61048k52934k29054k04355k21072
$$ 24984105 24268023 23565948 23113954 22843228 22482180 22229246 22000192 21795837 21574765
5357B1574765j13116k0199L4906k5800K5634R830K14231K04654J42004J29700
$$ 21574765 21461649 21441450 21476356 21450556 21476190 21486020 21700251 21904905 22046909 22176609
5347B2176609K89593K86970J52842J03357k27374l81867l16690k51484j52948
$$ 22176609 22466202 22753172 22906014 23009371 22781997 22400130 22083440 21831956 21679008
5338B1679008m7505M3630J09519J36028K10511J16422K21020K31242L51682K44022
$$ 21679008 21631503 21675133 21784652 21920680 22131191 22247613 22468633 22699875 23051557 23295579
5328B3295579J85064M22309L55194K65100N21305M92628N33818M74335N08785
$$ 23295579 23480643 23902952 24258146 24523246 25044551 25537179 26070997 26545332 27054117
5319B7054117N92889O21407N29858N21494M54139L71430M85844N32296P14774
$$ 27054117 27647006 28268413 28798271 29319765 29773904 30145334 30631178 31163474 31878248
5310C1878248Q61018Q56598J014924J235283J540720J722500J842298K086463
$$ 31878248 32739266 33595864 34610788 35846071 37386791 39109291 40951589 43038052
5302D3038052K497489K807988L130348L852378M437068M992695N659889O525848
$$ 43038052 45535541 48343529 51473877 55326255 59763323 64756018 70415907 76941755
5294G6941755P582694Q739404Q821086N799430n46872n442386o363938n253400
$$ 76941755 84524449 93263853 102084939 107884369 107337497 101895111 95531173 90277773
5286I0277773l343899j532368J8245J436558K912004M295028M578400J959074
$$ 90277773 86933874 85401506 85419751 86856309 89768313 94063341 98641741 100600815
5278A00600815j204748j850899n75504J115342L070428M822158N598590L959869
$$ 100600815 99396067 97545168 96969664 98085006 101155434 105977592 111576182 115536051
5270A15536051K17481l561025n173436m579425k633755n62285J086084N78002
$$ 115536051 115753532 112192507 107019071 102439646 99805891 99243606 100329690 100907692
5262A00907692k473038m740675m246612k893086j600010k51191L45042R90735
$$ 100907692 98434654 93693979 89447367 86554281 84954271 84703080 85048122 86038857
5254H6038857K030636L210465L488887J537927l664045p876452q961509q127902
$$ 86038857 88069493 91279958 94768845 96306772 92642727 84766275 75804766 67676864
5246F7676864o525578n099028m143129l483538k803255k317723j730616j177181
$$ 67676864 61151286 56052258 51909129 48425591 45622336 43304613 41573997 40396816
5238D0396816r01765n03347j97147K45736K52406N55419M11115l22525j389504
$$ 40396816 39495051 38991704 38794557 39040293 39292699 39848118 40259233 39936708 38547204
5229C8547204k168830k250260k271235k103327j852853j408812j255275j125971
$$ 38547204 36378374 34128114 31856879 29753552 27900699 26491887 25236612 24110641
5221B4110641q10146p35210o61307m65245l21161l47367l81998j93198j61557
$$ 24110641 23300495 22565285 21903978 21438733 21117572 20770205 20388207 20195009 20033452
5212B0033452o7950l7047J78726J71807K46399K58560K61071R6646j87423n06081
$$ 20033452 19965502 19928455 20107181 20278988 20525387 20783947 21045018 21141664 20954241 20448160
5202B0448160r15025j108634r97627r54145p96743o98560n58740m54583o20157
$$ 20448160 19533135 18424501 17426874 16472729 15675986 14977426 14418686 13964103 13343946
5193A3343946m34780l95208l60899m01338m23254j54953k78415j73133q2316l03354
$$ 13343946 12909166 12513958 12153059 11751721 11328467 11173514 10895099 10721966 10639650 10336296
5183A0336296j43400j96196j02391j0403m2245j16977l1539k4602j73057q8186
$$ 10336296 10192896 9996700 9894309 9883906 9841661 9724684 9693145 9668543 9495486 9407300
5173I407300j809j19950M9240N3396M423J41820J98332J85521Q6531p7695J43707
$$ 9407300 9405491 9285541 9334781 9388177 9392600 9534420 9732752 9918273 10004804 9927109 10070816
5162A0070816J49496J92749K34730K87667L10732L99004N03843P31666Q11406
$$ 10070816 10220312 10413061 10647791 10935458 11246190 11645194 12149037 12880703 13692109
5153A3692109Q07462O91121P25710P65443N32444J77293j77072n54151q04350
$$ 13692109 14499571 15190692 15916402 16681845 17214289 17391582 17214510 16660359 15856009
5144A5856009q95115j068052j002095q87198q06726o22748n86331n38549l91011
$$ 15856009 14960894 13892842 12890747 12003549 11196823 10574075 9987744 9449195 9058184
5135I058184l81753l40042j82877r0542j24823j44562j92425q3968j43520j94268
$$ 9058184 8676431 8336389 8153512 8062970 7938147 7793585 7601160 7517192 7373672 7179404
5125G179404j44733p9272o3781j07651j2910J09980Q3153J09192O792N1899J95341
$$ 7179404 7034671 6955399 6891618 6783967 6771057 6881037 6964190 7073382 7080174 7132073 7327414
5114G327414L02505K71269K89597L85639N07871L79872N02877M84300J86363n47721
$$ 7327414 7629919 7901188 8190785 8576424 9084295 9464167 9967044 10451344 10637707 10089986
5104A0089986p98387p31361p13629o48712m33690l34462m04009k55802j59263
$$ 10089986 9291599 8560238 7846609 7197897 6764207 6429745 6025736 5769934 5610671
5095E610671j44080k3316j32999j13393j98516j04681k563r9079k8224L8873j01002
$$ 5610671 5466591 5443275 5310276 5196883 4998367 4893686 4891123 4792044 4763820 4802693 4701691
5084D701691j92724m5498K2660j26898j84361q9132j22675o7135j81705j20725
$$ 4701691 4508967 4463469 4486129 4359231 4174870 4085738 3963063 3895928 3714223 3593498
5074C593498o1126R7195Q7181m9437k9031n3064k357K2052K6735M528o0503K8847
$$ 3593498 3532372 3629567 3716748 3667311 3638280 3585216 3582859 3604911 3631646 3636174 3575671 3604518
5062C604518j6674J07053P204p5550p6773L9160n9891j21449Q3644K2479L1787
$$ 3604518 3587844 3694897 3702101 3626551 3549778 3588938 3529047 3407598 3491242 3513721 3545508
5051C545508L0514P2322O0009l4830k8059J50317k9143o4655k3957j22406j0959
$$ 3545508 3576022 3648344 3708353 3673523 3645464 3795781 3766638 3701983 3678026 3555620 3544661
5040C544661l6898j13281m9857o7563m2816K9610o2581K1737O1432p8841j7807
$$ 3544661 3507763 3394482 3344625 3277062 3234246 3263856 3201275 3223012 3284444 3205603 3187796
5029C187796N6668q2171j8430O2635J0679M6769K30064M0623J88468K30239J51530
$$ 3187796 3244464 3162293 3143863 3206498 3217177 3263946 3494010 3534633 3723101 3953340 4104870
5018D104870J89057K95414K14496K02648K89132r4789j59605k47479l21697k51202
$$ 4104870 4293927 4589341 4803837 5006485 5295617 5200828 5041223 4793744 4472047 4220845
5008D220845j94994l17824j37907j11402j20036m1986j2846K5378q768j61603
$$ 4220845 4025851 3708027 3570120 3458718 3338682 3296696 3283850 3309228 3300460 3138857
4998C138857Q5466m4357R2865O0579m133k2184J22222N8952l64K19693J04441
$$ 3138857 3224323 3179966 3272831 3333410 3329277 3307093 3429315 3488267 3487903 3707596 3812037
4987C812037K12858J72388K18918L24947L59110K15844n8808k39611j80631k08640
$$ 3812037 4024895 4197283 4416201 4741148 5100258 5316102 5257294 5017683 4837052 4628412
4977D628412m29654k72459j21295j93059j09053j23044j00153r4875l0693n9071
$$ 4628412 4198758 3926299 3805004 3611945 3502892 3379848 3279695 3184820 3154127 3095056
4967C095056J753L1175j32077j0997O7051k9180O9821j20120J67865J9506o513
$$ 3095056 3096809 3127984 2995907 2984910 3051961 3022781 3092602 2972482 3140347 3159853 3153340
4956C153340R0656J02773j33136P0342Q5802J12927M9894n8378N2923m8969j58902
$$ 3153340 3243996 3346769 3213633 3283975 3369777 3482704 3532598 3474220 3527143 3478174 3319272
4945C319272j92349o0807k5103o1140m4178m7806K0794M2707J2052p2607n0048
$$ 3319272 3126923 3066116 3041013 2979873 2935695 2887889 2908683 2951390 2963442 2890835 2840787
4934B840787J0145o4239k6929N547l6480N949j5178l8107M757M5904P04j57745
$$ 2840787 2850932 2786693 2759764 2765311 2728831 2734780 2719602 2681495 2686252 2732156 2732860 2575115
4922B575115P0784o2996p5391J8543m3968N2581o75J25953J1135j43213M534M7914
$$ 2575115 2645899 2582903 2507512 2526055 2482087 2534668 2533993 2659946 2671081 2527868 2532402 2580316
4910B580316N4578P9953P4493R3704J72886k1398P4359K597o4058k0693o9013
$$ 2580316 2634894 2714847 2789340 2883044 3055930 3034532 3108891 3111488 3047430 3026737 2957724
4899B957724q1646Q9374K0634j31527R869J09235O87j16933L3696M5532K3057
$$ 2957724 2876078 2965452 2986086 2854559 2864428 2973663 2974350 2857417 2891113 2936645 2959702
4888B959702o08K437O4119O0168J54231N6804P170J06645K03332K08583O2219
$$ 2959702 2959094 2961531 3025650 3085818 3240049 3296853 3304023 3410668 3614000 3822583 3884802
4877C884802J07669J61344L10962M24557K58509p4422l61133k84679j96460j89211
$$ 3884802 3992471 4153815 4464777 4889334 5147843 5073421 4712288 4427609 4231149 4041938
4867D041938k06987j70528k34863q0794o976q5816j1897m2797j1742k1954q5005
$$ 4041938 3834951 3664423 3429560 3348766 3341790 3255974 3244077 3201280 3189538 3167584 3082579
4856C082579n919l4882j1862l7872l656J0368R7413l0404L1304r6523r6752K7233
$$ 3082579 3076660 3041778 3029916 2992044 2988388 2998756 3096169 3065765 3097069 3000546 2903794 2931027
4844B931027J08866L8609J4609l4931j6273J24662J24672M6060m2590N6816o84
$$ 2931027 3039893 3078502 3093111 3058180 3041907 3166569 3291241 3337301 3294711 3351527 3350843
4833C350843J07362L8864j3400m0779R5659J43071Q1992J14675N4568N4872P6192
$$ 3350843 3458205 3497069 3483669 3442890 3538549 3681620 3763612 3878287 3932855 3987727 4063919
4822D063919K24176L56295L08810L42821K57500L62541N43435P32030P71062K63648
$$ 4063919 4288095 4644390 4953200 5296021 5553521 5916062 6459497 7191527 7962589 8226237
4812H226237o50216q26786o23300l84465k44666p5337m4895j43272j7953N5954
$$ 8226237 7576021 6749235 6125935 5741470 5496804 5421467 5376572 5233300 5215347 5271301
4802E271301o2779K5166J23271k9118J29464K17320K14703L39901K63678l40537
$$ 5271301 5208522 5233688 5356959 5327841 5457305 5674625 5889328 6229229 6492907 6152370
4792F152370m74148k72668j96987k26835j08038j50356q8374j06791L0712n7867
$$ 6152370 5678222 5405554 5208567 4981732 4873694 4723338 4634964 4528173 4558885 4501018
4782D501018o163J44125l9932j54319j7716k594k3688n0612l1448j0581Q2619
$$ 4501018 4494855 4638980 4599048 4444729 4427013 4424419 4400731 4350119 4318671 4308090 4390709
4771D390709O5337L8624M9999J8118j97039J08802J00790l6693j267J20941K01482
$$ 4390709 4456046 4494670 4544669 4562787 4365748 4474550 4575340 4538647 4537380 4658321 4859803
4760D859803l3302Q1680o1473O4919J03663O5035l4469J60216J06228n4986L6231
$$ 4859803 4826501 4908181 4846708 4911627 5015290 5080325 5045856 5206072 5312300 5257314 5293545
4749E293545P0737o6970L8750K09999j2015J02206k3107J00108L3269J06700L0590
$$ 5293545 5364282 5297312 5336062 5546061 5534046 5636252 5613145 5713253 5746522 5853222 5883812
4738E883812q9683j1992l7551J32706P1766o953j15311Q8979O6042m9895L1897
$$ 5883812 5794129 5782137 5744586 5877292 5949058 5942105 5826794 5915773 5981815 5931920 5963817
4727E963817O0771p219J31472J29253J91646P6811J32472K5999J35665o8021m0869
$$ 5963817 6024588 6017369 6148841 6278094 6469740 6546551 6679023 6705022 6840687 6772666 6731797
4716F731797M7103K44313j872J23497J6466J23944K39592L70701L23967K85535
$$ 6731797 6778900 7023213 7021341 7144838 7161304 7285248 7524840 7895541 8219508 8505043
4706H505043j57527l33356j94334o6450k8626j9880n9706j9112J10545M7260j63681
$$ 8505043 8347516 8014160 7819826 7753376 7724750 7704870 7645164 7626052 7736597 7783857 7620176
4695G620176k7972Q7794m2313O6113m0557J58213n5790P9264J36545Q8845M7151
$$ 7620176 7592204 7679998 7637685 7703798 7663241 7821454 7765664 7844928 7981473 8070318 8117469
4684H117469M6000J06436J50706J384l1279J41195R2545N684n9736J39083J52054
$$ 8117469 8163469 8269905 8420611 8421995 8390716 8531911 8624456 8630140 8570404 8709487 8861541
4673H861541J3192R5368K34098R1508R0822K28425J04603J55156j219J66447K07217
$$ 8861541 8874733 8970101 9204199 9295707 9386529 9614954 9719557 9874713 9873494 10039941 10247158
4662A0247158J51895K45410K44148O9732P2405K06537K45243K45484J62243K97497
$$ 10247158 10399053 10644463 10888611 10958343 11030748 11237285 11482528 11728012 11890255 12187752
4652A2187752J43002K56902K90648K68091L33394L58399K95857L35915M57595
$$ 12187752 12330754 12587656 12878304 13146395 13479789 13838188 14134045 14469960 14927555
4643A4927555N18108N62312M85990L94111L34866K06786K32723K74027L13763
$$ 14927555 15445663 16007975 16493965 16888076 17222942 17429728 17662451 17936478 18250241
4634A8250241M85279J81854L34126L22398K94652K39232L22467K63113K38453
$$ 18250241 18735520 18917374 19251500 19573898 19868550 20107782 20430249 20693362 20931815
4625B0931815L10825K83881K15201L28617K13775M30536K73572L93766L83459
$$ 20931815 21242640 21526521 21741722 22070339 22284114 22714650 22988222 23381988 23765447
4616B3765447M07847M37770N94158N54795O76838O59730P50169P68269P70072
$$ 23765447 24173294 24611064 25205222 25760017 26436855 27096585 27846754 28615023 29385095
4607B9385095P58775P03481O15093Q64189R56694R95111Q01608R65262R65479
$$ 29385095 30143870 30847351 31462444 32326633 33283327 34278438 35080046 36045308 37010787
4598C7010787J116923J047645R76737R82885J156358J141523J372482J521030
$$ 37010787 38127710 39175355 40152092 41134977 42291335 43432858 44805340 46326370
4590D6326370J816718J834340K109625K461443K869648K586258J734804J209878
$$ 46326370 48143088 49977428 52087053 54548496 57418144 60004402 61739206 62949084
4582F2949084J268575J398001K215282K761888L516816M075403M886578N428681
$$ 62949084 64217659 65615660 67830942 70592830 74109646 78185049 83071627 88500308
4574H8500308O653873P722192Q995486J0069462J1435511J2371374J4700815J7498917
$$ 88500308 95154181 102876373 111871859 121941321 133376832 145748206 160449021 177947938
4566A77947938K1344743K5564875K9614648L3766196M2348492N5864767P0673750
$$ 177947938 199292681 224857556 254472204 288238400 330586892 386451659 457125409
4559D57125409L3597105n2078360p7985046o5879864n0324550l6201791k6256906
$$ 457125409 490722514 438644154 360659108 294779244 244454694 208252903 181995997
4552A81995997k0007586j6800782j3900863j1432990r211892p422309o545787
$$ 181995997 161988411 145187629 131286766 119853776 110641884 103219575 96673788
4545I6673788o088069m726814l766587l008835k362928j674695j336300p38562
$$ 96673788 90585719 85858905 82092318 79083483 76720555 75045860 73709560 72970998
4537G2970998k95939J56531J24039O62638P94177R32853J027386J135973J191723
$$ 72970998 72675059 72831590 72955629 73618267 74412444 75345297 76372683 77508656 78700379
4528G8700379J445623J463337J629655J422726J355969R49821P78720M42576L40970
$$ 78700379 80146002 81609339 83238994 84661720 86017689 86967510 87746230 88188806 88529776
4519H8529776J49895K91347N8368J10435p8659J80965L01830M00466P00530J112637
$$ 88529776 88679671 88971018 89029386 89139821 89061162 89242127 89543957 89944423 90644953 91757590
4509I1757590J500775J996098K524754K721968K979924L146843L276681L280978
$$ 91757590 93258365 95254463 97779217 100501185 103481109 106627952 109904633 113185611
4501A13185611L086938L129235K787153K317909J385431L89866q35554j690032
$$ 113185611 116272549 119401784 122188937 124506846 125892277 126282143 125446589 123756557
4493A23756557k249663k468973k515687k792404l078013l187074l106165k766983
$$ 123756557 121506894 119037921 116522234 113729830 110651817 107464743 104358578 101591595
4485A01591595k204938j520003r06056k20688K12768P98400J152682J490843J844579
$$ 101591595 99386657 97866654 96960598 96739910 96952678 97751078 98903760 100394603 102239182
4476A02239182K226540K564422L009971L153607L297030L263322K752280K153053
$$ 102239182 104465722 107030144 110040115 113193722 116490752 119754074 122506354 124659407
4468A24659407J512186O30507j73672p53440j497977k211839k756559l157364
$$ 124659407 126171593 126802100 126628428 125874988 124377011 122165172 119408613 116251249
4460A16251249l148116l021892k553488k199533j557697j113566o50323l06415
$$ 116251249 113103133 110081241 107527753 105328220 103770523 102656957 102006634 101700219
4452A01700219J40633N16276R19044J469303J951447K413926K829354L160795
$$ 101700219 101840852 102357128 103276172 104745475 106696922 109110848 111940202 115100997
4444A15100997L184146K970202K645580K182239J751191J405136J237159O95143
$$ 115100997 118285143 121255345 123900925 126083164 127834355 129239491 130476650 131171793
4436A31171793k75501j279680k413148l031623l116005l185143l132298k761695
$$ 131171793 130896292 129616612 127203464 124171841 121055836 117870693 114738395 111976700
4428A11976700k591162k439193k276507j940861j586200j498547j320420j074625
$$ 111976700 109385538 106946345 104669838 102728977 101142777 99644230 98323810 97249185
4420I7249185q10252o51880p13899o38040p16130q20626j289838j439956j459627
$$ 97249185 96438933 95787053 95073154 94435114 93718984 92898358 91608520 90168564 88708937
4411H8708937j719565k073110k537167k888859l060932l234846l172082k958052
$$ 88708937 86989372 84916262 82379095 79490236 76429304 73194458 70022376 67064324
4403F7064324k828929k566415k550102k555468k333603k317180k035828j916296
$$ 67064324 64235395 61668980 59118878 56563410 54229807 51912627 49876799 47960503
4395D7960503j839287j722333j514144j388922j273945j381472j263473j122811
$$ 47960503 46121216 44398883 42884739 41495817 40221872 38840400 37576927 36454116
4387C6454116j098615q65709q21853p92832o29061o84628n92713m54879l39369
$$ 36454116 35355501 34489792 33667939 32875107 32246046 31561418 30968705 30513826 30174457
4378C0174457k91065k75387k07853j32747j07185j43753k25425j77738j63184
$$ 30174457 29883392 29608005 29400152 29267405 29160220 29016467 28791042 28613304 28450120
4369B8450120j19773k62874n29680n99960p02558q43420p49808p59591o64345
$$ 28450120 28330347 28067473 27537793 26937833 26235275 25391855 24642047 23882456 23218111
4360B3218111o76830p16759o68507o56581n45853n38302m47144l33149l03182
$$ 23218111 22541281 21824522 21156015 20499434 19953581 19415279 18968135 18634986 18331804
4351A8331804m29510k51422k32429j48719p3854l04621k36599k17557l18009j48737
$$ 18331804 17902294 17650872 17418443 17269724 17195870 16891249 16654650 16437093 16119084 15970347
4341A5970347k31048m83236m98986l54111m86451m46361m91330k77147l38496
$$ 15970347 15739299 15256063 14757077 14402966 13916515 13470154 12978824 12701677 12363181
4332A2363181m78661m44627m11929m00140n00839l56565k24398k12290k86228
$$ 12363181 11884520 11439893 11027964 10627824 10126985 9770420 9546022 9333732 9047504
4323I047504l31433l59137k04495j78160j51159k06524j19375j48342j28244j88939
$$ 9047504 8716071 8356934 8152439 7974279 7823120 7616596 7497221 7348879 7220635 7031696
4313G031696j66642j88922j23357j42980l6099j38218r9200m5863q5171j66566
$$ 7031696 6865054 6676132 6552775 6409795 6373696 6235478 6136278 6090415 6005244 5838678
4303E838678j43613j3488j37673n739o3078j28097j5517l6846k0456q1295j19056
$$ 5838678 5695065 5681577 5543904 5538165 5475087 5346990 5331473 5294627 5274171 5192876 5073820
4292E073820m0520j03827n307p2815j13990J31236j75782k4641J9915j37250j58719
$$ 5073820 5033300 4929473 4924166 4851351 4737361 4868597 4692815 4668174 4688089 4550839 4392120
4281D392120j4312R035P6409q3538q8164k8232j13717Q9160o4180j29463K578
$$ 4392120 4377808 4386843 4463252 4379714 4291550 4263318 4149601 4238761 4174581 4045118 4047696
4270D047696J03746j3356q6260m2914j10064j60344j6242J07964l126q144Q743
$$ 4047696 4151442 4138086 4051826 4008912 3898848 3738504 3722262 3830226 3827100 3818956 3827699
4259C827699O3260o3076k2837P8462N0830P3213m5935n1868M7224R4514N1999
$$ 3827699 3890959 3827883 3805046 3883508 3934338 4007551 3961616 3909748 3956972 4051486 4103485
4248D103485J92339K25960K51303O0960K88195L03900K42473k94047m41803m14666
$$ 4103485 4295824 4521784 4773087 4834047 5122242 5426142 5668615 5374568 4932765 4518099
4238D518099k36692j78137n2604j65835j48089r9483l5416j25004l4005J8159
$$ 4518099 4281407 4103270 4050666 3884831 3736742 3637259 3601843 3476839 3442834 3460993
4228C460993j43380k3476L9067j47234m4488m8100j3033j29583J9070J49320Q242
$$ 3460993 3317613 3294137 3333204 3185970 3141482 3093382 3080349 2950766 2969836 3119156 3127398
4217C127398o498J3236J4496n628L334K8388n3877K938j1577j4301R3612m9864
$$ 3127398 3120900 3134136 3148632 3143004 3146338 3174726 3120849 3123787 3112210 3097909 3191521 3141657
4205C141657j06435k0115k1519o8952N0858o9479J9806j5214o1085R4593j1106
$$ 3141657 3035222 3015107 2993588 2924636 2975494 2906015 2925821 2910607 2849522 2944115 2933009
4194B933009j42049M3442l3613j8779Q911j8453j0051P536O2481L2756J4596q505
$$ 2933009 2790960 2834402 2800789 2782010 2790921 2772468 2762417 2769953 2832434 2865190 2879786 2871281
4182B871281k0396P9994N0956J0047j29377K2252k5071M9930j40065J8656J13410
$$ 2871281 2850885 2930879 2981835 2991882 2862505 2884757 2859686 2909616 2769551 2788207 2901617
4171B901617L8638N1616J9682o9430j6958o160m8084q390j46242q2715R4173J68836
$$ 2901617 2940255 2991871 3011553 2942123 2925165 2919005 2870921 2862531 2716289 2633574 2727747 2896583
4159B896583n7252J3655J05612n4057M1451J01804J76304K9860k0298M310k545
$$ 2896583 2839331 2852986 2958598 2904541 2945992 3047796 3224100 3253960 3233662 3237972 3235427
4148C235427K4904P2329O5241k2668l3630o6542L0388J59239q6873M7262m2264
$$ 3235427 3260331 3332660 3397901 3375233 3341603 3275061 3305449 3464688 3377815 3425077 3382813
4137C382813J37877q1823j83277l4456M5606M2177k0926O6872m6712J1368J61944
$$ 3382813 3520690 3438867 3255590 3221134 3266740 3308917 3287991 3354863 3308151 3319519 3481463
4126C481463j657o713M0622r181L4655m6834O8958J4924j8316O2246o7018p2677
$$ 3481463 3479806 3473093 3513715 3504534 3539189 3492355 3561313 3576237 3557921 3620167 3553149 3480472
4114C480472Q3572l7148k3598j26454J71321J33087m6891n312J1076n978L5516
$$ 3480472 3564044 3526896 3503298 3376844 3548165 3681252 3634361 3629049 3640125 3634147 3669663
4103C669663o2162N7734O8764k3202n5926J2632L2531j2708r354M8983P2369l2117
$$ 3669663 3607501 3665235 3733999 3710797 3654871 3667503 3700034 3687326 3677972 3726955 3799324 3767207
4091C767207j12680J89764J08683L8402n7484o1105J08806J09838r1898J5674
$$ 3767207 3654527 3844291 3952974 3991376 3933892 3872787 3981593 4091431 3999533 4015207
4081D015207p5231k1372L7579p7567K6043N1165O219M2620J004r5819O3036k824
$$ 4015207 3939976 3918604 3956183 3878616 3904659 3955824 3962043 4004663 4005667 3909848 3972884 3970060
4069C970060J8423j02859k0427J07582j1759J1119Q390m4669k2709j6361J01764
$$ 3970060 3988483 3885624 3865197 3972779 3961020 3972139 3980529 3935860 3913151 3896790 3998554
4058C998554N0178N6153J56410j7930l3921n7501R9362N9067o3095N8262r7596
$$ 3998554 4048732 4104885 4261295 4243365 4209444 4151943 4251305 4310372 4247277 4305539 4207943
4047D207943K0807j1516J31915J31633j22332q6061O3319l4603N653J0487l6968
$$ 4207943 4228750 4217234 4349149 4480782 4358450 4272389 4335708 4301105 4306758 4317245 4280277
4036D280277O950J44878m4131m5162Q6621r953j5259L2066l7204M0670n6908K5476
$$ 4280277 4287227 4432105 4387974 4342812 4429433 4419480 4404221 4436287 4399083 4439753 4382845 4408321
4024D408321N795j28580J7597n2552L6126l9055P7943J03259j03008m2473k20
$$ 4408321 4414116 4285536 4303133 4250581 4286707 4247652 4325595 4428854 4325846 4283373 4283153
4013D283153J35867p365Q6359r5613j11117P4692Q7711L2981o8256k2986M3606
$$ 4283153 4419020 4411655 4498014 4402401 4291284 4365976 4453687 4486668 4418412 4395426 4439032
4002D439032l5100O3762j515M1430L5030j00023M2896J2884j9578J9735K9611
$$ 4439032 4403932 4467694 4466179 4507609 4542639 4442616 4485512 4498396 4478818 4498553 4528164
3991D528164k7281o7387l5779J20806m74m0734K4324J29948N385l2961O2847k2552
$$ 4528164 4500883 4433496 4397717 4518523 4518049 4477315 4501639 4631587 4636972 4604011 4666858 4644306
3979D644306k1977J8432j2545O1308J05297Q6928o9908O6880j1404N8345K1955
$$ 4644306 4622329 4640761 4628216 4689524 4794821 4881749 4811841 4878721 4867317 4925662 4947617
3968D947617j7143j8119P590K4766k7833J7395o016n4411L4257Q0949J38549j35226
$$ 4947617 4930474 4912355 4919945 4944711 4916878 4934273 4928257 4873846 4908103 4989052 5127601 4992375
3956D992375O0639L0562j5238N0259l3170l3746P1679J44251J04790k3802Q6433
$$ 4992375 5053014 5083576 5068338 5118597 5085427 5051681 5123360 5267611 5372401 5348599 5435032
3945E435032M9409l8821L4590Q9160K5450j3434J50624p932L3210J6224j4789
$$ 5435032 5484441 5445620 5480210 5569370 5594820 5581386 5732010 5724078 5757288 5773512 5758723
3934E758723J4720O8229J4026O6134J09146M2415N6807J02036n05J32987J44911
$$ 5758723 5773443 5841672 5855698 5921832 6030978 6073393 6130200 6232236 6231731 6364718 6509629
3923F509629M8493P6346R5276j9685M0102R3921J33355O7203P7694R6217j3096
$$ 6509629 6558122 6634468 6729744 6710059 6750161 6844082 6977437 7044640 7122334 7218551 7205455
3912G205455J18986M038J72998J27184J258J03092O3280J19472J70395J32251
$$ 7205455 7324441 7328479 7501477 7628661 7629919 7733011 7796291 7915763 8086158 8218409
3902H218409J06862J76606K6749L7580J94526J15640J56288K04816J17548J24340
$$ 8218409 8325271 8501877 8528626 8566206 8760732 8876372 9032660 9237476 9355024 9479364
3892I479364k262K09623K25371O0332P9931J58691J54172J38373J70822K1654
$$ 9479364 9477102 9686725 9912096 9972428 10052359 10211050 10365222 10503595 10674417 10696071
3882A0696071J04854K20785K10066K33014J22209K45364K68472J36469J85871
$$ 10696071 10800925 11021710 11231776 11464790 11586999 11832363 12100835 12237304 12423175
3873A2423175J21089L05273L90308K39111K16341J63349J74444K07251L45609
$$ 12423175 12544264 12849537 13239845 13478956 13695297 13858646 14033090 14240341 14585950
3864A4585950K70479L74673K77687L17197L01095L11953M32668M36506M58419
$$ 14585950 14856429 15231102 15508789 15825986 16127081 16439034 16871702 17308208 17766627
3855A7766627M62508M79011O98506O31940N78395P64095P43026P22768P45815
$$ 17766627 18229135 18708146 19406652 20038592 20616987 21381082 22124108 22846876 23592691
3846B3592691R04652R10627Q58988R11912P19272O28490P61934O30638N58453
$$ 23592691 24497343 25407970 26266958 27178870 27898142 28526632 29288566 29919204 30477657
3837C0477657N54665O04871O70906O87743Q34645R56362J028945R77041J121593
$$ 30477657 31032322 31637193 32308099 32995842 33830487 34786849 35815794 36792835 37914428
3828C7914428J278651J322795J269507R89223R01269P04963Q40328R00756R62037
$$ 37914428 39193079 40515874 41785381 42774604 43675873 44380836 45221164 46121920 47083957
3819D7083957R90755J154215R97194R54758J149307J071135J031852J006657R94105
$$ 47083957 48074712 49228927 50226121 51180879 52330186 53401321 54433173 55439830 56433935
3810E6433935R15832R91066Q57572Q97655J046522J397422J551134J916684K160766
$$ 56433935 57349767 58340833 59198405 60096060 61142582 62540004 64091138 66007822 68168588
3801F8168588K314831K226504J835985J266243O70139K77592K32198M91800N41164
$$ 68168588 70483419 72709923 74545908 75812151 76482290 76759882 76992080 77483880 78025044
3792G8025044N36668M77912O40015M42533N15812P21908P15540Q70772R04660
$$ 78025044 78561712 79039624 79679639 80122172 80637984 81359892 82075432 82946204 83850864
3783H3850864R32581P27019M03842L63772M73868P33063J166327J588710J972796
$$ 83850864 84783445 85510464 85914306 86278078 86751946 87485009 88651336 90240046 92212842
3774I2212842K562253K735850K721809K550267J993239J613266J380585J235676
$$ 92212842 94775095 97510945 100232754 102783021 104776260 106389526 107770111 109005787
3766A09005787J354947J214330R27756P51598O31055N66810N25468L49345L92398
$$ 109005787 110360734 111575064 112502820 113254418 113885473 114452283 114977751 115327096 115719494
3757A15719494K08804K15337J63721J51499L45817M38925O56631R64565J130200
$$ 115719494 115928298 116143635 116307356 116458855 116804672 117243597 117900228 118864793 119994993
3748A19994993J284021J265569J153802Q99982L17756l77033p21304q29752p27230
$$ 119994993 121279014 122544583 123698385 124598367 124916123 124539090 123817786 122988034 122260804
3739A22260804n46301j30283K38002K93783K87623J21147K24724R2270p3815k24248
$$ 122260804 121714503 121584220 121822222 122116005 122403628 122524775 122749499 122841769 122767954 122543706
3729A22543706k26565l34662k69052k68068o92177j025320j044881r16745q18697
$$ 122543706 122317141 121982479 121713427 121445359 120753182 119727862 118682981 117766236 116947539
3720A16947539o20754j018643j529175j936734j948805j714391j535393j500641
$$ 116947539 116326785 115308142 113778967 111842233 109893428 108179037 106643644 105143003
3712A05143003j236975q08227n78723l73083l64331m52517n32219r02182j074959
$$ 105143003 103906028 103097801 102519078 102145995 101781664 101329147 100796928 99894746 98819787
3703I8819787j041528j088019q67674j041036j136054j138985j080766r32551
$$ 98819787 97778259 96690240 95822566 94781530 93645476 92506491 91425725 90493174
3695I0493174o49973n55162l35836k77071p33361j459909k035196k286962k313584
$$ 90493174 89843201 89288039 88952203 88675132 87941771 86481862 84446666 82159704 79846120
3686G9846120k188963j828652j641796j654464j592750j375894j535403j712176
$$ 79846120 77657157 75828505 74186709 72532245 70939495 69563601 68028198 66316022
3678F6316022j740149j714742j596198j609992j375549j458630j379919j143575
$$ 66316022 64575873 62861131 61264933 59654941 58279392 56820762 55440843 54297268
3670E4297268j143944j049243r52679j056619r83322q57523r08440j233070j400280
$$ 54297268 53153324 52104081 51151402 50094783 49111461 48253938 47345498 46112428 44712148
3661D4712148j387456j398280j216062r36581q36341r08904p96184p70977q57083
$$ 44712148 43324692 41926412 40710350 39773769 38937428 38028524 37232340 36461363 35604280
3652C5604280q32843q24140q59823o68682q02223q45231o62710p18462q23587
$$ 35604280 34771437 33947297 33087474 32418792 31616569 30771338 30108628 29390166 28566579
3643B8566579q92824r12522p58402p21482p49186o18198m59155n59673m87836
$$ 28566579 27673755 26761233 26002831 25281349 24532163 23913965 23454810 22895137 22407301
3634B2407301l53541k96973l08798l96135l42257l18760l41347k44447k53323
$$ 22407301 22053760 21756787 21447989 21051854 20709597 20390837 20049490 19805043 19551720
3625A9551720l06103k44238l09410k63509k84419j87664o1740k53115j58097j36516
$$ 19551720 19245617 19001379 18691969 18428460 18144041 17956377 17894637 17641522 17483425 17346909
3615A7346909j42497j90981k26199r8736j01690j42213j38312j13220o8749q6407
$$ 17346909 17204412 17013431 16787232 16688496 16586806 16444593 16306281 16193061 16124312 16037905
3605A6037905j99472j66659j05633j89744k14652j79723p7349k9059J6552L675
$$ 16037905 15838433 15671774 15566141 15376397 15161745 14982022 14904673 14875614 14892166 14895841
3595A4895841k00309q808o8686o6983O2995o5878p2166J1388m1278o5822r7447
$$ 14895841 14695532 14686724 14618038 14551055 14614050 14548172 14476006 14487394 14446116 14380294 14282847
3584A4282847L6990J9383p1896o6034J0640n3511k3455j33M9217j4264j29162
$$ 14282847 14319837 14339220 14267324 14201290 14211930 14158419 14134964 14134831 14184048 14169784 14040622
3573A4040622N1859N9015k3818J304Q6121K5448O8812J9282L8232K7528K2985
$$ 14040622 14092481 14151496 14127678 14128982 14215103 14240551 14309363 14328645 14366877 14394405 14417390
3562A4417390J08935Q0440J07918N8052P6137J32280K50862K09565J36025K20403
$$ 14417390 14526325 14606765 14714683 14772735 14848872 14981152 15232014 15441579 15577604 15798007
3552A5798007K07211K32297L25773K75281M68596M26549L98319N41760N48291
$$ 15798007 16005218 16237515 16563288 16838569 17307165 17733714 18132033 18673793 19222084
3543A9222084N27312O97519Q47218Q84792R11815R37398J023638N75950J59078
$$ 19222084 19749396 20446915 21294133 22178925 23090740 24028138 25051776 25627726 25786804
3534B5786804m33691r06805j116033j331253j239160j013672q52672p17905n96862
$$ 25786804 25353113 24446308 23330275 21999022 20759862 19746190 18893518 18175613 17578751
3525A7578751n70546n00976m59590m39233j90746j61808k73316k97384j49651
$$ 17578751 17008205 16507229 16047639 15608406 15417660 15255852 14982536 14685152 14535501
3516A4535501k90680j89493j42348j31869j44075j54264q0712j68957J0417J7682
$$ 14535501 14244821 14055328 13912980 13781111 13637036 13482772 13402060 13233103 13243520 13261202
3506A3261202j03590l3028L0323k4016k09207q3156m8987n0964L0096L2604K5651
$$ 13261202 13157612 13124584 13154907 13130891 12921684 12838528 12789541 12738577 12768673 12801277 12826928
3495A2826928n4966P1193l2512J81429n9503N0237M588m523R244n8457m4696m8561
$$ 12826928 12771962 12843155 12810643 12992072 12932569 12982806 12987394 12982871 12992115 12933658 12888962 12840401
3483A2840401R094P9636N2858l805p957l5122O9590J16855o193p7761L7613J46982
$$ 12840401 12849495 12929131 12981989 12978184 12970227 12935105 13004695 13121550 13115357 13037596 13075209 13222191
3471A3222191O3601K3826K2024m0193M0053n7259O5424P7411P6969o9748J4972
$$ 13222191 13285792 13309618 13331642 13291449 13331502 13274243 13339667 13417078 13494047 13424299 13439271
3460A3439271N8755J06593P0283K4375r0725Q8161O5398k2225J64978K5557k2652
$$ 13439271 13498026 13604619 13674902 13699277 13608552 13696713 13762111 13739886 13904864 13930421 13907769
3449A3907769J69386k587o9006P9778O0351J04697R106j422n8794J6990J20648
$$ 13907769 14077155 14074568 14005562 14085340 14145691 14250388 14259494 14258072 14199278 14216268 14336916
3438A4336916k8507N0105L1795N4607O3650k929n296R5220Q3087j18615J23636
$$ 14336916 14308409 14358514 14390309 14444916 14508566 14505637 14500341 14595561 14678648 14560033 14683669
3427A4683669J0691l220l6813O4651M1101K2117P5485K2624J00715j2382m8315
$$ 14683669 14694360 14691140 14654327 14718978 14760079 14782196 14857681 14880305 14981020 14968638 14920323
3416A4920323o3156Q6584J20471p8609j4576m7469j6852l2423r6897O8145J45096
$$ 14920323 14857167 14943751 15064222 14985613 14971037 14923568 14906716 14874293 14777396 14845541 14990637
3405A4990637K8065m8956j04981P5076J34253p8833J02507N2213l553O8423n507
$$ 14990637 15018702 14969746 14864765 14939841 15074094 14995261 15097768 15149981 15146428 15214851 15209344
3394A5209344R168o962J06297M2244L9275J1095k6131J31853P0597k1487J41619
$$ 15209344 15218512 15211550 15317847 15360091 15399366 15410461 15384330 15516183 15586780 15565293 15706912
3383A5706912j3564L9149O4512j1807J8505m9538L388m3679Q0757p999J03506
$$ 15706912 15693348 15732497 15797009 15785202 15803707 15754169 15757557 15713878 15794635 15786636 15890142
3372A5890142Q7672O8787M8609o6653M65J10011J30127L0322N4182k505k564O6624
$$ 15890142 15977814 16046601 16095210 16028557 16029022 16139033 16269160 16299482 16353664 16351159 16348595 16415219
3360A6415219R3243K06466j1282n3991K9907J9334L3609K06358J23651J15366
$$ 16415219 16508462 16714928 16703646 16649655 16679562 16698896 16732505 16938863 17062514 17177880
3350A7177880j8598O073J48995J11528P9648J80729R6920J135P5949J17577J49186
$$ 17177880 17159282 17165355 17314350 17425878 17505526 17686255 17783175 17784310 17860259 17977836 18127022
3339A8127022N083R1626K12225J04393J63455J47847Q6495J51886J72310J34005
$$ 18127022 18132105 18223731 18435956 18540349 18703804 18851651 18938146 19090032 19262342 19396347
3329A9396347K22898J03819P126J59298K67678J93536J70984J76916K10341L12479
$$ 19396347 19619245 19723064 19730190 19889488 20157166 20350702 20521686 20698602 20908943 21221422
3319B1221422J15365J04010K78508J79820K54511J71991J74223J84517J94046
$$ 21221422 21336787 21440797 21719305 21899125 22153636 22325627 22499850 22684367 22878413
3310B2878413J96059J32703K46435L07482J66527J65635J32177J62730L59252
$$ 22878413 23074472 23207175 23453610 23761092 23927619 24093254 24225431 24388161 24747413
3301B4747413K59915L00297K45693K02363K63156K08568K32326K83927K46605
$$ 24747413 25007328 25307625 25553318 25755681 26018837 26227405 26459731 26743658 26990263
3292B6990263L29302K37019L11717K52859L93053L46527L15028N08645M12427
$$ 26990263 27319565 27556584 27868301 28121160 28514213 28860740 29175768 29684413 30096840
3283C0096840K34473M57620L36285K97463M67335M18422L46549N04907N39872
$$ 30096840 30331313 30788933 31125218 31422681 31890016 32308438 32654987 33159894 33699766
3274C3699766L64950M43182O36496N24601N87930N62585N19805M74155M31338
$$ 33699766 34064716 34507898 35144394 35668995 36256925 36819510 37339315 37813470 38244808
3265C8244808N85636O76066O47419P00992O32842N77330N94428O04473N73255
$$ 38244808 38830444 39506510 40153929 40854921 41487763 42065093 42659521 43263994 43837249
3256D3837249O94319O09000O45698O70830P14281N91198O78910Q13959Q77742
$$ 43837249 44531568 45140568 45786266 46457096 47171377 47762575 48441485 49255444 50133186
3247E0133186P89710O98119R41217Q09443Q24861Q75205R27298R52506Q57975
$$ 50133186 50922896 51621015 52562232 53371675 54196536 55071741 55999039 56951545 57809520
3238E7809520J097777J012160R56906J174581J088294J048617J165247J050479
$$ 57809520 58907297 59919457 60876363 62050944 63139238 64187855 65353102 66403581
3230F6403581J161610J238228J151677J168961J114166J145675J216236J220640
$$ 66403581 67565191 68803419 69955096 71124057 72238223 73383898 74600134 75820774
3222G5820774J251796J323216J346397J493655J560031J390140J603107J597233
$$ 75820774 77072570 78395786 79742183 81235838 82795869 84186009 85789116 87386349
3214H7386349J636333J954357J867543J921431J903572K177047K169691K374667
$$ 87386349 89022682 90977039 92844582 94766013 96669585 98846632 101016323 103390990
3206A03390990K316385K742482K914083L156035L380884L795150L979948M343497
$$ 103390990 105707375 108449857 111363940 114519975 117900859 121696009 125675957 130019454
3198A30019454M890651N358360N791937O118280O564118P144117P612884Q004789
$$ 130019454 134910105 140268465 146060402 152178682 158742800 165886917 173499801 181504590
3190A81504590Q476647Q841183R118594R149443R103574Q784915Q323281P136157
$$ 181504590 189981237 198822420 207941014 217090457 226194031 234978946 243302227 250438384
3182B50438384N396067L064333L02482k956311o230036q831130j0337390j0731080
$$ 250438384 255834451 258898784 259201266 256244955 250014919 241183789 230846399 220115319
3174B20115319j0270292r389986q584578p922641p090736o403519o004961n498003
$$ 220115319 209845027 200455041 191870463 183947822 176857086 170453567 164448606 158950603
3166A58950603m879405m382187m149222l637711l184293l034833k913130k833395
$$ 158950603 154071198 149689011 145539789 141902078 138717785 135682952 132769822 129936427
3158A29936427k778760k611539k526616k344485k287667k127929k103784k181726
$$ 129936427 127157667 124546128 122019512 119675027 117387360 115259431 113155647 110973921
3150A10973921k202436k172751k081095k074612k058684k139692k154513k093264
$$ 110973921 108771485 106598734 104517639 102443027 100384343 98244651 96090138 93996874
3142I3996874k107766j922969j937628k022912j807331j662678j763862j555340
$$ 93996874 91889108 89966139 88028511 86005599 84198268 82535590 80771728 79216388
3134G9216388j390085j409700j155617j048130q70600o40687r10197j391956j508712
$$ 79216388 77826303 76416603 75260986 74212856 73342256 72701569 71791372 70399416 68890704
3125F8890704j563562j629757j621991j577763j348467j273409j199168r70628
$$ 68890704 67327142 65697385 64075394 62497631 61149164 59875755 58676587 57705959
3117E7705959r52375r49624j121399j004152r08394p53948p04856o29323o97856
$$ 57705959 56753584 55803960 54682561 53678409 52770015 52016067 51311211 50681888 49984032
3108D9984032p02251n50948m66335n38825m97914l65149n01217m80671l28533
$$ 49984032 49281781 48730833 48264498 47725673 47227759 46862610 46361393 45880722 45552189
3099D5552189k67149k87098p3149l9606n63341n83241o81312o86540o80315n99398
$$ 45552189 45285040 44997942 44924793 44885187 44321846 43738605 43057293 42370753 41690438 41091040
3089D1091040o12550n25003n07675n34607k90343m44625l89776m17629l73184
$$ 41091040 40478490 39953487 39445812 38911205 38620862 38176237 37786461 37368832 36995648
3080C6995648m42108m10282l33298k67445l99824k80424l56429k82578l13960
$$ 36995648 36553540 36143258 35809960 35542515 35142691 34862267 34505838 34223260 33909300
3071C3909300l57386k99871k35788k77963l52031l11865k28165k03735l46158
$$ 33909300 33551914 33252043 33016255 32738292 32386261 32074396 31846231 31642496 31296338
3062C1296338j56994k75418k37516k69514j65250k44702k02063k32011j85905
$$ 31296338 31139344 30863926 30626410 30356896 30191646 29946944 29744881 29512870 29326965
3053B9326965m7723j81269l00929j12522k13053j35826j12600l03641j34557p7211
$$ 29326965 29279242 29097973 28797044 28684522 28471469 28335643 28223043 27919402 27784845 27707634
3043B7707634j65328r5322k06034j73644P1486r5962j71452j71887j07146j98844
$$ 27707634 27542306 27446984 27240950 27067306 27138792 27042830 26871378 26699491 26592345 26393501
3033B6393501j80822n7661k27677K8182o7805q7273n9035J019k479q3578j59688
$$ 26393501 26212679 26155018 25927341 25955523 25887718 25800445 25741410 25742429 25739950 25656372 25496684
3022B5496684j58174j46686j00162q9926r3440j2279j16108q6032j53434n9300
$$ 25496684 25338510 25191824 25091662 25001736 24908296 24896017 24779909 24693877 24540443 24481143
3012B4481143o9851r7831r4900j59785k31645k20089j41876j79026j16395j22177
$$ 24481143 24411292 24313461 24218561 24058776 23827131 23607042 23465166 23286140 23169745 23047568
3002B3047568k06352j16250j95302k0333j73224k12169r6102n6725j61045k49690
$$ 23047568 22841216 22724966 22529664 22509331 22336107 22123938 22027836 21971111 21810066 21560376
2992B1560376j91561Q6905q0285j65708j03919m7274k3014j80206j25957p6007
$$ 21560376 21368815 21455720 21375435 21209727 21105808 21058534 21035520 20855314 20729357 20653350
2982B0653350j41274j02637l2097j93591l4766j93372j79968l03914k01854m9847
$$ 20653350 20512076 20409439 20377342 20183751 20148985 19955613 19775645 19471731 19269877 19220030
2972A9220030j67204j86042j16986n5518j14542j1663P762p0374q0614m6535q3191
$$ 19220030 19052826 18866784 18749798 18694280 18579738 18568075 18575837 18505463 18424849 18378314 18295123
2961A8295123r824p8513J21557N1203K9713j74071n634O976j5352K02907J05987
$$ 18295123 18285299 18206786 18328343 18379546 18409259 18235188 18229554 18236530 18221178 18424085 18530072
2950A8530072O5941J45614l8843p4118O0420R0788R6104k5871m6608O4540Q3250
$$ 18530072 18596013 18741627 18702784 18628666 18689086 18779874 18875978 18850107 18803499 18868039 18951289
2939A8951289J80058J01653O0423J82862J69178J42848K73567J10109K52560J37626
$$ 18951289 19131347 19233000 19293423 19476285 19645463 19788311 20061878 20171987 20424547 20562173
2929B0562173J74629K32718R6475K72539K50697K72837K91337K74832J18536L11668
$$ 20562173 20736802 20969520 21065995 21338534 21589231 21862068 22153405 22428237 22546773 22858441
2919B2858441K37766K87243J72440J46753L25376L61233L43068K49135K27208
$$ 22858441 23096207 23383450 23555890 23702643 24028019 24389252 24732320 24981455 25208663
2910B5208663J91474J92643J78861J54641K46100J94619L44538M20778K72370
$$ 25208663 25400137 25592780 25771641 25926282 26172382 26367001 26711539 27132317 27404687
2901B7404687L43786M00091K57012M70576M21831M48230M60437N26600O08902
$$ 27404687 27748473 28148564 28405576 28876152 29297983 29746213 30206650 30733250 31342152
2892C1342152N61052O25047P53845P02694P35681P24393O19068O07182Q61790
$$ 31342152 31903204 32528251 33282096 33984790 34720471 35444864 36063932 36671114 37532904
2883C7532904J001811R47572R62550R76428J034300J048293J084557J083949J230361
$$ 37532904 38534715 39482287 40444837 41421265 42455565 43503858 44588415 45672364 46902725
2874D6902725J120427J185526J197851J138446J049892R39710Q72756P89938O10753
$$ 46902725 48023152 49208678 50406529 51544975 52594867 53534577 54407333 55197271 55808024
2865E5808024P35535M95228O29255O92522O78794P46697Q34113R61455R72904
$$ 55808024 56543559 57038787 57668042 58360564 59039358 59786055 60620168 61581623 62554527
2856F2554527J129889J442703J446426J555980J849217J997998K279299K226950
$$ 62554527 63684416 65127119 66573545 68129525 69978742 71976740 74256039 76482989
2848G6482989K573521K599242K716908K837902K815255K962919K440770J898582
$$ 76482989 79056510 81655752 84372660 87210562 90025817 92988736 95429506 97328088
2840I7328088J126428j53351r63256j824592k261497k729673k542050k068979
$$ 97328088 98454516 98301165 97337909 95513317 93251820 90522147 87980097 85911118
2832H5911118j548295j108610o22499j00940J44178N23490P87576J119977J393102
$$ 85911118 84362823 83254213 82631714 82530774 82674952 83198442 83986018 85105995 86499097
2823H6499097J470705J665320J757554J844257J587809J646072J527798J418982
$$ 86499097 87969802 89635122 91392676 93236933 94824742 96470814 97998612 99417594
2815I9417594J215571Q07057o248n30892j322379j972950k074410k425178k849987
$$ 99417594 100633165 101440222 101433974 100903082 99580703 97607753 95533343 93108165 90258178
2806I0258178l142223l108221k968489k603762k187186j725769j438560j192712
$$ 90258178 87115955 84007734 81039245 78435483 76248297 74522528 73083968 71891256
2798G1891256p81299n66705m25612j55693j33591k0897k21194m23105o10380p65475
$$ 71891256 71109957 70543252 70117640 69961947 69828356 69807459 69586265 69163160 68552780 67787305
2788F7787305j108501j223561j538988j776679k104233k332161k534578k523558
$$ 67787305 66678804 65455243 63916255 62139576 60035343 57703182 55168604 52645046
2780E2645046k339771k165975k118169j866794j872866j668346j476320j363330
$$ 52645046 50305275 48139300 46021131 44154337 42281471 40613125 39136805 37773475
2772C7773475j288226j205924j102299q92904q18009q60848p84190p54133p03185
$$ 37773475 36485249 35279325 34177026 33284122 32466113 31605265 30821075 30066942 29363757
2763B9363757n93249m94778n66036o26641p22200p66284p36031p59433o81263
$$ 29363757 28770508 28275730 27709694 27083053 26360853 25594569 24858538 24099105 23417842
2754B3417842o56148o61293o65399o63239n63820n40340m77649n01242m12809
$$ 23417842 22761694 22100401 21435002 20771763 20207943 19667603 19189954 18688712 18275903
2745A8275903l66561l84432m20727m06999l80312l90704l72749m65109k52144
$$ 18275903 17909342 17524910 17104183 16697184 16316872 15926168 15553419 15088310 14836166
2736A4836166j75232k92748k93601j97387k11384k45681k37051j78159j45733
$$ 14836166 14660934 14368186 14074585 13877198 13665814 13420133 13183082 13004923 12859190
2727A2859190j62838j07673l08220j88118k05941j95327k43813j16576j31431
$$ 12859190 12696352 12588679 12280459 12092341 11886400 11691073 11447260 11330684 11199253
2718A1199253j09718k73160k21594j96879k33585k13783k71967k67039k79979
$$ 11199253 11089535 10816375 10594781 10397902 10164317 9950534 9678567 9411528 9131549
2709I131549r4938k19731j57211j13885k42699j17321q262k22066m8653k4001
$$ 9131549 9036611 8816880 8659669 8545784 8303085 8185764 8177502 7955436 7906783 7882782
2699G882782j52890j58645m2167j40750j16115j8791j74022j63213o4375j41361
$$ 7882782 7729892 7571247 7529080 7388330 7272215 7253424 7079402 6916189 6851814 6710453
2689F710453k28576j46953j37038p8287j74527j16349l7806J4029k44969j89521
$$ 6710453 6481877 6334924 6197886 6119599 5945072 5828723 5790917 5804946 5559977 5370456
2679E370456L4250n0080q7874j88722k07372j44284r8527K4450O7302j83913o9019
$$ 5370456 5404706 5354626 5266752 5078030 4870658 4726374 4627847 4652297 4719599 4535686 4466667
2668D466667n9806j04283j32911L7876p0700j82181j2741O416p5296o4862k1551
$$ 4466667 4406861 4302578 4169667 4207543 4136843 3954662 3941921 3948337 3873041 3808179 3786628
2657C786628q6754l9431k1934m073K013j26200j67940q8536N6127j43318j23198
$$ 3786628 3699874 3660443 3638509 3634436 3636449 3510249 3342309 3253773 3309900 3166582 3043384
2646C043384J23478l8386p0582k4445n4652K8575L4527n9091K0447l8257o611
$$ 3043384 3166862 3128476 3057894 3033449 2978797 3007372 3041899 2982808 3003255 2964998 2958387
2635B958387j16371N0299n854o6709M8766p292j32403p1568j20585Q0967N2991
$$ 2958387 2842016 2892315 2886461 2819752 2868518 2861226 2728823 2657255 2536670 2617637 2670628
2624B670628L3k6117j20817l0604L2931n3579j12130o2517m8180l5577J05808
$$ 2670628 2670661 2644544 2523727 2493123 2526054 2472475 2360345 2297828 2249648 2214071 2319879
2613B319879R0437r2061m697n2265J348k6309n9425j3R6442j7437j00389k7713
$$ 2319879 2410316 2318255 2313558 2261293 2262641 2236332 2176907 2176894 2273336 2255899 2155510 2127797
2601B127797L4924P1501j3020j7445j67319M5008n6778J5736J2846j09842O1724
$$ 2127797 2162721 2234222 2221202 2203757 2036438 2081446 2024668 2040404 2053250 1943408 2005132
2590B005132K185p696j7319J616q3548P1287k6198k4107l5455O4798M3546r3877
$$ 2005132 2007317 1999621 1982302 1983918 1900370 1971657 1945459 1921352 1885897 1950695 1994241 1900364
2578A900364k3257r3978m5126K1119L7353J8638p1115N4545P4473O6040j241p8322
$$ 1900364 1877107 1783129 1738003 1759122 1796475 1815113 1743998 1798543 1873016 1939056 1937815 1859493
2566A859493r4080k5975M9370N6938o6486n560K2883M8338L8975l3608r280j6242
$$ 1859493 1765413 1739438 1788808 1845746 1779260 1773700 1796583 1844921 1883896 1850288 1841008 1824766
2554A824766P8472j63841j73174R5499O3790l0331j00742j45929P8547P4152M8411
$$ 1824766 1903238 1739397 1566223 1661722 1725512 1695181 1594439 1448510 1527057 1601209 1649620
2543A649620J02815n3346L696J3667j07641p9470P9019l8701L6602J5280j09277
$$ 1649620 1752435 1699089 1702785 1716452 1608811 1529341 1608360 1569659 1606261 1621541 1512264
2532A512264q48m459j923J17974K0885o3766L2444q5153m5554m377J0878m07J2281
$$ 1512264 1511416 1506957 1505034 1623008 1643893 1580127 1612571 1527418 1481864 1477487 1488365 1487958 1500239
2519A500239n8067l7610m1956j36292j9053L2812j7699M0308K1899l3275n8442
$$ 1500239 1442172 1404562 1362606 1226314 1207261 1240073 1222374 1262682 1284581 1251306 1192864
2508A192864K9585L4887q4032l7726j7089j6210L8769j0910k0008J31412j3593
$$ 1192864 1222449 1257336 1173304 1135578 1118489 1102279 1141048 1130138 1110130 1241542 1227949
2497A227949o7094L450j33966L3083o8386k3749n6528r1186O7037k512Q1219R924
$$ 1227949 1160855 1164305 1030339 1063422 995036 971287 914759 823573 890610 888098 969317 979241
2485I79241j24006j265N6678j3420j5316p3360P9878l2516l2791l0242N636k2296
$$ 979241 855235 853970 910648 897228 881912 808552 888430 855914 823123 792881 798517 776221
2473G76221o2300J08452N7789j19149j945j09701K0680O2359P4297J4092j93370
$$ 776221 713921 822373 880162 761013 759068 649367 670047 732406 806703 820795 627425
2462F27425p3037P0440N8459O300N0939M8250l5237m1783k6169o2523K3054K9708
$$ 627425 554388 624828 683287 689587 740526 788776 753539 711756 685587 623064 646118 675826
2450F75826l8981K0215P2738j1316m1810m5717L5447M391j0794k2618m4150O139
$$ 675826 636845 657060 729798 718482 676672 630955 666402 670793 659999 637381 593231 599370
2438E99370K0124O3977k9525P014j4911r1081K8806q3610q4594L9176J01546o9721
$$ 599370 619494 683471 653946 660960 646049 554968 583774 500164 415570 454746 556292 486571
2426D86571M0682L7514o2830n6881j1834J521O1280K3407p2903K4975M0903j4716
$$ 486571 527253 564767 501937 445056 433222 434743 496023 519430 446527 471502 512405 497689
2414D97689n872J4694J8372r9092l0080P6842j10731N8781J43638j28918p6931
$$ 497689 491817 506511 524883 425791 395711 472553 361822 420603 564241 435323 358392
2403C58392P6225n9017Q7081l9310m7237j1661J1987M6584J101K4449q8688k7707
$$ 358392 434617 375600 462681 423371 376134 364473 376460 423044 424145 448594 359906 332199
2391C32199q0035q193Q712l8502j4288L3299K449l1640q2100Q8445K6946P513
$$ 332199 252164 243971 252683 214181 199893 233192 235641 204001 121901 210346 237292 244805
2379B44805p8607l1544J65203j0496r0241r7480J2609q1696R518J28428q1575
$$ 244805 166198 134654 299857 289361 199120 101640 114249 32553 42071 170499 88924
2368H8924K7683N3773J4752M3699j05160k9534O6098j7669j1640R063J09187r5491
$$ 88924 116607 170380 185132 228831 123671 94137 160235 142566 130926 139989 249176 153685
2356A53685j919r1666Q7806J04225q3054K1481M6277r943m8171q8738p2846J8298
$$ 153685 151766 60100 147906 252131 169077 190558 236835 226892 178721 89983 17137 35435
2344C5435p7367j3946M8138N1745J5737P844L3351m4996o7128O928j9688l0216
$$ 35435 -41932 -55878 -7740 44005 59742 67586 100937 55941 -11187 -4259 -23947 -54163
2332e4163R6527k1279j1957r4816l2815J40012r475N214q0479R8907O6146j9453
$$ -54163 42364 21085 9128 -85688 -118503 21509 12034 17248 -63231 35676 101822 82369
2320H2369n2601k8439k177P8895j36265Q0818J19477p7494L74P1077J40221o3204
$$ 82369 29768 1329 -848 78047 -58218 22600 142077 64583 64957 136034 276255 213051
2308B13051k8379M4589q9451m7175p5981n1453M1256K482R822O467k1898N327
$$ 213051 184672 229261 139810 92635 16654 -34799 6457 8939 18761 25228 3330 8657
2296H657k8258j5261m1409l5747N8339m8218k2721N5724k1908J38790K5899m7646
$$ 8657 -19601 -34862 -76271 -112018 -53679 -101897 -124618 -68894 -90802 47988 73887 26241
2284B6241m8885m905Q967P8946n0256n5561o8139Q9446Q585j16371Q2035K9146
$$ 26241 -22644 -27549 -18582 60364 10108 -45453 -113592 -24146 -15561 -131932 -49897 -20751
2272b0751P1994n2104j17416K4705O9056J8322j1051L6422n6657n9625J1319L345
$$ -20751 51243 -861 -118277 -93572 -24516 -6194 -17245 19177 -37480 -97105 -85786 -82441
2260h2441p260J0057p1076K2688P191M103j9624M975O3579m2475K6801m9331O7691
$$ -82441 -89701 -79644 -150720 -128032 -120841 -116738 -136362 -131387 -67808 -110283 -83482 -132813 -65122
2247f5122R2551l4142j53234Q3457k3905r3267o025J19143o2891M8305K1303J1466
$$ -65122 27429 -6713 -159947 -76490 -100395 -193662 -199687 -80544 -143435 -95130 -73827 -62361
2235f2361k036k6120M6587J2996K8143q3986N3092j6472n14J1860K6665n2075
$$ -62361 -64397 -90517 -43930 -30934 -2791 -86777 -33685 -50157 -50671 -38811 -12146 -64221
2223f4221j26832K2197J9955L6904k1717n6808O6395o324L188k0164l0004L8424
$$ -64221 -191053 -168856 -148901 -111997 -133714 -190522 -124127 -130451 -127263 -147427 -177431 -139007
2211a39007L7255M5777q9620L2755l2635J9958r870J7818j6579P3983l8242n960
$$ -139007 -101752 -55975 -145595 -112840 -145475 -125517 -135387 -117569 -134148 -60165 -98407 -104367
2199a04367J8968K381J21991o3740j84513N2717N6450j6873J69759m3577K8327
$$ -104367 -85399 -83018 38973 -24767 -209280 -156563 -100113 -116986 52773 9196 37523
2188C7523o973m306q4213m9581k2273J1396K5316K3566L5902p7689j3153K08095
$$ 37523 30550 26244 -57969 -107550 -129823 -118427 -93111 -69545 -33643 -111332 -124485 83610
2176H3610l7832q6432o5604k8081N5169K3561M8268J13303M277n4111n6621j0338
$$ 83610 45778 -40654 -106258 -134339 -79170 -55609 -7341 105962 110239 56128 -493 -10831
2164a0831N3192L0020M0256k2381N579n856K0650j2027l0650p0179J26574Q5597
$$ -10831 42361 72381 112637 90256 95835 89979 110629 98602 67952 -2227 124347 209944
2152B09944n1988J4603M5715m9922K6886n9832J08397J4469k4690M1224j9749
$$ 209944 157956 172559 218274 168352 195238 135406 243803 258272 233582 274806 255057
2141B55057j34527j0106J11782o0588O8918K118N5181Q5215l4814R5782O3834
$$ 255057 120530 110424 222206 161618 230536 232654 287835 373050 338236 434018 497852
2130D97852j7050l0698q0543r856R5026K10399m9112j82141L6397P4531o0766
$$ 497852 480802 450104 369561 359705 454731 665130 616018 433877 470274 544805 484039
2119D84039k4968J05476N6498o897J00108p8539L1455P1716O890O97L8619o9623
$$ 484039 459071 564547 621045 614148 714256 635717 667172 738888 745778 746475 785094 715471
2107G15471r5919J00060J9536q9098J957J8141P137N3552J09383m0762J20019
$$ 715471 619552 719612 739148 650050 652007 670148 677285 730837 840220 799458 919477
2096I19477k6418m8021R3492O5587k0415K2345n894M0106N4352R7990P6882R5286
$$ 919477 893059 845038 938530 1004117 983702 1006047 1000153 1040259 1094611 1192601 1269483 1364769
2084A364769j5364R4225J84441k1056K1079j12894Q558P2436J64938R7470N6289
$$ 1364769 1349405 1443630 1628071 1607015 1628094 1515200 1523758 1596194 1761132 1858602 1914891
2073A914891K0759J9120J29603L1850N2757J55499J56942K00904J27876J32171
$$ 1914891 1935650 1954770 2084373 2116223 2168980 2324479 2481421 2682325 2810201 2942372
2063B942372J77362K54683K91173L66146L53760L08532N35765N45200K87692L62530
$$ 2942372 3119734 3374417 3665590 4031736 4385496 4694028 5229793 5774993 6062685 6425215
2053F425215N03677O55196O73914J133035J204886J343239J696879J945664K178376
$$ 6425215 6928892 7584088 8258002 9391037 10595923 11939162 13636041 15581705 17760081
2044A7760081K773600M015508N001467M53969m637794n244936m063409k858151
$$ 17760081 20533681 24549189 29550656 30004625 25366831 20121895 16058486 13200335
2036A3200335j996302j545306j358558j004187p71306m90304n04094l54124l32176
$$ 13200335 11204033 9658727 8300169 7295982 6524676 6034372 5530278 5176154 4843978
2027D843978l77640l77563l89979m76233k17896l34153k14723k96823o3195j41591
$$ 4843978 4466338 4088775 3698796 3222563 3004667 2670514 2455791 2158968 2095773 1954182
2017A954182j18194m4970j6996j51178j32148R2453k00223j94900l5400K4472
$$ 1954182 1835988 1791018 1774022 1622844 1490696 1583149 1382926 1188026 1152626 1177098
2007A177098j30403p4892j19829K6843j6236q3348Q374l8512l8717k4912j1785
$$ 1177098 1046695 971803 851974 878817 862581 779233 787607 749095 710378 685466 673681
1996F73681r2614M3713j4432o8038j15938k4490Q5836o2396j0558l8822q6959
$$ 673681 581067 624780 610348 542310 426372 401882 487718 425322 414764 375942 288983
1985B88983n5060J13173N8892J8026O7595o4802o643l4413j05673p8872J50902
$$ 288983 233923 347096 405988 424014 491609 426807 420164 385751 280078 201206 352108
1974C52108r4991q6788K7877j0820m7706L5783k4871O083P6011j14372k5756J6868
$$ 352108 257117 170329 198206 187386 139680 175463 150592 156675 232686 118314 92558 109426
1962A09426p1190L2689J38623J3775l5244O98q6314l1931n3892m9709j7391K0709
$$ 109426 38236 70925 209548 223323 188079 188777 102463 70532 16640 -33069 -50460 -29751
1950b9751J12697O0580l410k974o5267j45965O3640k7172q0164N7797L5837O0155
$$ -29751 82946 143526 140116 137142 71875 -74090 -10450 -37622 -117786 -59989 -24152 36003
1938C6003l1574R418m7798r095n977N8607P9289K7025l0239n8313k6335l1627
$$ 36003 4429 13847 -33951 -43046 -49023 9584 88873 115898 85659 27346 1011 -30616
1926c0616j6122P7004k1367k8159p7220J7018J46326l430q6416j63008K8862M2780
$$ -30616 -46738 30266 8899 -19260 -96480 -79462 66864 63434 -22982 -185990 -157128 -114348
1914a14348p9146j03381Q1894K5704k301J7194L0612M133L2046L1897L989l616
$$ -114348 -193494 -296875 -214981 -189277 -191578 -174384 -143772 -139639 -107593 -75696 -71707 -75323
1902g5323j9626J9003j301k1813J2769r8755K7501k2280m2029k25P1613r3129
$$ -75323 -94949 -75946 -77247 -99060 -86291 -185046 -157545 -179825 -221854 -222079 -150466 -243595
1890b43595L0223J04769O5588m6461l5900n78r6994M3149M8130j13409Q1492r816
$$ -243595 -213372 -108603 -43015 -89476 -125376 -125954 -222948 -179799 -131669 -245078 -163586 -173402
1878a73402j205O5660l736m3721L5198j3719P2822J4298k2311m6710L4334K1290
$$ -173402 -174607 -108947 -112683 -156404 -121206 -134925 -62103 -47805 -70116 -116826 -82492 -61202
1866f1202j17442p4132O428p6133m1882K20016J6060r431K6517M429j01894Q0859
$$ -61202 -178644 -252776 -246348 -322481 -364363 -144347 -128287 -137718 -111201 -106772 -208666 -127807
1854a27807p4456j0767m387o079J38464J9782p2097r0620O2235j8502p1165K2027
$$ -127807 -202263 -213030 -217417 -223496 -85032 -65250 -137347 -227967 -165732 -184234 -255399 -233372
1842b33372K7051J61306m9596q5070N3285m055J1950N913j11435o8756M9912R9607
$$ -233372 -206321 -45015 -94611 -179681 -126396 -130451 -118501 -112588 -224023 -292779 -242867 -143260
1830a43260l1900J5205N4513j26010Q154M9717m4659M9942L9325k7561J4572m8759
$$ -143260 -175160 -159955 -105442 -231452 -223298 -173581 -218240 -168298 -128973 -156534 -141962 -190721
1818a90721p3012O2356J3520M2473n1348l0133j6065J30315M341q2096R2686J1956
$$ -190721 -263733 -201377 -187857 -145384 -196732 -226865 -242930 -112615 -108274 -190370 -97684 -85728
1806h5728o1686j0129M4175J8191p4656j2081j0639R662O3479J8122n1235l4457
$$ -85728 -147414 -157543 -113368 -95177 -169833 -181914 -192553 -182891 -119412 -101290 -152525 -186982
1794a86982K0359n727j2497O3692K9941k9961O6066j01184m5844p3994J10791
$$ -186982 -166623 -172350 -184847 -121155 -91214 -121175 -55109 -156293 -202137 -276131 -165340
1783a65340J20917k5354O5178r9922L5325O1787j2596j17273m2178J5127n41R8037
$$ -165340 -44423 -69777 -4599 -104521 -69196 -7409 -20005 -137278 -179456 -164329 -164870 -66833
1771f6833Q5694l7483o3969p1905K4656k201l6535j6158j6200l1184L5426K0564
$$ -66833 18861 -18622 -82591 -154496 -129840 -132041 -168576 -184734 -200934 -232118 -196692 -176128
1759a76128R8559J8999j19235j3620K8614N17O8884j044K0834l2809J770M1054
$$ -176128 -77569 -58570 -177805 -191425 -162811 -162294 -93410 -94454 -73620 -106429 -104659 -63605
1747f3605o5200j3409N97J39627o7364o652M5031o4443r5333n288j1417J88641
$$ -63605 -128805 -142214 -141617 -1990 -69354 -76006 -30975 -95418 -190751 -196039 -207456 -18815
1735a8815k5048m8246m2784M538K6751P0331q2331j5588L7610k3452P8487p1462
$$ -18815 -43863 -92109 -134893 -130355 -103604 -33273 -115604 -131192 -93582 -117034 -38547 -110009
1723a10009j9912q9224P6356k0415O0002o4401O67K6316j6914m8190K3465M6507
$$ -110009 -129921 -219145 -142789 -163204 -103202 -167603 -166936 -140620 -157534 -205724 -182259 -135752
1711a35752K8647n00l0647M7246P7293n6718J770k3221j16703K7489M8823M9788
$$ -135752 -107105 -107605 -138252 -91006 -13713 -70431 -68661 -91882 -208585 -181096 -132273 -82485
1699h2485K8218l5464m3744Q5570j25797J7788M2487p8870k9470J13844q0493
$$ -82485 -54267 -89731 -133475 -47905 -173702 -155914 -113427 -192297 -221767 -107923 -188416
1688a88416l5650J15150N8340k6426j73223K5505L2968J11175M1746n3957J8974
$$ -188416 -224066 -108916 -50576 -77002 -250225 -224720 -191752 -80577 -38831 -92788 -73814
1677g3814j50924L4651m1593N7665O9034Q0915k1662r5418L9226l226n8788p4495
$$ -73814 -224738 -190087 -231680 -174015 -104981 -24066 -45728 -141146 -101920 -105146 -163934 -238429
$$ [...]
##END NTUPLES=NMR SPECTRUM
##END=
