##TITLE=1H_CG-1188-H1
 200.13Hz, DMSO+CCl4.
 8 sc
 
 15.4.2026
##JCAMPDX= 6.0         $$ Bruker NMR JCAMP-DX V2.0
##DATA TYPE= NMR SPECTRUM
##DATA CLASS= NTUPLES
##ORIGIN= UXNMR, Bruker Analytische Messtechnik GmbH
##OWNER= pz
$$ XWIN-NMR		Version 3.5
$$ Wed Apr 15 13:51:50 2026 Russian Standard Time (UT+4h)  she@DPX200
##.OBSERVE FREQUENCY= 200.1313
##.OBSERVE NUCLEUS= ^1H
##.ACQUISITION MODE= SIMULTANEOUS
##.ACQUISITION SCHEME= undefined
##.AVERAGES= 8
##.DIGITISER RES= 18
##SPECTROMETER/DATA SYSTEM= spect
##.PULSE SEQUENCE= zg30
##.SOLVENT NAME= DMSO
##.SHIFT REFERENCE= (INTERNAL, DMSO, 0, 15.5298)
##AUDIT TRAIL= $$ (NUMBER, WHEN, WHO, WHERE, WHAT)
$$ ##TITLE= Audit trail, XWIN-NMR		Version 3.5
$$ ##JCAMPDX= 5.01
$$ ##ORIGIN= Bruker BioSpin GmbH
$$ ##OWNER= she
$$ F:/spectra/data/she/nmr/H-C/1/pdata/1/auditp.txt
$$ ##AUDIT TRAIL=  $$ (NUMBER, WHEN, WHO, WHERE, WHAT)
(   1,<2026-04-15 13:50:22.79 +0400>,<she>,<DPX200>,
      <created by zg, POWCHK disabled, PULCHK disabled
       configuration hash MD5:
       00 E9 B6 7A A2 85 ED C7 34 08 36 98 17 FE 4E 26
       data hash MD5: 16K
       21 FA E3 D6 ED 2F 9C E9 54 84 D6 D3 27 FC 1A B2>)
(   2,<2026-04-15 13:50:28.34 +0400>,<she>,<DPX200>,
      <Start of raw data processing
       efp BC_mod = 2 LB = 0.25 FT_mod = 6 PKNL = 1 PHC0 = -3706.231 PHC1 = 9.592312 SI = 16K 
       data hash MD5: 16K
       EB 59 2A 8A 50 EF 54 DD 8F 03 CA 76 FA 57 01 F6>)
(   3,<2026-04-15 13:50:53.37 +0400>,<she>,<DPX200>,
      <pk PHC0 = -2.080766 PHC1 = 0.6 
       data hash MD5: 16K
       F4 11 B2 31 29 85 54 00 C9 05 D4 DC F6 C1 66 1E>)
(   4,<2026-04-15 13:50:58.48 +0400>,<she>,<DPX200>,
      <abs ABSG = 5 
       data hash MD5: 16K
       15 4C 17 83 48 66 9A 15 7E 55 44 63 79 9C DF E8>)
$$ ##END=
$$ 
$$ hash MD5
$$ F0 07 67 9C 11 21 A8 F8 A2 4C 76 5C 40 4E 87 54
##$RELAX= 
##$RELAX= 
##$RELAX= 
##$RELAX= 
##$RELAX= 
##$RELAX= 
$$ Bruker specific parameters
$$ --------------------------
##$DU= <F:/spectra>
##$EXPNO= 1
##$NAME= <H-C>
##$PROCNO= 1
##$TYPE= <nmr>
##$USER= <she>
##$AMP= (0..31)
100 100 100 100 100 100 100 100 100 100 100 100 100 100 100 100 100 100 
100 100 100 100 100 100 100 100 100 100 100 100 100 100 
##$AQSEQ= 0
##$AQ_mod= 1
##$AUNM= <au_zg>
##$AUTOPOS= <>
##$BF1= 200.13
##$BF2= 200.13
##$BF3= 200.13
##$BF4= 200.13
##$BF5= 200.13
##$BF6= 200.13
##$BF7= 200.13
##$BF8= 200.13
##$BYTORDA= 1
##$CFDGTYP= 0
##$CFRGTYP= 5
##$CHEMSTR= <none>
##$CNST= (0..31)
1 1 145 1 1 1 1 1 1 1 1 1 1 1 1 1 1 1 1 1 1 1 1 1 1 1 1 1 1 1 1 1 
##$CPDPRG= <>
##$CPDPRG1= <>
##$CPDPRG2= <>
##$CPDPRG3= <>
##$CPDPRG4= <mlev>
##$CPDPRG5= <mlev>
##$CPDPRG6= <mlev>
##$CPDPRG7= <mlev>
##$CPDPRG8= <mlev>
##$CPDPRGB= <>
##$CPDPRGT= <>
##$D= (0..31)
0 0.7 0 0 0 0 0 0 0 0 0 0.03 0 0 0 0 0 0 0 0 0 0 0 0 0 0 0 0 0 0 0 0 
##$DATE= 1776246622
##$DBL= (0..7)
120 120 120 120 120 120 120 120 
##$DBP= (0..7)
150 150 150 150 150 150 150 150 
##$DBP07= 0
##$DBPNAM0= <>
##$DBPNAM1= <>
##$DBPNAM2= <>
##$DBPNAM3= <>
##$DBPNAM4= <>
$$ [...]
##$SUBNAM3= <"">
##$SUBNAM4= <"">
##$SUBNAM5= <"">
##$SUBNAM6= <"">
##$SUBNAM7= <"">
##$SUBNAM8= <"">
##$SUBNAM9= <"">
##$SW= 18.0517328524113
##$SWIBOX= (0..15)
0 0 2 0 0 0 0 0 0 0 0 0 0 0 0 0 
##$SW_h= 3612.71676300578
##$TD= 16384
##$TD0= 1
##$TE= 0
##$TE2= 300
##$TE3= 300
##$TEG= 300
##$TL= (0..7)
0 120 120 120 120 120 120 120 
##$TP= (0..7)
150 150 150 150 150 150 150 150 
##$TP07= 0
##$TPNAME0= <>
##$TPNAME1= <>
##$TPNAME2= <>
##$TPNAME3= <>
##$TPNAME4= <>
##$TPNAME5= <>
##$TPNAME6= <>
##$TPNAME7= <>
##$TPOAL= (0..7)
0.5 0.5 0.5 0.5 0.5 0.5 0.5 0.5 
##$TPOFFS= (0..7)
0 0 0 0 0 0 0 0 
##$TUNHIN= 0
##$TUNHOUT= 0
##$TUNXOUT= 0
##$USERA1= <user>
##$USERA2= <user>
##$USERA3= <user>
##$USERA4= <user>
##$USERA5= <user>
##$V9= 5
##$VALIST= <valist>
##$VCLIST= <CCCCCCCCCCCCCCC>
##$VD= 0
##$VDLIST= <DDDDDDDDDDDDDDD>
##$VPLIST= <PPPPPPPPPPPPPPP>
##$VTLIST= <TTTTTTTTTTTTTTT>
##$WBST= 1024
##$WBSW= 4
##$XGAIN= (0..3)
0 0 0 0 
##$XL= 0
##$YL= 0
##$YMAX_a= 68123
##$YMIN_a= -61281
##$ZGOPTNS= <>
##$ZL1= 120
##$ZL2= 120
##$ZL3= 120
##$ZL4= 120
##$ABSF1= 15.48355
##$ABSF2= -2.568299
##$ABSG= 5
##$ABSL= 3
##$ALPHA= 0
##$AQORDER= 0
##$ASSFAC= 0
##$ASSFACI= 0
##$ASSFACX= 0
##$ASSWID= 0
##$AUNMP= <proc_1d>
##$AZFE= 0.1
##$AZFW= 0.1
##$BCFW= 0
##$BC_mod= 2
##$BYTORDP= 0
##$COROFFS= 0
##$CY= -3
##$DATMOD= 1
##$DC= 0
##$DFILT= <>
##$DTYPP= 0
##$F1P= 0
##$F2P= 0
##$FCOR= 1
##$FTSIZE= 16384
##$FT_mod= 6
##$GAMMA= 0
##$GB= 0
##$INTBC= 1
##$INTSCL= 3.241238e-09
##$ISEN= 128
##$LB= 0.25
##$LEV0= 0
##$LPBIN= 0
##$MAXI= 10000
##$MC2= 0
##$MEAN= 0
##$ME_mod= 0
##$MI= 1.114404
##$NCOEF= 0
##$NC_proc= -9
##$NLEV= 6
##$NOISF1= 3.799351
##$NOISF2= 2.8
##$NSP= 0
##$NTH_PI= 0
##$NZP= 0
##$OFFSET= 15.52984
##$PC= 1
##$PHC0= -3708.312
##$PHC1= 10.19231
##$PH_mod= 1
##$PKNL= yes
##$PPARMOD= 0
##$PSCAL= 0
##$PSIGN= 0
##$REVERSE= no
##$SF= 200.129998371409
##$SI= 16384
##$SIGF1= 3
##$SIGF2= 2
##$SINO= 0.751879
##$SIOLD= 32768
##$SREGLST= <19F.Aceton>
##$SSB= 0
##$STSI= 16384
##$STSR= 0
##$SW_p= 3612.71676300578
##$SYMM= 0
##$S_DEV= 0
##$TDeff= 16384
##$TDoff= 0
##$TI= <>
##$TILT= no
##$TM1= 0
##$TM2= 0
##$TOPLEV= 0
##$USERP1= <user>
##$USERP2= <user>
##$USERP3= <user>
##$USERP4= <user>
##$USERP5= <user>
##$WDW= 1
##$XDIM= 16384
##$YMAX_p= 307172308
##$YMIN_p= -5146970
$$ End of Bruker specific parameters
$$ ---------------------------------
##NTUPLES= NMR SPECTRUM
##VAR_NAME=  FREQUENCY,     SPECTRUM/REAL,   SPECTRUM/IMAG
##SYMBOL=    X,             R,               I
##VAR_TYPE=  INDEPENDENT,   DEPENDENT,       DEPENDENT
##VAR_FORM=  AFFN,          ASDF,            ASDF
##VAR_DIM=   16384,         16384,           16384
##UNITS=     HZ,            ARBITRARY UNITS, ARBITRARY UNITS
##FACTOR=    0.220516191357247, 1,           1
##FIRST=     3107.98694784133, 0,            0
##LAST=      -504.729815164452, 0,           0
##MIN=       -504.729815164452, -5146970,    0
##MAX=       3107.98694784133, 307172308,    0
$$ Real data points
##PAGE= N=1
##DATA TABLE= (X++(R..R)), XYDATA
$$ [...]
7210 -1531044 204452 2020255 2593297 2345863 232124 -535663 -1032256 -547624 1316942
7201 1316942 -37611 -338870 -69270 -461984 -460950 1260391 1401873 590021 -155008 -73632
7191 -73632 -794144 -286525 954738 837068 1432602 782337 -327230 -2000458 -2811023
7182 -2811023 -760084 1690765 1106960 692601 1622469 1090571 -55015 -777270 225625
7173 225625 -35047 227937 489350 464017 434982 264278 850771 401207 731335 -267845
7163 -267845 -759400 -633693 -346025 312596 842865 891931 -842695 -206394 215880 2684930
7153 2684930 3831874 1971188 -407072 -2011138 -515577 371833 2292843 1840248 1744521
7144 1744521 47291 -635421 1148327 2516347 1507951 693443 -1013393 -585769 673112
7135 673112 2154300 3206060 1230043 -737046 -1298595 -1434694 -55570 1345672 2528232
7126 2528232 -273911 -1623654 -1180439 699930 1265571 384810 -252371 -1085798 469360
7117 469360 1016062 -51157 -567204 514365 150836 -318203 584928 956158 2119158
7108 2119158 1181838 1306196 3560 -579153 -1820829 -1493684 612690 2306430 2910751
7099 2910751 1970574 534854 -324377 858340 -659615 247006 -557294 -1522278 -574285
7090 -574285 -40555 786573 491718 -340287 -1132750 331954 576318 814186 558551 -1474751
7080 -1474751 -36579 706989 774172 -367763 -1123196 -1444114 -58845 922632 676994
7071 676994 252926 -1091410 -1430225 -488927 -58223 299282 712961 -766801 -3250934
7062 -3250934 -2315627 -1048661 -453062 395214 1234343 -527252 -791065 110653 929388
7053 929388 708153 851139 -704630 -1671980 -245201 -52748 1602024 481911 -594568
7044 -594568 -1297069 -1020447 -186227 734555 417328 -922812 -325505 -1509945 -287197
7035 -287197 272722 -206565 -235994 -304890 -353881 487819 189389 518565 772284 -845705
7025 -845705 -641919 988217 522538 -848178 766397 782810 -1501104 -1085602 46895
7016 46895 711745 393259 1366014 -339688 -2663135 -277087 1728701 2100170 516613
7007 516613 1871044 677789 -1066731 -826873 1758162 1398768 -65096 -301494 -1254663
6998 -1254663 -1379745 -1177587 1833438 2062648 360442 -1263239 -1044060 -2054184 -1550683
6989 -1550683 2730629 1610764 -1305964 -2070157 -1551079 -1632393 -848873 422272 -609255
6980 -609255 -1508225 -2400715 -1068381 679056 1767040 1315498 1434908 654611 -999585
6971 -999585 196234 765498 1475722 520378 20264 415221 -926673 -527630 1466714
6962 1466714 2199484 549904 481947 1117832 845686 -139864 1314664 317523 -316042
6953 -316042 -543025 -1255768 -788396 898397 3577546 3332659 2332321 21399 610498
6944 610498 381310 -40000 1723737 2195552 -453555 -662862 1419211 1622843 1187651
6935 1187651 73850 -624530 -652073 936074 1917774 1842381 756808 -889868 -807008
6926 -807008 -262804 130528 733717 1597051 -55606 -808375 113022 -296510 429215 1087323
6916 1087323 140632 85851 524433 -435386 -480121 1249565 1571136 941881 -613704 152971
6906 152971 1511924 1998356 1956185 2694830 2415465 664828 14245 -314789 14309 1259200
6896 1259200 1326878 -136204 287366 -773375 -1182498 44858 1386535 1082910 497589
6887 497589 2674738 1829223 1511077 1422121 1982411 1132430 -104628 732782 1002179 678615
6877 678615 633504 811733 574211 -1092572 -1255545 70969 455594 1760854 1785289 1457131
6867 1457131 2026945 732047 95749 71198 504164 788125 174871 -271422 187747 839760
6857 839760 1402405 1940419 2827309 718282 -359114 -678241 -176895 1726744 2512464
6848 2512464 1936095 -9583 -579895 -1060758 338315 1474894 2289218 973637 -1503016
6839 -1503016 -711527 1707684 1713165 1994020 1337671 478453 387565 790326 1791647 1595757
6829 1595757 1404299 1376311 582999 605752 1498263 4231165 2585249 -1558522 -1172350
6820 -1172350 -516337 -739286 -394988 -512130 -716926 -62457 237923 955015 1913403 1620359
6810 1620359 748530 -69492 969264 1935784 1912635 730747 157121 -824957 30705
6801 30705 248854 -50851 27133 617066 251002 957254 2327272 1346394 -515748 -1312437
6791 -1312437 432010 1115112 -277156 -49198 218572 -317685 137728 921937 1304408
6782 1304408 576738 -479195 310912 1216882 -448544 108858 858144 -344006 397353
6773 397353 1731250 962988 1472629 1966807 1928459 616419 -15769 350919 -520509 442938
6763 442938 2476670 2613366 989960 763103 2131579 2669965 1918111 2211422 1638500
6754 1638500 502276 2057864 2888201 2578330 -120550 -200188 700947 1131761 987450
6745 987450 861418 -32278 -654875 242484 2011686 2474096 559473 1332446 639206
6736 639206 586065 1193910 1988055 1507602 943411 598973 94195 1526041 294740 -133316
6726 -133316 622798 824658 975592 -828259 -893020 110527 1594413 1409052 584090
6717 584090 -1268666 -258068 -7740 349404 758703 364444 10229 -455156 1961664
6708 1961664 1721719 1012884 926856 245987 -1319428 -274920 1253209 2352150 1739468
6699 1739468 1250104 1136948 965076 548020 255170 1894357 929694 643606 -179767
6690 -179767 -729214 1025500 843023 1066547 466110 961317 142149 298630 853054 -316412
6680 -316412 -141302 -505575 682150 745057 769995 957091 1583964 1227785 497062 428683
6670 428683 -490833 943799 1015376 1794081 1258467 193051 307116 1455497 1647486
6661 1647486 1928467 743664 876867 1529793 -133145 1621622 1845971 1003482 297680
6652 297680 1219026 1994714 2465269 3997000 2200042 1747585 2034003 2982637 1627916
6643 1627916 2035915 2592178 2208177 2047903 3050286 3916540 2790482 3340333 1976557
6634 1976557 2535277 1935026 1621389 2259052 2648033 2176349 3198274 2960032 632549
6625 632549 1062063 1500113 2703797 3269979 2739625 1058979 884043 1302833 2008250
6616 2008250 4059204 3973640 2581365 2138850 1546763 1433691 2341398 1757833 2641114
6607 2641114 2774292 1920802 1361543 1957485 2929248 3812993 3215830 2108055 3404626
6598 3404626 3159809 3028544 2719698 2533608 2737825 2132177 3132243 2283035 3931371
6589 3931371 3450018 2931586 3152305 2557239 1756981 2475402 2914644 1808183 2979566
6580 2979566 1815978 2064526 2324896 3714014 3847107 3005990 1385961 1177524 2301058
6571 2301058 1923858 3262941 1983219 3168751 2964863 1600462 1023696 667625 1359781
6562 1359781 3232421 3531720 2110236 2516365 1273468 1922853 2777382 3834865 3081611
6553 3081611 2472890 2289938 1817654 1954438 2063986 3826320 3842597 2920900 2219832 2580950
6543 2580950 3692899 2846625 3676407 2889428 1878059 1605579 2887272 3335870 3863942
6534 3863942 3427458 2036696 1666787 1479621 3330255 1918861 3277534 3729859 4231541
6525 4231541 4205806 4559701 3277715 1837706 1776449 2234778 2745902 1781395 3307263
6516 3307263 3920538 4124493 2930116 3352902 4369926 2179135 1873289 2426298 2450469
6507 2450469 2321492 3696326 3727044 3579782 4646628 3550396 2567030 3154751 4443343
6498 4443343 4653021 4485103 5057860 4472783 2619640 3307588 4554629 4051140 3078527
6489 3078527 3149392 3297195 3592596 4807741 4483615 4711325 3861671 3713501 3226026 4329448
6479 4329448 5746501 5476287 6322427 5228872 5135662 3964575 3815775 4411222 4609521
6470 4609521 3716871 3448670 4588223 4398553 4466134 5178919 4772524 3627095 2595659
6461 2595659 3199597 4576713 3292691 3614841 4279094 3646225 4373435 4150752 4004241
6452 4004241 3704020 3633754 3274560 3151409 2729512 3496728 3318722 3827579 6650037 5812419
6442 5812419 4428353 2883459 2785211 3145974 3984431 4428533 3616639 3593833 3536331 4817344
6432 4817344 4304842 4287092 4150005 3871383 3195489 3763566 5504250 5006223 4039740 5391407
6422 5391407 4324994 3927843 4191303 3926838 4373534 5189940 6019937 5740501 4181295
6413 4181295 3019050 3735745 4155349 3405373 3822113 4384187 5085924 5644474 5436081
6404 5436081 4849483 4944601 5191296 4660647 5976332 5425786 5465074 5337047 4819693 4717386
6394 4717386 4770496 5101124 4323331 4774695 4770721 5152455 6248793 6402662 7062518 6578827
6384 6578827 5343826 4511900 4256745 5532635 5937233 5559215 6239931 6721078 7113898
6375 7113898 6219056 5763676 4812267 4965684 5650280 4612020 5058299 5669342 5883537
6366 5883537 6885159 6359383 6450778 5544721 4002495 4226289 6275625 6584611 5855864
6357 5855864 5388363 6341045 6508758 6249375 6552230 6459901 6044156 4827423 5381892 6372768
6347 6372768 5786641 5925171 6957028 6849311 7143050 6174248 5306597 5523882 5104619
6338 5104619 5082762 6218581 6305406 6255410 5219038 5381863 6254605 8178757 7834899 6556461
6328 6556461 5517175 4254263 4192785 5395895 6966175 7522769 7568727 6096917 6430991
6319 6430991 6157992 7453964 9760917 10000843 7934903 6811131 7010350 6265713 7148680
6310 7148680 7174416 6457677 6122064 6324529 6587505 6558174 6709431 7463499 8391079 6329256
6300 6329256 6363606 6814660 6597582 6996263 7895240 7233765 7365146 7262682 6261526 7558630
6290 7558630 7896723 7980678 7589458 7299420 7539230 7576358 7665323 7921517 8503940 7597456
6280 7597456 8813415 8269287 7887988 8423475 9675426 9587743 9721724 8879577 7382673
6271 7382673 6139701 6431496 9107563 9482490 10355978 9852730 9813000 9031505 8285156
6262 8285156 9181993 8866224 8823960 9475355 9651003 8724325 9832794 9878834 9980200 9390617
6252 9390617 7987281 8028764 8361899 10204227 12254550 12323891 9717021 9860286 9484168
6243 9484168 8599806 8967274 11083522 11864101 11006030 11089390 11282597 11916295 10986276 10790623
6233 10790623 10680574 9266864 8710677 9478457 11171194 10352185 11429235 9046756 8232648
6224 8232648 8347942 9932823 11855060 11892070 11037186 9387125 8748104 10012552 12207702
6215 12207702 12020980 11929610 11632956 10361279 9903422 10203659 10958877 11651850 11142272
6206 11142272 9920112 9973896 10365246 11936768 13141994 11961499 10124147 9874170 8899809
6197 8899809 8922526 10596404 11350238 11086178 11342314 10966608 10442401 11407812 13284255
6188 13284255 12979310 10715312 10028948 12505254 12636174 12741455 14510172 14657872 13119461
6179 13119461 12750578 12562857 13252539 12644734 12835366 14255278 12422860 12098075 11845557
6170 11845557 12764189 13226021 14059837 13198182 12558809 12982403 13505323 12774586 12196626
6161 12196626 13410205 14364544 11837111 10852102 14210122 14534051 13517120 13545495 13116946
6152 13116946 12244597 11037652 13019794 14840106 15000529 12235236 12857573 13496893 12305545
6143 12305545 13236631 13778260 13214143 12948323 13538044 14298462 14202504 14559297 14097460 14121442
6133 14121442 13899737 13453080 13972036 13606365 13048119 14310376 14693627 14807215 13423172
6124 13423172 13068067 15167947 16054273 16122260 15932498 15581456 13828642 15329121 16117912
6115 16117912 15013278 15522719 14910019 14323489 14936621 14781916 14595028 15480462 15285808
6106 15285808 16725478 16903373 14989502 14785216 16854540 16611325 16107773 17258619 15480084
6097 15480084 16103076 17184297 18866179 19818477 17476159 15328310 15184136 14962224 15610790
6088 15610790 17124662 17397424 17825397 18053903 16861375 16998912 17782463 17560433 15816535
6079 15816535 15592881 17503005 19491762 20542775 21431377 20755692 19029954 16168882 16165810
6070 16165810 18208057 18188513 20219931 20504392 21543952 20569632 19187164 18954969 18130396
6061 18130396 16417921 16598974 18412263 19117259 20092132 19487883 19033802 20311426 21052085
6052 21052085 19778669 18338101 19069155 19058852 19552216 19497883 20464232 20168008 19936459
6043 19936459 20845191 20178566 19489793 19463999 20802029 19188996 19965525 21161384 20251081
6034 20251081 19593175 20695744 21973643 22387698 22546731 20526129 19497589 20095102 21508865
6025 21508865 22263619 20647899 20452351 21361140 20437634 21166963 23747165 23502356 21122423
6016 21122423 19441881 19988150 20844842 22117349 22862848 22892803 21924972 22019648 22138955
6007 22138955 23410707 24268040 23589936 22094470 22201825 21973122 22325865 21760395 21704723
5998 21704723 23427527 24035163 23797786 23797662 23438086 23362937 24070992 23813408 22706631 23774393
5988 23774393 23283532 22663196 23567970 25158322 26028655 25134113 23431514 23452057 24175702
5979 24175702 25054927 26729159 26502563 25786489 25089740 26427997 25812096 25311500 25255869
5970 25255869 25439525 26332922 27753217 28474601 26635421 26395029 26892090 27171843 27542110
5961 27542110 27209145 27038534 27032927 27558451 28670169 30595219 29125016 28400419 26774781
5952 26774781 25858973 27160204 29254611 30874371 29895527 29749469 28773470 28436043 27649089
5943 27649089 28838845 28520529 27487144 28624460 28125024 28815734 29917762 30868246 31419950
5934 31419950 31438829 30029972 28690458 29207927 31348171 31803333 31701810 31629628 30837162
5925 30837162 30440556 30702150 31260613 30712284 29695430 30727510 31230361 32987203 32949357
5916 32949357 31556945 31130077 31015739 31043788 32087339 32202201 31875574 32684709 32695750
5907 32695750 32286765 31945921 31692631 30156629 29640155 31049448 31932775 32508027 33655530
5898 33655530 32707216 33563962 34193733 33959412 33263764 31634901 32429596 33638988 32809901
5889 32809901 32574781 32686010 32259408 32177602 33555763 33558772 33017708 34020433 32549177
5880 32549177 32920047 34604683 34390773 33137952 34203500 35134625 35767422 35084857 35207334
5871 35207334 36753561 37940988 36940127 37341007 36867822 35524411 36527927 36806529 37411756
5862 37411756 37230287 36605647 36062982 37295005 38311471 40081289 39967227 37755218 36671624
5853 36671624 37628623 37745683 38189994 39884611 38677480 37753084 38158716 38437257 39183878
5844 39183878 40744533 40698522 40120550 40495912 39427673 40181439 41618011 41738248 42346286
5835 42346286 42947165 41131261 40754844 40933076 40246181 41398674 42296708 42942844 43969302
5826 43969302 43085219 41340711 42067784 42949602 41880623 41175776 40598854 41504929 42259478
5817 42259478 43557509 45477305 45843558 44130591 42832827 44107774 44194893 45286106 46705555
5808 46705555 45598525 44479025 44641068 46177017 48562787 50026855 49831673 48994537 47369426
5799 47369426 47346524 47954258 48706239 49549081 51028966 50603221 49122500 50291569 51222954
5790 51222954 52123760 51354794 51280116 52077030 51374739 52697004 55357768 56354115 54857582
5781 54857582 53753875 54104965 56161937 58430892 59992436 60200225 60278095 58932705 59798869
5772 59798869 61068630 61931337 64286822 64796457 66101815 66333763 67911127 68833630 69684478
5763 69684478 70656565 69795269 69816419 72246112 73468734 75365799 77667903 77947274 79646545
5754 79646545 80518211 81221368 82516327 83954154 85580933 87330858 88482569 89643285
5746 89643285 91097172 90919313 91960534 94103316 96895735 98011800 98650377 99316961 98633851
5737 98633851 99619090 101336036 102227262 103259918 104074296 103663000 103325031 104449994 104160819
5728 104160819 103635867 101918751 100472068 98923225 97324753 98366197 98524154 96146264
5720 96146264 93429642 91179878 87922976 85276484 84468717 83937966 81873531 79875615
5712 79875615 77815905 76579049 76242056 75020506 73638020 71635559 69673294 69477054
5704 69477054 69120952 68696443 68582888 67797509 66812712 66551277 66114470 65108076 64100986
5695 64100986 64840151 63216926 63049974 63404257 63658189 62955413 61768688 61200924 61996518
5686 61996518 61378089 59889507 60267053 59790857 59397342 59250376 59428294 59720477 61305457
5677 61305457 60123249 59969479 58800833 57098522 59284755 60015576 59340977 58504584 57902973
5668 57902973 57520924 58535026 58132667 57563679 57898519 56037227 55696171 55263546 55506516
5659 55506516 57067976 57937360 57682333 56797807 56524377 55361147 55590304 56750301 56582406
5650 56582406 56459049 56287155 56625300 57126346 56764585 56183062 56419840 54690902 54536199
5641 54536199 54541275 56829902 57041935 56868740 56268576 55299642 54554465 53520648 55467965
5632 55467965 55531867 55532176 55545243 55275050 53751380 53944667 54838283 53384307 54358013 55397752
5622 55397752 55742659 55565330 54772565 53242090 53308717 54018973 54603689 55339671 54154299
5613 54154299 54233569 54821909 54865933 54168418 54674349 53781025 52736012 53071779 54257315
5604 54257315 56372529 56152278 56139612 55259618 54120062 52995163 53464816 54134989 53977064
5595 53977064 54679260 55236686 56382559 54286459 53022841 52721871 54174874 56054853 56388938
5586 56388938 56260735 55035352 54386081 53152060 54475123 55203998 55750907 55545493 53925586
5577 53925586 54157735 54451269 55361698 54737445 53794288 53552089 54308435 53611297 54168218
5568 54168218 55610598 55044708 54314496 54200309 53427946 52827171 52604038 53021301 54072098
5559 54072098 53242554 53414381 52948429 50485324 49967130 51820511 54130569 53242140 52097916
5550 52097916 52063305 53469580 54064652 53058984 52429124 51499331 50193055 49890315 50708123
5541 50708123 51048412 51990480 51124085 49516101 50481833 50930890 50867308 50612249 50855752
5532 50855752 50877200 50781450 49651260 48954619 49824488 50187613 50033971 49781555 50844262
5523 50844262 49422550 49957031 49418572 49686809 50358757 49374254 49271065 49952107 48282378
5514 48282378 47884385 49608489 48582198 47466015 48496803 49163745 46865310 47099301 48077293
5505 48077293 47921461 47301065 48101149 49702589 48676467 44911963 44949175 46360868 46793081
5496 46793081 47691538 47411807 45121524 43584740 43623625 44698593 45893189 45088730 43970067
5487 43970067 42779947 43308371 44856814 45212408 44647096 42786148 41993604 40850111 41907059
5478 41907059 43074952 43216029 41796044 40979163 40602010 40699579 40846246 40088205 39402367
5469 39402367 39562402 40099661 41555428 41432684 40501108 39112318 38426670 39062190 38923490
5460 38923490 39397863 39493994 41411009 40606321 37861234 37247645 37710694 38319475 38123916
5451 38123916 38102256 38150100 36043956 35681184 36455084 37124721 34691242 33571863 34749595
5442 34749595 35830513 37032184 38029219 37390541 36544424 35024787 34314402 34138728 35022375
5433 35022375 35910604 35487943 34273159 34333115 34377034 31915714 31301521 33739568 34080564
5424 34080564 32297790 32299832 32854199 31592390 32678142 34554703 32923649 30700451 30328433
5415 30328433 32120684 33078289 31871142 31073310 30562196 29014653 29119847 31233999 31837743
5406 31837743 32546185 31336752 29252299 29348098 30854735 30107031 29965259 29182940 29251551
5397 29251551 28102655 28421133 29360479 29643827 29389264 27705892 27722416 28084254 28367480
5388 28367480 28325758 28616026 28648649 27443989 25262154 24279864 25562754 27417635 27582513
5379 27582513 26689064 25638241 25034396 25744657 27392265 26893366 26480507 25150382 25527868
5370 25527868 25657326 25258661 23609026 24772999 24893826 23419588 23714924 24102819 23231177
5361 23231177 24154292 24103805 22962779 22753549 23281132 23374826 23165478 22696599 22145031 22480908
5351 22480908 23071146 23368241 23435652 19907785 19578351 21537791 22046201 21545275 22630784
5342 22630784 21972720 19975412 21348234 21383843 22040714 21289354 20601344 21281315 19785013
5333 19785013 17696642 19114987 19784211 19674596 20006754 20436153 18222057 18613369 20127725
5324 20127725 20736506 22491038 20722096 17743570 18981094 19712585 20825402 20842651 18567215
5315 18567215 17270095 15980467 16150341 18157616 19298807 18209679 17650464 18027139 17178550
5306 17178550 17331886 17851952 16130208 16095867 16727479 15269335 15299344 16671216 17094905
5297 17094905 18366466 18218840 16812254 15123901 15074789 15748399 17700184 17169169 15817019
5288 15817019 16975551 16154049 14271059 13930499 14374636 15381839 15911440 15931558 17620994
5279 17620994 18426611 15474844 13889196 14318824 14355545 14044232 14025601 13538697 14953723
5270 14953723 15171061 15087048 15435878 14187292 13241847 13067193 14100507 13759031 14687162
5261 14687162 14678508 13771144 14277247 13429553 13382174 12551181 13146512 13484728 12916412 13812218
5251 13812218 13297177 13680265 12555301 12797559 11574209 10135190 9120327 10668595 11996908
5242 11996908 12494032 13004268 13701403 12234896 9862954 9436106 10217993 11725690 11569584
5233 11569584 12990928 12456218 9765721 9016524 10612008 13190131 12000303 9878723
5225 9878723 9620230 11536670 11346544 11273642 12226092 10915811 9632192 9323235 10417557
5216 10417557 10893701 11550970 10620081 10575739 11435647 11900011 10901665 9980860 10306363 10860706
5206 10860706 12488088 12318867 12101034 10967301 10258838 10414344 10823458 11815126 11853245
5197 11853245 11599480 10008630 10687635 11115911 10718550 10826324 10998755 10736961 11042489
5188 11042489 11143192 11088555 11290280 10912094 11667169 10992578 10005479 10162667 10392656 9805608
5178 9805608 10103423 11160219 10890484 10722486 10442111 9844800 9585088 9282545 9990615
5169 9990615 10225208 9344271 7762765 8388091 9747898 10089984 10032483 9023464 8460911
5160 8460911 9814808 10385924 9502755 10492657 10383077 8507528 7657474 7563946 8605099
5151 8605099 8762530 8821974 9383855 9758064 9194363 9538025 9431506 8016019 8194001 10012873
5141 10012873 11065379 10164390 8970223 8328058 9370412 10110733 10001836 9115181 8214944
5132 8214944 7823796 7684738 9159241 9787434 9648948 9283915 8220582 7661076 8244561
5123 8244561 8759960 8713222 8609913 8713371 9737632 8216737 6937666 9698527 10374998
5114 10374998 9605375 9330960 8099965 8179977 8747544 9062008 9300692 9101035 6753904
5105 6753904 8113955 8044458 8101948 8888701 10901492 8724688 7422263 9133050 10325917
5096 10325917 9827867 8380385 8887675 8292477 7037653 6959935 9579329 9744281 10094648
5087 10094648 10039563 7441515 7176809 8032568 8073524 7451690 6568396 6372543 8054271
5078 8054271 8149280 7927175 9051001 8110479 7874680 8067351 8787265 8643237 8801299 9268922
5068 9268922 7334279 7425608 8377965 9143429 9579589 8826474 8647632 7845533 6015680
5059 6015680 5453247 6528842 7650448 8929414 8825961 8580034 6739800 6378230 6377506
5050 6377506 6574281 7308079 6622384 6881995 7285559 7634099 8688265 8893105 8617553
5041 8617553 7140111 5617345 4573165 5283933 7352491 7781455 6896350 6783148 6536811
5032 6536811 6841275 7021853 6362163 6170366 5900180 6771280 6996896 6836796 6805099 7322642
5022 7322642 8213347 7613926 7866050 6671614 6240104 5787782 6545638 7321003 8532436
5013 8532436 8003207 6179757 5728824 7447639 8364843 6532264 5728933 4883691 5804384
5004 5804384 6316766 7596862 8388927 6531774 7218468 7018246 5212256 5006479 6440005
4995 6440005 7325138 7506850 7342722 5332182 6206123 5843030 7183309 7226280 7275616 5790487
4985 5790487 5730482 6446969 6219789 8118074 6977735 5437452 4500034 5719214 6544874
4976 6544874 7576942 7710551 7867059 6787739 4737902 6700651 6251587 6150468 5609248
4967 5609248 5041326 4553583 6030983 7512334 7096409 7295802 5421999 6148739 5492823
4958 5492823 5344688 4615770 5993806 6126486 7596603 8584636 7266468 5861196 5998530
4949 5998530 6214551 6414146 7083253 6925344 5380432 4430508 6130296 7015137 6473702
4940 6473702 6522227 5394094 4106049 3726779 5504163 6918145 8599554 9181904 6714570
4931 6714570 5020035 3930579 5606903 5250493 6262730 7026498 7721720 6675588 6330356
4922 6330356 6625866 6600031 6756875 7419879 6843803 5483479 6649443 9474827 9552409
4913 9552409 8308477 5358850 3755103 3441279 5244964 7353240 7721230 6917477 6424383
4904 6424383 6761004 5961239 5711072 6754308 6408623 5800995 6832754 6995185 6708899
4895 6708899 5637106 6046984 5348686 4538528 5684049 7109090 7087586 7035830 6729224
4886 6729224 7011991 7751299 7407233 7281962 5984736 7440683 9072770 9757729 9519045
4877 9519045 9506505 7930095 6845741 6707544 8348837 9100490 8311637 9351281 10316744
4868 10316744 10218280 9472868 9897355 8885261 8963692 10396409 10920891 11763145 11897259
4859 11897259 12823873 12778001 12424105 12979522 11741602 11433608 11361225 12605097 12497687
4850 12497687 13884372 14264791 14164691 13731471 15091311 16081954 15376068 16683892 16422974
4841 16422974 16529582 16799439 17971795 18212786 17467021 18349292 20452840 20469678 19319736
4832 19319736 22454738 22861656 22076529 22395499 23864180 23345734 23195483 23880209 25915204
4823 25915204 27239710 28349271 31337317 31195323 29794871 29882398 31273595 31106773 33916563
4814 33916563 36470552 35666953 36254325 37754274 39987440 39639520 39867795 39097213 40289622
4805 40289622 41380973 42737991 45443708 44600615 45432517 46537006 47452773 46123311 45675553
4796 45675553 44597871 43871086 45043929 45021750 45695463 44611793 42846779 42599623 42276493
4787 42276493 41349650 39549264 37135070 35292856 34581653 33306985 31847342 30534044
4779 30534044 30028205 28776261 28796586 26755046 23729305 22919630 23284342 22110633 21053339
4770 21053339 19852121 18655044 18690633 18545497 18393104 18112293 16397100 15908135 16710351
4761 16710351 15809625 15497378 15881833 16690498 16208557 14063234 13509664 14757998 16134032
4752 16134032 16444095 16341734 14174419 12141941 12383760 12549648 12644406 12560289 12537488 11035426
4742 11035426 11867966 13625528 14026950 12086445 10796605 10416619 11363699 11579360 12276609
4733 12276609 12308237 11887965 12622750 11907852 11024962 10845550 10835914 10592486 12259280 11259574
4723 11259574 10211904 10983590 11699225 12262923 12095913 11747605 10775726 10691844 11517864
4714 11517864 12747152 11617249 9266828 10604485 10589404 10063220 11652476 11982557 10653861
4705 10653861 11438739 12658994 12950836 11308634 9861393 11001656 12468477 12272819 12672162
4696 12672162 13299200 12262703 12957967 12120795 11633555 11425047 11227251 12544159 12843973
4687 12843973 13588573 13142528 13770551 13225549 13840867 15142349 14779580 14501071 14650244
4678 14650244 14675412 14790833 15728687 16388047 17263312 17519367 17175097 17746846 15958633
4669 15958633 16354056 17995547 18935506 19536484 19598269 21135257 21799942 21715053 22221497
4660 22221497 24558039 23127475 22932185 22832038 23023004 23668995 24428339 26775335 28039116
4651 28039116 27590574 27317196 27989155 28722045 30319092 32011823 32547526 31797146 32332250
4642 32332250 33087552 34534770 36046852 35716326 36542141 37141915 38329403 39654472 42050393
4633 42050393 42370415 42905770 43979575 44256102 44344604 46355875 46864896 49009805 51469658
4624 51469658 52033899 50423469 50140503 51316793 53126041 55196943 55240976 55904651 55678928
4615 55678928 57030044 59035888 61483348 61215527 59464209 58230902 59385553 61605526
4607 61605526 64362070 65530061 66313997 67192838 67210368 66821108 67494592 66935023 67293146
4598 67293146 67013440 66737288 68129530 67953337 67736896 68997341 68410645 67555832 67196459
4589 67196459 66071306 65472733 66197012 66418541 65923222 64321028 62879653 61857087 62039842
4580 62039842 61901497 61423015 60155328 57366485 55656603 53770065 52474431 52110087 52056726
4571 52056726 49117796 47181823 47010710 46798746 46570215 44728906 42714471 39994733 38337400
4562 38337400 36907664 36311728 35292565 34318115 33615008 32938354 31941115 31330721 30405035
4553 30405035 28749141 28329344 26364878 25707808 24635568 24447823 24067929 23278970 22068848
4544 22068848 20781858 20108278 18297874 17716851 17904778 18618885 17986460 17654838 17510362
4535 17510362 16933524 17163303 17422181 16191535 14084416 13462731 12564405 13688273 13365107
4526 13365107 14148093 14333098 12698684 12420702 11708776 11957122 11845495 12471762 11296839
4517 11296839 10961755 12328409 10899377 10280696 10464869 9544854 7942387 8881855 8434795
4508 8434795 9644867 9780484 8470179 8450041 8976848 9589911 8732518 7791740 6177046
4499 6177046 6929239 8479787 9252282 8509223 6481357 5456268 4901196 5335931 6099475
4490 6099475 6849619 6775200 7046488 7628754 6480741 6167018 5473224 6237219 7326973
4481 7326973 6967108 5661699 5650961 6415637 6198521 6290227 5421293 4680610 5323670 7090358
4471 7090358 8246767 7424438 5879948 4842300 3663861 3991945 5457317 6648941 5569042
4462 5569042 4627025 5253410 5353804 5440670 5463906 4370825 4004314 2828876 2961846 5978486
4452 5978486 6993636 6633564 4448278 3718710 3874863 4855571 4930132 4811557 3059814
4443 3059814 3906658 3593625 3763533 4172090 4012027 4332950 3821865 4669466 3349256
4434 3349256 2615134 3544452 4507586 3684040 2773926 2951202 2587845 2245316 3955078
4425 3955078 4948312 3371222 2548976 1938343 1855455 2805651 1995694 3255286 3154449
4416 3154449 2247684 3570070 2943246 1726836 2053980 1973242 2544225 1748108 1352269
4407 1352269 2770723 2049372 1757900 3136369 2454274 899417 406522 1036290 1188352
4398 1188352 1490513 3989532 2718737 1939664 1928545 1029999 -679781 -905909 2434616
4389 2434616 3134110 2273893 752880 963103 -53352 887557 2275500 2074826 988220
4380 988220 522192 537034 -219665 841604 1811854 1720243 1427090 1167596 35971 393681
4370 393681 882046 1868252 3371897 1514208 2078716 2561092 2474515 2112697 2492936 2830876
4360 2830876 767700 -509184 -724970 2099254 3139740 4158796 4606485 3910381 2140561
4351 2140561 1778315 1505329 618726 1097882 2356728 2817420 2951612 2933892 1793204
4342 1793204 2481571 1125417 -383002 557459 577264 1246958 1853899 2518618 930641
4333 930641 983264 758948 1351626 2469824 1564634 1365127 264219 482318 2074978
4324 2074978 2782266 1146249 1304039 879561 684812 1791741 1459108 1047585 -5568
4315 -5568 1646101 2223797 2665150 2171331 1847739 1058793 -635576 132369 467677 74868
4305 74868 11758 2922680 3222146 1912022 514816 -239113 717046 1151072 1104660 997663
4295 997663 141547 1873090 3245663 1996687 1255448 1194065 1093296 1449659 2576987
4286 2576987 3393096 919723 -376489 24584 1273332 478174 40249 1122227 848449
4277 848449 932806 1957916 1686925 371486 85986 1748210 2627429 2926047 3943283
4268 3943283 3893830 2595695 1997219 2986826 1546569 -15851 571080 1700382 2201321
4259 2201321 1784344 1996267 842293 -827751 94192 2131406 783773 13881 961712
4250 961712 987223 1204989 955288 427371 -285011 -303144 -613404 2568230 3502987 1896847
4240 1896847 1042799 802110 530969 803194 2218152 1909357 1725139 1597648 2675360
4231 2675360 2965762 583276 -829623 140420 1942033 1984764 3443024 1578930 1464400
4222 1464400 409178 198923 806329 612471 1477701 1845832 1072793 710116 2842655
4213 2842655 2710775 314751 -669511 -406445 131880 804720 2643006 2421751 884795
4204 884795 326601 1161692 1271971 500178 276736 -658220 172033 202824 2133025 876872
4194 876872 -660216 -33292 1267727 659840 325277 1652281 -59831 277187 1265344
4185 1265344 1070344 837587 2122880 1783634 623863 1233784 939628 1434998 142801
4176 142801 -148011 831713 1409268 1725270 2527185 2413549 1793421 1662549 1032057 854021
4166 854021 1284595 1769979 1949726 2388678 3038013 1601068 903941 361023 1457035
4157 1457035 1050309 1829730 2377237 2200125 1450970 891593 3067104 2730999 2928177
4148 2928177 2339849 957456 988191 1398416 1556578 790313 430562 579171 224604 483551
4138 483551 996748 929396 161023 -382431 -612534 349287 499875 1894546 1366372 224151
4128 224151 78168 -305070 -1219083 -1550198 -233479 -567898 1281671 418700 323436 -1023483
4118 -1023483 -876780 160058 -766859 -577497 465266 1269041 -563287 130814 -4974
4109 -4974 -192374 -473779 780422 392172 -26873 1310679 -166721 882004 534870
4100 534870 993054 715670 -922117 -389332 659185 1650700 1764454 1846244 170517
4091 170517 -60121 -1696 2275768 2119138 2229654 2414851 1557861 -388183 568943 2990584
4081 2990584 2287863 2734798 2875733 980924 1122073 2121124 1821150 -211814 -171100
4072 -171100 32071 2164512 3609778 4489210 4282082 2021516 1371039 1585428 2194467
4063 2194467 1246267 3090358 2416010 2065183 3065274 2827553 2483445 1620153 2350572
4054 2350572 2572198 4717180 4119037 3264294 2780746 2937327 5098777 5030847 6449124
4045 6449124 5789210 5127088 4761859 6419310 6715511 5645540 5042944 4266013 6922664
4036 6922664 8677855 9714007 7126772 5862400 4571148 4458411 6776139 6656467 7961940
4027 7961940 8199570 7970157 9056373 9693749 5798878 6205807 6577453 6815878 7672239
4018 7672239 8350515 7527067 6489055 6239103 7085143 7613097 5919008 4934044 5793520
4009 5793520 5742076 6736305 7279446 6052044 4695832 4748554 3619877 3357326 5048164
4000 5048164 5246285 3459821 2926821 3985560 4401170 5346115 4304004 4119337 3127940
3991 3127940 3245537 5140430 5810413 3514351 2725342 3515782 2753936 4885825 4750658
3982 4750658 3779026 2771516 1490095 2210735 3612491 3650134 3464987 4180857 4052181
3973 4052181 4569233 3383943 1488541 1763375 3520739 3782441 4309430 5547497 3962519
3964 3962519 3085580 3323688 3517024 3046071 3082465 2120879 2507692 3468483 3972600 6416925
3954 6416925 5355529 4098572 3110233 3068856 3481546 5326558 6046473 5339029 4327613
3945 4327613 4273432 4169383 5144210 7222200 7620785 5969261 4745509 4830471 5774811
3936 5774811 6327438 7387047 8118048 7698634 6745842 8061188 9672137 9372503 8998836
3927 8998836 8294370 6285213 7615101 9503091 8787717 10086892 10384999 8133947 7440948
3918 7440948 7950910 8029531 8257008 8675958 10223860 11359635 10654350 9235184 9301477
3909 9301477 10378269 9581308 10337358 8750433 8258889 10286231 10405281 10534417 11171028
3900 11171028 9826598 8891331 11432044 10910034 9942153 9131782 8653720 9005670 9365304
3891 9365304 9709766 9585786 10008938 8761757 9780247 9431072 7862140 6998713 6297136
3882 6297136 6214075 6957347 8507627 8817980 7312170 5750314 6210896 6307971 5969272
3873 5969272 5864956 5665205 4352783 4347004 4298656 3336188 3260038 5047210 5169522 3700320
3863 3700320 2974231 2085895 1181755 1418808 1487873 2819711 2315630 1896402 3144334
3854 3144334 3503536 3054330 2800271 1325913 -465446 -81181 2150289 3237192 2922970
3845 2922970 2292938 2021703 1617581 1177992 1052772 1402902 -287893 -327684 257397 1920373
3835 1920373 1883063 740689 -475990 -941592 -407384 540480 1969028 1185740 605850
3826 605850 523996 -583282 -1382509 100818 -15341 -1071119 -1633901 -1993923 -561430
3817 -561430 516820 611218 370312 -291303 -1876775 -2414614 -1276422 -243568 946916
3808 946916 -834435 -499376 424022 -655685 -1909598 -23931 -21684 -1941329 -1185312
3799 -1185312 -1220200 -1639945 -511449 1200360 619600 -434634 -1651410 -1234149 -407588
3790 -407588 -416257 540875 318933 -1555560 -1108229 640382 816054 76839 -53501 -672846
3780 -672846 103712 780599 1114698 1359058 124345 -506166 1054516 1490358 2467022
3771 2467022 2730469 718177 180725 -776710 -1506986 -1943267 -826326 383992 1941812
3762 1941812 950879 1126848 1217812 866053 826198 1066070 -369806 -1232201 -849181 -787007
3752 -787007 762424 1151489 867308 -434452 -2738656 -2300882 -1576752 -400733 1187310
3743 1187310 975193 -772477 -733683 -1386947 -2247401 -1814369 -1179689 -1729499 -2671843 -1795833
3733 -1795833 -415049 316362 163426 488741 -613333 -2409026 -1048717 -98166 -769342
3724 -769342 -514722 173642 -2730062 -2878993 -604490 -1998567 -2340750 -1952901 -829625
3715 -829625 -874910 -1133195 -1372639 -702777 -3095070 -2305689 138900 75410 464687 -267798
3705 -267798 -1472005 -3326466 -2460579 -1892128 -1008495 -485873 -565126 954821 687840
3696 687840 861910 1170779 -408149 -2134682 -974414 -436967 270827 1187022 50523
3687 50523 -135932 18237 701370 -151562 -1009424 -2450146 -1315588 -616930 -872076 1334447
3677 1334447 1547167 223361 -481007 153594 -1446719 -466102 -602363 -731442 334267
3668 334267 1562504 1320867 1524989 2279012 803748 -118713 -1461276 -966851 -715785
3659 -715785 14152 1437304 1361105 1448961 265949 621957 404967 22755 -700840 -1687881
3649 -1687881 -3061099 -1977075 387825 1017286 1848472 -343778 -1203220 -1329602 -1922282
3640 -1922282 -1562135 -943817 -1465420 -898143 -582578 -636410 861465 209234 61640 108333
3630 108333 -321853 -495415 -1533431 -834486 -773916 540519 173527 -832869 -831725 -741662
3620 -741662 -886230 576675 1442504 -1473416 -948688 -1108739 -178349 -8185 -380414
3611 -380414 229330 581349 -816152 -1260350 -167577 -1815339 -378303 -1272858 -1286677
3602 -1286677 585400 1343316 -349285 -1744156 -1586510 -1583757 224686 307888 680602
3593 680602 514418 -1167076 -1311654 92985 -945427 -1404436 -897164 -1531609 -767844
3584 -767844 1023906 2230696 1133907 -450150 -3823733 -3454382 -2150163 -2747477 -1104862
3575 -1104862 -654433 -114772 -29390 634141 -660592 -817151 -1082449 -1189958 -839375 -1257192
3565 -1257192 378157 262341 -411706 -764059 -1024033 -3252356 -2490330 -1686662 -2370307
3556 -2370307 -549384 86010 -449433 -1681202 -1606950 -1851029 -1794665 -1310335 -1561085 -1327034
3546 -1327034 -932729 -327264 -488997 -1393720 -3699341 -3617939 -1758253 -1660426 -1678766 -2949610
3536 -2949610 -2769678 -2870790 -2162909 -2494410 -2589487 -1377490 -1052098 -1291910 -2127528 -2078906
3526 -2078906 -1469248 -1387303 -1331865 -1175886 -2927988 -3573435 -2158275 -287550 241769
3517 241769 517450 -1382036 -1522945 -1559888 -1462643 -694234 -1224814 -2452172 -1938613 -1826200
3507 -1826200 -674305 230338 -612341 -620196 330819 -2056564 -2151117 1208410 1612430 1432179
3497 1432179 2075262 646487 201209 1361543 1530013 1695451 1149536 -6030 713220
3488 713220 1312620 582290 377808 -749889 -1050604 622049 661221 -762198 351521
3479 351521 1297370 457332 888049 1819607 1316375 979831 -1362259 -993549 580567
3470 580567 1435775 949940 412236 -7999 -409675 -574457 571333 996685 555780 391397
3460 391397 479019 153940 -196354 -517764 -311533 -248413 253524 -600939 558066 513253
3450 513253 143768 -169495 1071447 1620612 -407972 103583 -277197 659810 783300
3441 783300 -198420 -461228 804351 1409058 951086 701341 209491 511354 -907235
3432 -907235 -497605 102511 44998 -65363 275135 1360153 575050 1232589 651400 613636
3422 613636 -1173391 -791636 145517 1576214 1926224 299060 215328 -1323028 -238037
3413 -238037 1000601 1457213 244199 611381 -184806 -816733 866030 1422550 1887103
3404 1887103 1800705 2377474 447738 853311 1002056 1310541 233424 -1125781 -193899
3395 -193899 -286651 -1360659 158145 2386356 1589274 1829032 891054 -1205316 -1872913
3386 -1872913 104686 939166 833275 1771759 -16506 -186595 706007 2223714 1705439
3377 1705439 1526762 1418724 1020694 -596467 -661268 3320907 2119942 74075 -186035
3368 -186035 -428228 -1530160 1127054 2530275 1955794 1109442 104174 246748 -182890
3359 -182890 -122567 -35307 -76884 -1079401 386309 1539435 447517 1221331 1416931 -721021
3349 -721021 -1481474 1325485 -160254 -1087097 -11308 442494 1570939 796376 337438
3340 337438 55941 -1246219 -2449975 641062 -126805 -952954 31048 311204 -424468
3331 -424468 736962 804289 -1354558 -587004 -1328954 -576703 -118887 -169611 -390450 872191
3321 872191 177082 730900 1244082 -745676 761580 190252 -1343374 -3074387 -1049524
3312 -1049524 -1035276 -921803 1170966 654406 638132 -510181 -1562564 -1370381 -1070489
3303 -1070489 -2190192 137634 1044435 2523807 3491905 2161177 655306 129014 -314704
3294 -314704 -1536499 1043899 1408118 1901980 1625590 2679975 2571800 91987 -732470
3285 -732470 -1531116 -1092424 -1186675 1592514 1771486 922179 455292 1252832 -675801 -1882444
3275 -1882444 -1124173 -1864026 628757 1821034 1726115 537686 -324475 1056401 135368
3266 135368 -937276 -816036 -448260 -1721586 340049 1826137 251029 -1681219 -2966668
3257 -2966668 -1558221 -953710 429761 271629 -1037442 -2050008 -1786405 -1191061 -211238
3248 -211238 -425716 -88532 -1024703 -1502282 85116 -302371 -1486781 -946428 -1235994
3239 -1235994 -2576329 -1378269 -124046 -372195 1003576 1022402 542667 -1755759 -3168084
3230 -3168084 -2260358 -341676 670956 -263958 -583932 -1239081 -1598083 -710296 -16685
3221 -16685 -755777 -999418 -2102506 -2133757 -40408 1432463 118791 -233904 -215264 -2410482
3211 -2410482 -1706998 -326813 1004674 783722 -762829 -756559 -640786 -1082294 -1623036
3202 -1623036 -890142 -1062041 -269961 327344 -206201 81118 -713042 -1573196 -1417246 -126129
3192 -126129 338608 292578 -1312386 -1852766 -131537 618088 2005510 634361 -2670413
3183 -2670413 -3560388 155789 1956589 878540 578636 -596725 -2400974 -2393569 -187302
3174 -187302 475096 112983 -715678 105655 524966 -552918 877802 327081 -1362736
3165 -1362736 -1326959 -436359 -1867945 -195293 1126187 624526 866057 -274948 -1758524
3156 -1758524 -1710570 520854 96696 1044460 1373009 935397 889784 365614 152060 1142034
3146 1142034 423598 -1482165 -1743514 -2231015 -1048740 301491 502542 1114960 1782700
3137 1782700 -37062 -1125596 1276607 -397651 -1358667 113162 552292 2771169 2651417
3128 2651417 288630 39490 652541 -485039 574735 727175 311258 -299677 -191240
3119 -191240 -500867 1558395 2593774 137293 -2070320 -2784879 265259 1163600 1495455
3110 1495455 229066 -531659 22418 -315979 345411 -1306600 -1438923 -90946 -815086
3101 -815086 -556171 821199 -813091 -1568770 -852922 213257 1670374 1167702 -1116567
3092 -1116567 -1229618 492913 793072 867642 127560 -286112 -37751 789272 632458 963308
3082 963308 262104 -1192113 -1826718 -434794 646013 948888 293402 1341546 1137020
3073 1137020 -125077 -450819 -413812 -1431235 -1434855 -429686 -838847 -1282593 656237
3064 656237 24863 -1495010 -2834119 -1774764 -32949 -76555 -772006 -763721 150470 3667
3054 3667 1161581 1337980 -292596 -1839894 -2339307 -2666292 -410437 1294047 1238015
3045 1238015 361553 39711 -582177 -1070117 -1534310 -262573 689692 -627306 -1980674
3036 -1980674 -1040765 -38443 39241 1920436 1574844 -3084430 -3277149 -2479487 -1756562
3027 -1756562 -1124363 -1139338 -1456576 -1366468 -586814 875285 890258 -1380094 -1528386 -655465
3017 -655465 -528400 -4625 410658 -148469 32564 28282 472523 208193 -1137034 -2296257
3007 -2296257 -2492798 -3698346 -2662015 918289 1215467 663801 312945 -1392347 -1400967
2998 -1400967 -1023864 -745748 -521415 -1512826 -2532300 -2029487 -164915 1187990 518207
2989 518207 -2234929 -3912025 -2517315 -1349650 -1542290 -1074990 -1914580 -3248914 -2831656
2980 -2831656 -2170105 -1181407 -628657 -1124776 -1639943 -2443278 -2504417 -1646551 -859895 -1643317
2970 -1643317 -1688571 -2042202 -2504715 -2930165 -2405767 -2396139 -1449491 -928932 -1868848 -1764964
2960 -1764964 -2448185 -1463300 -553988 -727028 -1703137 -2196845 -2052984 -2120058 -1513033 -2162484
2950 -2162484 -1883790 -1327321 -1469108 -591950 -221239 -1603597 -1997302 -1184938 -187511
2941 -187511 -522244 -2498288 -2380886 -1801385 -1053370 -638698 -1382027 -1356087 -607333 -2021920
2931 -2021920 -1599177 -155341 87486 -788078 -1027525 -2157843 -1630746 -1304811 -1759769
2922 -1759769 -1475365 -1147031 -2557520 -2073279 -404910 -1326059 -1837289 -1437259 -1218367
2913 -1218367 -2283014 -1400787 -771760 -395955 -1205268 -563248 -997146 -909246 -408509 -1731792
2903 -1731792 -2678027 -3288548 -1243209 -974627 -1595217 -2404311 -1687857 -1891193 -1055984
2894 -1055984 -242090 -767633 -3134675 -2557521 -484456 -2410769 -2826649 -3030345 -2878818
2885 -2878818 -3106529 -1872845 -838168 -1396343 -2164586 -2024049 -1997307 -1917979 -1520220 -2322624
2875 -2322624 -2645343 -1496882 -206663 -609159 -799816 -615558 -2025100 -1689809 -1904789
2866 -1904789 -1012766 -1381303 -1962166 -1427048 -1127834 -1099298 -1271145 153244 78018 326105
2856 326105 239611 -1532450 -2277606 -893786 235899 787343 1160802 -242775 -1393299
2847 -1393299 -717314 68345 -642032 -874126 -1041270 -1236272 -1356069 376989 1900338
2838 1900338 625481 -1076329 -1870006 -982097 -2609732 -2163184 -1042857 -488851 -658076
2829 -658076 -2070341 -2432034 -1619214 -58669 -1342014 -2196230 -2551163 -923019 1544745
2820 1544745 1068961 294661 -790460 -3227140 -4101837 -1704037 461461 515893 -1551787
2811 -1551787 -1328980 -275457 -464666 1061683 931443 -1291835 -2728885 -1374416 -1276950
2802 -1276950 -631145 -854919 -749862 -810943 -1675902 -1648576 -1867230 -1761926 -248932 291535
2792 291535 -365313 -275082 -1145016 -2363615 -1310410 -212568 -900114 -2402235 -1917277
2783 -1917277 280302 1052809 200458 -483138 82151 -1438119 -1393233 -713937 708240
2774 708240 284579 -1248956 -1958756 -551122 -292777 -1213477 -1260160 -521329 66545 -150444
2764 -150444 -47296 -129241 326953 -855069 -870755 40937 216157 -1364551 977739 1826924
2754 1826924 -1000130 -470119 -279750 469313 621500 -242418 -949989 634929 337584
2745 337584 1375773 1106750 -1349112 -1252088 757842 1181507 1243502 510910 -1552861
2736 -1552861 -1468116 348722 660052 515294 339087 -985076 -140260 -485713 -1578144
2727 -1578144 -1598946 -1991436 -1941195 107107 554758 -114427 1100027 917268 95776 1094258
2717 1094258 -208145 -572117 -1046221 -858592 820841 2723985 622806 -177321 1122009
2708 1122009 160251 -346285 -1369540 -1762407 -911699 -694658 -609834 -342676 173310 189008
2698 189008 1172183 1699452 204834 152510 -332489 -354192 673838 1509188 484556 137449
2688 137449 -579427 -886592 297775 664471 791530 735774 -658271 -1053479 -923427 -950907
2678 -950907 -211688 481625 183468 176302 -222034 458181 1113803 322702 -844713 -248863
2668 -248863 -144854 -1121984 723549 1382129 830906 404816 -119637 -1146118 -1380920
2659 -1380920 -2331118 -1618047 -1698171 -201518 1158459 1317887 -347309 -1641159 -374041
2650 -374041 537438 695357 1687621 -326107 -2335887 -1157057 511854 1413734 662489
2641 662489 -462978 -1079556 -1230227 538186 1791792 -422262 -2751199 -2581945 -1062613
2632 -1062613 -502805 1019916 1029274 1597176 -375145 -505998 494983 210817 -347284
2623 -347284 -535829 -1193785 -1647231 -1263378 514619 300262 270869 -151675 -892864 -1642854
2613 -1642854 -1521098 -1137590 -1345834 -1094001 -1969623 -1234915 -447862 339371 -161533 -2300458
2603 -2300458 -2609856 -2343791 -2922929 -1595257 -2170360 -1743774 -791906 -535749 -1357529
2594 -1357529 -517011 32203 -170083 92054 -658047 -1290770 -636435 10389 566949 1694362
2584 1694362 519835 -659993 -302577 -819310 -1895552 -107782 721638 142374 -356588
2575 -356588 -785459 1779494 2331589 2369762 2370915 710729 -468175 495605 545518 215803
2565 215803 1974706 886762 1748693 2758480 3339522 1892311 2318480 2065984 1178872
2556 1178872 355696 40396 1114554 2516617 2697623 1805395 2628702 2006252 337328
2547 337328 252838 815860 942776 2035959 2432935 2136325 1434205 1240300 1743892 3078551
2537 3078551 2525477 2057299 1477039 1147143 598946 1725486 1559854 2346465 2507443
2528 2507443 1869447 2423770 2594682 2143669 1331104 1898431 1941492 2367416 2376187 2783544
2518 2783544 2582961 1771726 1666330 1999363 2369458 1167039 2871842 1323878 1082808
2509 1082808 3024914 3655157 3308780 3404803 2923625 2008971 2978446 3288473 5005697
2500 5005697 4245098 3306335 2791192 2780593 2100891 3140147 3772200 3851288 5395025 4055466
2490 4055466 3881694 3840270 3709993 4038835 3568236 2612816 2482164 3850224 3203852 3112726
2480 3112726 3538800 3859683 3814286 3660259 3414927 3328381 2494774 3143698 4386180 4425219
2470 4425219 5116591 3868170 3131498 3353914 5199811 6154162 4521584 3122760 2520127
2461 2520127 3210973 4373393 5489112 5378456 4656500 2759421 2528458 3770030 5758271
2452 5758271 6349361 6013491 4375731 3741844 4902053 5148813 5310372 5995760 6290845
2443 6290845 6389732 4757528 6016984 8387709 8898003 7649402 6560035 5467655 5530120
2434 5530120 6212069 6921006 9142728 10068612 8703841 6891643 6784120 7564526 8413752
2425 8413752 9160920 9173422 9386730 9072583 8270272 9704848 9718281 8784131 8009394 9458612
2415 9458612 10697994 10460299 10070123 10096968 10689833 10607734 10902361 11149602 11278334 11791603
2405 11791603 11169240 10197832 10265430 12046848 13861911 13510117 13072234 14453522 14417661
2396 14417661 14984734 14721575 14017267 13497905 14140162 16422580 17969250 18659542 18495117
2387 18495117 18400012 16526642 16913166 18088092 18485074 20190322 20925855 23640339 23816080
2378 23816080 23481353 22295284 23249742 23533273 25239812 26921812 27914728 29133050 28910653
2369 28910653 29400668 29811484 30705925 32980062 34278938 33752091 35116178 37324699 38500349
2360 38500349 38363169 38543190 40075260 41071950 44278450 46297592 48075096 49322842 50137262
2351 50137262 51383545 53207750 54946558 56865515 60351927 61000953 64573620 65729371
2343 65729371 65902677 68079813 71940604 74632726 77472182 80022428 82051316 85076533
2335 85076533 87759220 91335470 95566378 97564735 98697877 102028341 107425273 112307423
2327 112307423 117738005 121291993 125005012 128409844 132615400 138295573 145390561 150358615
2319 150358615 155580412 162319899 168184833 174183609 180199283 186688525 194230708 201223644
2311 201223644 207057080 214910848 224051316 231136466 238129330 244243929 250273127 256478181
2303 256478181 262645819 268034902 275637863 282480080 286797949 291266814 293281661 295341520
2295 295341520 298723998 302038310 304490699 305850496 306822123 307172308 305565078 303817034
2287 303817034 299468938 295648696 290310886 283300270 275782458 268070036 259539097 251453993
2279 251453993 241798475 231464769 219802152 208804714 198750771 188387537 180634301
2272 180634301 172438338 164044369 155724441 146599637 139190314 132198295 125923455 121816056
2264 121816056 118059545 113106502 108584922 103859126 99708596 97464728 94803146 90653713
2256 90653713 85874732 83109276 80569120 79352140 77788604 74671799 73046853 71094001
2248 71094001 67883247 66242419 64600070 61624610 60289463 57968183 56946121 55417234
2240 55417234 54023486 52679717 50837383 49690756 48849926 46995503 45853637 45474679
2232 45474679 42481396 41429634 41722633 41746049 40764117 40030279 38327166 35954633 33837292
2223 33837292 35098322 37107102 35326249 34910509 33820732 32029607 31686869 32664256 31254432
2214 31254432 29827423 28929105 28842538 29015418 28086297 27685718 26934474 26368458 26554703
2205 26554703 26234496 23523203 23143706 25030844 25313178 25212846 24536286 22276924 20524530
2196 20524530 20054987 21762400 22383151 22341746 20542905 20431616 19186269 18301156 19438453
2187 19438453 19749959 18597736 18535560 18268960 17973326 18769509 18246427 17068795 18080835
2178 18080835 16807906 14708559 15190876 15077027 14993976 14769087 15162960 14914299 13959158
2169 13959158 12058059 13168396 15770524 15411922 14522942 14290159 13272106 13049694 12798229
2160 12798229 12535662 12389617 12247311 11865821 10989988 9807939 12052282 13103779 11455470
2151 11455470 10396503 11005526 10638391 10333492 11435793 11099412 9591713 8883412 9494436
2142 9494436 10575570 9149574 8976237 8177568 7379522 8441235 8994381 9386663 7630564
2133 7630564 6970220 8913485 9275853 9602379 8973119 7121263 7005777 7494253 8357476
2124 8357476 8313428 7803637 7699110 6954896 8033231 8574171 8041389 6358595 4646941
2115 4646941 6211273 6228025 6530534 6785243 8105736 7455646 7491679 5809222 4661661
2106 4661661 5499703 5140703 6139343 5604120 6247034 4914191 5166585 6195865 6561948
2097 6561948 6239503 3999299 4171393 4410464 6396711 6983513 6524718 4104629 4256752
2088 4256752 3920828 3526336 2733584 3003749 4336522 3955951 3398316 3138411 4139001
2079 4139001 2495663 3145644 4473022 4460042 4823986 4262387 3912096 3419581 3293728
2070 3293728 2050791 1830746 1692288 3329311 4128797 3362400 4681105 4509250 3940795
2061 3940795 2663382 3270732 2874532 3348456 3755442 3692063 3898972 3068160 1968313
2052 1968313 2179003 3037254 3792009 4512253 3571424 2173190 1756780 2008054 2250983
2043 2250983 2918827 3200013 2626587 2587319 2297337 3490343 4448518 4540712 3213556 2797720
2033 2797720 3217800 4185713 4374234 3688995 3701962 2846383 1343913 810448 3463022
2024 3463022 5877534 4836947 3886137 3363595 3677888 3994876 3585920 3996899 4209348
2015 4209348 2901965 2813805 4741679 3795263 3088658 3126001 1041910 1958677 4139075
2006 4139075 3167291 3435511 4389845 3045552 2548386 2827060 1717288 1707433 1606004 2779993
1996 2779993 3506520 2116468 1102434 2955187 3979321 2819850 2799688 2349503 1875708
1987 1875708 1856111 3788328 4657041 1860333 235358 1235265 878775 235951 1323384
1978 1323384 2205548 1264581 356986 1390193 1099222 1903480 1493152 889322 1562817
1969 1562817 1452574 2583078 1510921 1718902 2647357 2296411 158263 80665 2435210
1960 2435210 2069001 1932969 1676098 219028 -2236333 -761939 1059568 965800 1745564
1951 1745564 1916138 736634 -719453 -1066159 513878 1021854 682793 993688 1108097
1942 1108097 1057717 1889987 2481409 1158305 111186 684956 1052573 731246 1685740
1933 1685740 1763724 1374803 -50291 96353 461775 1002027 -39267 -15012 -381629 -1236923
1923 -1236923 234013 1116422 268772 -678534 483809 781313 1383338 1408373 511803
1914 511803 -612498 -1549966 -687110 494804 568847 -154695 -267748 -791264 -529592 1311427
1904 1311427 379605 -1177078 -1874049 -1284181 -1560898 -917808 -39271 -491490 269822
1895 269822 -302078 -125936 -2080757 -3026011 -1166168 -48763 -615151 -1976554 -1019500
1886 -1019500 -1520533 -468509 -105171 610410 7521 425152 1111671 1705753 1821386
1877 1821386 1480398 1031511 -629641 -279136 847830 555641 -2205959 -1337320 800149
1868 800149 1190943 328749 -408337 -256332 -2027899 -317846 -1033138 -814428 -441071
1859 -441071 381177 918038 -452433 -769984 -1540819 288867 124547 1127388 -177038
1850 -177038 -1191689 -1684000 -1006167 753289 114508 -998243 -2268311 -1475310 497051
1841 497051 2006289 1246667 -823828 -1725581 -2551832 -1558893 -926538 -781123 -1484735
1832 -1484735 -80918 308877 -882191 -2075304 -1460955 -94627 -862532 -586891 -732384
1823 -732384 -689883 -944216 1450298 979249 -1042826 141056 -296301 358659 1007318
1814 1007318 819818 -1441375 -2139403 -2684974 -1486585 -1911673 -825674 954916 361044
1805 361044 -75319 1814124 1265029 -1021167 231710 39255 -196685 -601373 941429
1796 941429 991182 -62826 -137548 1683787 1175881 219966 436175 -551223 -1154754 -545268
1786 -545268 505193 1411819 2410943 1758750 629392 68552 -292975 1651095 1528120
1777 1528120 415213 145935 -1260154 -2070682 521433 1300583 761583 449878 -1169899
1768 -1169899 -633594 -442657 -723542 -921592 -678036 -1096766 -1092904 -213249 -368823 -46464
1758 -46464 -574266 154830 -158669 -1231983 -2483464 -1213807 43489 1748765 2463661
1749 2463661 -1646813 -1705510 -1304701 -1531796 -75056 2086796 -1237207 -2174779 -1388599
1740 -1388599 -678444 262875 -239386 -89289 -915620 -416171 -1152382 684354 1030566
1731 1030566 -140632 1101762 -429878 -418753 -477704 -439937 291081 -40187 -1686403
1722 -1686403 -1040227 -583091 -1827867 -1624598 -2557525 -901941 152575 1091724 -1042396
1713 -1042396 -858284 25930 -1096025 -187302 1037068 1636564 -668824 -1351286 -423787
1704 -423787 1228279 673670 -251526 -421259 -860858 -221597 697234 534550 -775012
1695 -775012 -558713 -1855701 -429465 1549808 1910839 472085 107597 1590178 1430331
1686 1430331 1027013 -626219 -695640 -991167 420881 2100610 1192583 -655416 -1323462
1677 -1323462 266313 -1124692 -153123 956793 1417845 1472812 1087888 387837 348665
1668 348665 1186642 95912 245189 779282 383098 527224 536148 1395273 2511668 1436531
1658 1436531 -1083929 73446 469847 -78573 741289 1129569 660474 -578624 -1536416
1649 -1536416 -1177437 -797420 -674638 541081 -520373 -430007 -148599 -355108 518944
1640 518944 109432 -929196 -2027872 -1543674 -995242 1170219 2798932 1254039 490833
1631 490833 -1888983 -1240040 141530 853446 -108601 1280526 1007592 388026 828148
1622 828148 -85790 129501 26484 -142441 -1558313 -1583055 -24400 135797 543381 1463979
1612 1463979 2101985 -47129 -1519494 -1017896 -663030 -2015113 273646 1255822 1439472
1603 1439472 168499 -1118757 3457 -1525818 -1820144 -706912 116018 -940230 -893977
1594 -893977 -764347 -1336335 -613558 -69095 -435980 -3380663 -3288318 -1195284 -310367 10551
1584 10551 -287746 -461073 -2422878 -1411469 119681 -224967 -1043679 -507 -167448
1575 -167448 -2936527 -2353024 -1778373 -2468664 -2672171 -964076 -1474240 -559862 -1158008
1566 -1158008 -1365088 -1575112 -3407128 -2565708 -715074 528873 -969930 -1019211 -2136242
1557 -2136242 -3159144 -3161641 -1764295 -116414 1326049 25404 -1393515 -938148 -597360
1548 -597360 -391347 208413 -1094654 -2539789 -3040470 -1491146 165642 399676 -1304861
1539 -1304861 -1605830 -4108397 -3668787 -1160651 -141919 136328 660896 -956533 -2054891
1530 -2054891 -1979440 -1892717 -759502 -316127 -408090 -299742 -1045342 -1906930 -1139858 -540816
1520 -540816 -1175418 -681486 801968 470358 310792 1365350 1351669 46846 -1350338
1511 -1350338 -1236292 -205967 -65533 606469 1236027 1158742 19787 -848556 -985454
1502 -985454 -731662 211523 597606 837575 556769 293956 1210679 389582 601118 -1104788
1492 -1104788 -1650482 -685798 851234 983682 594554 1625 -474587 1596895 1848359
1483 1848359 247176 -2006777 -2845364 -2306232 -1812945 -677311 331894 -134931 -718817
1474 -718817 344201 724324 -1320581 -1643950 -1532349 -1389624 -791977 -396137 607904
1465 607904 1488940 1588025 825458 -359507 -2471453 -2865885 -1753647 -442895 791494
1456 791494 1770770 1112579 221560 92583 64005 -681511 -995415 -135883 -395968 -813803
1446 -813803 -359900 228456 179695 -1002674 -1692779 -615915 -246444 138732 199001 -1070560
1436 -1070560 -1038911 -1804917 -166359 -265408 781742 712657 426778 -809553 -342867 723879
1426 723879 -175396 785306 867305 2348046 1228118 -262632 -772489 -1313119 -540816
1417 -540816 189150 1385051 930914 1188038 1308275 1720974 2155224 1749763 -248757
1408 -248757 -759311 -825929 -711264 1403053 2196765 2549466 -567783 -1753695 -1537510
1399 -1537510 -62182 89031 773495 64391 -301948 -438585 -1386928 -101891 -333446
1390 -333446 526800 -324019 -714107 -750532 -173114 897214 -670560 824019 -291873
1381 -291873 -2045790 -1626421 696245 1444614 469835 -444032 -633496 -859262 -2041273
1372 -2041273 -614543 463432 206938 -607176 -852653 -2150166 -1549833 148987 -277645
1363 -277645 -190687 -1044621 -955303 -1306873 -591185 21543 181871 -915384 -1740284 -2179022
1353 -2179022 -2285769 -2054532 -2038823 -622382 -2042090 -2720868 -2147387 -1601747 -1990634
1344 -1990634 -711581 -583384 -1292621 -2407008 -3294203 -2240647 -2578926 -2565536 -820512
1335 -820512 -490062 -1696162 -1370361 -2121980 -2438494 -1850328 -1753503 -649637 -505973 -274751
1325 -274751 -32937 1139419 607546 -1783871 -2139000 -2419480 -2108240 349888 632692
1316 632692 680149 -12119 -1093416 -525783 338277 260238 -647943 -518442 -2149468 -1742012
1306 -1742012 -413980 -237278 2037 -626526 -1613631 -1372791 -148936 1073779 1436725
1297 1436725 547668 -713968 -998005 -1576772 -287876 725850 632780 -303685 -253164
1288 -253164 -1648840 -2148110 -234497 474584 302926 -455457 -527687 -3360346 -1250315
1279 -1250315 160554 1185316 1062212 -161784 -2447806 -3728680 -1343513 472012
1271 472012 3128438 603167 -382340 -2072831 -2529213 -689090 1226664 -493262 -1666721
1262 -1666721 -58214 -983674 436856 849437 534763 67320 -505247 -1961018 -825096
1253 -825096 -696803 -945343 650683 -1089678 -1704762 -2632172 -2629217 -2599934 1071615 1800454
1243 1800454 96318 -341883 -836226 -436317 -2377044 -2538967 -1020001 1238304 -629287
1234 -629287 -184386 598603 -993150 -329635 -315283 -43151 -668687 -255596 -1383250 -2113889
1224 -2113889 -1071215 -404754 335041 436002 561067 -150972 -1218842 -2980865 -724966
1215 -724966 -206998 -1060452 -901246 -2268620 -2060591 84775 1389737 1215239 676295
1206 676295 -1526162 -3360499 -1469219 224422 -570909 591809 -497680 -1249812 -57662
1197 -57662 -1702182 -1252502 -2168379 -2728249 -1134710 -489548 -652223 358269 -450691
1188 -450691 -2711690 -2518040 -89064 -925658 -1204651 96548 -1100295 -511483 227017
1179 227017 -203677 -490915 -809781 -589062 437223 116126 -377675 637177 37221
1170 37221 -17850 -785365 -2074342 -2021940 -711937 922825 765686 975753 383089 20198
1160 20198 -306367 -910850 -57394 -105838 -1028066 269415 -387261 -762293 120797 508279
1150 508279 1111405 71675 -1798421 -2981650 -2061772 -2083334 -434807 1607583 479070
1141 479070 1011075 618551 1463543 1509446 350906 -1148900 -1309294 -890919 -956586 490166
1131 490166 2097404 3120492 2896197 780685 -1581052 -1762083 -2607168 -1700354 572359
1122 572359 2435484 2065494 238314 -1418098 -1351061 1203533 995939 -1004116 -1208536
1113 -1208536 -1455740 -875970 560946 1094865 1306955 -57879 -1296184 -536225 408913
1104 408913 406919 616702 86558 -1629197 -1511217 -983649 544783 2506978 2295578 438344
1094 438344 -282117 -1177643 -553618 902287 1639212 1099061 811778 1328164 571035 217803
1084 217803 -955977 -174089 -17414 -1146346 -657548 1122559 124427 -898 2189112
1075 2189112 2533311 1755623 263041 -838075 18673 1364846 2310918 1112358 1345435
1066 1345435 132616 1521252 2223110 2069841 383736 295764 -38673 783404 1996371
1057 1996371 2380836 1949770 251556 436242 1336598 2786836 860005 187311 -112230
1048 -112230 -280195 1706919 2097136 1149926 912332 1925774 1736620 749257 856620
1039 856620 389568 1305911 -755648 407293 1376996 993393 596136 1479149 388183
1030 388183 -349458 684035 885098 2506854 2316942 721774 344945 -258048 -2058206
1021 -2058206 -1285280 -296155 -628712 260360 758603 704549 45484 174742 -868006 -186121
1011 -186121 -474555 -162687 631812 190499 2165826 2548216 1003453 83826 -222056
1002 -222056 -2366490 -1528683 -1907 -630739 -634819 -907259 57226 674318 -493499 -2339792
992 -2339792 -184613 875181 661112 1719272 -180424 -2871705 -3940911 -1443666 559156
983 559156 111908 -1285362 -2807849 -1504379 -418771 789455 591426 -1359943 -2307648
974 -2307648 -3187665 -1696747 560229 1196735 1468797 705548 -1293733 -1059580 312109
965 312109 1290298 582023 428140 -798549 -2741314 -1185475 -781428 200956 -316202
956 -316202 -530152 -1492287 -766584 797479 1076367 2001945 -282489 -1073725 -569532 88354
946 88354 603648 194232 -555570 -192197 228460 787245 -139324 -1541072 -437312 -141327
936 -141327 468890 534218 626794 861744 -784857 -1304491 -243840 -230961 -249679 1679522
926 1679522 1084586 -351895 33267 460628 892029 1209974 1615347 801651 -609699
917 -609699 -1002546 308447 1552652 1145009 965606 -579949 -706994 -1108744 1016463
908 1016463 2599178 2443831 188352 -928243 -799945 -981914 944031 1870207 1924523
899 1924523 718638 533505 199790 136498 269938 773835 1055297 146233 -7674 122265
889 122265 2243242 1208636 281708 -1408181 -976349 2145275 2600318 1674379 1021959
880 1021959 -385028 -2223408 -1743556 -181764 875417 -72407 -1096165 895368 892428
871 892428 -120198 -543715 -312129 292264 687294 585491 928828 676591 1328789 2595642
861 2595642 1188162 635496 -1547637 -1446533 -219881 467376 921169 335409 -1182605
852 -1182605 -948025 196756 1576341 89735 -1568339 -1261169 221259 621842 1141112
843 1141112 1451908 1476943 269597 -786246 917373 2193254 3063937 2553650 680252
834 680252 -1019733 -987264 222313 2112186 1718359 1103293 1941986 259933 -367516
825 -367516 1604467 1739164 -100354 26075 1024053 807626 678220 944673 963282 92245
815 92245 -618975 -494655 -1402676 -3329981 -2282320 169049 -506461 -696545 -204666 164011
805 164011 -1255094 586177 743932 -924495 65709 -228062 -290513 343388 29460 42344
795 42344 -189287 158510 1205175 -418326 -1070370 -302809 702577 869886 1555080 245339
785 245339 -889070 517783 2824846 2650972 1875196 980726 -940065 -1069767 -474773
776 -474773 561792 1161057 323950 -84273 355502 -151337 -183779 1561739 1450373 -330184
766 -330184 -1330759 -2180028 -2310535 49177 1823484 860251 658412 198396 -464663
757 -464663 162032 1362836 2044641 562471 -998360 -5274 571788 1470822 1830921
748 1830921 615015 -917692 -1671108 -223066 203984 -281402 984943 1549575 2048524
739 2048524 2787341 3202458 2485496 410085 -534479 -443206 -207511 802925 1900457
730 1900457 890847 -294352 1217354 2369128 873968 1024162 370328 -484594 524191
721 524191 2705485 2962190 892964 -182461 611441 1007732 1287315 1237999 -136079
712 -136079 -496558 644357 1761094 1709502 1701234 75660 -168071 -101147 1301596 2354054
702 2354054 780916 -596560 715369 1375530 466037 754117 1313684 997380 1856206
693 1856206 1977063 1210520 1628343 896157 869458 1195901 1681971 1635545 2000724 -1087624
683 -1087624 -715007 2527129 2529599 -175470 -1315181 -1988193 -2228652 93399 877022
674 877022 2561874 1375249 123795 593846 970904 1105960 1018453 907121 -206649
665 -206649 232803 926320 1562131 1634254 1820464 1449938 165039 -129795 -92633 1021283
655 1021283 39567 -165509 192139 -514424 -2262881 -1964350 799165 856846 1050599 588680
645 588680 531383 -384595 -1576917 -1874389 -1152057 -1406233 -378389 255016 -79424 466452
635 466452 602316 -87995 -1051117 -1285857 -1562735 -971716 1096934 1654030 1281409 237292
625 237292 -466787 -559827 -609915 -581247 -284691 316637 541883 1113184 -421396 -882476
615 -882476 -92109 57219 427966 814057 1535397 1459652 1027069 -708957 -364513 -356204
605 -356204 591925 1157667 -137525 104038 1185375 1489700 572415 1525031 2723211
596 2723211 938059 -649533 -620539 731138 2483439 3352078 2468310 1646513 -214987
587 -214987 -1250173 -41540 520485 2429960 2787928 1760105 515316 2184622 1939057
578 1939057 1514268 -357545 -617346 -2169391 -1166808 1677896 3572816 4431261 2673609
569 2673609 772112 429045 -861470 -796677 716812 131175 -645004 551459 -131738
560 -131738 -14318 -1050626 -2011846 -2161030 -2210210 -752479 261363 300601 480632 1322490
550 1322490 3086 -1102365 -1975490 -1903611 -1237249 -222524 -1135289 -206964 623238
541 623238 -618154 -797467 -1961621 -1579076 -1754551 -1389565 -190863 783797 1348571
532 1348571 981797 482150 -1400688 -1471231 -1326480 -1162477 -1720193 332490 1546555
523 1546555 -476289 -284480 604447 -403061 -794001 -22994 -222080 -87274 100637
514 100637 1185091 648956 -923239 -538163 500311 1153660 520247 -90594 -1616440
505 -1616440 -2176630 -1307756 1746953 1229850 1205692 1006280 75265 -865491 -14973 853053
495 853053 -132105 -134429 87332 802752 378607 1355905 2532314 -7286 -1896694 -1230414
485 -1230414 -752682 -662375 420926 913233 1752589 1307295 644814 -601037 -1500512 -1089995
475 -1089995 -420460 686713 443000 -761172 -1626353 -999234 -145169 1881736 1861238
466 1861238 659814 704357 212420 787021 207221 -404824 -759499 -753679 -691126 973849
456 973849 1478254 1176271 -224587 -3572666 -2437410 -1698463 -706078 -259813 403193
447 403193 637735 304324 -75304 -1004640 -1462540 -2126191 -1412706 -1254838 -252664 768038
437 768038 1168770 102029 -1028020 -825763 564277 -494295 -1821661 215552 775749
428 775749 1382185 1333210 281375 -1448711 -1046668 1018063 544630 266589 390163 -183034
418 -183034 -386708 -561258 -235465 445222 -306957 -100449 1995528 2350003 367997 -1130345
408 -1130345 -628743 -128290 1072397 1617614 2850841 3306407 3083727 2783791 3052367
399 3052367 2786923 1266325 223077 431968 2177201 4142177 4462090 3692148 2198229
390 2198229 1102265 1287400 3139857 3442470 2822280 1828651 2125610 1884153 2879669
381 2879669 2177232 -145925 1124861 2529588 2517953 3190659 3337229 2329853 1487291
372 1487291 342133 1055058 1803948 1551630 1896821 2338224 2168742 3049199 2167188 823376
362 823376 556980 1948278 2601190 2492066 2256128 1391928 1284646 363461 1381930 2121791
352 2121791 2419909 1936689 1726320 2234347 2165602 2218019 -43725 -702459 1855368 3462314
342 3462314 3495749 2103817 1060047 222175 1121486 1625713 2277806 1683059 1237344 1243649
332 1243649 2271256 3591395 3252275 2463283 342479 1404044 1781232 839666 737095
323 737095 1107974 410025 -321569 1752104 1716949 1150397 1976154 1861253 1069732 2472218
313 2472218 3379653 2467484 956834 354424 1992783 1146289 1507363 1648574 2845178
304 2845178 2501798 2788814 1979807 2371298 2972321 2827015 2020564 903609 1319664 2468988
294 2468988 3778551 2944882 2673004 3247802 2311217 1253755 1838273 2737119 2251739
285 2251739 1916759 2623674 3759063 3432131 2273025 1278301 1696277 1325345 1220668
276 1220668 893430 -437358 926927 3454300 3792330 2439597 1022875 986875 672860
267 672860 875053 818383 2264169 2471394 1868369 2904296 2465648 -82433 -1028163 1559923
257 1559923 974316 1146797 2210998 2170583 1507228 1688292 2479483 1738858 16184 -958683
247 -958683 1446532 2284886 1824953 1472396 686790 833429 47595 1704448 2592183 3186380
237 3186380 1722570 1251149 863123 736550 697467 1545864 2002524 2209734 2428995 1544017
227 1544017 1804918 2524991 1817558 69098 636044 2593861 3663809 3747110 3041439
218 3041439 2482724 1202603 345432 1067724 993488 540583 801944 3082077 3397005 2663152
208 2663152 2512732 1743753 609555 429366 964056 2737574 3021165 2134865 2234235 2156195
198 2156195 1350917 1012716 2433244 2492661 1672308 2193691 2472999 2312372 2262791 2826591
188 2826591 2431703 882773 1627078 3239411 3249177 2701572 2503061 1280788 -92624
179 -92624 119616 2515348 3607573 3472433 2290541 2235097 1188067 1753684 3469392
170 3469392 2390105 807471 608235 1859873 2037471 2300402 2862127 2608776 2253142
161 2253142 -699862 -786379 246618 1153211 1190319 2294456 1715673 -415094 1292565
152 1292565 1944341 1755185 819144 450655 350635 1258820 278367 889978 2552011 2508472
142 2508472 3418619 2826547 891691 -576375 145516 2422418 2654898 2712630 1706620
133 1706620 -225601 -1149042 240893 1280018 1368557 163644 286870 728749 794980
124 794980 1518119 2316122 2887403 1661983 2591000 1465059 854553 2462406 2903432
115 2903432 2138624 247684 1249885 1371533 1338698 2298279 3964632 1805382 -464791
106 -464791 45488 536389 1050283 1941616 3310571 2826235 1789228 1604382 3033431
97 3033431 2102335 1046934 2554616 1887592 1800795 2502970 4157498 3538101 3697076 2966344
87 2966344 795598 398764 656091 1957508 2455783 3286088 2625137 2265869 108618
78 108618 54303 445138 936499 1238498 1626245 1192887 766017 2248135 1901946 1783428
68 1783428 1048062 1375268 1719627 1977382 1523525 1218138 1219572 939688 1494296 522129
58 522129 339564 1270347 1226708 451440 1746215 1175298 -737358 794131 1219447 1537464
48 1537464 1649695 2187384 1261709 1222942 1396432 1300822 1257668 974676 2554526 3100353
38 3100353 2744333 2792569 3549853 998818 90546 1058729 1054971 1695437 2675198 3505917
28 3505917 2093588 1453968 1361466 1758928 1327906 1198896 1950186 2016347 1927797 2288326
18 2288326 1855506 961826 2081522 2063677 1757093 1306039 1200351 1610351 1285821 788270
8 788270 1805428 1483784 375410 423721 348633 1192063 1901234 2032628
0 2032628
$$ Imaginary data points
##PAGE= N=2
##DATA TABLE= (X++(I..I)), XYDATA
16383 -3724845 -2693333 -2694354 -2342847 -2351297 -2752160 -3094886 -2151067 -1722895 -2368073 -3052644
16373 -3052644 -2452534 -2476033 -3572846 -2216140 -1926582 -1823606 -1325686 -1430910 -1165875
16364 -1165875 -1540962 -1433947 -1631899 -1363334 -1633642 -866919 -749000 -470176 -801628
16355 -801628 -2196532 -1850471 -1503581 214568 -140745 -820804 -1419655 -1412116 -1057477 -29076
16345 -29076 116338 -1932322 -2194894 -1026542 -443276 -708032 761200 1157259 -419959
16336 -419959 -1668221 -1523544 43347 423382 1042016 732411 -147943 -193161 516406
16327 516406 275082 -9346 525178 373486 -159380 -217982 536371 922927 1205083 1470057
16317 1470057 527280 355916 -99081 788802 473063 1124199 1749545 1412849 266296
16308 266296 1128396 1770808 899757 1215864 342770 482062 437884 1064904 857500 1681169
16298 1681169 2249967 1715137 848644 -305947 1221930 1767015 1842440 1563416 2792011
16289 2792011 1854329 2212071 2535803 2205539 1063665 503074 2023805 2719171 2253464
16280 2253464 2305569 2402195 1197352 2865075 3219158 2611434 2361270 2816478 2521543
16271 2521543 2469994 3228616 2561801 1861337 1720124 2348379 4489869 5135149 4196116
16262 4196116 3065774 2648102 1628882 3208556 3064930 2497138 2754753 3396274 3802676
16253 3802676 4664782 4664402 3970023 3954549 3671796 3260957 2505065 2582535 3785649 5173952
16243 5173952 5024572 5207564 4395901 2466693 2993660 4571750 4376716 4771415 4480279
16234 4480279 4086837 4235202 3734269 4143776 3570031 3158022 2761399 3239545 4528246
16225 4528246 3872240 3908715 2927275 2659690 3206853 3359992 4173212 4885922 4185335 2478300
16215 2478300 1894761 2688869 4245979 4536095 3240358 1872034 2193325 1905981 2670498
16206 2670498 4313553 4168617 3477559 2239553 2921693 4405809 5229113 4935181 4813274
16197 4813274 5077269 3162815 3392681 4424073 5043856 4904767 4224355 4405200 2150749
16188 2150749 982600 1917154 3325746 4471268 5425082 4659966 2471685 2950198 5101498
16179 5101498 5277686 4869023 3902549 2566847 2482516 3976015 4707612 4996493 4668766
16170 4668766 3331269 4413885 3960594 2197523 3095034 2931108 2442140 5097980 5584294
16161 5584294 4389292 3055865 3392776 2846506 3672239 3801220 4057059 4594145 3783692
16152 3783692 4304818 6028846 4463761 4227761 4642003 3553877 2252287 3155224 4062920
16143 4062920 5068142 5463971 4362159 4878236 3241820 2582812 4141104 4625265 4638772
16134 4638772 4213641 4635870 3379459 3770498 5107668 3806083 5480094 4863272 5666220
16125 5666220 4901930 4105811 4455170 4692286 4571980 5012068 4094311 2728965 4139410
16116 4139410 5495312 6215960 5764440 4557966 4184023 4253211 5999284 5700297 4613172
16107 4613172 2903163 3648854 5127263 5239477 4735433 4284184 3941907 3394652 4489941
16098 4489941 4630658 4274226 4551256 5039549 4509450 4806039 5346157 4688723 4480496
16089 4480496 3612249 4263210 5974982 5834237 4506284 5207304 5097296 5333399 5172400
16080 5172400 4514005 4031735 4913587 4323478 4479906 6130838 6273204 5069825 4289601
16071 4289601 4297434 4013315 2134363 3899969 4218966 4097423 4667460 5706333 6824617
16062 6824617 4786239 4604521 3597019 2322866 3106549 5507936 6264291 7031432 7234404
16053 7234404 6009259 5151976 4630386 4810211 3607512 3562041 5318071 5398645 5485467
16044 5485467 5534160 5819250 3762204 3962215 4028628 4169349 3608643 5332249 5860425
16035 5860425 4964616 4779321 5266655 5282043 5157980 5290328 4683827 2961477 3481214
16026 3481214 4448203 4496666 5029127 5670951 5189182 4515207 4041963 5913744 4166946
16017 4166946 4097626 5161906 3802099 4502773 4987822 5655196 4032709 4643419 5086816
16008 5086816 4442726 3004207 1530206 3232052 3373784 3888119 4754491 5027128 3328396
15999 3328396 4625243 5791508 4361242 3774827 2923336 2060832 3097936 5190364 5906732
15990 5906732 5163556 4046982 3977006 3896890 4485568 4999874 5073152 4320655 3517128 4073833
15980 4073833 4522851 5091734 4913028 4045778 4753043 3614114 3956096 4700557 4897576
15971 4897576 4624289 4399496 4002463 3359257 3406201 5295999 6968483 6802000 6466642
15962 6466642 5379996 4430414 3856752 4948132 5344085 5708620 5563321 4555793 4275637
15953 4275637 4597695 5293884 4270989 5468164 5270992 3471993 3801096 5429523 6409080
15944 6409080 5456068 5734041 4437443 3295994 3703952 4942996 5657816 5032536 5430917
15935 5430917 3781795 3609124 3101130 3413632 3725445 3450896 3774422 4245263 3393204
15926 3393204 3667162 3976175 3568356 3366452 3435682 3081967 4362637 4734750 5346354
15917 5346354 4286672 4049574 2616080 3593877 3797301 3758286 4377244 3363506 3716593
15908 3716593 4753094 6044992 5530132 5865226 5167544 5564104 4372132 4561598 5454338
15899 5454338 5737798 6004188 6579170 5341051 3938264 4344243 4751119 5538978 5102780
15890 5102780 5292863 5345608 5052809 5879965 6679771 6172947 5315279 5807676 5014625 3567162
15880 3567162 3757381 5524134 5641784 5643337 5043194 5317165 5716673 5784102 5834494 4971137
15870 4971137 5017421 5481352 5616697 4591130 5077776 5725509 5367353 4468387 4788066
15861 4788066 5497618 5131074 5442487 4697887 5169121 4372314 5196226 6230660 5489914
15852 5489914 4082062 3037633 2728671 2566747 3834905 4689558 5477494 5347724 5074498
15843 5074498 5125697 5481195 3840960 3796607 4367946 3302673 4029538 3813428 3679623
15834 3679623 4244442 5167832 4228859 3347471 3111594 3281240 4085116 5122230 6436584
15825 6436584 5635904 3957842 4248204 5312165 5752635 3992930 4774182 5946932 6181319
15816 6181319 6418826 6188324 5570396 4984984 4296145 4245475 6442951 5302238 4615782
15807 4615782 5555784 6078505 5599420 5930128 6124035 5278687 5470535 4057827 4042194
15798 4042194 5227028 6365700 5773421 5868241 5916493 5905871 5962277 5520920 7374295 6736873
15788 6736873 3422832 3835945 6090472 5876761 5614345 6122590 5676988 4706038 4587848
15779 4587848 5747741 6799483 6059545 4401151 5909344 5870335 5403183 6181922 6330381
15770 6330381 5153461 5207312 5182698 4450535 5755064 5441532 5087512 5736353 5783350 4898965
15760 4898965 4743749 4967035 5482334 6652707 5450408 4968817 6731500 4520546 2779803
15751 2779803 4803644 5485048 4720086 5940823 5669411 5419597 4768491 4124688 5640834
15742 5640834 6086455 3804259 4110938 5323284 5209815 6163564 6034815 5037842 4639861
15733 4639861 2964669 3140008 4628065 5502688 4888981 4504993 4116011 5463519 5546140
15724 5546140 3783847 3610934 6000121 5559986 4755341 4932698 3962497 3720291 5428537
15715 5428537 5583314 5761352 4028989 3434205 4907240 5720493 5189499 5151196 4528767
15706 4528767 2795691 2295191 4949026 6115372 5350605 5364199 4694997 4934724 3675807
15697 3675807 3190686 3919011 3615428 3534453 5035507 4612687 4970713 5237475 4151711
15688 4151711 3822494 4233855 3429233 3489796 4939570 6888038 6359825 5191393 3737653
15679 3737653 6093344 5529674 4524532 4811524 5572829 5020385 4878815 6377173 5647695
15670 5647695 4054177 3192957 4192197 5577438 6747133 6179456 5602795 5432042 3965381
15661 3965381 4739632 5916178 5942459 5413568 5531150 5288850 5150951 5169855 5330384 5855477
15651 5855477 4945821 4701325 5186947 5060670 6892842 8199129 7173207 5927569 5822040
15642 5822040 5289657 4867063 6330521 6779159 4889258 4211546 5656776 6954002 7380796
15633 7380796 5718236 4370968 3485229 3396489 4443913 5997648 4977178 4116569 4318592
15624 4318592 4368313 5329456 4507295 4065451 4905169 4719762 5071841 5480946 6385340 6555889
15614 6555889 5225982 5010283 4441089 3906065 5356650 5461194 5754786 4902191 3963604
15605 3963604 3435590 2917591 3608359 4921337 4410942 2990992 2979246 3296920 4291482
15596 4291482 6708698 7823895 5949729 4509363 5511458 7036424 6546476 5997921
15588 5997921 6249854 6449792 5104798 5674152 7577778 6356401 5037588 5475356 4443500
15579 4443500 3227667 4376688 4177918 5178144 6902516 4629954 5604337 6576512 5941084
15570 5941084 5405809 4555879 5213991 5698669 5823990 5755758 6652857 6391784 4733066
15561 4733066 4839404 5740541 3907556 3869942 4218938 3410826 3790440 3919880 4697569
15552 4697569 5802952 5243460 3814402 3695800 4854976 5745649 6720076 5560331 4682179
15543 4682179 5680667 4100074 3942682 6266229 5985288 4907979 4780770 4516712 3501970
15534 3501970 4297826 5370506 6084916 4927831 3847789 5181122 5915180 4639706 5146500
15525 5146500 6115998 4757511 4536171 4567918 5611656 6756099 5396666 5063876 6098367
15516 6098367 5008055 5080304 5211469 5096891 4903884 4285904 3713847 4066393 5782586
15507 5782586 5367614 5563023 4827819 3893357 3657470 3451619 4133064 4685994 4170866
15498 4170866 3036124 3383709 2879950 3959294 6063017 7040543 6466511 5302721 4143030
15489 4143030 4006933 4746203 4336763 3988491 4627025 3609822 3474361 3489523 4179910
15480 4179910 3181961 3310427 4816171 4033033 3986987 4026515 4689016 5841495 4772066
15471 4772066 4457569 4062977 3557275 3666026 4629375 5111727 3977892 4918591 3550291
15462 3550291 3970343 5030333 4329251 3827169 4135200 5045887 6126088 6091887 4661802
15453 4661802 4699670 4347303 4551150 5087313 5026520 4353574 4325426 5891175 5474348 5382252
15443 5382252 3890034 3428508 3432443 2744536 4563222 4109403 3968721 4991192 6206828
15434 6206828 6899039 6651578 4050993 2674995 3490239 5018697 7509243 7214064 6580457
15425 6580457 3807242 3948125 4586405 5425639 6829647 5223800 4382846 4797680 5213542
15416 5213542 5335453 7033075 6063153 4722934 4545845 6152375 7195840 6747971 5267444
15407 5267444 5384899 4563229 4204019 6881832 7641130 8674369 7602432 6609976 6213299
15398 6213299 5810314 5549257 5739221 4854629 5639414 6809786 7434846 8020741 7792790
15389 7792790 6622866 6068256 5213916 4756216 5226264 5557629 5941686 7148996 7870037
15380 7870037 7578776 6830917 5861154 5398981 5826561 6708141 7750696 8834267 8293514
15371 8293514 6831866 5688471 5846994 4708843 5425751 6315221 7600239 8101234 6258088
15362 6258088 4987525 5491430 4559589 4953044 5137394 4328252 4980968 6338540 6456004
15353 6456004 6792340 7315218 5360149 4338803 4678031 3961198 4389028 5640877 6043342
15344 6043342 5634944 4478591 4488281 4747067 5929269 5744997 6047924 5435284 3036222
15335 3036222 3946667 3637633 3901537 5798983 6218872 4988723 4991430 5705238 5997252
15326 5997252 5670941 5704393 5787226 5618539 5448793 6636595 6904124 5517621 5911325
15317 5911325 6124490 6180285 4606701 4108134 2834119 4286171 6350357 7293998 7017750
15308 7017750 5162537 4375294 3601143 3982801 5387233 7179417 6878992 5150171 5218061
15299 5218061 4425127 5875830 7546040 6387813 4765194 4811868 5443683 5925158 6957270
15290 6957270 6953672 6375052 4968366 4126351 4797683 5706341 6813870 7090903 5231104
15281 5231104 4593884 4465681 4823055 5489108 7577321 7773167 6070806 5879786 5447253
15272 5447253 5701787 5320397 3729375 5261294 5608304 5536366 6998328 7171230 5103253
15263 5103253 4681877 6164719 5551961 5995339 5927401 6166923 6706217 5037280 4710493
15254 4710493 5072507 5224310 5014234 4912537 5158614 5220341 6160873 5471290 6598152
15245 6598152 6967916 4877273 4178151 3663033 3743646 4820789 4990195 5974148 6992804
15236 6992804 6231742 5173227 5364079 7202178 6952014 5953422 5109637 5446684 6000364
15227 6000364 5266889 7258515 8151748 5726059 3378562 4404279 5670251 5717531 6383957
15218 6383957 5696538 4843910 4955372 6745053 7993169 8294251 7092299 5542024 4427674
15209 4427674 5161281 6814749 6853803 5406307 4191573 5063991 4343762 5382570 5283800
15200 5283800 5134813 5374138 5222262 6199162 6474798 5185996 4372064 6363868 5389064
15191 5389064 5263393 6859282 6851877 5342219 4451369 5622923 6004962 6491524 5915591
15182 5915591 7002733 6256502 4250100 3737982 5512318 6210396 5727478 5210092 3810438
15173 3810438 4068059 4013278 5063803 6009500 5865867 5203486 5085625 4815648 5494526
15164 5494526 7036827 5569401 4649680 4844354 4862681 3558644 4111888 5037412 3984034
15155 3984034 5216746 4637018 5096406 3807972 3240348 4004219 4433354 4366568 5438933
15146 5438933 5247023 4175147 3624515 3469575 4479253 5431209 6058353 4492413 3487890
15137 3487890 2108981 1767473 3516663 4498840 4374061 2945348 2069782 2924521 5684437
15128 5684437 4622390 4280224 3347261 2528267 3988562 4378591 5024185 4975280 6533189
15119 6533189 5657968 4402425 3505923 3629424 3331966 5079888 5989500 5674057 6426846
15110 6426846 6478118 6100164 5719394 5425591 4568788 5047487 4851892 5714869 7854108
15101 7854108 8429900 6659771 6368305 5996687 5723081 7752098 6049028 6980817 6442407
15092 6442407 6002063 6931051 7104813 6663789 6556052 6383979 5374665 7002160 6295738
15083 6295738 6607066 5668673 4793496 4841661 5861702 7027779 6774159 7582132 6578503
15074 6578503 6054031 5249036 5582154 5282003 5433995 5363564 4068534 5261250 5415131
15065 5415131 5869278 5328638 6260954 6617207 7887457 5188929 3574577 4853229 5071005
15056 5071005 5297392 4982369 6326083 5434432 5687161 7096346 8415729 7407780 4234320
15047 4234320 4293236 2656171 2752916 4914031 7162996 7309327 6326695 6058399 4522989
15038 4522989 4916789 5385823 4604701 3568695 4127455 6096046 7494976 6836443 6834106
15029 6834106 6858038 5573179 4602358 4258082 5395708 6267387 7252768 8312606 6738148
15020 6738148 6920054 7496416 8043878 6332927 5757280 5481526 5668851 5385398 6911908
15011 6911908 7898708 7447658 6956950 7598971 6432181 6036656 7774032 7251887 6614219
15002 6614219 6263675 6894258 7636988 7287516 7378604 6511629 6271584 6860677 7257489 7321770
14992 7321770 6064107 6825259 6751461 6272255 5715742 7424869 6935021 5558269 7222368
14983 7222368 6298936 4981059 5844391 5060236 4381534 5071054 4983888 5926323 7113375
14974 7113375 5650000 5257600 4905532 4504109 6350867 6975063 4932411 5754557 5804106
14965 5804106 6070519 6822957 6261743 5592788 5242193 4582037 5623144 6957238 6499723
14956 6499723 4992113 4998535 3615359 4095710 5728547 5558020 5776936 7175060 8504468
14947 8504468 7376797 5988108 4929990 4517037 4033281 4995651 6557466 6752441 5425858
14938 5425858 5600459 5577457 4920414 4641840 5926784 4974113 4712212 6166069 8078452
14929 8078452 7886365 8004714 7200771 6007231 5304517 5240868 4428929 5671539 6191235
14920 6191235 6695646 7966485 5615430 4623629 4207876 4403441 4867512 5863395 5603116
14911 5603116 6342066 7100744 7158344 7810958 5929863 4343577 3799939 3189357 4494566
14902 4494566 6028737 6275291 5154285 6591305 6586386 6926952 5298005 5084067 5164708
14893 5164708 4259559 5041236 7272644 6903991 5486424 5948713 4949822 4801085 4333941
14884 4333941 4908582 6120966 6337730 4877285 5401381 6603195 5615767 6764367 6808834
14875 6808834 5119738 3934360 4387178 3907940 5066453 6316710 6982373 6119175 4038190
14866 4038190 5314560 6124195 5420662 4578589 7160093 4633057 2186054 4591788 6201386
14857 6201386 6448867 6293985 6131145 4359742 2854364 3705333 5793878 6434834 4848890
14848 4848890 5795158 4544893 2741156 5199600 6501554 5497605 4726448 4342203 3453334
14839 3453334 3585252 5032910 5994202 6032220 4788163 4643020 4483192 3786207 4324485
14830 4324485 4301782 4280396 4502885 4779350 4567334 5152112 6441648 5693973 4389263
14821 4389263 2973656 4044342 6163604 6393731 4524882 4796966 4667123 3865592 4993756
14812 4993756 4730937 4778220 4476855 4715760 4965327 5804764 6623650 6481322 6386493 5699198
14802 5699198 4653162 5394819 4933643 5473852 7157894 6595711 6263635 6151229 5969778
14793 5969778 5783044 5160622 4946021 4520605 4026039 6652577 8901720 8827368 6879921
14784 6879921 6338806 6175903 5507701 6351452 7009697 6797261 6261742 6441508 7436758
14775 7436758 7217782 5099119 5049148 6170042 6929796 6359705 6069683 5446554 5068901
14766 5068901 5859405 6682344 6263939 5184086 4739732 4283140 4732361 6456987 7889704
14757 7889704 5706150 4935230 4883647 4725787 5754568 5969479 6052256 5631806 5896778
14748 5896778 5976611 5405511 4087424 5925048 6800815 5968789 6665345 6306425 4800463
14739 4800463 4140686 5381724 7029506 7842505 8010792 7458453 4710127 4361240 6307932
14730 6307932 6303087 5817894 6163163 6218077 5785793 6750953 8401079 7775876 6696659 6577069
14720 6577069 6222457 5314243 6022291 7527824 7331660 5581289 4586808 6502654 5017619
14711 5017619 5091342 6728401 7799948 7804052 7901999 7254109 6009533 6222237 6817697 8796861
14701 8796861 7506379 6995142 6726395 6554161 6435549 7762153 7534013 4963997 4723811
14692 4723811 6226375 7766959 8445462 9888230 8974969 6313076 5202988 5840978 7175997
14683 7175997 6417827 6743724 5967609 6671786 6705536 6760493 7481585 6307263 5908787 4897847
14673 4897847 7126379 7420863 5992982 5564632 6774754 6000801 5377080 6437462 6016564
14664 6016564 4505399 5489737 7444112 5407908 5865195 7080013 5701740 6410486 7227660
14655 7227660 8067745 6132582 5383687 4756094 4244451 4495147 7050569 9188005 6307265
14646 6307265 5031515 5869468 7227696 6145664 6514175 6090080 4621905 3945733 5247309
14637 5247309 7463951 7608214 7039537 6719868 6200952 5675414 5725979 6399547 6213046
14628 6213046 5391455 4521871 4942376 4553946 5940007 6937659 7298681 7011937 6623626
14619 6623626 4495391 3117109 4909918 5061373 5555758 6859822 6482024 5737471 4893586
14610 4893586 4649091 5305518 5371832 4849186 4736703 4541654 4010936 5183615 6748618
14601 6748618 6591985 5095498 4550686 4799347 5505130 5555126 5858489 4998402 5268325
14592 5268325 5227038 5076312 5387044 5444338 5424992 5530406 5375292 4733331 4396142 5301942
14582 5301942 5102879 4991096 5568808 6067434 5597900 6039324 6301435 7458842 7355958
14573 7355958 5413757 4941848 4373711 5537585 6941877 6519317 4198337 2586242 1807440
14564 1807440 3403095 5141577 6041738 5649722 4392065 4123607 4438267 4995067 5460964
14555 5460964 6530537 5936943 5029730 5536277 6387641 6278974 5986072 5603882 4116058
14546 4116058 4704448 5338164 6462767 6541464 7376080 6517442 5836882 4771399 4937297
14537 4937297 6675218 7734434 8980348 7265959 5825501 5212519 5323557 5073602 5157955
14528 5157955 5376720 5449168 7417292 8334456 7875682 8045990 7236327 5422152 4434217
14519 4434217 5851811 8057766 8990862 8106015 7377863 6213428 6170562 8185516 8025668
14510 8025668 7819697 7906679 7393056 7073247 8204071 8915661 7317801 7516488 6720720
14501 6720720 7044718 6108894 6099304 7699987 7939014 7911432 7425551 5953671 5633219 4589789
14491 4589789 4881480 7404859 8057471 7274220 6736816 5800735 6796225 6852054 5784578
14482 5784578 5034121 4816339 5108786 6173876 7192419 6769530 6935878 5515404 5729749
14473 5729749 4592996 3906120 4112138 6170574 7249518 6599420 6507342 5671080 5013010
14464 5013010 3683577 4595014 5438000 7049202 5323925 3483223 5211857 5074611 6561690
14455 6561690 6507838 5455522 3879239 3288375 4207800 6709586 6433393 5359151 4881496
14446 4881496 3396525 3715546 4474174 5225460 5326636 5541389 5727908 5686554 6045665
14437 6045665 5541794 5634750 3905479 4217342 5400304 6388213 7748466 7387478 5438099
14428 5438099 5228912 5553718 5465601 5842530 5071773 4954557 6058046 6372371 4377943
14419 4377943 5458206 5662600 5829551 7817530 7040984 5603572 5092866 4717766 5331186
14410 5331186 7039895 6791835 5172079 4726390 4947000 6433320 7750818 7067099 4790511
14401 4790511 4740534 5398718 6631582 7426098 6619682 6615798 7690146 6567420 6512889 6614236
14391 6614236 5731185 6028773 7574774 7410360 8255870 7082942 5183598 5765374 6337683
14382 6337683 6360209 6392700 6239280 7345143 7965971 7674656 6691147 6716965 7525672 5524186
14372 5524186 5322378 4635294 5697672 7683819 8767418 7684391 6606969 6100319 3955701
14363 3955701 5188139 5700383 6670553 7348453 5649708 4898299 4606710 5383841 6323664
14354 6323664 6449911 5660869 5908211 4081223 4154480 6275701 7578155 7041274 7273862
14345 7273862 5898641 4174164 5450629 6715626 6810084 6595627 4539063 3722323 5020216
14336 5020216 6078901 6033141 5532209 4817902 5778750 8215114 6645035 4775363 5283477
14327 5283477 4732504 5159076 7163083 6614603 5773003 4842072 4180223 5619356 6935620
14318 6935620 7105610 5446476 3921135 4986150 6780432 7211993 7156590 8213257 7593305
14309 7593305 6086804 5595335 5473229 5775438 6172849 6648889 5819032 5299411 4990414
14300 4990414 6277628 7213875 6371660 6746805 5834180 4389455 5874671 8847923 8299241
14291 8299241 5962943 4604826 4070183 5114351 6824063 6870732 5591697 4010150 4678894
14282 4678894 6074668 6632519 6739247 8096716 6925176 4870285 5639571 6082580 5261536
14273 5261536 6587421 7809525 6704491 5224330 5880164 5577471 6375945 6936193 7213013
14264 7213013 6233617 5388110 5797540 7329866 7258866 5442377 6452685 5610981 5371424
14255 5371424 5839895 5665928 4881166 6009116 6301864 5383881 4427380 5461293 7222568
14246 7222568 6705588 6594586 6687202 5582838 5375179 6442043 7142515 6075529 5964303
14237 5964303 6787963 7403748 6077010 8100601 8078212 6299665 6098003 6570867 6505653
14228 6505653 5399087 6140109 6948744 6759469 7560463 7536377 5348103 4984002 6624094
14219 6624094 8334132 8006846 7252508 6826270 6377365 6808929 9150262 8768892 6943421
14210 6943421 5537396 5175381 4454457 5716896 6463458 6013444 5658265 5936438 6366686
14201 6366686 6249264 6227719 6993801 8068338 6629370 6093470 5414968 6046809 7016743
14192 7016743 7942629 8533928 6425930 5685607 5934394 5613436 7562761 7969305 6106138
14183 6106138 4267055 4048565 5603813 8052906 9753842 8311657 6930045 5309287
14175 5309287 5025901 6597135 7219043 8091478 8245492 5645082 4609031 6100509 7984432
14166 7984432 9794960 10095291 6992318 4159788 4154467 5622101 6924730 6661872 4711812
14157 4711812 4808511 4616903 4961810 7342100 6097204 4849341 6051061 6223636 4564900
14148 4564900 5649345 6137136 5604108 6261430 5890724 5322138 6152312 6605314 6719434
14139 6719434 6995286 4316624 4287967 5339163 5023479 7059747 8231781 6898023 5186820
14130 5186820 5179462 5988910 7627673 7295995 5722808 5655596 5723465 6501004 7700839 7009569
14120 7009569 4556332 5288818 6488592 6813147 8781675 7841065 7851448 7435954 5682013
14111 5682013 5355808 6238741 6155272 6110078 6237638 7140077 8073600 7645417 7476748 6737109
14101 6737109 4903908 4965258 6827496 6741123 6218369 5706088 6184047 7071682 7878201
14092 7878201 6870012 5850677 6461320 7477716 8124576 7151959 6731650 6467068 5397453
14083 5397453 4036361 5052821 6921833 6282163 6755849 6495311 6191525 6057865 5668284
14074 5668284 5557739 5828176 6302403 7192369 6531648 6028400 5006696 4334305 4875867
14065 4875867 3983135 3200469 4056288 5352951 6866891 6569030 6326418 5001667 3710279
14056 3710279 2732293 3059954 4908163 5073894 5491588 6309245 4609820 3737363 4706607
14047 4706607 3155601 3238469 3878614 5210994 5657796 5510628 4662798 4592791 3606878
14038 3606878 3924484 4697301 3904418 4179464 4847503 6439966 5608161 4973241 4535056
14029 4535056 3546503 3886245 4950861 6464575 6448114 7438090 7505989 7269995 5511253
14020 5511253 6100801 5624932 3748496 3987805 6390716 8758920 8115596 7168631 5540048
14011 5540048 6186092 6843191 7704322 7918401 7361549 7640671 6916062 7289490 8385650
14002 8385650 9334468 8298761 7331992 6724033 5959471 8015637 8621724 9081299 7030488
13993 7030488 6198753 5830042 6504182 8497465 9220087 9238524 8873931 8985636 7552004
13984 7552004 7499627 6587193 6645240 6937826 7202746 8009494 8127958 8938159 7767768 7337611
13974 7337611 6658392 7185822 7608182 7079764 8186684 8187189 8561301 8076207 7715532 7371269
13964 7371269 6746475 6476269 7227847 6639939 6368287 5268145 6446677 7810617 6905593
13955 6905593 7706131 7040875 6144739 6355756 8003972 7846373 6568524 6081407 5662240
13946 5662240 7740725 9473026 8991350 8281937 6615600 6081028 6812084 7095134 6717735
13937 6717735 6359148 5576715 6110718 7370912 7751988 6652610 6751785 6256648 6270250
13928 6270250 7687218 6505718 6776650 6012181 6195810 7705146 8865506 9291641 8130279
13919 8130279 6937156 6151390 5858272 6205477 6584444 6455569 6454676 7037453 7567169 9534160
13909 9534160 7807971 5508547 6739630 6932868 7835080 8297139 7116763 6494634 7350658
13900 7350658 8137324 10453678 8542062 7385987 7231496 6877013 7524073 8113677 8182247
13891 8182247 6774464 6924493 7006941 7490392 8935041 8887889 7276291 6493494 7409281
13882 7409281 6657909 7034832 7105244 7780861 7917407 7834712 7045985 6493612 6331511 6717605
13872 6717605 7018106 7594636 8571487 7510540 5534830 4593588 6220938 7406111 6401742
13863 6401742 6739697 6298300 6744506 6815783 7555562 7035913 5803275 4722220 4031605
13854 4031605 5303316 5320597 6921635 8166651 8522281 7230139 6735802 5269953 4824285
13845 4824285 6164194 7050933 7216410 8147753 8052013 7678108 6156079 5908062 5860248
13836 5860248 6749242 6245471 7062716 6595985 6463744 7404677 7419821 5167750 4370249
13827 4370249 4187111 5173865 7182943 6974139 7857685 7319339 6127718 6082624 6405760
13818 6405760 5994655 6423680 6990341 6843077 7490304 6560246 7116652 6289176 6145517
13809 6145517 5861674 7175472 7268770 6087438 6138935 7683279 9694779 7477303 5679545
13800 5679545 5708086 6299705 5608303 6843037 6725387 5333119 5561415 6098524 6527731
13791 6527731 6643152 7012346 7523583 8547072 7328341 6925451 6731212 5876815 7631900
$$ [...]
##END NTUPLES=NMR SPECTRUM
##END=
