##TITLE=1H_CG-1188-F1
 200.13MHz, CDCl3+DMSO,
 8 sc
 
 5.2.2025
##JCAMPDX= 6.0         $$ Bruker NMR JCAMP-DX V2.0
##DATA TYPE= NMR SPECTRUM
##DATA CLASS= NTUPLES
##ORIGIN= UXNMR, Bruker Analytische Messtechnik GmbH
##OWNER= pz
$$ XWIN-NMR		Version 3.5
$$ Wed Feb  5 16:20:19 2025 Russian Standard Time (UT+4h)  she@DPX200
##.OBSERVE FREQUENCY= 200.1313
##.OBSERVE NUCLEUS= ^1H
##.ACQUISITION MODE= SIMULTANEOUS
##.ACQUISITION SCHEME= undefined
##.AVERAGES= 8
##.DIGITISER RES= 18
##SPECTROMETER/DATA SYSTEM= spect
##.PULSE SEQUENCE= zg30
##.SOLVENT NAME= D2O
##.SHIFT REFERENCE= (INTERNAL, D2O, 0, 15.6059)
##AUDIT TRAIL= $$ (NUMBER, WHEN, WHO, WHERE, WHAT)
$$ ##TITLE= Audit trail, XWIN-NMR		Version 3.5
$$ ##JCAMPDX= 5.01
$$ ##ORIGIN= Bruker BioSpin GmbH
$$ ##OWNER= she
$$ F:/spectra/data/she/nmr/H-C/1/pdata/1/auditp.txt
$$ ##AUDIT TRAIL=  $$ (NUMBER, WHEN, WHO, WHERE, WHAT)
(   1,<2025-02-05 16:18:53.93 +0400>,<she>,<DPX200>,
      <created by zg, POWCHK disabled, PULCHK disabled
       configuration hash MD5:
       00 E9 B6 7A A2 85 ED C7 34 08 36 98 17 FE 4E 26
       data hash MD5: 16K
       AD 57 C1 6C D7 8B 2D ED 5D 8F 1F 30 B2 EC A5 5E>)
(   2,<2025-02-05 16:18:56.17 +0400>,<she>,<DPX200>,
      <Start of raw data processing
       efp BC_mod = 2 LB = 0.25 FT_mod = 6 PKNL = 1 PHC0 = -142.1093 PHC1 = 60.99221 SI = 16K 
       data hash MD5: 16K
       48 86 D5 F1 8E A1 DF 01 1F D5 09 FD 3C 91 65 FA>)
(   3,<2025-02-05 16:19:23.48 +0400>,<she>,<DPX200>,
      <pk PHC0 = 32.89766 PHC1 = -50 
       data hash MD5: 16K
       01 63 AB D9 10 26 57 C5 83 53 6E 6C C2 88 F0 B1>)
(   4,<2025-02-05 16:19:28.07 +0400>,<she>,<DPX200>,
      <abs ABSG = 5 
       data hash MD5: 16K
       02 B5 6A 35 23 97 70 94 A4 A4 88 32 D5 3A 1A 9F>)
$$ ##END=
$$ 
$$ hash MD5
$$ A2 FD 08 74 85 49 D4 38 48 1D F0 11 8B AC 5A AB
##$RELAX= 
##$RELAX= 
##$RELAX= 
##$RELAX= 
##$RELAX= 
##$RELAX= 
$$ Bruker specific parameters
$$ --------------------------
##$DU= <F:/spectra>
##$EXPNO= 1
##$NAME= <H-C>
##$PROCNO= 1
##$TYPE= <nmr>
##$USER= <she>
##$AMP= (0..31)
100 100 100 100 100 100 100 100 100 100 100 100 100 100 100 100 100 100 
100 100 100 100 100 100 100 100 100 100 100 100 100 100 
##$AQSEQ= 0
##$AQ_mod= 1
##$AUNM= <au_zg>
##$AUTOPOS= <>
##$BF1= 200.13
##$BF2= 200.13
##$BF3= 200.13
##$BF4= 200.13
##$BF5= 200.13
##$BF6= 200.13
##$BF7= 200.13
##$BF8= 200.13
##$BYTORDA= 1
##$CFDGTYP= 0
##$CFRGTYP= 5
##$CHEMSTR= <none>
##$CNST= (0..31)
1 1 145 1 1 1 1 1 1 1 1 1 1 1 1 1 1 1 1 1 1 1 1 1 1 1 1 1 1 1 1 1 
##$CPDPRG= <>
##$CPDPRG1= <>
##$CPDPRG2= <>
##$CPDPRG3= <>
##$CPDPRG4= <mlev>
##$CPDPRG5= <mlev>
##$CPDPRG6= <mlev>
##$CPDPRG7= <mlev>
##$CPDPRG8= <mlev>
##$CPDPRGB= <>
##$CPDPRGT= <>
##$D= (0..31)
0 0.7 0 0 0 0 0 0 0 0 0 0.03 0 0 0 0 0 0 0 0 0 0 0 0 0 0 0 0 0 0 0 0 
##$DATE= 1738757933
##$DBL= (0..7)
120 120 120 120 120 120 120 120 
##$DBP= (0..7)
150 150 150 150 150 150 150 150 
##$DBP07= 0
##$DBPNAM0= <>
##$DBPNAM1= <>
##$DBPNAM2= <>
##$DBPNAM3= <>
##$DBPNAM4= <>
$$ [...]
##$SUBNAM3= <"">
##$SUBNAM4= <"">
##$SUBNAM5= <"">
##$SUBNAM6= <"">
##$SUBNAM7= <"">
##$SUBNAM8= <"">
##$SUBNAM9= <"">
##$SW= 18.0517328524113
##$SWIBOX= (0..15)
0 0 2 0 0 0 0 0 0 0 0 0 0 0 0 0 
##$SW_h= 3612.71676300578
##$TD= 16384
##$TD0= 1
##$TE= 0
##$TE2= 300
##$TE3= 300
##$TEG= 300
##$TL= (0..7)
0 120 120 120 120 120 120 120 
##$TP= (0..7)
150 150 150 150 150 150 150 150 
##$TP07= 0
##$TPNAME0= <>
##$TPNAME1= <>
##$TPNAME2= <>
##$TPNAME3= <>
##$TPNAME4= <>
##$TPNAME5= <>
##$TPNAME6= <>
##$TPNAME7= <>
##$TPOAL= (0..7)
0.5 0.5 0.5 0.5 0.5 0.5 0.5 0.5 
##$TPOFFS= (0..7)
0 0 0 0 0 0 0 0 
##$TUNHIN= 0
##$TUNHOUT= 0
##$TUNXOUT= 0
##$USERA1= <user>
##$USERA2= <user>
##$USERA3= <user>
##$USERA4= <user>
##$USERA5= <user>
##$V9= 5
##$VALIST= <valist>
##$VCLIST= <CCCCCCCCCCCCCCC>
##$VD= 0
##$VDLIST= <DDDDDDDDDDDDDDD>
##$VPLIST= <PPPPPPPPPPPPPPP>
##$VTLIST= <TTTTTTTTTTTTTTT>
##$WBST= 1024
##$WBSW= 4
##$XGAIN= (0..3)
0 0 0 0 
##$XL= 0
##$YL= 0
##$YMAX_a= 64791
##$YMIN_a= -74397
##$ZGOPTNS= <>
##$ZL1= 120
##$ZL2= 120
##$ZL3= 120
##$ZL4= 120
##$ABSF1= 15.50559
##$ABSF2= -2.546259
##$ABSG= 5
##$ABSL= 3
##$ALPHA= 0
##$AQORDER= 0
##$ASSFAC= 0
##$ASSFACI= 0
##$ASSFACX= 0
##$ASSWID= 0
##$AUNMP= <proc_1d>
##$AZFE= 0.1
##$AZFW= 0.1
##$BCFW= 0
##$BC_mod= 2
##$BYTORDP= 0
##$COROFFS= 0
##$CY= -3
##$DATMOD= 1
##$DC= 0
##$DFILT= <>
##$DTYPP= 0
##$F1P= 0
##$F2P= 0
##$FCOR= 1
##$FTSIZE= 16384
##$FT_mod= 6
##$GAMMA= 0
##$GB= 0
##$INTBC= 1
##$INTSCL= 3.241238e-09
##$ISEN= 128
##$LB= 0.25
##$LEV0= 0
##$LPBIN= 0
##$MAXI= 10000
##$MC2= 0
##$MEAN= 0
##$ME_mod= 0
##$MI= 1.114404
##$NCOEF= 0
##$NC_proc= -9
##$NLEV= 6
##$NOISF1= 3.799351
##$NOISF2= 2.8
##$NSP= 0
##$NTH_PI= 0
##$NZP= 0
##$OFFSET= 15.60586
##$PC= 1
##$PHC0= -109.2116
##$PHC1= 10.99221
##$PH_mod= 1
##$PKNL= yes
##$PPARMOD= 0
##$PSCAL= 0
##$PSIGN= 0
##$REVERSE= no
##$SF= 200.129983156955
##$SI= 16384
##$SIGF1= 3
##$SIGF2= 2
##$SINO= 0.751879
##$SIOLD= 32768
##$SREGLST= <19F.Aceton>
##$SSB= 0
##$STSI= 16384
##$STSR= 0
##$SW_p= 3612.71676300578
##$SYMM= 0
##$S_DEV= 0
##$TDeff= 16384
##$TDoff= 0
##$TI= <>
##$TILT= no
##$TM1= 0
##$TM2= 0
##$TOPLEV= 0
##$USERP1= <user>
##$USERP2= <user>
##$USERP3= <user>
##$USERP4= <user>
##$USERP5= <user>
##$WDW= 1
##$XDIM= 16384
##$YMAX_p= 409197760
##$YMIN_p= -9365963
$$ End of Bruker specific parameters
$$ ---------------------------------
##NTUPLES= NMR SPECTRUM
##VAR_NAME=  FREQUENCY,     SPECTRUM/REAL,   SPECTRUM/IMAG
##SYMBOL=    X,             R,               I
##VAR_TYPE=  INDEPENDENT,   DEPENDENT,       DEPENDENT
##VAR_FORM=  AFFN,          ASDF,            ASDF
##VAR_DIM=   16384,         16384,           16384
##UNITS=     HZ,            ARBITRARY UNITS, ARBITRARY UNITS
##FACTOR=    0.220516191357247, 1,           1
##FIRST=     3123.20045021209, 0,            0
##LAST=      -489.516312793692, 0,           0
##MIN=       -489.516312793692, -9365963,    0
##MAX=       3123.20045021209, 409197760,    0
$$ Real data points
##PAGE= N=1
##DATA TABLE= (X++(R..R)), XYDATA
$$ [...]
12401E28264n64245m02271l60813O9641J083137J54267Q3431n64330j95359R45384
12391G77106N3274n86099l1951P6123k65903k44758K66100R88840q31540J4844
12381B16036o19635j00187P03050l33154j62353J24930j09644M67283l41374O13128
12371D58080J92782p70801K00570p78972k06528Q87203M51638l0737o02773j13405
12361c12943j092586R7186K040320J16010L1002j79795M23115k65606r35188J40314
12351F1829j1372q41127M4531M8819k05408K21730L22145p4511K12400l35399
12341e56363J048742M01815l56650l10079j2869n00849k98884O76532K62688j054750
12331g00667m77372P95920R89488m19074k33744J57763J96971j029929q8685l24897
$$ plain form
12401 528264 -35981 -438252 -799065 -729424 353713 507980 591411 27081 -168278 777106
12391 777106 830380 244281 212330 288453 22550 -222208 43892 1032732 201192 216036
12381 216036 -403599 -503786 199264 -133890 -296243 -171313 -280957 186326 -155048 458080
12371 458080 650862 -119939 80631 -698341 -904869 -17666 433972 403235 -199538 -312943
12361 -312943 -1405529 -1308343 731977 847987 878989 699194 1122309 856703 -78485 61829
12351 61829 50457 -790670 -746139 -697320 -902728 -680998 -358853 -433364 -220964 -556363
12341 -556363 492379 894194 537544 227465 214596 -286253 -585137 91395 354083 -700667
12331 -700667 -1178039 -382119 607369 188295 -45449 112314 309285 -720644 -809329 -1134226
12321a134226Q03510M8469J01148J833242o58543k67973K11504j442564p61799
12312a267232R84496m65540K772l81683N69905J110033K22956m42405L83269j712537
12302i95966P33017Q02207N00828o58749q75725O61680o01064J20221P31120k55342
12292A62227o4054P28043M17248o6313j070294n42592o42960Q35228O61726l10108
12282A08151m78841P44136l17885m04211N04557J18316L75771J80599j141542
12273c10949p83166J135282m40077J299183M39074k76715l32349l16257m25120
12264a1094l55377J062695R1590p90134j61340P5977j56960K84065n12014m98070
12254i70662K46057M40536j0649J48563M0601j66600p5979J34945l6748N4123
$$ plain form
12321 -1134226 -330716 -282247 -181099 1652143 993600 725627 937131 -505433 -1267232
12312 -1267232 -282736 -748276 -745504 -1127187 -557282 552751 775707 333302 716571 -995966
12302 -995966 -262949 539258 1040086 381337 -494388 167292 -433772 -313551 417569 162227
12292 162227 98173 826216 1243464 1177151 106857 -435735 -1078695 -243467 418259 108151
12282 108151 -370690 373446 55561 -348650 155907 274223 649994 830593 -310949
12273 -310949 -1094115 41167 -398910 900273 1339347 1062632 730283 414026 -11094
12264 -11094 -366471 696224 787814 -2320 -163660 -87683 -244643 39422 -472592 -970662
12254 -970662 -724605 -284069 -294718 -146155 -105554 -272154 -348133 -213188 -249936 -195813
12244a95813o19519p54129J043426K82842k12564M53680m2135N29890j84385p16915
12234d15622J168909o85613p31217o10194J54128J543376k06926L31075O32619
12225A180535l34347o14102L79562j21919K24350l29936o16167P05426P88326
12216A261728J02880O70270o25159q51812j314620K1767R79759K75602M8284j120071
12206e51372K80500J249459q28444K98648N74343l66009l84303M23570k34032
12197D62360j5716K02497J03865n2882j32548j55612k84244r28148K05057R73500
12187C78129R3723J50401R72066q34010r02468O2599o80843n24393J209309O19953
12177E44466m15277l07030l184R7869O88322O49454j047292J378356j76708o81724
$$ plain form
12244 -195813 -815332 -1569461 -526035 -243193 -455757 -2077 -44212 485678 301293 -415622
12234 -415622 753287 67674 -663543 -1273737 -1119609 423767 216841 547916 1180535
12225 1180535 846188 232086 611648 489729 714079 384143 -232024 473402 1261728
12216 1261728 1364608 2034878 1409719 557907 -756713 -734946 244813 520415 568699 -551372
12206 -551372 -270872 978587 150143 448791 1023134 657125 272822 696392 462360
12197 462360 446644 649141 753006 700124 567576 411964 127720 -800428 -595371 378129
12187 378129 471852 622253 1594319 760309 -142159 -79560 -760403 -1284796 -75487 544466
12177 544466 129189 -177841 -181025 -83156 605166 1254620 207328 1585684 1408976 727252
12167G27252o49047O74674N6883p02127L65867O14707O35518J105409p31884j895319
12157B01933j858128J647275j45434k09267L96190M8229P22941l39306N7861M23694
12147I45988J92026l19849l48598N88207L62968p08291q09274M24089R92052k92978
12137A026340J4800J143150j173195r91600M10396P98643l36185N25152m27614
12128I89887l05414j193422Q73681J74101j006446N67194o16006K22830N56369
12119B62774Q30198j64946m42790n11353l65053k84684O51645P93044n13043J86744
12109D42536O60668j481790J211162Q27354m43219j302922j64381P35383M70170
12100I54961n93461R35072p39544O82389j50566l27119k11245k92270q0278R59869
$$ plain form
12167 727252 78205 752879 809762 107635 473502 1088209 1723727 2829136 2097252 201933
12157 201933 -1656195 -8920 -154354 -363621 32569 80798 803739 464433 522294 945988
12147 945988 1138014 818165 469567 1057774 1420742 712451 -96823 327266 1319318 1026340
12137 1026340 1041140 2184290 1011095 19495 429891 1228534 892349 1417501 989887
12128 989887 684473 -508949 364732 538833 -467613 99581 -516425 -293595 262774
12119 262774 1092972 928026 485236 -26117 -391170 -675854 -24209 768835 255792 442536
12109 442536 1103204 -378586 832576 1659930 1216711 -86211 -250592 484791 954961
12100 954961 361500 1296572 557028 1239417 1088851 761732 550487 258217 177939 1137808
12090A137808p9191J77754L45093o10329L91486j04891m17831k7291l8841q46963
12080g3196L88208o41422m5614J38767O3034j16308Q36760l84476K00383O76322
12070A042458l81639n50565K65066p66806K99713K83602k79541M18643N9488l42218
12060D8201m20971K7535n4113N76938L17563o49623K28602K69388N52550N95597
12050A491667J213985l18832j349515M64048o12421l07584r53901K12963K24465
12041F4875J185534j463938o74241N67995L02692J206673N49825o16110o09237
12032E14068K67061K03711n39078K84179j68425m3565L58521L75462Q58191J11581
12022B221706m71574q41961O07478M51193n88507p15613Q95827j58863K74849
$$ plain form
12090 1137808 1058617 1236371 1581464 971135 1362621 1257730 839899 812608 773767 -73196
12080 -73196 315012 -326410 -372024 -233257 -170223 -286531 550229 165753 366136 1042458
12070 1042458 660819 110254 375320 -391486 -91773 191829 -87712 330931 390419 48201
12060 48201 -372770 -345235 -399348 177590 495153 -154470 74132 343520 896070 1491667
12050 1491667 2705652 2386820 1037305 1501353 888932 581348 -372553 -159590 64875
12041 64875 1250409 -213529 -887770 -319775 -17083 1189590 1739415 1123305 514068
12032 514068 781129 984840 445762 729941 561516 517951 876472 1251934 2110125 2221706
12022 2221706 1750132 908171 1515649 1966842 1378335 662722 1558549 1399686 1674535
12013A674535l80055m86102L83081j23838m61621k04556o12882L55367L31336
12004D75265n99917O62216Q91765o17566m81795J249851j2235q18343M01881n61614
11994E89508R05591K44660o30717J68124O85961L62459j82937p39350N04723N47743
11984B455765r99663q0191m15006R97845m40494N36855j72218Q1993N66607K51405
11974B782898N92102j409872k52760j97689p37654N01911J004280L9856l55270
11965A967802L62969M30864o0204J18159J02265j20512o08785L73233n45876o19164
11955A400751N0553n55496K96901N55773N77978k31796j69852Q76242k80111O27292
11945C148235n87404L55923O44257m29412p15007O42060p8356K82293j86601l15213
$$ plain form
12013 1674535 1294480 808378 1191459 1067621 606000 401444 -211438 143929 475265
12004 475265 -124652 537564 1429329 811763 329968 1579819 1567584 749241 1151122 589508
11994 589508 1495099 1739759 1109042 1277166 1963127 2325586 2142649 1403299 1908022 2455765
11984 2455765 1456102 1375911 960905 1958750 1518256 2055111 1882893 1964886 2531493 2782898
11974 2782898 3375000 1965128 1712368 1514679 777025 1278936 2283216 2323072 1967802
11965 1967802 2330771 2761635 2701431 2819590 2921855 2801343 2192558 2565791 2019915 1400751
11955 1400751 1451304 895808 1192709 1748482 2326460 2094664 1924812 2801054 2520943 3148235
11945 3148235 2560831 2916754 3561011 3131599 2416592 3058652 2980296 3262589 3075988 2760775
11935B760775L52677L55552m12401k96133L55214j315045J19942Q18807N96378
11926C335766Q69215r02005j83942o31547q07339Q20265L83925N85786J82977
11917C653101k01429o00156J47048j375352R88376N19335q2683K29881l91624
11908B886497J12859p39604m94937O92546O80720R87358R01536L94130q22237
11899D598868k08298L29668N8898p17107l8625O16381o26077j13583j73713M47367
11889D173779K54677q50653L70275P3225q31219L78463n43691L53445J271810
11880D650111m56898j34435J593749n92914j006246M27339M51738J78860o0399
11871E050905K55357P75522j87525m8881K94971m53840K37998o2076M73665L0909
$$ plain form
11935 2760775 3113452 3469004 3056603 2760470 3115684 1800639 1920581 2739388 3335766
11926 3335766 4204981 3302976 3119034 2487487 1680148 2500413 2884338 3470124 3653101
11917 3653101 3451672 2851516 2998564 1623212 2611588 3130923 3048240 3278121 2886497
11908 2886497 2999356 2259752 1764815 2457361 3138081 4125439 5026975 5421105 4598868
11899 4598868 4390570 4720238 4779136 4062029 4023404 4639785 4013708 3900125 3726412 4173779
11889 4173779 4428456 3577803 3948078 4021303 3190084 3568547 3024856 3378301 4650111
11880 4650111 4193213 4058778 5652527 5059613 4053367 4480706 4932444 5111304 5050905
11871 5050905 5306262 6081784 5894259 5845378 6140349 5686509 5924507 5862431 6336096 6367005
11861F367005R30811m29953L46802o31424K10664j61380k15530k74434J371175
11852G513736N27707q8755K17642l67363J104016M05431J68481o96426L48713
11843I133182o49410k29751N13222J27301r15133m5939R73159K29345O23069K89087
11833A0048132M69463j30426j47588O41607m05074K45559K13949L29675M11296
11824A1676593k35768l23276L25786n92180K053757m78161l09880K50380R13006
11815A3280257m40562O97966J225038l29876L16740L99854q71919P28283K73034
11806A5278815o80496L41218J51516K40013o10860J184484M68635p5161R49468
11797A7247632J170202K47536K59048N41036L66939j962954J305694P41112k7985
$$ plain form
11861 6367005 7297816 6867863 7214665 6583241 6793905 6632525 6416995 6142561 7513736
11852 7513736 8041443 7952688 8170330 7802967 8906983 9312414 9480895 8784469 9133182
11843 9133182 8483772 8254021 8767243 8894544 7979411 7933472 8906631 9135976 9759045 10048132
11833 10048132 10517595 10387169 10239581 10881188 10476114 10721673 10935622 11265297 11676593
11824 11676593 11440825 11117549 11443335 10851155 12904912 12426751 12116871 12367251 13280257
11815 13280257 12839695 13537661 14762699 14432823 14749563 15149417 14277498 15005781 15278815
11806 15278815 14598319 14939537 15091053 15331066 14720206 15904690 16373325 16298164 17247632
11797 17247632 18417834 18665370 18924418 19465454 19832393 17869439 19175133 19916245 19888260
11788A9888260R678K67060Q36314J84827M54384J382333J24398M41438O76725
11779B4265417J073967R32239J156304R3775P06391m66762o54809J617756O28756
11770B9353034J018270O08000J52293n407N02596J988155P38465K97754J043292
11761C5696452k73529o80507J21494J569927N32258O24703r5354M83803R90702
11752C8969949L79745P0459J47663J675145J169435N6331k82936L07262K43712
11743D2736765M31748R98691J219954L59009J047650k09505o5360J195042J159156
11734D8873150L82014N89144L83541J189059J121274m22228R78626O04975L21969
11725E4021524l13592J053645k26872l08913M49541Q00397K59211L89744l38343
$$ plain form
11788 19888260 19897938 20164998 21001312 21186139 21640523 23022856 23147254 23588692 24265417
11779 24265417 25339384 26271623 27427927 27521702 28228093 27761331 27106522 28724278 29353034
11770 29353034 30371304 30979304 31131597 31126190 31628786 33616941 34355406 34653160 35696452
11761 35696452 35422923 34742416 34863910 36433837 36966095 37590798 37495444 37979247 38969949
11752 38969949 39349694 39420153 39567816 41242961 42412396 42468727 42185791 42493053 42736765
11743 42736765 43168513 44167204 45387158 45746167 46793817 46584312 46518952 47713994 48873150
11734 48873150 49255164 49844308 50227849 51416908 52538182 52115954 53094580 53699555 54021524
11725 54021524 53707932 54761577 54534705 54225792 54675333 55475730 55734941 56124685 55786342
11716E5786342n72734O5820r6021P399N52741k26213J548848J308412j373605
11707E7000989l43802N66227J589734n6348m18235n41463o37451O88369j598683
11698E6249337j101370R31720J91180j051359Q78427M81514K3130O96396j44682
11689E7154293m83537N77288K12464O44673K62719L31319k74448K87030Q63822
11680E9575623k39108k52542m18389k55216J47856r60401M73531N10454j367747
11671E7214061o82691o57500j010550j575403o76638l81340j999981j094561m94093
11662D8641304q56581j419927j677656o85700o60931p61607j236874k213073o64847
11653C8464108k229633j906546q323k94068p60843j303014r40333j228182n22237
$$ plain form
11716 55786342 55213608 55279428 55183407 55190806 55743547 55517334 57066182 58374594 57000989
11707 57000989 56657187 57223414 58813148 58756800 58338565 57797102 57159651 57848020 56249337
11698 56249337 55147967 56079687 56270867 55219508 56097935 56579449 56602579 57298975 57154293
11689 57154293 56670756 57248044 57460508 58105181 58367900 58699219 58424771 58711801 59575623
11680 59575623 59336515 59083973 58665584 58410368 58558224 57597823 58071354 58581808 57214061
11671 57214061 56531370 55873870 54863320 53287917 52611279 52229939 50229958 49135397 48641304
11662 48641304 47784723 46364796 44687140 44001440 43340509 42578902 41342028 39128955 38464108
11653 38464108 36234475 34327929 34319606 34025538 33264695 31961681 31021348 29793166 29270929
11644B9270929j210764l71084j220762p93868r41281q11725p01784j095506j620058
11635B0504097k8389m20345q85771q51440p90352k63747J42791k15608k29683
11626A6961553p52980j190366l67302K65878j329369J40168j063284o56456J478
11617A2009320J15862p4905o19595J91214N4608n68172q30351o36122M42111l62604
11607I721366m51675j94366n9916l37756k96686n55620k57664P01829m81740J43444
11597G931216K0095m36090L46294n36302r8566r73436n02184O44498J8811O36185
11587G050521L78701n11983j1609j069567J75862m4220j369189O55223R3478k97031
11577E050186L7795k26068L55994p9076L46142M81593o41806J17967j062703k89152
$$ plain form
11644 29270929 28060165 27689081 26468319 25674451 24733170 23921445 23219661 22124155 20504097
11635 20504097 20475708 20055363 19169592 18318152 17527800 17264053 17406844 17191236 16961553
11626 16961553 16208573 15018207 14650905 14916783 13587414 13727582 12664298 12007842 12009320
11617 12009320 12125182 12050277 11430682 11621896 11676504 11108332 10277981 9641859 10083970 9721366
11607 9721366 9269691 9075325 9015409 8677653 8380967 7825347 7567683 8269512 7787772 7931216
11597 7931216 7951311 7515221 7861515 7325213 7226647 6253211 5751027 6395525 6414336 7050521
11587 7050521 7429222 6917239 6905630 5836063 6011925 5967705 4598516 5253739 5347217 5050186
11577 5050186 5087981 4861913 5217907 5138831 5484973 5966566 5324760 5442727 4380024 4090872
11567D090872p12095P82755P4708j58014k42870J95183L0102o50072r734J433770
11557D834605J69608k38136j187631m97716O57967N86834j057404J12566K38773
11548C619466P21431q60843j066068M51446M85074M9718Q63011O52393m31435
11539D484193K7862q5176J06364j365987n76150o11025M59031j9903P91010R69882
11529D180101o77426j54095j81863n25904p8764o5304m15954P15714j22893q1695
11519B591917J015053R85216L93464j084602j55072K11827k82012R0743J014962
11510D781496j651015r83677j77044O57223L34592q6580J76496J920j54299J218481
11500D117593M5431p22229K79850n69520P43717J71659J041700j328125j286180
$$ plain form
11567 4090872 3378777 4161532 4236240 4078226 3835356 4030539 4060641 3410569 3400835 4834605
11557 4834605 5004213 4766077 3578446 3080730 3738697 4325531 3268127 3380693 3619466
11548 3619466 4340897 3480054 2413986 2865432 3350506 3400224 4263235 4915628 4484193
11539 4484193 4512055 4426879 4533243 3167256 2591106 1980081 2439112 2419209 3210219 4180101
11529 4180101 3502675 3348580 3166717 2640813 2562049 2496745 2080791 2796505 2673612 2591917
11519 2591917 3606970 4592186 4985650 3901048 3745976 3957803 3675791 3766534 4781496
11510 4781496 3130481 2146804 1969760 2626983 2961575 2874995 3051491 3053411 2899112 4117593
11500 4117593 4163024 3440795 3720645 3151125 3894842 4066501 5108201 3780076 2493896
11491B493896p7668J30968P84726M87459q00714m86581k73070Q0785N74344Q20589
11481C734734P24389j125510m2799O91877n01842O78538m65958J89361R04326
11472D787116m00067j033157J38591J093028m61311n11990J82510J57340j020827
11463B931233o32599O29000P02074p096Q07877M20530k21921O46434o15428o07413
11453D052691n46165J002429M62756k65978K58963j477713J92405J30313m13614
11444C396087N63908O29709n73900o70773J91226J99681m38717M6220N20575K88732
11434D152748n14844L54800j24204M95695N50105j278554l8695M40747p32362
11425C305436L12916M23246m02781m34178P43794j87347l92587L7975K99687N91105
$$ plain form
11491 2493896 2416228 2547196 3331922 3819381 3018667 2532086 2259016 2339801 2914145 3734734
11481 3734734 4459123 3333613 3290814 3982691 3480849 4159387 3693429 3882790 4787116
11472 4787116 4387049 3353892 3492483 4585511 4124200 3612210 3794720 3952060 2931233
11463 2931233 2298634 2927634 3629708 3622612 4430489 4851019 4629098 5275532 4660104 4052691
11453 4052691 3506526 4508955 4971711 4705733 4964696 3486983 3679388 3809701 3396087
11444 3396087 3959995 4589704 4015804 3345031 3536257 3735938 3297221 3343441 3864016 4152748
11434 4152748 3637904 3992704 3868500 4364195 4914300 3635746 3597051 4037798 3305436
11425 3305436 3618352 4041598 3638817 3204639 3948433 3761086 3368499 3406474 3706161 4297266
11415D297266p24459r0816n50690n5461R24691n35384J19164K35695R19570k49768
11405D289808P28567n48141j90383J38500p77742M06688l67401P7205o8526m74936
11395C213639j63936J026668Q0335K63095O12204q89402j67p60250Q7605Q20389
11385D290180M96768r15257j116773O99375N81555l85578k78972P19763N02468
11376D593529r52131p78188q29355P3318J054910k70076N48734L56530K48032
11367D045303j49202j216408o4895P3833r12488M15408R0728l1337J51213M79274
11357B881429j17889k1175o36710l44373l62472K45365k84614j38559J58325n10006
11347H69321L30745k57799l10618N85194M31984K57276l37681j25232N63137J05634
$$ plain form
11415 4297266 3572807 3481991 2931301 2875840 3800531 3265147 3384311 3620006 4539576 4289808
11405 4289808 5018375 4470234 4279851 4418351 3640609 4047297 3679896 3757101 3688575 3213639
11395 3213639 3049703 4076371 4156706 4419801 5032005 4142603 4142436 3382186 3469791 4290180
11385 4290180 4786948 3871691 2754918 3454293 4035848 3650270 3371298 4091061 4593529
11376 4593529 3641398 2863210 2033855 2107173 3162083 2892007 3440741 3797271 4045303
11367 4045303 3896101 2679693 2614798 2688631 1776143 2191551 2282279 2250942 2402155 2881429
11357 2881429 2763540 2742365 2105655 1761282 1398810 1644175 1359561 1221002 1379327 869321
11347 869321 1200066 942267 631649 1216843 1648827 1906103 1568422 1443190 2006327 2111961
11337B111961p59217l04926R368j00828m76721O98667j13492m46459K2460P89515
11327A430328o91366q05411O5940j23580N94059o93665j22898L81380R05800Q19
11317I41406L68291K64305L14333m25935o92252q0799M83564j83071m32553J851119
11307B408408j73101q82310k91519K99946L62900k18829j25458j04429M85469
11298A761077r91046j080431Q45193j84929p82998K17941P61612J44601r47805
11289b56785o01838l67559M06053N86281O543P02138L91921M97130o46995o22541
11279I4348L8391K61312o8104j04220K43672K74286m99629l56679j23643L03644
11269F3378r7702k94759J239410K99772o79206o01946N01221r5351m99840L05252
$$ plain form
11337 2111961 1352744 1047818 1057186 956358 479637 1178304 1064812 618353 640813 1430328
11327 1430328 738962 -66449 -509 -124089 469970 -223695 -346593 34787 940587 941406
11317 941406 1309697 1574002 1888335 1462400 770148 689349 1172913 989842 557289 2408408
11307 2408408 2235307 1352997 1061478 1361424 1724324 1505495 1380037 1275608 1761077
11298 1761077 770031 -310400 534793 349864 -433134 -215193 546419 691020 -256785
11289 -256785 -858623 -1226182 -820129 -233848 -227305 474833 866754 1363884 716889 94348
11279 94348 132739 394051 325947 221727 465399 739685 240056 -116623 -240266 63378
11269 63378 -34324 -329083 910327 1210099 530893 -71053 430168 334817 -165023 140229
11259A40229P28117K21980k18572o39343k07889J52447m16783J98227K39917Q74609
11249A072939l07138j99576J265536m47549l51291r32538N04068R13901k10296
11240A308056l89360J52201o96047o98380M39619J87449l99921J1243j2010k60539
11230c57689P65468j081617J80694P46723n40898N95246j32712n09288Q06684
11221D72611L75252J56721n59893J19131J192671j23845j002058o95827j64087
11212b29324O91387M40269o88752l0536K69469n37949o02214K14178m47198O85956
11202b34714L81323j08270l37784L42380k57293J227708j178316j137895Q29814
11193d73047j77048J06929K88489o49092L7369P23103J156167q60813K4933J052396
$$ plain form
11259 140229 868346 1090326 871754 232411 24522 176969 -239814 -41587 198330 1072939
11249 1072939 765801 566225 1831761 1384212 1032921 100383 604451 1518352 1308056
11240 1308056 918696 1070897 374850 -323530 116089 303538 -96383 -85140 -97150 -357689
11230 -357689 407779 -673838 -493144 253579 -287319 307927 175215 -334073 472611
11221 472611 847863 1004584 444691 563822 1756493 1632648 630590 -65237 -229324
11212 -229324 462063 902332 213580 183044 452513 -85436 -687650 -473472 -920670 -234714
11202 -234714 146609 38339 -299445 42935 -214358 1013350 -164966 -1302861 -473047
11193 -473047 -650095 -543166 -254677 -903769 -866400 -143297 1012870 152057 176990 1229386
11183A229386n29286l91234o92613l34811l96778J842013k89473m77736j78048
11174b18580L97926l00848K3948L50048l39487o05044j76688L49764J07840l51434
11164g62555q5236k80801o0415L79536M44575M79042o76428p47672J113107J518281
11154A321434M27860m03817r23630p855N06511k85683n94540L72984O93129l64427
11144G41966l42834j29330o22647P53572N10264l81670k58750K63571k87487Q27649
11134A074304j81954l18974O70248m67884p73316k95980l18359j28476p93477
11125a533868M25553J345971L03421l71165k88900p45437K234j32904k42154j40960
11115a378209Q30156M87363M66378P36058O17902J256667j32809j203869n89820
$$ plain form
11183 1229386 700100 308866 -383747 -718558 -1115336 726677 437204 -40532 -218580
11174 -218580 179346 -121502 -97554 252494 -86993 -692037 -868725 -518961 -411121 -762555
11164 -762555 -847791 -1128592 -1189007 -809471 -364896 114146 -562282 -1309954 -196847 1321434
11154 1321434 1749294 1345477 421847 413992 920503 634820 40280 413264 1106393 741966
11144 741966 399132 269802 -352845 400727 910991 529321 270571 534142 246655 1074304
11134 1074304 892350 573376 1243624 775740 2424 -293556 -611915 -740391 -1533868
11125 -1533868 -1108315 237656 541077 169912 -118988 -864425 -862191 -995095 -1237249 -1378209
11115 -1378209 -548053 -60690 405688 1141746 1759648 3016315 2883506 1679637 1089817
11106A089817p9825j003522Q07048K52152r44294K28054N02586o9164p27795o00147
11096e45090J137192J37621O173q11100M57765K79917j42791l08918k03774j92363
11086a85368M02715K02663j52168n37216l32804k43038J26567P78498J597182
11077A657031o9256j578891m89834J22892J220838l58462r60960Q73476k61717
11068A55117L47766j38144l81607m74461N92592L91299N3382j81720m03181k88369
11058c27326j55424j16136J99402J53153L16532P02882o12008L29888M55469p43036
11048B03396L81520L7042q71363q28813N6270P62025P66664o5347j207929M64909
11038c01626J33031n23734P72613L61765L20932k07873l22843m90937j037858
$$ plain form
11106 1089817 1009992 6470 813518 1065670 121376 349430 852016 782852 55057 -545090
11096 -545090 592102 729723 735896 -75204 382561 662478 519687 210769 6995 -185368
11086 -185368 217347 420010 267842 -269374 -602178 -845216 -718649 59849 1657031
11077 1657031 1587775 8884 -480950 -358058 862780 504318 -456642 416834 155117
11068 155117 502883 364739 -16868 -491329 101263 492562 545944 364224 -38957 -327326
11058 -327326 -482750 -598886 -399484 -246331 70201 773083 161075 490963 946432 203396
11048 203396 584916 621958 -249405 -1078218 -1021948 -259923 506741 441394 -766535 -301626
11038 -301626 -168595 -692329 80284 442049 762981 555108 232265 -258672 -1296530
11029a296530J370353L26385k81572p98535M2328j73371J266634K03587Q2904
11020G42183p44837l55625K88941j29912O42896J57198j125415K39773L59490
11011G4692K06053r68931J97156k4745q91358J68121m41344j53874N01528R26363
11001d06339J09944J075699R51241l70618r46383n63027N72970k94141n11636
10992c82290j92530J10934K27185n72084l29987L89776k66479M88734K40852J273281
10982I87392j276561j170945R54800K71133P3392l62219n80910R48921k81866
10973d36863p3592J41398r24243R40507M2553l51920K41995J56815n77662k52234
10963a093246K42635J749496O56853o30295m37946j31997K49075L03883J8002
$$ plain form
11029 -1296530 73823 400208 118636 -679899 -637571 -810942 455692 659279 742183
11020 742183 -2654 -358279 -69338 -199250 443646 600844 -524571 -284798 74692
11011 74692 280745 -688186 -491030 -515775 -1407133 -1239012 -1680356 -1834230 -1332702 -406339
11001 -406339 -296395 779304 1730545 1359927 413544 -149483 423487 129346 -382290
10992 -382290 -574820 -463886 -236701 -808785 -1138772 -748996 -1015475 -526741 -285889 987392
10982 987392 -289169 -1460114 -505314 -234181 -160789 -523008 -1103918 -154997 -436863
10973 -436863 -510455 -369057 -1293300 -352793 -310240 -662160 -420165 -263350 -841012 -1093246
10963 -1093246 -850611 898885 1555738 925443 487497 355500 604575 908458 926460
10954I26460N01907j75353p65726k35367o44407P6344o04111n21342R21027J62994
10944c57574m17748L95004J055049m76618k70122m13845l12268L99590J385785
10935I87253j000730r87412J43086j67090R89119O73755m3436N2081M2965L2697
10925G22288P26045L03279m49793p3280j74443l44724k76234N59116j21807J63335
10915A033782o37359K46973o16181J00435M90830m21016k71118R02081k02337
10906F26090J34771n58093O2030M90274j396059K11724N00255q46593j04824J027616
10896A47191J21577n3832M6053q62339N48885L6200l60218N02197N29718o84881
10886b9449P42309J18517j8212j50197j155736k2749l40231J744914Q389J725
$$ plain form
10954 926460 1428367 1253014 487288 251921 -392486 -316142 -920253 -1441595 -520568 -357574
10944 -357574 -775322 -380318 674731 198113 -72009 -485854 -798122 -398532 987253
10935 987253 -13477 -1000889 -857803 -1024893 -35774 637981 594545 646626 689591 722288
10925 722288 1448333 1751612 1301819 1228539 1054096 709372 433138 992254 870447 1033782
10915 1033782 396423 643396 27215 127650 618480 197464 -73654 828427 626090
10906 626090 760861 202768 264798 755072 -640987 -429263 70992 -775601 -880425 147191
10896 147191 268768 214936 260989 -601350 -52465 -16265 -376483 125714 655432 -29449
10886 -29449 712860 831377 813165 662968 -492768 -515517 -855748 889166 897555 899280
10876H99280K27283j20714r73297j168382l68567Q45817R20240m15111k89130
10867d42581K24582L24123R19318j60979j67044l08835Q03373k65362k3269q27602
10857G5724J23893K7559L7700p35603j601359K48690O61349P96924J98150L91595
10847B24622N2012L9547m04964q43127M44406k25678N00380k3844q7603J036581
10837G12332j667542L53548o16392O8297J802250K7564n8545j06213j171178o58990
10827a314869J286343N35110m75578l76911M48149m84430K62709M21688K40739
10818E42950l30082m5332q04087k66734J186626O31049k93151N77309j81558j220066
10808b03076N45188N2750K67433j00705N7738l84586M130R29444j4856L06872
$$ plain form
10876 899280 1126563 1005849 32552 -1135830 -1504397 -658580 261660 -153451 -442581
10867 -442581 -217999 106124 1025442 864463 697419 388584 1191957 926595 903326 75724
10857 75724 199617 227176 264876 -470727 -2072086 -1823396 -1162047 -365123 -166973 224622
10847 224622 276634 316181 -88783 -931910 -487504 -713182 -212802 -236646 -324249 712332
10837 712332 -955210 -601662 -1218054 -1149757 652493 680057 621512 515299 -655879 -1314869
10827 -1314869 -28526 506584 31006 -345905 102244 -382186 -119477 302211 542950
10818 542950 212868 167536 -636551 -903285 283341 914390 621239 1198548 1016990 -203076
10808 -203076 342112 394862 662295 561590 619328 234742 238872 1168316 1153460 1460332
10798A460332j176697J78075L41242r20684j042523j95706O673k59018J373569
10789b34737l03880l21633J763m14186Q23277J284640k28516n18747j293766n09089
10779a714874Q84969K3522P63123o69991n56466J594127q02979m16330L39101
10770e55798K08667p59343M58296N6020Q7050M12017N49171m86761j71098L56400
10760A54621p86206R86299J42378l57255m98816J30622J58357p59339J083642
10751B54303p92648l26855M81646O70218K0365l70237L69306J41724J55767k05757
10741C97832R5460j66143L91189n25416P19285o80211m32787l77577M18171N4253
10731a05944j53127n04732P05405K86762J20308K46502r09937P685r42761J36968
$$ plain form
10798 1460332 283635 461710 802952 -117732 -1160255 -1355961 -1349288 -1608306 -234737
10789 -234737 -538617 -860250 -858487 -1272673 -449396 835244 606728 87981 -1205785 -1714874
10779 -1714874 -829905 -806383 -43260 -713251 -1269717 324410 -478569 -894899 -555798
10770 -555798 -347131 -1106474 -648178 -592158 -505108 -93091 456080 -30681 -201779 154621
10760 154621 -631585 354714 497092 139837 -358979 -228357 -70000 -829339 254303
10751 254303 -538345 -865200 -383554 286664 307029 -63208 306098 447822 603589 397832
10741 397832 493292 327149 718338 192922 912207 231996 -200791 -578368 -160197 -105944
10731 -105944 -259071 -763803 -58398 228364 348672 595174 -314763 -307078 -1249839 -1112871
10721a112871M23112J302622p16145n91189J268572l71141J056105n92824q46656
10712a80415j05919n60397P52770L81493P0165q34315k71540R88935l76794n70205
10702g06222K45237L74817L03951L24523j30244r33368Q36952L20153j333964
10693f98165q818Q62356N92565p82961J08591M47791k45077M14154k55238M68413
10683I03611o23746J79857l03742N82324P13497j207064j550766j79828J427920
10674e7937O49024o05243k36732M1657K37267K35490j38665n52262K89317P46060
10664F07976j243857M80560R84321p01862l49389l72177J62801L16447O552r19542
10654a028170Q06675M08288p5922q75092K13455N41441K37406j57543L81048R03560
$$ plain form
10721 -1112871 -689759 612863 -103282 -694471 574101 202960 1259065 666241 -180415
10712 -180415 -286334 -846731 -93961 287532 357697 -476618 -748158 240777 -136017 -706222
10702 -706222 -460985 -86168 217783 542306 412062 -521306 315646 635799 -698165
10693 -698165 -706983 155373 747938 -35023 73568 521359 276282 690436 435198 903611
10683 903611 279865 459722 155980 738304 1451801 244737 -1306029 -1485857 -57937
10674 -57937 591087 -14156 -250888 -209231 28036 263526 124861 -427401 -138084 607976
10664 607976 -635881 -155321 829000 127138 -222251 -594428 -431627 -115180 -108628 -1028170
10654 -1028170 -221495 186793 110871 -764221 -550766 -9325 228081 70538 451586 1355146
10644A355146p6551j34876p28924j176760J67553j4885R29386j98347m87447P92342
10634D26637n49019L51204q35326o6892L69350K76988J69670l83848j50857n45451
10624i37544K75298J695324j51574J78059r64269q18660Q20133q6189q28561K80246
10614e37737l79954L96290J224156J2593m72539M89688q97381J67257j39672j86494
10604c23793o45962L51365R46955J052920K27509q10413L1396j121711j2817K13328
10594i1223r14726O62409M08021o61531K3021J087546l86483L12438K10090m78681
10584A70881l56534Q58431J167056j278743J12134j84978m45599l24378p48817
10575a030547O51401K56210K07738m9278k59022N02556l01917n03683M43833k02605
$$ plain form
10644 1355146 1278595 1143719 414795 -761965 -594412 -609297 320089 121742 -365705 426637
10634 426637 -122382 228822 -606504 -673396 -304046 -27058 142612 -241236 -392093 -937544
10624 -937544 -662246 1033078 881504 1059563 95294 -723366 96767 10578 -817983 -537737
10614 -537737 -917691 -521401 702755 715348 242809 732497 -164884 2373 -137299 -323793
10604 -323793 -969755 -618390 328565 1381485 1608994 798581 829977 -291734 -304551 -91223
10594 -91223 -1005949 -343540 64481 -597050 -574029 513517 127034 439472 649562 170881
10584 170881 -185653 672778 1839834 561091 673225 488247 42648 -281730 -1030547
10575 -1030547 -379146 -122936 84802 35524 -223498 279058 -22859 -526542 -82709 -285314
10565b85314j39608p4878J87303P890R76751N56662N33342p84715j171574k81213
10555d75354R01030N39996k101442K1044M98746k46032P61582Q77772N33627m82653
10545H28316j327710L64529J34410J875078k64196J16462r08482J1858l6174J6767
10535H10858O1352L31274n98569n72712o8568k28435P32081N35218l49266j218023
10525e64790l38707j14354K10033Q89646J37805J00495l47801L15570J58526Q3497
10515E29920q0893m55078p98501J9301N27752o45657k59314K30304N80220R65895
10505F13949j82221k05332N1176j14637o27807n7859l16950O65502J446641k88746
10495I83716m12193l53211l38719L43333q8960p94066N58833J073395p15228j32621
$$ plain form
10565 -285314 -424922 -499800 -312497 -304607 672144 1228806 1762148 977433 -194141 -475354
10555 -475354 425676 965672 -1135770 -1114726 -615980 -862012 -100430 777342 1310969 828316
10545 828316 -499394 -134865 -455 1874623 1610427 1726889 818407 830265 794091 810858
10535 810858 872210 1203484 604915 32203 -36365 -264800 467281 1002499 653233 -564790
10525 -564790 -903497 -1017851 -807818 81828 219633 320128 -27673 287897 446423 529920
10515 529920 449027 -6051 -804552 -785251 -257499 -903156 -1162470 -932166 -351946 613949
10505 613949 431728 226396 277572 162935 -464872 -522731 -839681 -174179 1272462 983716
10495 983716 571523 218312 -120407 222926 133966 -660100 -101267 972128 256900 124279
10485A24279Q72464j31988r5796q74579M94182m24460L95774m0821j2596J12750
10475D19209o30079n1523J116482L32795k82938l13582j10238p78198K60020J124909
10465A086857K49358q96298n68153K45657m83897k31189K52175R41176Q24175
10456A419861l31143q41350j320948M07448J075376N24451M11984J57878p31627
10447G71930q02387n31246M26609j53330l46007N29403O54092J179442P6615r58675
10437H46446J56129n83365r58240q3967k25835N22393J68169p52929J22424L7554
10427g51221M10100Q29961L87348M58822p14432L12302K40314M20020o76364n55425
10417C61425N88568p48718K06742j43004L78512m48456k00762j23563Q97106O66184
$$ plain form
10485 124279 996743 864755 768959 -105620 388562 -35898 359876 319055 306459 419209
10475 419209 -210870 -262393 854089 1186884 903946 590364 480126 -298072 -38052 1086857
10465 1086857 1336215 439917 -128236 117421 -366476 -597665 -345490 595686 1419861
10456 1419861 1088718 247368 -1073580 -666132 409244 933695 1345679 1503557 771930
10447 771930 -30457 -561703 -135094 -288424 -634431 -105028 549064 1728506 1805121 846446
10437 846446 1002575 419210 -539030 -622997 -848832 -326439 -158270 -911199 -788775 -751221
10427 -751221 -341121 488840 876188 1335010 620578 932880 1173194 1593214 916850 361425
10417 361425 949993 201275 408017 265013 643525 195069 -5693 -129256 767850 1434034
10407A434034l35758l3685j53451o47989p73670J65083M66842p5309R61965Q35399
10397A843461j109754M22994m72910L00057k53345O19630Q6193q86302M6377N18134
10387A114535o67013j7864L910m58383P76679j064050R1679N50902K4136Q95897
10377A250428j005309m18133l7485L03022O97961L09446k89747q6545J93630l13268
10367F04000l20843P25342Q6595l39437M15463m02595O3770l93297J063165k49758
10357A252405m38772N59759J05712o65590l77660N15273j2357L99535k85175j25115
10347I28015m03464J77946P99850N92265o55466M14448J95475q64852n94261M04349
10337I94305Q70378n15194j25530P89038o41524k09781j2152k8797R26091j124988
$$ plain form
10407 1434034 1098276 1064591 911140 263151 -510519 -345436 121406 46097 1008062 1843461
10397 1843461 733707 1156701 683791 983848 730503 1350133 1436326 550024 596401 1114535
10387 1114535 447522 429658 433568 -24815 751864 -312186 -220507 330395 354531 1250428
10377 1250428 245119 -173014 -210499 92523 790484 1099930 810183 723638 917268 604000
10367 604000 283157 1008499 1095094 755657 1171120 768525 832295 438998 1502163 1252405
10357 1252405 813633 1373392 1479104 813514 435854 951127 938770 1338305 1053130 928015
10347 928015 524551 702497 1502347 2094612 1439146 1853594 2049069 1184217 589956 994305
10337 994305 1864683 1349489 1223959 2012997 1371473 1161692 1149540 1120743 2046834 921846
10327I21846q42726Q73322l2830p24343m09964n90620K69586J606626n2370k52426
10317G66101o84105r868J387129J31716l56108O14604j38048j233586j430346
10308i52511M21400J138490o2326q9026M41699J166005m47368n38770j83943J054
10298H94704o63254n72234Q66062J74496m05541m97790J84173J48169k48883J45849
10288B5751k48433P08896p81326K33407j36271J83366O26019J64044l89179J16386
10278E02660m01932J052151P73667o90918n45434K51640r93605R29927M19885
10269A298041M16112r5567m23225j91091n98626J39641l95218M98606q9795K73272
10259H32150j39359N93303l62722q31372p4041J01805n57865M56852k78778J193821
$$ plain form
10327 921846 79120 952442 919612 195269 -214695 -805315 -535729 1070897 1018527 766101
10317 766101 81996 72128 1459257 1590973 1234865 1849469 1711421 477835 -952511
10308 -952511 -531111 607379 545053 456027 897726 2063731 1616363 1077593 893650 894704
10298 894704 231450 -340784 525278 699774 294233 -203557 -19384 128785 -120098 25751
10288 25751 -222682 486214 -295112 -61705 -197976 -14610 611409 775453 386274 502660
10278 502660 100728 1152879 1926546 1235628 690194 941834 -51771 878156 1298041
10269 1298041 1714153 1618586 1195361 1004270 405644 545285 150067 648673 558878 832150
10259 832150 692791 1286094 923372 92000 17959 119764 -438101 18751 -260027 933794
10249I33794m63477j138974Q9482O09235n36784N69336M26815q1185J43905l91430
10239A60717M32300J6079l37883n81021q2697l12938R79183J64736r48833r7388
10229f07745k70195L90828K39095N59980O88029k60518p24002L35451k72700N1314
10219A29537k83410m3204J61060M12449Q09773j178939j4917O09896q69037q3073
10209c49865J82799N49246K54371L54577m35874O37033j17744j014622K59598
10200C19519P00403L89457O72665p52417j207421J62883J16659M94034P6595J06914
10190A079291p69008Q67170o11679j18878n7620L04131o59925j010320N24538
10181d52300K84714k85096J39933N99943L23591j50556p86747l86713N90111L48488
$$ plain form
10249 933794 470317 -668657 -579175 30060 -506724 62612 489427 408242 552147 160717
10239 160717 593017 609096 271213 -309808 -392505 -705443 273740 438476 -510357 -607745
10229 -607745 -877940 -487112 -248017 311963 999992 739474 15472 350923 78223 129537
10219 129537 -153873 -197077 -36017 376432 1186205 7266 -7651 602245 -266792 -349865
10209 -349865 -167066 382180 636551 991128 555254 1192287 1074543 59921 319519
10200 319519 1019922 1409379 2082044 1329627 122206 285089 401748 895782 972377 1079291
10190 1079291 310283 1177453 565774 446896 389276 693407 33482 -976838 -452300
10181 -452300 -167586 -452682 -312749 287194 610785 460229 -326518 -713231 -123120 225368
10171B25368O93506j56589k02024K63757L14015j265191j83125N42127N43482
10162G75326N89441m05736r14638n88986P14229o0424o93248l85775P59166J68911
10152d1734N85910M79130q39937M15465L52548k34657O57027l62077q49954o83482
10142e21761j37323M84693L98550M80057q82032J75397Q92814o51843n88864J068202
10132G17890N18860m28824m49560l72197j66916O09765J23423N14492J34685j639084
10122d37466k5345P68887Q2667j189841p41353J171604J401893N71717m92947
10113A109816q04391l79544m2203J0841L18091K83816m62763Q51534o0921j65693
10103F58583j96873L26216K20619J87461k06632l11186n39468M58739Q26895L61655
$$ plain form
10171 225368 918874 762285 560261 824018 1138033 -127158 -310283 231844 775326
10162 775326 1364767 959031 44393 -544593 169636 109212 -584036 -969811 -210645 -41734
10152 -41734 544176 1023306 183369 598834 951382 716725 1373752 1011675 161721 -521761
10142 -521761 -659084 -174391 224159 704216 -177816 -2419 890395 238552 -350312 717890
10132 717890 1236750 807926 358366 -13831 -180747 429018 552441 1066933 1201618 -437466
10122 -437466 -462811 306076 388743 -801098 -1542451 -370847 1031046 1602763 1109816
10113 1109816 305425 -74119 -116322 -105481 212610 496426 33663 885197 824276 658583
10103 658583 461710 787926 1008545 1196006 989374 678188 138720 597459 1424354 1786009
10093A786009j074854n52259K0012L46603m424p46293N70543j76374K08774J86281
10083E64018k17943J387641K7966m96798m82529k20115o84703M56702M71441p59767
10073D5913j32662P68596k95503l73592J001236q42119M31077L3553q17568m89136
10063f70205J189282n58366k42043J321840k74437r55966J373538R08727r86132
10054A106238L64936m48838p49602p597R6637m4327J19639j22059N75748l42356
10044E48419Q0550p2119p51032N21058K16447j80611p86237L46866L5257J51062
10034A09660O15964m59550N61698L08354P88024K84727j39329p97885j028381
10025B43282k09675n48262L95601j90584J035945J85074j170397j15454M67417
$$ plain form
10093 1786009 711155 158896 178908 525511 521087 -225206 345337 168963 377737 564018
10083 564018 346075 1733716 1761682 1264884 782355 562240 -122463 334239 805680 45913
10073 45913 -86749 681847 386344 12752 1013988 171869 602946 636499 -181069 -670205
10063 -670205 519077 -39289 -281332 1040508 766071 -189895 1183643 2092370 1106238
10054 1106238 1471174 1022336 272734 265137 361774 317447 437086 315027 890775 548419
10044 548419 628969 556850 -194182 326876 543323 362712 -423525 -76659 -41402 109660
10034 109660 725624 266074 827772 1136126 1924150 2208877 2069548 1271663 243282
10025 243282 33607 -514655 -119054 -309638 726307 911381 -259016 -374470 92947
10016I2947L23086J06592o33887q61961R89750M37541P529J11912K60850j200016
10006c65657O054N51702O88108Q76443q71186l53045K16851l98077o80511N67859
9996B38541l66111m59314L99345J027345j71640j48814Q0523J208814j68235n96630
9986A043824j53961p4208o36040N30059K9579J78499P29514r7703j110281L36791
9976G76073J63765k62331n20402J418818N71025j783550m72703K16549J172023
9967A279267M15050o51354k47421J403095j06738k85692j66315L78543K73611
9958B292046k47791O43563P34336q23478l01519k28439J97660J67200l71076J6372
9948B078874k97836M64328J198882p5720j17332j083617q57348k72979N16542
$$ plain form
10016 92947 416033 522625 -111262 -973223 16527 454068 461597 573509 834359 -365657
10006 -365657 -359603 192099 880207 1756650 885464 532419 749270 351193 -329318 238541
9996 238541 -127570 -586884 -187539 839806 668166 519352 599875 1808689 1640454 1043824
9986 1043824 889863 815655 179615 709674 739253 917752 1647266 1549563 439282 776073
9976 776073 939838 677507 157105 1575923 2146948 363398 -109305 107244 1279267
9967 1279267 1694317 1042963 795542 2198637 2091899 1806207 1639892 2018435 2292046
9958 2292046 2044255 2687818 3422154 2598676 2297157 2068718 2266378 2433578 2062502 2078874
9948 2078874 1781038 2245366 3444248 3368528 3251196 2167579 1310231 1037252 1553794
9939A553794J262167O68131r0128J15929j072248k76510k92691K0102P89464n12033
9929B165977r52489N87149o924j178329N06762J06424k15904j61691N6841L48651
9919A256467j015781p72181L75228M6820J033334Q09181K70240n35003k85870
9910A182435J245870M3445p67943p11184J96717J045810q87388J51140q33703
9901F65199N29256J248881r34048q5603r9740r6613n50567k11246j96443L93620
9891F62696N26720Q6528J29318j209714j077791J900282J012689K41894n03061
9882A769561r1334r72247l05185O29608j30066j54482Q8833K46462K11263K02885
9872A495298o10712O03799M81610N60247j429042n7070P12566L43396J560992
$$ plain form
9939 1553794 2815961 3484092 3393964 3509893 2437645 2161135 1868444 1888546 2678010 2165977
9929 2165977 1213488 1800637 1793713 615384 1122146 1228570 1012666 850975 907816 1256467
9919 1256467 240686 -531495 -156267 -109447 923887 1733068 2003308 1468305 1182435
9910 1182435 2428305 2471750 1703807 992623 1189340 2235150 1347762 1498902 665199
9901 665199 1194455 2443336 1509288 1423685 1323945 1227332 676765 465519 269076 662696
9891 662696 1189416 1275944 1405262 195548 -882243 1018039 2030728 2272622 1769561
9882 1769561 1678227 705980 400795 1030403 900337 745855 834688 1081150 1292413 1495298
9872 1495298 884586 1488385 1969995 2530242 1101200 1044130 1756696 2100092 3661084
9863C661084m79404n8016j131233o65875K2823O1216l58810M53028L01515j93306
9853A613022k15025N58894M82908o64345q22346l02163o8017J87142k2664n03510
9843B43896J567166Q43000j259864L69342k09258r39552M93864j13529k06312
9834G88753N23392L56814P3627O9440m79654N14222n7187j86532m52477J69126
9824A319524O37964J8047o37343l61506r2535R55149o20475m32450M41621n02375
9814G25621m51748O64684j34619j82852M7587N43338J83758M35298J92482M96635
9804B520184J20239r32650L4690o95339M4217j63000J58953J187581j12174P81287
9794B943988m02185o27470J720829q2987j092111l40643o4902M85451J82456j11039
$$ plain form
9863 3661084 3181680 3123664 1992431 1326556 1349379 1410595 1051785 1504813 1806328 1613022
9853 1613022 1397997 1956891 2439799 1775454 953108 650945 582928 770070 747406 243896
9843 243896 1811062 2654062 1394198 1763540 1554282 614730 1108594 995065 788753
9834 788753 1312145 1668959 1742586 1812026 1332372 1846594 1789407 1602875 1150398 1319524
9824 1319524 1957488 1975535 1338192 976686 884151 1839300 1218825 786375 1227996 725621
9814 725621 273873 938557 803938 621086 668673 1212011 1395769 1831067 2023549 2520184
9804 2520184 2640423 1707773 1742463 1047124 1091341 928341 1087294 2274875 2162701 2943988
9794 2943988 2541803 1914333 3635162 3552175 2460064 2119421 2054519 2539970 2722426 2611387
9784B611387p57514P77854N24846j57732l19064j259987j323414J4106J241661
9775A352143Q46343o67976p91773J157453N96479l73609o07750P51249P8888J7943
9765B359390m497j18206J20705j6720N66824P42257L31400j103624J05649j7654
9755B965524p06430Q5586L6156q37992J170123j52155P67626o97730k31776K81121
9745B680053o11253K24391J4077J246622j40991J045403j124706j35219P78280
9736C976657J47051k63949m44055j076832K83250O05889m28961m8274N3236l45691
9726B458321J372321q7023k8637o17608l18019r06396J92730R80506N34314p8174
9716C502335q91082J026721j50423p0408L27481N90386J36488m7964q74915Q67936
$$ plain form
9784 2611387 1853873 2631727 3156573 2998841 2679777 1419790 96376 110482 1352143
9775 1352143 2198486 1530510 738737 1896190 2492669 2119060 1511310 2262559 2341447 2359390
9765 2359390 2354893 2236687 2357392 2340672 2907496 3649753 3981153 2877529 2983178 2965524
9755 2965524 2259094 2344680 2380836 1542844 2712967 2560812 3328438 2630708 2398932 2680053
9745 2680053 2068800 2293191 2307268 3553890 3412899 4458302 3333596 3198377 3976657
9736 3976657 4123708 3859759 3415704 2338872 2622122 3228011 2799050 2750776 2804012 2458321
9726 2458321 3830642 3743619 3714982 3097374 2779355 1872959 2065689 3046195 3580509 3502335
9716 3502335 2611253 3637974 3487551 3417143 3744624 4335010 4471498 4423534 3548619 4416555
9706D416555R68718l29215j1832j419976M96790l44129j4166P62322o32101o10296
9696C282670L61820N3157J74387M05529N19748K80751N34604l52654n4338o76299
9686D529375r98133Q32270P24575L72106O41968M0373M35343M96354J5691p22828
9676F367094k80359J134503N80288n59510M03838R09897J17275J7896q17151Q70117
9666H743888p08463K89196m57632L46741J346923n24132P1912P1289k251K46443
9656I423914J01793J149849N17075M97743J44142Q48282J289776P70651o38301
9647A4104924N57259J034976l75750R96112O14842O69849J444957R31255J186589
9638B1165013M89815P22549N37618K279360K229434L65035R85710J637795J474910
$$ plain form
9706 4416555 5385273 5056058 5044226 3624250 4121040 3776911 3762745 4525067 3892966 3282670
9696 3282670 3644490 3697647 3872034 4277563 4797311 5078062 5612666 5260012 5205674 4529375
9686 4529375 3531242 4363512 5088087 5460193 6102161 6142534 6577877 7074231 7089922 6367094
9676 6367094 6086735 7221238 7801526 7242016 7645854 8555751 8673026 8690922 7873771 8743888
9666 8743888 8035425 8324621 7866989 8213730 9560653 9036521 9108433 9179722 9177471 9423914
9656 9423914 9525707 10675556 11192631 11690374 11834516 12682798 13972574 14743225 14104924
9647 14104924 14662183 15697159 15321409 16317521 16932363 17602212 19047169 19978424 21165013
9638 21165013 21654828 22377377 22914995 25194355 27423789 27788824 28774534 30412329 31887239
9629C1887239J188012J739540K988036J433070R58781j87800Q06027J463691J881545
9620D4158141J336315N95534J057960P85609J108097J124272J194211O35531K330395
9611E4326065L463109K061554J004607K724795L490649L652175K062344M009940
9603G6795238M301570N313040M670421O533727O570325O260759R293452Q725639
9595A28464171R419160J1716246J3549728J4198081J5998323J7497648J9374825
9588B30218182K1007718K2796143K2101683K0716911K0497039J6428403J2930428
9581C66696507J0571763P454815Q038973L530826Q72231K4927k220429n004157
9573C89965456r262283j1737154j2024324j5483846j9122710j6941020j6262188
$$ plain form
9629 31887239 33075251 34814791 37802827 39235897 40194678 40006878 40812905 42276596 44158141
9620 44158141 45494456 46089990 47147950 47933559 49041656 50165928 51360139 51995670 54326065
9611 54326065 57789174 59850728 60855335 63580130 67070779 70722954 72785298 76795238
9603 76795238 81096808 86409848 91080269 97613996 104184321 110445080 119738532 128464171
9595 128464171 137883331 149599577 163149305 177347386 193345709 210843357 230218182
9588 230218182 251225900 274022043 296123726 316840637 337337676 353766079 366696507
9581 366696507 377268270 384723085 392762058 396292884 397165115 397190042 394969613 389965456
9573 389965456 380703173 368966019 356941695 341457849 322335139 305394119 289131931
9566B89131931j3353176j1812769r269726q137752p446034r420358j1550283r044456
9558B09097377r869399r283469q629585r123955r223296q695310r001581q409430
9550A36861352q111164r139363r926765q061768o706753o980445n419152n602289
9542G6913653l781924m891627k939632k601345k352340k340686j914959k156364
9534E3934776k028595j408068n24834j597857k304112r40049j486284k78769j290301
9525D2075907j043968j627508o07338L23007j288788j538106p12849j549774k295713
9516C1734870J44096l58168j819467n82979k52383q97167q44497r6002J14774
9507B7143077j254726j37561R3405p67659k79444j694828l55264j225978o18143
$$ plain form
9566 289131931 275778755 263965986 254696260 246558508 239112474 229692116 218141833 209097377
9558 209097377 199227978 189944509 181314924 172190969 162967673 154272363 145270782 136861352
9550 136861352 128750188 119610825 109684060 101622292 94915539 87935094 82515942 76913653
9542 76913653 73131729 68240102 65300470 62699125 60346785 58006099 56091140 53934776
9534 53934776 51906181 50498113 49973279 48375422 46071310 45131261 43644977 43366208 42075907
9525 42075907 41031939 39404431 38797093 39120100 37831312 36293206 35580357 34030583 31734870
9516 31734870 31878966 31520798 29701331 29118352 28865969 27968802 27124305 27028303 27143077
9507 27143077 25888351 25750790 25844195 25076536 24797092 23102264 22747000 21521022 20902879
9498B0902879L25140m62128j396007J20000j291666n63696o58752J5091q80909
9489A6109952J38508n96057m0491r45520j151841J175368j05090K45178M81930
9480A5311937Q58322o7444J09317J73041J61540r59016l80559p18901P75936n92542
9470A4671631N96500Q26114m07551j111283j449139Q6482J21913j14239j91197
9461A3029231p94847j244856j999745k02347N0629J27749j94469L5326L77108
9452I183779j785803K422O74167L06040K85990p95962j153237p24731Q23902m27931
9442F388636P93339k84113l72001k14170M65548K95119j397859j04038L80366
9433E950827k63262j0381l85642o57505J137267j619218j72694L18714n35325
$$ plain form
9498 20902879 21228019 20765891 19369884 19489884 18198218 17634522 16975770 16990861 16109952
9489 16109952 16248460 15652403 15611912 14666392 13514551 14689919 14584829 14830007 15311937
9480 15311937 16170259 16102815 16212132 16385173 16546713 15587697 15207138 14488237 15264173 14671631
9470 14671631 15268131 16094245 15686694 14575411 13126272 13212754 13334667 13220428 13029231
9461 13029231 12234384 10989528 8989783 8787436 8838065 8965814 8771345 8806671 9183779
9452 9183779 7397976 7400398 8074565 8380605 8666595 7870633 6717396 5992665 6816567 6388636
9442 6388636 7181975 6897862 6525861 6311691 6777239 7072358 5674499 5570461 5950827
9433 5950827 5687565 5677184 5291542 4634037 5771304 4152086 3979392 4298106 3762781
9424C762781Q68492K00798l11008r9051l95537j19671j123880R18407M46094k60448
9414C886977j25108l64846L79188N88055k66199M54430P45557k93747q54549J2199
9404D161957K09655p92958n61051n02470O91967P68168j068955N78439N3745p12783
9394B825714P5632L66552O179n25740J17349q7495j30532j06715R17359l20263
9384C138040P31088m79583O82418j64508J74335l08522o74942P6873k71604m29541
9374B474054j49141J247748K60952j67957p19197N70211M74143j145107n81290
9365B264416P04886L14251Q47410l83895J72381n79691q79743P42014p69146k15692
9355B217191k92280L66264J001888P29266r6004j466022L12719M77327M29624
$$ plain form
9424 3762781 4631273 4832071 4521063 4422012 4026475 3906804 2782924 3701331 4147425 3886977
9414 3886977 3761869 3397023 3776211 4364266 4098067 4552497 5298054 5004307 4149758 4161957
9404 4161957 4371612 3578654 3017603 2515133 3207100 3975268 2906313 3484752 3538497 2825714
9394 2825714 2901346 3267898 3274077 2748337 2865686 2778191 2647659 2540944 3458303 3138040
9384 3138040 3869128 3389545 4071963 3907455 4081790 3773268 3098326 3175199 2903595 2474054
9374 2474054 2324913 3572661 3833613 3665656 2946459 3516670 3990813 2845706 2264416
9365 2264416 2969302 3283553 4130963 3747068 3919449 3339758 2460015 3202029 2432883 2217191
9355 2217191 1924911 2291175 3293063 4022329 3926325 2460303 2773022 3250349 3679973
9346C679973m01246J97727R01554j29507j133864O42177m2369o2415j60113r80102
9336B511815P57729n15613o8405M12973Q3523m97935p7631J425070j97421J37130
9326C971235q19119j033193k01775k27430Q10043k60706p57414m33836L59076
9317A406881R09383k20057O30625j25175R2176L99097o94506O00846l94909R71021
9307C575382j09298J53569j25490m96175o9902O55278p82485q59830K87616n38529
9297A690136Q51855L91991n07322O79203Q23316l65915o66530o56865M22994J346706
9287D009569J16956L8924k87836k55344J53164J39271l84194L74503P74059r85879
9277C693193j66627O63292L41398l44230m56768j97234J009030N50536n27302
$$ plain form
9346 3679973 3278727 3476454 4378008 4248501 3114637 3756814 3714445 3652030 3491917 2511815
9336 2511815 3269544 2753931 2685526 3098499 3182022 2684087 2606456 4031526 3834105 3971235
9326 3971235 3152116 2118923 1917148 1689718 2499761 2239055 1481641 1047805 1406881
9317 1406881 2316264 2096207 2726832 2601657 2693833 3092930 2398424 2999270 2604361 3575382
9307 3575382 3466084 3619653 3494163 2997988 2928086 3583364 2800879 1941049 2228665 1690136
9297 1690136 2541991 2933982 2426660 3105863 3929179 3563264 2896734 2239869 2662863 4009569
9287 4009569 4126525 4165449 3877613 3622269 3775433 3914704 3530510 3905013 4679072 3693193
9277 3693193 3526566 4189858 4531256 4187026 3730258 3533024 4542054 5092590 4565288
9268D565288J87749k43422N50908k43086J09506M27269K12202k38679p88386K60074
9258D799423l05899Q77122L0282j38667q9133k51209J342429J000457N96463J129195
9248H990463p26473J036777J83119q05228L78936R0810K1370J441517N56818j96895
9238A0971214Q94114p90401o36676j320667k43537o13100p52605j45385K14867
9229G577824K75528J32329j37077p73371l4345J198596M11451o01543n07057j78429
9219G363906o14912k78643l70676N2980Q12481J64972o49040p44932M09525k80715
9209E864946O18091M89260K89139K76697M20151l99228l80990N33160k82558N3775
9199G482443j25517j40616Q71408K64463K93855M72000j94987N50130k39563p05569
$$ plain form
9268 4565288 4753037 4509615 5060523 4817437 4926943 5354212 5566414 5327735 4539349 4799423
9258 4799423 4493524 5370646 5400928 5262261 5173128 4921919 6264348 7264805 7861268 8990463
9248 8990463 8263990 9300767 9483886 8678658 9057594 9148404 9169774 10611291 11168109 10971214
9238 10971214 11865328 11074927 10438251 9117584 8874047 8260947 7508342 7362957 7577824
9229 7577824 7853352 7985681 7848604 7075233 7040888 8239484 8650935 8049392 7542335 7363906
9219 7363906 6748994 6470351 6099675 6152655 6965136 7130108 6481068 5736136 6145661 5864946
9209 5864946 6483037 6972297 7261436 7538133 7958284 7559056 7178066 7711226 7428668 7482443
9199 7482443 7356926 7216310 8087718 8352181 8646036 9118036 8923049 9473179 9233616 8528047
9189H528047j6295l63912m97122L53382j84072p1521J010314N11278o80858r6568
9179H492673N46330j060985l03680j011794k46621M84141o22879M96490O7651
9170F841326k95474K86228O36547n52375j485664O19090M59501j29922p03698
9161E675559n79580J26687N7258m1743P4240j33430R93029J67685j062080Q2463
9151E360088L68891K48817k53271m3430L97054M53800N57479m97966k007308J054564
9141E638718M88479p01320K75518o42164J119288l16405M06593L54500k38337
9132F384870N49251l71315k59736q10396K65724R39843K77682J82411L18289J99516
9122G676139o24483J112073K1387p32111L11264M23230l51764L79465Q22648p17582
$$ plain form
9189 8528047 8511752 8147840 7650718 8004100 7820028 7748507 8758821 9270099 8589241 8492673
9179 8492673 9039003 7978018 7674338 6662544 6415923 6900064 6277185 6773675 6841326
9170 6841326 6545852 6832080 7468627 6916252 5430588 6049678 6509179 6379257 5675559
9161 5675559 5095979 5222666 5279924 5238181 5312421 5178991 6172020 6339705 5277625 5360088
9151 5360088 5728979 5977796 5724525 5681095 6078149 6531949 7089428 6591462 4584154 5638718
9141 5638718 6127197 5425877 5701395 5059231 6178519 5862114 6268707 6623207 6384870
9132 6384870 6934121 6562806 6303070 5492674 5758398 6698241 6975923 7158334 7476623 7676139
9122 7676139 7051656 8163729 8185116 7453005 7764269 8187499 7835735 8215200 9037848 8320266
9112H320266L51258P31624K82095n87129J116850L25028j39206K81120r86435
9103I695471m04458O07442j314102J230528P88233N95639j4566p9852K18440j09928
9093A1212847N82065Q06470K86315l50809p75744N14178J171826K57478J586383
9084A5291009J452597q20017l01225O25304J149909J852162M47919K15787k16576
9075A9696869K13952Q20652R82090n005n07825J314410K288604K3714K45597J675611
9065B6748669M91546J368509J397286N74168J215813J468919K635783J498826
9057C7399519L24153K289135J845273K785092K569397K438481L018637K709816
9049E5379503M145866L183225M811069N665356N748270O535736O780593O741750
$$ plain form
9112 8320266 8671524 9403148 9685243 9098114 10214964 10539992 10400786 10681906 9695471
9103 9695471 9291013 9898455 8584353 9814881 10603114 11198753 11184187 11104335 11322775 11212847
9093 11212847 11794912 12601382 12887697 12536888 11761144 12275322 13447148 13704626 15291009
9084 15291009 16743606 15923589 15622364 16247668 17397577 19249739 19697658 19913445 19696869
9075 19696869 19910821 20731473 21713563 21708558 21200733 22515143 24803747 24827461 25073058 26748669
9065 26748669 27240215 28608724 30006010 30580178 31795991 33264910 35900693 37399519
9057 37399519 37723672 40012807 41858080 44643172 47212569 49651050 52669687 55379503
9049 55379503 59525369 62708594 67519663 73185019 78933289 85469025 92249618 98991368
9041I8991368P118875R605384J0881392J1469231J0248635M300702L236049M290478
9033A60142114M896676M833693J861884J212577L209668R30219j286631r92229
9025A74807971l601845j304695M09301n612855p133842m316514k152137k63392
9017A50831992R15245J374559J957683K256763J918362J619796J872874K584927
9009A65332201K033530L320616N777255P753940Q300270R177087R456173J0766156
9001B21917228J2382130J4491404J7530388J5198161P328457J610038M861655
8994B95319461O399239P833365K402065j492499K681910J868302o365435j1123813
8986B97522595o750956k820261l945083j4868423j8472903j2468616r216472o729466
$$ plain form
9041 98991368 106110243 115715627 126597019 138066250 148314885 152615587 155851636 160142114
9033 160142114 165038790 169872483 171734367 172946944 176156612 177086831 175800200 174807971
9025 174807971 171206126 169901431 170310732 164697877 157564035 153247521 151095384 150831992
9017 150831992 151747237 153121796 155079479 157336242 159254604 160874400 162747274 165332201
9009 165332201 167365731 170686347 176463602 184217542 192517812 201694899 211151072 221917228
9001 221917228 234299358 248790762 266321150 281519311 288847768 290457806 295319461
8994 295319461 301718700 309552065 311954130 310461631 313143541 315011843 308646408 297522595
8986 297522595 290771639 287951378 284006295 269137872 250664969 238196353 228979881 222250415
8978B22250415o887014m448784l187736l031240o203848q898969p684908o036886
8970A75871030o415363o940788n104193m712236m797700n908704n865449n156525
8962A30970072m470462o734858n747330m702715m945733l361294k591508j590888
8954I6825284k424530j735420n73597p22061j741172j365257n25609J78038N24256
8945H8439932Q37503J20716J727031K020021J949952J284104J981856L142996
8937A01504111L423610L708109M241397M324756N554875O228787P624468J0300323
8929A46910436J1098961J3585313J5419909K0650197K3142778K7258562K2217586
8922B80283742J0980178q40589o322883j481245N783256J0340028J5220238K0097132
$$ plain form
8978 222250415 215363401 210914617 207726881 204695641 198491793 189592824 181907916 175871030
8970 175871030 169455667 162514879 157410686 152698450 147900750 141992046 136126597 130970072
8962 130970072 126499610 119764752 114017422 109314707 104368974 101007680 98416172 96825284
8954 96825284 94400754 92665334 92091737 91369676 89628504 88263247 87737638 87915676 88439932
8945 88439932 89277435 89398151 91125182 93145203 95095155 96379259 98361115 101504111
8937 101504111 104927721 108635830 112877227 117201983 122756858 128985645 136610113 146910436
8929 146910436 158009397 171594710 187014619 207664816 230807594 258066156 280283742
8922 280283742 291263920 290423331 284100448 282619203 288402459 298742487 313962725 334059857
8914C34059857K4369252K1258190J5804137J0837591K868733q432564j9062594
8907C81702602j9548956k1747122k3761550j8343870j4138643j2572588j1370831
8900B60219042j0247747j0496036r283127q018307p900373o288127n245017p441867
8892A95298441q438580q856966q013352q673003p262678m746558k699027j936827
8884A44671450Q05896J746670J728697L892718M955545M628534O052253Q378703
8876A76860466J0344950J2239104J0861540Q056176M966500J896193o348943r835376
8868B09040610j1260702j2259984j3527627j1813896q458641o892279o549392
8861A38278089p501972o300048o483032o331040l758836m131917n052182m288317
$$ plain form
8914 334059857 358429109 379687299 395491436 406329027 409197760 400765196 381702602
8907 381702602 362153646 340406524 316644974 298301104 284162461 271589873 260219042
8900 260219042 249971295 239475259 230192132 222173825 214273452 207985325 202740308 195298441
8892 195298441 186859861 178002895 169989543 161316540 154053862 149307304 146608277 144671450
8884 144671450 145477346 147224016 148952713 152845431 157800976 162429510 168481763 176860466
8876 176860466 187205416 199444520 210306060 218362236 223328736 225224929 218875986 209040610
8868 209040610 197779908 185519924 171992297 160178401 151719760 144827481 138278089
8861 138278089 130776117 124476069 117993037 111661997 107903161 103771244 98719062 94430745
8853I4430745n222357p070827o286658p326279n053068m710786m749987k611273
8845E1399510k427048l083835k705427l297638j934250j666615j271571k270861
8837C2742265j423182j708091j071668j408852j055762l70053j731696o76222
8829B3296739p64163k44273j236172m66344q42548j105291m91695K20683k60769
8820A8106167j143653j144261r28075n63966L67115j485782l8740m54232K37631
8811A2952204r5494m97412j53547k2630o19400o94574J453185L79213j5649p88746
8801A1897150L57626P74249l56795p95469J075352p16789r73961J632859J293153
8792A4187375k83734q75542o85184k06986n26357P13219q8778p15301L66549Q23697
$$ plain form
8853 94430745 89208388 82137561 75850903 68524624 63471556 58760770 54010783 51399510
8845 51399510 48972462 45888627 43183200 39885562 37951312 36284697 35013126 32742265
8837 32742265 31319083 29610992 28539324 27130472 26074710 25704657 23972961 23296739
8829 23296739 22532576 22288303 21052131 20585787 19743239 18637948 18146253 18366936 18106167
8820 18106167 16962514 15818253 14890178 14326212 14693327 13207545 13168805 12714573 12952204
8811 12952204 12856710 12359298 12205751 12183121 11563721 10869147 12322332 12701545 12685896 11897150
8801 11897150 12254776 13029025 12672230 11876761 12952113 12235324 11261363 12894222 14187375
8792 14187375 13903641 13028099 12342915 12135929 11609572 12322791 12234013 11518712 11885261 12708958
8782A2708958m38271l58528j54731J22186j391230r40400M21144M39871p0143
8773A0338856J071054L52511j066944l46918O2285Q0460M79595q92981J168415
8764A1246333J366885n98612L58215R61608N93854n29554J161216j432521q6559
8755A3040865n22735j24950L84733J69380j675554r90337m25904L48182R9725
8746A0303405o59681r52709K78482n71580K17515Q73982q61390j36887N4077J75474
8736H720688j209330l65521O45309M2952M52622J117549q3101j373912l2866l25804
8726G588586j02942p61109r43715P04495J59181K47002j141648O29652J38563
8717F518065r72242j352232j077033J564819n00434N8323O91251j68732k58539
$$ plain form
8782 12708958 12270687 11912159 11757428 11879614 10488384 9547984 9969128 10408999 10338856
8773 10338856 11409910 11762421 10695477 10348559 10410844 10491304 10970899 10077918 11246333
8764 11246333 12613218 12014606 12372821 13334429 13928283 13398729 14559945 13127424 13040865
8755 13040865 12518130 12393180 12777913 12947293 11271739 10281402 9855498 10203680 10303405
8746 10303405 9643724 8691015 8969497 8397917 8615432 9489414 8628024 8491137 8545214 8720688
8736 8720688 7511358 7145837 7791146 7834098 8286720 9404269 9321168 7947256 7914390 7588586
8726 7588586 7485644 6724535 5780820 6485315 6644496 6891498 5749850 6379502 6518065
8717 6518065 5545823 4193591 3116558 4681377 4180943 4239266 4930517 4761785 4503246
8708D503246j7711k36293l89948o72857r27768R12177Q49314j209365j78217j3314
8698B619264K13693M60347j036253O24165l03169j334487P42656J279645j25815
8689C140046k29881N04661l01244q68249k1038j61663K10323K26904k53732k6955
8679B219172k07636l31002K95164N0321n79141m46165p65617N1814J425250J122969
8669B835129L02041n83974k91798O4165o08158p25966P4318N27885r2896K30153
8659A730899J71227k60051m5768L57949J27302M66010n38548M46404m83437O42762
8649B614749L76113p46640O91319j264246j02803K95673R55900q69342o51183
8640A299540K48441Q10207L52115m10938L58731m00764m93950L57257J38666p05376
$$ plain form
8708 4503246 4485535 4249242 3859294 3186437 2258669 3170846 4020160 2810795 2632578 2619264
8698 2619264 2832957 3293304 2257051 2881216 2578047 1243560 1986216 3265861 3140046
8689 3140046 2910165 3414826 3113582 2245333 2224295 2062632 2272955 2499859 2246127 2219172
8679 2219172 2011536 1680534 1975698 2026019 1446878 1000713 235096 286910 1712160 2835129
8669 2835129 3137170 2553196 2261398 2325563 1717405 991439 1065757 1593642 1500746 1730899
8659 1730899 1902126 1642075 1596307 1954256 2081558 2547568 2009020 2455424 1971987 2614749
8649 2614749 2990862 2244222 2935541 1671295 1568492 1864165 2820065 1950723 1299540
8640 1299540 1547981 2358188 2710303 2299365 2658096 2257332 1763382 2120639 2259305 1553929
8630A553929L29708k08815j6633Q7928j324670Q31412L07133m2063O87651p25895
8620A479685p79029K88333O80566K11019j147260K2879J432191l24982n07741
8611A355661J91355L97932m68728k67062P50286L50970o72182j140484O86969
8602A184717N96253p47695n92593J373207M98097n25009q27126L73172l12390
8593A020633J65030n04459K60057P95924j152557n61826J412244l7191k73047
8584A124808j28725K26677o75271P50217j009229j677229K261240j021141k64861
8575d13514p27526M45375Q3504O68894k52266L23113O04288k46895M09283K3860
8565I18116J04721o76861Q2023m1847r38633J20986O30855J58717J05147R7875
$$ plain form
8630 1553929 1883637 1674822 1658189 1746117 421447 1252859 1559992 1517929 2205580 1479685
8620 1479685 700656 988989 1669555 1880574 733314 756193 2188384 1863402 1355661
8611 1355661 1547016 1944948 1476220 1209158 1959444 2310414 1638232 497748 1184717
8602 1184717 1780970 1033275 440682 1813889 2311986 1786977 959851 1333023 1020633
8593 1020633 1185663 681204 941261 1737185 584628 22802 1435046 1397855 1124808
8584 1124808 996083 1222760 547489 1297706 288477 -1388752 872488 -148653 -413514
8575 -413514 -1141040 -695665 -612161 56733 -195533 127580 731868 484973 894256 918116
8565 918116 1022837 345976 427999 386152 -552481 -431495 199360 358077 463224 561099
8555E61099K11902m70892M89085J49193r67124N28758O67695L73586J36487M44871
8545B124660K86833q30270J40478M53622r4760p23780L71875n22593n02331O70666
8535A374400l02343n3963L02245J62238j154647P56567M39430p02463K05226P25790
8525A752480j66118k61423n0074m06318o34238J058381J277818n51781q81629
8516A137098n65960m04917M89801J2552l30592J09284k25886N26922L60137J6746
8506A125185M58195j036054J602567L3740o6349o70757k62774k02891J83902Q92824
8496B057588r10586N17939K44008p02807j23820l32719K30511P58623l11941l10305
8486A116491r5084M0447m18492L66329K74510K82673k4085r02968j02534o18056
$$ plain form
8555 561099 773001 302109 791194 940387 -26737 502021 1169716 1543302 1679789 2124660
8545 2124660 2411493 1581223 1721701 2175323 2080563 1356783 1728658 1206065 703734 1374400
8535 1374400 1072057 1018094 1320339 1482577 327930 1084497 1523927 821464 1026690 1752480
8525 1752480 1586362 1324939 1274865 868547 234309 1292690 2570508 2018727 1137098
8516 1137098 571138 166221 656022 668574 337982 447266 221380 748302 1108439 1125185
8506 1125185 1583380 547326 2149893 2183633 2117284 1446527 1183753 980862 1164764 2057588
8496 2057588 1147002 1664941 1908949 1206142 1082322 749603 980114 1738737 1426796 1116491
8486 1116491 1021407 1061854 643362 1009691 1284201 1566874 1542789 639821 537287 -80769
8476h0769o68282J409399k51954k01839P8219m86416j02250J240071K48610j9321
8466A165468n41202k89580O28129p32940p4730J50399k62973o78047j114322N02214
8456a247584L26560L78467k69829o7327L2411l14526J351340r3866m53398N24055
8446A66303m83248K24366M42638l58186j405105N66707R26233n92825N21122R14015
8436I22020j446710L82593P06469m01144j175783P75259J199522n05495l2820
8427D23911J95576j085866r26197J477197N97507p90637r7465k41608O04907J189073
8417A346398l54409p03798m51686k57309o91982M47720p27197J96677R51714J27454
8407a16418m36880M90542O64659j21066j74248k62719J034037L26099n96878J36343
$$ plain form
8476 -80769 -749051 660348 408394 206555 284774 -201642 -303892 936179 1184789 1165468
8466 1165468 624266 334686 962815 229875 155145 305544 42571 -635476 -1749798 -1247584
8456 -1247584 -921024 -542557 -812386 -879713 -847302 -1161828 189512 95646 -357752 166303
8446 166303 -316945 -92579 350059 -8127 -1413232 -846525 79708 -513117 8005 922020
8436 922020 -524690 -142097 564372 163228 -1012555 -237296 962226 456731 423911
8427 423911 619487 -466379 -1392576 84621 682128 -108509 -205974 -447582 157325 1346398
8417 1346398 991989 288191 -163495 -420804 -1112786 -665066 -1392263 -1195586 -243872 -116418
8407 -116418 -553298 -62756 601903 480837 306589 43870 1077907 1404006 807128 943471
8397I43471N20850k095018J37478L43441Q59716j49310m34617J69485j031033
8388g35537P39562N84297M91970M18047j76939n99570L49543k62977J61030l36769
8378F32657o90521j79911M43470J21086O56866o91041j045073l2919O73697L18427
8368B06738K53303o3449L81300l34828p49854J31310O75424p16090l34779J090916
8358E39991m23067p46781K23666N00075M7216K01978o26637J16778J70016j96135
8348a92900K72762m3235j77013l59120L20534L10691o67872k75325o44789l83458
8338a839725L05599Q56890N10930k78537m96889N40746k07161n72082L49645P80017
8328e0567K41338l68130N86401p48420Q16988j58584k43784J3894j000262M73493
$$ plain form
8397 943471 1464321 -630697 -493219 -149778 709938 560628 126011 295496 -735537
8388 -735537 4025 588322 1080292 1498339 1321400 721830 1071373 808396 969426 632657
8378 632657 -57864 -237775 205695 326781 983647 292606 -752467 -785386 -111689 206738
8368 206738 460041 396592 777892 443064 -306790 -175480 499944 -216146 -550925 539991
8358 539991 116924 -629857 -406191 93884 141100 343078 -283559 -166781 3235 -192900
8348 -192900 79862 36627 -140386 -499506 -178972 131719 -536153 -811478 -1456267 -1839725
8338 -1839725 -1534126 -677236 -166306 -444843 -941732 -400986 -608147 -1180229 -830584 -50567
8328 -50567 190771 -177359 409042 -339378 477610 319026 75242 89136 -911126 -437633
8318d37633N39572M06327l84327j157030L63192N9281q78926P09078M34593P48587
8308D02714P92270k10262J2927J60975j76622L20918q81976p54060L03681j87028
8298b16463m37670Q61816j56701l44181l34554O28765L48262j16554M09751p9457
8288E63014k02499j338153L60667n92133L14118k21655k72739M09729Q23191l05489
8278d61949j95136L31138N80374m11938n59901O8146j44133P14251O6411N91144
8268E78407k84334j23835k85707M62718l280n45223l16830J25375n16118n17453
8258a426280J462492j39600o62900N26667m77397j06176O67158J04616P77019
8249G25599n04785j207490J029921m86729J03991L2815r73973l50047J796328
$$ plain form
8318 -437633 101939 508266 123939 -1033091 -669899 -610618 -1489544 -780466 -345873 402714
8308 402714 1194984 984722 997649 1158624 982002 1302920 420944 -333116 -29435 -216463
8298 -216463 -654133 207683 50982 -293199 -627753 1012 349274 232720 642471 563014
8288 563014 360515 -977638 -616971 -1209104 -894986 -1116641 -1389380 -979651 -156460 -461949
8278 -461949 -657085 -325947 254427 -157511 -717412 -649266 -793399 -79148 -12737 578407
8268 578407 294073 170238 -115469 347249 343969 -201254 -518084 -392709 -908827 -1426280
8258 -1426280 36212 -103388 -766288 -239621 -717018 -823194 -156036 -51420 725599
8249 725599 220814 -986676 43245 -443484 -339493 -306678 -1280651 -1630698 165630
8240A65630Q54921j090407J31739j062508L16251K45921n62569J17860J092966
8231B09804L45919K68280p11947j194295N43192l22030O70690P51924m96016q5298
8221a9777N48099j043335j73186R77818J78452p45814k76724j69332o8011R62594
8211A70784N59713m3361j081612l25922j20582P3300j8809J08574l6228M45627
8201b68516m33291J67695R87958m14187L92688k32276J10569J35070J201531j1013204
8191i365963R49424N882257r27990J737078L40582m96832K42595Q96641n43041
8182a285249J204929j512522R85967P54753k24687j145597P91322q2421P62039
8173B48534j085852M49352l13569l80299L04822L88342P1677L79803p38792Q0448
$$ plain form
8240 165630 1020551 -69856 61883 -1000625 -684374 -438453 -1001022 -883162 209804
8231 209804 555723 824003 112056 -1082239 -539047 -861077 -190387 561537 65521 -19777
8221 -19777 528322 -515013 -688199 289619 468071 -277743 -554467 -723799 -791810 170784
8211 170784 730497 687136 -394476 -720398 -840980 -767680 -786489 -677915 -714143 -268516
8201 -268516 -701807 -534112 453846 39659 432347 200071 310640 445710 1647241 -9365963
8191 -9365963 -8416539 -2534282 -3462272 -1725194 -1384612 -1881444 -1638849 -742208 -1285249
8182 -1285249 -80320 -1592842 -606875 147878 -76809 -1222406 -431084 -513505 248534
8173 248534 -837318 -387966 -701535 -1081834 -777012 -388670 -316993 62810 -675982 -595534
8163e95534M55846N34660j835422m23789Q68259J27601O09448j475355M23588
8154a310698L41196N55686L23099K08466j169413o76384n840J349003l19795q8310
8144g92990m26071J80001k81884N92697L17287N03774K75274q79758P02560k47348
8134e6458j35662j35677p31825j94961M61317J567483r3604j716112k62419P30192
8124e67726k94668k14315M57369L46702O77686k2461o3890o15252K89120M33813
8114D26378l57817O52737K27109n38559l7535l54090j351026j26643R04538O45942
8104I1034N9446l61554l25182K1078Q4753M44055L15095n70918q43532k47746
8094a333471J349996M50136j339514O75254K20462j196777j192313J419572L61484
$$ plain form
8163 -595534 -139688 394972 -1440450 -1864239 -995980 -868379 -258931 -1734286 -1310698
8154 -1310698 -969502 -413816 -90717 117749 -1051664 -1728048 -1733888 -384885 -704680 -792990
8144 -792990 -1219061 -1039060 -1320944 -728247 -410960 92814 368088 -511670 190890 -56458
8134 -56458 -192120 -327797 -1059622 -1254583 -793266 774217 680613 -1035499 -1297918 -567726
8124 -567726 -862394 -1076709 -619340 -272638 405048 382587 318697 -296555 -7435 426378
8114 426378 68561 721298 948407 409848 372313 18223 -1332803 -1459446 -554908 91034
8104 91034 150480 -211074 -536256 -515178 -430425 13630 328725 -242193 -1085725 -1333471
8094 -1333471 16525 466661 -872853 -197599 22863 -1173914 -2366227 -946655 -585171
8085e85171J98247J167885r17741M90107N166k36205J98490p17210o47758R11402
8075a32788m22415n39423P69042k37853k92193R86378n09312j85028j2256J73524
8065d02324l83496L52350J570772P8874j144401p2456k47271l95491L5897j044547
8055a652093N229R26893P9749K53933k05338N47324R3196p55475j3307n05026
8045a224915N14125R33522n22743o25769q22977Q07942J358914O78880o99721
8036C97258p76480k90240m09889J251019J03432p49359m4314n08146o46364R66057
8026g07026J517413M33956j069742j213145K72954K79050m31838J057605p15438
8017e76211J05212O86006L04887j49632m25601m54595L57733p9199K50786K65707
$$ plain form
8085 -585171 -386924 780961 -136780 353327 358493 122288 320778 -396432 -1044190 -132788
8075 -132788 -555203 -1094626 -325584 -563437 -855630 130748 -378564 -563592 -575848 -402324
8065 -402324 -785820 -433470 1137302 1216176 71775 -681 -247952 -643443 -607546 -1652093
8055 -1652093 -1646864 -719971 -640222 -386289 -591627 -44303 48893 -706582 -719889 -1224915
8045 -1224915 -710790 222732 -300011 -925780 -1748757 -940815 418099 1096979 397258
8036 397258 -379222 -669462 -1079351 171668 275100 -474259 -518573 -1026719 -1673083 -707026
8026 -707026 810387 1244343 174601 -1038544 -765590 -486540 -918378 139227 -576211
8017 -576211 -470999 215007 519894 370262 -55339 -509934 -152201 -231400 19386 285093
8007B85093p18744L27088m84724o23284L8024P9706J457155j50684O7361m0151
7997B36840k86395q95128L6702J192670l92498l45692j98663J55693m36218K32360
7987g00329k04328K65253R06791o02207l03108n08387n4805M09541N75495k46403
7977d62487l37380n7088o01293P71602J55337J46374O14111M70310j048415m0014
7967c88943J67324m47396l47331K19879J16284n61260p12034Q91968R30202J502295
7957A370988l02518j256994l44465n28515J250540K9985K37517m94890L3227J218070
7947A212945j191643j156359r9002J232475o99532q5901J43573N50254m12190
7938e05380j038826P65494O69635J2828j0621J21771r62738P90363l77430j780
$$ plain form
8007 285093 -433651 -106563 -591287 -1214571 -1176547 -1096841 360314 209630 276991 236840
7997 236840 -49555 -944683 -907981 284689 -107809 -453501 -652164 -496471 -932689 -700329
7987 -700329 -904657 -639404 267387 -334820 -637928 -1146315 -1201120 -791579 -216084 -462487
7977 -462487 -799867 -856955 -1458248 -686646 -531309 -384935 229176 699486 -348929 -388943
7967 -388943 -221619 -669015 -1016346 -796467 -680183 -1241443 -1953477 -1061509 -131307 1370988
7957 1370988 1068470 -188524 -532989 -1061504 189036 219021 456538 -38352 -5125 1212945
7947 1212945 21302 -1135057 -1234059 -1584 -701116 -787017 -643444 -93190 -505380
7938 -505380 -1544206 -778712 -109077 -96249 -106870 14901 -947837 -157474 -534904 -536684
7928e36684j6505k26605l62026M28902N05055j48301O1020m2045L69450j27777
7918i5516K80052q3880o75440K78706J018094o03903n29055J32028r99368l82927
7908a661209J278093Q62847k56348m85542o39694k92632N80126n61730k18823
7899a394912m4307K42364m2281P8927P61518K65322P5540l40021L25266m14447
7889d87031J1428O43537L21144J01194j5482l69086J203977j283082n82701N61411
7879A05309q54799K24463J070773o77634l03843L96840n35739N13682k08375O7053
7869b02270N63722j207344O5523J11498j04979M6523k8850l01608J56250O97060
7859b04475l48959p05239O64574L5738j190198Q73994O04996J274813l78939j074182
$$ plain form
7928 -536684 -553189 -779794 -1141820 -712918 -207863 -356164 -295144 -337189 32261 -95516
7918 -95516 184536 100656 -574784 -296078 722016 118113 -410942 -278914 -1278282 -1661209
7908 -1661209 -383116 479731 223383 -262159 -901853 -1194485 -614359 -1176089 -1394912
7899 -1394912 -1439219 -1196855 -1239136 -1160209 -398691 -133369 -57829 -397850 -72584 -487031
7889 -487031 -475603 167934 489078 590272 574790 205704 1409681 126599 -456102 105309
7879 105309 -749490 -525027 545746 -131888 -435731 -38891 -574630 -60948 -269323 -202270
7869 -202270 361452 -845892 -780369 -668871 -773850 -727327 -756177 -1057785 -901535 -204475
7859 -204475 -553434 -1258673 -594099 -558361 -1748559 -874565 -269569 1005244 626305 -447877
7849d47877l82043n24939J43133L70943K32377K6763P75204k77459l24975K2385
7839c86488K63972K10499l91143J5871j86579j35366r41585R26272N87519q17400
7829h54428o43784K17130k60190Q88852m4728J027066N0490j115905O25996J051560
7819I42059m02645j117299l76226L91797N54377p37626J44823K89989j149317
7810a460068K31158Q76251n61799Q55066j320554p80246J613289J59568O91033
7801C03698J72971K88681j030688q67294M84085K58168O55958R4191j460307O27463
7791d73074N82608o37404N69673m50187j45088K28359O38100n04607j3658k0241
7781b25519M44828r03572K09766J40175j255777K8195P34190N26385O05305M02743
$$ plain form
7849 -447877 -829920 -1354859 -1211726 -840783 -608406 -581643 193561 -83898 -408873 -386488
7839 -386488 -122516 87983 -303160 -287289 -473868 -609234 -1550819 -624547 -37028 -854428
7829 -854428 -1498212 -1281082 -1541272 -652420 -697148 329918 380408 -735497 -109501 942059
7819 942059 539414 -577885 -954111 -562314 -7937 -745563 -600740 -310751 -1460068
7810 -1460068 -1228910 -352659 -914458 -59392 -1379946 -2160192 -546903 -387335 303698
7801 303698 476669 765350 -265338 -1132632 -648547 -390379 265579 359770 -1100537 -473074
7791 -473074 109534 -527870 41803 -408384 -553472 -325113 312987 -191620 -205278 -225519
7781 -225519 219309 -684263 -474497 -334322 -1590099 -1561904 -827714 -301329 303976 706719
7771G06719K922R1344Q32656j343997j060495k74995K14217J083320L1013j193464
7761i10760k12174K76550l02666J026134Q09904o86131O62692m27049K83655p4917
7751D45238n59335l24190O62139k82731j012657N5824J107818J0806j628998J164207
7741c61879J14900J93879j400598O16993M4644O32220O65235n07990j170718l64926
7731a538240L65926P90978P38229l30137j191322J02573L94637l14203p60130
7722a741689J172323P97754n93549M87798L1912n55460O56454p64319l70760R52204
7712G2668m80503L21176O16346p66738p41727j54458J233332K50392j145425o59324
7702a454261O51625J219717k37493j71221l93065J026604o89968l89670p04595
$$ plain form
7771 706719 709641 800985 1633641 289644 -770851 -1045846 -831629 251691 282704 -910760
7761 -910760 -1122934 -846384 -1149050 -122916 686988 857 663549 236500 520155 445238
7751 445238 -114097 -438287 223852 -58879 -1071536 -1015712 92106 102912 -1526086 -361879
7741 -361879 -246979 -53100 -1453698 -836705 -792061 -159841 505394 -2596 -1173314 -1538240
7731 -1538240 -1172314 -381336 356893 26756 -1164566 -1061993 -667356 -981559 -1741689
7722 -1741689 -569366 228388 -365161 122637 154549 -400911 255543 -508776 -879536 72668
7712 72668 -407835 -86659 529687 -237051 -978778 -1133236 100096 350488 -794937 -1454261
7702 -1454261 -802636 417081 179588 8367 -384698 641906 -48062 -437732 -1142327
7693a142327J85518O54974J88626j670478m2313J132000K24876N90753k76916
7684a55287j410572l80062l94534J405725L70785k23726K09367K30186J07545
7675b40573p63255N78835J55757k08538L52943M8361K86372o6155o18961J94660
7665b80554m33341m60122L41239K70547K44354o68084J16924L60285k28976J31896
7655f05832m21657J062937n36428L07205M10350n22174j46771J146991J098973
7646A793594m96813o01596j184530r92120Q73227J92389L26140M29358j07855
7637B31794p73428J14069N35251J006498q40623q61095N19745m43590N69222o00755
7627e42912n60524M48623p27381J441265J40086o12122l60188N7159N85792m75804
$$ plain form
7693 -1142327 -956809 -301835 -113209 -1783687 -1826000 -694000 -469124 121629 -155287
7684 -155287 -1565859 -1945921 -2340455 -934730 -563945 -787671 -578304 -348118 -240573
7675 -240573 -1003828 -424993 -269236 -477774 -124831 -76470 209902 143747 -475214 -280554
7665 -280554 -713895 -1174017 -832778 -562231 -317877 -985961 -869037 -508752 -737728 -605832
7655 -605832 -1027489 35448 -500980 -193775 216575 -305599 -452370 694621 1793594
7646 1793594 1296781 695185 -489345 -1481465 -608238 -415849 -89709 339649 231794
7637 231794 -541634 -427565 107686 1114184 273561 -587534 -67789 -511379 57843 -542912
7627 -542912 -1103436 -654813 -1382194 59071 199157 -412965 -773153 -715994 -130202 -606006
7617f06006N0513K44475M42880o72476m1835N06514J077697k5114j232713m49665
7607g05730L84810j68530M80458M18855J83019p01621J79191K80277o08293L42339
7597H4775M00751l14170m79819O11251l40347n4344R9929q43414m49705J44K57589
7586a027360M32598O80049o27062P67642N11851m94067j096276Q8518k7617L97020
7576c94704Q59329j04001K09950O4491n71888L7331n75369N30389p2552n71699
7566e88723O5577P5974O7789K38907N36863r87443L01666l16326k95276k52933
7556a153925n1473j7122K71954Q29400p55935K09174N67480j48776R195k57677
7546d97705l10700k93742L64030M59461P98999k59702p72969J045598L09374j445563
$$ plain form
7617 -606006 -555493 -311018 131862 -540614 -582449 -75935 1001762 976648 -256065 -705730
7607 -705730 -320920 -489450 -8992 409863 592882 -108739 70452 350729 -257564 84775
7597 84775 485526 171356 -308463 302788 -37559 -91903 8026 -835388 -1285093 -1284949 -1027360
7586 -1027360 -594762 85287 -541775 225867 737718 243651 -852625 -764107 -791724 -394704
7576 -394704 464625 360624 570574 635065 63177 100508 -474861 55528 -17024 -588723
7566 -588723 -523146 -447172 -379383 -140476 396387 -591056 -289390 -605716 -900992 -1153925
7556 -1153925 -1205398 -1222520 -950566 -121166 -877101 -667927 -100447 -249223 -240028 -497705
7546 -497705 -808405 -1102147 -738117 -278656 520343 260641 -512328 533270 842644 -602919
7536f02919O40510m8546M42260l92437K57278r20791q4706P57954N48056j038435
7526d41776j54285N72474Q56099p12822l21599l14677l85112M28738K36579M4411
7516a91970L042N89636m34435k61457K26047P91280j008254k04420L56528R54433
7506H20430L38104k82077k33587j247797L05256r9442n91003Q91583P24751p09191
7496h2973k95045j56791l15434Q67453O75668j51293j285993J045709p59351M44033
7486a4017J17724L4451N77115p1978k028383J83912N03981J177016M51854m44786
7476D86889j02499j47617J30243r31744K72507Q79340M23295p19015o53241M02450
7466D0608K2728K775m33704P685L66145M90021l14998r98084o2348L49370O63627
$$ plain form
7536 -602919 37591 -10955 431305 38868 296146 -624645 -709351 48603 596659 -441776
7526 -441776 -596061 -23587 832512 119690 -201909 -516586 -901698 -472960 -236381 -191970
7516 -191970 -188928 400708 -33727 -295184 -69137 722143 -286111 -490531 -134003 820430
7506 820430 1158534 876457 642870 -604927 -299671 -399113 -990116 -98533 626218 -82973
7496 -82973 -378018 -534809 -850243 17210 692878 541585 -744408 301301 -458050 -14017
7486 -14017 103707 138158 715273 643295 -1385088 -1201176 -697195 479821 931675 486889
7476 486889 384390 236773 367016 -564728 -292221 587119 1010414 291399 -361842 40608
7466 40608 63336 66111 -367593 -359908 6237 496258 181260 -816824 -879172 -529802 133825
7455A33825j110555q23228N19256M69565K83278L19449K87446P40636j45594j200548
7445e26470L41129O98817q46005M73102q94255n90554k01371P97210J125670q70544
7435d93271k18795J06567r25521n39327J193635N37474k17703k70515J293335
7426D65879k84048j21678K1035j105910j37713K45243L69641n77928J03863K31172
7416g90444N71828j92887j103675O22330J03929J28044l03607M06107N85230k13902
7406a87047j05810j066664Q16940M89635q74108L8609J3218O63138Q97712l17598
7396C68025n53620r64777l7281J3332q74029P94478N91393m49123R93547j62560
7386b80615J82499j11545k20181j013707R35467P47914J040733r033r84849Q38182
$$ plain form
7455 133825 -976730 -1799958 -1280702 -811137 -527859 -208410 79036 819672 674078 -526470
7445 -526470 -185341 513476 -332529 140573 -753682 -1344236 -1545607 -748397 377273 -493271
7435 -493271 -712066 -605499 -1531020 -2070347 -876712 -339238 -556941 -827456 465879
7426 465879 181831 60153 81188 -1024722 -1162435 -917192 -547551 -1125479 -1021616 -790444
7416 -790444 -218616 -411503 -1515178 -892848 -788919 -660875 -964482 -558375 26855 -187047
7406 -187047 -292857 -1359521 -542581 -52946 -927054 -888445 -875227 -212089 685623 368025
7396 368025 -185595 -1150372 -1187653 -1174321 -2048350 -1253872 -662479 -1111602 -118055 -280615
7386 -280615 -98116 -209661 -429842 -1443549 -508082 239832 1280565 1271532 286683 1124865
7376A124865n8r22148j99500n72150m14299N24269N78648q98184k71267J50338
7366h99486j163946P66090N48553q6442l51594J55815L32689q8325O23547J46453
7356a6646q76682O07609K56156n58238M08468m22744n51N0383K01850l27391R14512
7345B36726P35483j005784j347883k29644J07199N28047O97817l76543J54011
7336e00571M20356p17343o2133k16952J08293J383432L7626k70839j51089M76081
7326E06861n70217j02903M12035k09990n09377J108690q51512n84876n67901J13379
7316a255811J601488J4292n46710n27584J15236L70960l81498j224923M78046
7307a356504P87623O6324j51396n23457m6441P31400Q46248n05099J68748J72285
$$ plain form
7376 1124865 1124807 202659 3159 -568991 -983290 -459021 119627 -778557 -1049824 -899486
7366 -899486 -2063432 -1297342 -748789 -835231 -1186825 -1031010 -698321 -786646 -163099 -16646
7356 -16646 -893328 -285719 -29563 -587801 -179333 -602077 -602628 -552245 -350395 -677786 236726
7345 236726 972209 -33575 -1381458 -1611102 -1503903 -975856 -278039 -654582 -500571
7336 -500571 -80215 -797558 -859691 -1076643 -968350 415082 452708 181869 30780 506861
7326 506861 -63356 -166259 245776 35786 -473591 635099 -216413 -801289 -1369190 -1255811
7316 -1255811 345677 359969 -186741 -714325 -599089 -228129 -609627 -1834550 -1356504
7307 -1356504 -568881 -502557 -653953 -1177410 -1223851 -492451 353797 -151302 17446 189731
7297A89731j73049K8038p9135p33404o42327P09636K75906j481037N74725M86624
7287h44292j96586J470865q50611o39806J296723M90288j30515n66551M7738j079236
7277a001983N87158J93756m8155k52549J14834K55493p4355L2698j37978J242660
7267I11579P10278q05173q55925J2936o9661n08262L45359J70111j60787q25692
7257a075237j83802R72955K79411l5555r85065R00510k19374Q46R49083J1287
7247F15059n71594k92781N53P6231l25885q69316N14866P99543Q46680p23092
7237G0264l56809O03032k54909j74720O2044r3203p29586r4698k5836m89314J02270
7226a381465J324630K68041j22378K59031K90344l89054O33899N211L85290N49890
$$ plain form
7297 189731 16682 44720 -34415 -767819 -1410146 -700510 -424604 -1905641 -1330916 -844292
7287 -844292 -1040878 429987 -420624 -1060430 236293 726581 596066 29515 77253 -1001983
7277 -1001983 -414825 -221069 -269224 -521773 -406939 -151446 -225801 -193103 -331081 911579
7267 911579 1621857 816684 -39241 -26305 -95966 -604228 -258869 -88758 -249545 -1075237
7257 -1075237 -1259039 -286084 -6673 -42228 -1027293 -126783 -346157 -345311 603772 615059
7247 615059 43465 -249316 -248763 -172532 -498417 -1367733 -852867 -53324 793356 70264
7237 70264 -286545 316487 61578 -113142 -51098 -144301 -873887 -968585 -994421 -1483735 -1381465
7226 -1381465 -56835 211206 88828 347859 638203 249149 883048 888259 1273549 1823439
7216A823439j222210q77329j332360N66568q622M25780J771422q02440o89225
7207c44977l14799Q4225J35292o11034P45639J72085j5826r2124o40395N53162
7197c28752o30282Q18233l45428n08464n34949L04006Q04126j1417k8562r74720
7187a436209M8037k31373P48862J92212N6017R570M33969l40571j323349J403057
7177d39778l37660R31174L9949k65894R75099r5209k18823n65451n34139M64670
7167d6062O29828k73325o47455N48184m34343j060394M5636R10932k67739J09437
7157d85301P14300n755j63966Q7301p73047Q1902k3532l42295l29001r415L38407
7146i10402p73749K70163K06684M14788P37576J35891l58399j95294q18749N39524
$$ plain form
7216 1823439 601229 -276100 -1608460 -1041892 -1050514 -624734 1146688 344248 -344977
7207 -344977 -659776 -575551 -440259 -1051293 -305654 -133569 -149395 -241519 -881914 -328752
7197 -328752 -959034 -140801 -486229 -994693 -1529642 -1225636 -421510 -432927 -461489 -1436209
7187 -1436209 -1388172 -1619545 -870683 -678471 -622454 -612884 -178915 -519486 -1842835 -439778
7177 -439778 -777438 153736 193685 -72209 902890 807681 588858 23407 -510732 -46062
7167 -46062 583766 310441 -337014 211170 -223173 -1283567 -1237931 -326999 -594738 -485301
7157 -485301 228999 223244 59278 146579 -626468 -544566 -568098 -910393 -1239394 -1248809 -910402
7146 -910402 -1684151 -1413988 -1207304 -792516 -54940 80951 -277448 -472742 -1291491 -751967
7136g51967K34714J050807k15496J47608P12763k77466k159504n37050R3695J315958
7126c85938n32955J0442N23690K93407m70761M45014Q48375k76211l25715q05243
7116f75895q25589M51345J188483l7427j86274N89310O01510j070719m82729N80308
7106A32323m47706J26202k04318M84546k65279p44934O37188k35960R55860l31159
7096A06763o2246J57428j88035j15845J28285L2558K51921M56834o06250m03046
7086b41633m96481l74934L43152p1777M90837k55789M18487O60537N90025l38312
7076G24112m59231j2344j238612M73991R70904K19723j312617K80946J255842
7067I02714j16576l84192n24062O27716L7853p31513L9825r1587j223613N85496
$$ plain form
7136 -751967 -517253 533554 318058 465666 1178429 900963 -1258541 -1795591 -1701896 -385938
7126 -385938 -918893 -908451 -384761 -91354 -562115 -117101 731274 455063 129348 -675895
7116 -675895 -1501484 -1050139 138344 100917 -85357 503953 1105463 34744 -447985 132323
7106 132323 -315383 -189181 -393499 91047 -174232 -919166 -281978 -517938 437922 106763
7096 106763 44517 201945 13910 -101935 26350 58908 310829 767663 161413 -241633
7086 -241633 -738114 -1113048 -769896 -841673 -350836 -606625 -188138 472399 1062424 724112
7076 724112 264881 252537 -986075 -512084 458820 678543 -634074 -353128 902714
7067 902714 786138 401946 -122116 505600 543453 -188060 -148235 -239822 -1463435 -877939
7057h77939n42065K23937P32031J765001P9273K2312r83435k45161J0361k46210
7047f1895r1591k17817l75599N76597l39376o99966R03721k64817k50949Q35949
7037A4257o81245J73220R42678j144698M68079L76715P51519o22725m07158l73410
7027e02768J57376M60075l54337o0264M32947N1814L96014j037678l16906J417334
7017F43607l55255l77225P45202m98340j23295K1408n12191r3868J76642R5180
7007b78135L61564k19829k48162r93740L00165Q67503L28569K18475o82886n0749
6997c97225N02598L21151m03002L89635r0310K1580j185083J18313J222962o66057
6987a65438j06309O04115N86304k95207r4174k26192o12969j551J269581L75026
$$ plain form
7057 -877939 -1420004 -1196067 -464036 1300965 1380238 1402550 419115 173954 184315 -61895
7047 -61895 -153486 -371303 -746902 -170305 -509681 -1209647 -305926 -570743 -821692 14257
7037 14257 -666988 -493768 448910 -695788 -227709 149006 900525 277800 -129358 -502768
7027 -502768 -345392 114683 -239654 -299918 133029 184843 580857 -456821 -773727 643607
7017 643607 288352 -88873 656329 157989 34694 56102 -456089 -549957 -373315 -278135
7007 -278135 83429 -136400 -384562 -1378302 -1078137 -210634 117935 336410 -346476 -397225
6997 -397225 105373 426524 23522 413157 322847 344427 -840656 -722343 500619 -165438
6987 -165438 -271747 332368 918672 623465 529291 303099 -309870 -311421 958160 1333186
6977A333186J84876l68668l67938j32378P74766r58260n46276J71158J134959
6968A225425L93509j577068k65321P1471k71298l91478l98505J71966L49490N9654
6958f32155J58684n16176K56340k16O39002J264158j473905j065540M98723J072594
6948B01509L00262N39667q04248m38970O46897n92394n54263p76243P54294o7803
6938g91292Q49175j077035l58686R22019J61653k89120L6613K52837O66166m23553
6928e1223m90868r85452P59197J315446n34329p43066K91712R83393j82640n61219
6918a99049p46081K8658m5277Q0108L32581l7944R44933j95964q58272J74013
6908e22294K39773M79841o94520M27476n69002L30206n44921o95720J326112m22987
$$ plain form
6977 1333186 1518062 1149394 781456 649078 1423844 465584 -80692 90466 1225425
6968 1225425 1618934 41866 -223455 -151984 -423282 -814760 -1213265 -1041299 -691809 -632155
6958 -632155 -473471 -989647 -733307 -733523 -94521 1169637 -304268 -1369808 -871085 201509
6948 201509 501771 1041438 237190 -201780 445117 -147277 -701540 -1477783 -723489 -791292
6938 -791292 57883 -1019152 -1377838 -455819 -294166 -583286 -546673 -293836 372330 -51223
6928 -51223 -542091 -1527543 -768346 547100 12771 -730295 -438583 544810 362170 -199049
6918 -199049 -945130 -916472 -961749 -881641 -549060 -587004 357929 161965 -696307 -522294
6908 -522294 -282521 197320 -497200 -69724 -638726 -308520 -853441 -1549161 -223049 -646036
6898f46036N00235l6974M56948L95902R651o08957j64736N55663n63999r03069
6888a005372N18470M93142l08807L52684m46913p7314P07946N69363o85519p7058
6878D0622n60115M95578n22981o31440M92797j08705n10043Q57477R28172j24786
6868C56576K2762k79535M64054J53585r22015j39355N47921j5889m58229M93190
6858B23065k03543l13509P24166m52886l31299K29627j067009j01980J684228
6849C90860J3384o17297J35934M14901k76917n91814q68137K48451j62537j50886
6839a464058J093523m6500m9576O89038N61771k29489j535796k76619k67176P82914
6829g41968P02039L20106j83998r88322j40956k43969J18979P97760P281k29575
$$ plain form
6898 -646036 -145801 -182775 274173 670075 679726 70769 -93967 461696 -102303 -1005372
6888 -1005372 -486902 6240 -302567 50117 -396796 -474110 233836 803199 117680 40622
6878 40622 -519493 -23915 -546896 -1178336 -685539 -794244 -1304287 -446810 481362 356576
6868 356576 379338 99803 563857 717442 -204573 -343928 203993 188104 -270125 223065
6858 223065 19522 -293987 430179 -22707 -354006 -124379 -1191388 -1293368 390860
6849 390860 404244 -213053 -77119 337782 60865 -530949 -1399086 -1150635 -1313172 -1464058
6839 -1464058 -370535 -417035 -466611 222427 784198 554709 -981087 -1257706 -1524882 -741968
6829 -741968 -39929 280177 96179 -892143 -1033099 -1277068 -1158089 -360329 -353048 -582623
6819e82623Q98872j98036K962k30868L63771q55453j04079k36489q08860J05350
6809a645453M38006P40303K58012R94216j053163J59023Q97604J67720j056015
6800i9747l36941J87103O78641o71607J849l45840Q76938n22427q64037L94824
6790g01244n0488m51431K10512l26198J79987Q21679L65342K76801o83692J034457
6780F75725m24235K42696R5263L467j31563n24562l31946J92653k36835M99410
6770F0073l23662k58178l50042M65934J53984k26541k17247O77046k95214L30434
6760A6587j19945n52263Q07586o53123o51621J217302L38073J23646R6098n97340
6750B5000k18443L31324m70097j91596j99919N56284J200111j521101O50800O87539
$$ plain form
6819 -582623 316249 118213 121175 -109693 254078 -601375 -705454 -941943 -1750803 -1645453
6809 -1645453 -1207447 -467144 -209132 785084 -268079 -109056 788548 956268 -99747
6800 -99747 -436688 -249585 429056 -242551 -240702 -586542 290396 -232031 -1096068 -701244
6790 -701244 -751732 -1203163 -992651 -1318849 -1138862 -317183 48159 324960 -358732 675725
6780 675725 251490 494186 589449 592916 461353 -63209 -395155 -202502 -439337 60073
6770 60073 -263589 -521767 -871809 -405875 -251891 -478432 -695679 -18633 -313847 16587
6760 16587 -103358 -655621 151965 -501158 -1152779 64523 402596 526242 622340 25000
6750 25000 -193443 137881 -332216 -523812 -723731 -167447 1032664 -488437 162363 849902
$$ [...]
##END NTUPLES=NMR SPECTRUM
##END=
