##TITLE=1H_CG-1188-F
 200.13MHz, CDCl3+DMSO,
 8 sc
 
 4.2.2025
##JCAMPDX= 6.0         $$ Bruker NMR JCAMP-DX V2.0
##DATA TYPE= NMR SPECTRUM
##DATA CLASS= NTUPLES
##ORIGIN= UXNMR, Bruker Analytische Messtechnik GmbH
##OWNER= pz
$$ XWIN-NMR		Version 3.5
$$ Tue Feb  4 14:10:27 2025 Russian Standard Time (UT+4h)  she@DPX200
##.OBSERVE FREQUENCY= 200.1313
##.OBSERVE NUCLEUS= ^1H
##.ACQUISITION MODE= SIMULTANEOUS
##.ACQUISITION SCHEME= undefined
##.AVERAGES= 8
##.DIGITISER RES= 18
##SPECTROMETER/DATA SYSTEM= spect
##.PULSE SEQUENCE= zg30
##.SOLVENT NAME= D2O
##.SHIFT REFERENCE= (INTERNAL, D2O, 0, 15.6312)
##AUDIT TRAIL= $$ (NUMBER, WHEN, WHO, WHERE, WHAT)
$$ ##TITLE= Audit trail, XWIN-NMR		Version 3.5
$$ ##JCAMPDX= 5.01
$$ ##ORIGIN= Bruker BioSpin GmbH
$$ ##OWNER= she
$$ F:/spectra/data/she/nmr/H-C/1/pdata/1/auditp.txt
$$ ##AUDIT TRAIL=  $$ (NUMBER, WHEN, WHO, WHERE, WHAT)
(   1,<2025-02-04 14:09:06.81 +0400>,<she>,<DPX200>,
      <created by zg, POWCHK disabled, PULCHK disabled
       configuration hash MD5:
       00 E9 B6 7A A2 85 ED C7 34 08 36 98 17 FE 4E 26
       data hash MD5: 16K
       08 B4 58 D9 66 8A D5 94 4D 18 3B 1E C7 67 D4 F1>)
(   2,<2025-02-04 14:09:11.68 +0400>,<she>,<DPX200>,
      <Start of raw data processing
       efp BC_mod = 2 LB = 0.25 FT_mod = 6 PKNL = 1 PHC0 = -19.17799 PHC1 = 9.992222 SI = 16K 
       data hash MD5: 16K
       AC EB EA 40 90 E2 37 7B 9D 31 76 37 B0 F4 87 85>)
(   3,<2025-02-04 14:09:30.42 +0400>,<she>,<DPX200>,
      <pk PHC0 = -89.27232 PHC1 = 1 
       data hash MD5: 16K
       ED D5 F5 42 30 B5 33 DF ED 72 0E 81 02 A9 53 0D>)
(   4,<2025-02-04 14:09:33.75 +0400>,<she>,<DPX200>,
      <abs ABSG = 5 
       data hash MD5: 16K
       58 78 93 31 6E 53 88 FB FB AB 51 8B E8 14 92 F1>)
$$ ##END=
$$ 
$$ hash MD5
$$ 59 0A 07 B6 10 90 34 F1 C5 F4 75 A1 69 D2 7C 25
##$RELAX= 
##$RELAX= 
##$RELAX= 
##$RELAX= 
##$RELAX= 
##$RELAX= 
$$ Bruker specific parameters
$$ --------------------------
##$DU= <F:/spectra>
##$EXPNO= 1
##$NAME= <H-C>
##$PROCNO= 1
##$TYPE= <nmr>
##$USER= <she>
##$AMP= (0..31)
100 100 100 100 100 100 100 100 100 100 100 100 100 100 100 100 100 100 
100 100 100 100 100 100 100 100 100 100 100 100 100 100 
##$AQSEQ= 0
##$AQ_mod= 1
##$AUNM= <au_zg>
##$AUTOPOS= <>
##$BF1= 200.13
##$BF2= 200.13
##$BF3= 200.13
##$BF4= 200.13
##$BF5= 200.13
##$BF6= 200.13
##$BF7= 200.13
##$BF8= 200.13
##$BYTORDA= 1
##$CFDGTYP= 0
##$CFRGTYP= 5
##$CHEMSTR= <none>
##$CNST= (0..31)
1 1 145 1 1 1 1 1 1 1 1 1 1 1 1 1 1 1 1 1 1 1 1 1 1 1 1 1 1 1 1 1 
##$CPDPRG= <>
##$CPDPRG1= <>
##$CPDPRG2= <>
##$CPDPRG3= <>
##$CPDPRG4= <mlev>
##$CPDPRG5= <mlev>
##$CPDPRG6= <mlev>
##$CPDPRG7= <mlev>
##$CPDPRG8= <mlev>
##$CPDPRGB= <>
##$CPDPRGT= <>
##$D= (0..31)
0 0.7 0 0 0 0 0 0 0 0 0 0.03 0 0 0 0 0 0 0 0 0 0 0 0 0 0 0 0 0 0 0 0 
##$DATE= 1738663746
##$DBL= (0..7)
120 120 120 120 120 120 120 120 
##$DBP= (0..7)
150 150 150 150 150 150 150 150 
##$DBP07= 0
##$DBPNAM0= <>
##$DBPNAM1= <>
##$DBPNAM2= <>
##$DBPNAM3= <>
##$DBPNAM4= <>
$$ [...]
##$SUBNAM3= <"">
##$SUBNAM4= <"">
##$SUBNAM5= <"">
##$SUBNAM6= <"">
##$SUBNAM7= <"">
##$SUBNAM8= <"">
##$SUBNAM9= <"">
##$SW= 18.0517328524113
##$SWIBOX= (0..15)
0 0 2 0 0 0 0 0 0 0 0 0 0 0 0 0 
##$SW_h= 3612.71676300578
##$TD= 16384
##$TD0= 1
##$TE= 0
##$TE2= 300
##$TE3= 300
##$TEG= 300
##$TL= (0..7)
0 120 120 120 120 120 120 120 
##$TP= (0..7)
150 150 150 150 150 150 150 150 
##$TP07= 0
##$TPNAME0= <>
##$TPNAME1= <>
##$TPNAME2= <>
##$TPNAME3= <>
##$TPNAME4= <>
##$TPNAME5= <>
##$TPNAME6= <>
##$TPNAME7= <>
##$TPOAL= (0..7)
0.5 0.5 0.5 0.5 0.5 0.5 0.5 0.5 
##$TPOFFS= (0..7)
0 0 0 0 0 0 0 0 
##$TUNHIN= 0
##$TUNHOUT= 0
##$TUNXOUT= 0
##$USERA1= <user>
##$USERA2= <user>
##$USERA3= <user>
##$USERA4= <user>
##$USERA5= <user>
##$V9= 5
##$VALIST= <valist>
##$VCLIST= <CCCCCCCCCCCCCCC>
##$VD= 0
##$VDLIST= <DDDDDDDDDDDDDDD>
##$VPLIST= <PPPPPPPPPPPPPPP>
##$VTLIST= <TTTTTTTTTTTTTTT>
##$WBST= 1024
##$WBSW= 4
##$XGAIN= (0..3)
0 0 0 0 
##$XL= 0
##$YL= 0
##$YMAX_a= 75577
##$YMIN_a= -96382
##$ZGOPTNS= <>
##$ZL1= 120
##$ZL2= 120
##$ZL3= 120
##$ZL4= 120
##$ABSF1= 15.42627
##$ABSF2= -2.625578
##$ABSG= 5
##$ABSL= 3
##$ALPHA= 0
##$AQORDER= 0
##$ASSFAC= 0
##$ASSFACI= 0
##$ASSFACX= 0
##$ASSWID= 0
##$AUNMP= <proc_1d>
##$AZFE= 0.1
##$AZFW= 0.1
##$BCFW= 0
##$BC_mod= 2
##$BYTORDP= 0
##$COROFFS= 0
##$CY= -3
##$DATMOD= 1
##$DC= 0
##$DFILT= <>
##$DTYPP= 0
##$F1P= 0
##$F2P= 0
##$FCOR= 1
##$FTSIZE= 16384
##$FT_mod= 6
##$GAMMA= 0
##$GB= 0
##$INTBC= 1
##$INTSCL= 3.241238e-09
##$ISEN= 128
##$LB= 0.25
##$LEV0= 0
##$LPBIN= 0
##$MAXI= 10000
##$MC2= 0
##$MEAN= 0
##$ME_mod= 0
##$MI= 1.114404
##$NCOEF= 0
##$NC_proc= -8
##$NLEV= 6
##$NOISF1= 3.799351
##$NOISF2= 2.8
##$NSP= 0
##$NTH_PI= 0
##$NZP= 0
##$OFFSET= 15.6312
##$PC= 1
##$PHC0= -108.4503
##$PHC1= 10.99222
##$PH_mod= 1
##$PKNL= yes
##$PPARMOD= 0
##$PSCAL= 0
##$PSIGN= 0
##$REVERSE= no
##$SF= 200.129978086903
##$SI= 16384
##$SIGF1= 3
##$SIGF2= 2
##$SINO= 0.751879
##$SIOLD= 32768
##$SREGLST= <19F.Aceton>
##$SSB= 0
##$STSI= 16384
##$STSR= 0
##$SW_p= 3612.71676300578
##$SYMM= 0
##$S_DEV= 0
##$TDeff= 16384
##$TDoff= 0
##$TI= <>
##$TILT= no
##$TM1= 0
##$TM2= 0
##$TOPLEV= 0
##$USERP1= <user>
##$USERP2= <user>
##$USERP3= <user>
##$USERP4= <user>
##$USERP5= <user>
##$WDW= 1
##$XDIM= 16384
##$YMAX_p= 411375456
##$YMIN_p= -3836126
$$ End of Bruker specific parameters
$$ ---------------------------------
##NTUPLES= NMR SPECTRUM
##VAR_NAME=  FREQUENCY,     SPECTRUM/REAL,   SPECTRUM/IMAG
##SYMBOL=    X,             R,               I
##VAR_TYPE=  INDEPENDENT,   DEPENDENT,       DEPENDENT
##VAR_FORM=  AFFN,          ASDF,            ASDF
##VAR_DIM=   16384,         16384,           16384
##UNITS=     HZ,            ARBITRARY UNITS, ARBITRARY UNITS
##FACTOR=    0.220516191357247, 1,           1
##FIRST=     3128.27168079697, 0,            0
##LAST=      -484.445082208812, 0,           0
##MIN=       -484.445082208812, -3836126,    0
##MAX=       3128.27168079697, 411375456,    0
$$ Real data points
##PAGE= N=1
##DATA TABLE= (X++(R..R)), XYDATA
$$ [...]
10096 227534 368921 47108 318530 181882 122961 -20305 159334 444936 168493 29540
10086 29540 324689 489903 220910 57378 87347 220164 380327 90593 269150 -19935
10076 -19935 486613 451820 552812 330142 586245 673162 326789 421161 316774 383628
10066 383628 -213028 568721 370576 -147875 9495 39296 102684 85538 -367599 -145241
10056 -145241 -14814 -4331 -268674 -14398 19489 -85313 62650 28857 51362 3575
10046 3575 276537 306099 374917 506341 531137 170899 93276 41443 -63121 -25763 135291
10035 135291 213136 -257792 -353752 -101163 33942 -446389 -828361 -677275 -155000 -209043
10025 -209043 -283655 -855963 -442023 310464 -143851 -4904 -75300 -5083 44959 -126087
10015 -126087 104338 191280 -62182 151038 -95952 -47431 230316 109442 252029 469360
10005 469360 593533 436728 -40081 -58455 -285996 -177742 88558 177804 -201077 -574523
9995 -574523 -343370 -119821 726665 659457 70328 129579 -94181 6433 492700 705003
9985 705003 110014 216690 511871 76779 129842 223077 36203 288914 614394 893971
9975 893971 724481 517281 -150417 -284204 256991 251940 250326 544324 146377 175539 45021
9964 45021 376872 513001 -92439 -126483 -62582 108276 1034122 847460 343062 -121678
9954 -121678 6407 616564 119855 362809 583518 -95568 -70298 -84021 279398 1099433
9944 1099433 806746 676065 1028832 1201907 581613 75550 177989 730554 649201 1211198
9934 1211198 1347491 970012 1128799 1127130 949579 1445375 2143218 2302556 2116686 1935484
9924 1935484 2577983 2524252 2256149 2580780 2590456 2728404 2214439 1870263 2227265 1598020
9914 1598020 1595584 1866675 2042750 1973287 1033438 870278 773955 619500 859906 561382
9904 561382 626731 982122 1139582 679291 499691 812850 945897 1131281 644046 803105
9894 803105 903693 718876 247071 717349 505262 216971 503403 801926 1186470 596041
9884 596041 239258 -51920 85842 472741 413917 409887 1053585 843368 197979 824930
9874 824930 1080105 854057 432709 812837 503573 440417 1043586 754527 598198 774475
9864 774475 520313 169376 64505 444082 598261 1033093 675460 555196 895402 812088
9854 812088 877216 1060958 1736692 1579290 1445875 1117571 719984 983079 789926 614331
9844 614331 492671 599143 1003320 782076 889898 895104 1055065 1134761 796127 534037
9834 534037 547361 913603 1313033 1040878 1076396 808095 297512 985276 634591 551899
9824 551899 879363 668179 791104 617317 543355 784759 1017464 1116287 1265469 814346
9814 814346 602357 780249 996275 1138396 1157421 816925 698171 781091 540920 738944
9804 738944 832118 777379 1137897 1308304 905282 893407 1105738 948947 616117 455341
9794 455341 421558 613917 419126 787243 748222 608956 859466 556152 738353 738697 778511
9783 778511 707692 1093492 1031343 1357015 1436908 1246535 405888 130931 615707 682280
9773 682280 816004 1351349 727737 836814 692166 651546 884033 740007 1405426 1596687
9763 1596687 1484332 1456523 1376247 674262 845215 1122496 899973 1310157 704365 814459
9753 814459 1015892 992509 802003 731459 1296608 1368386 1256685 1324932 1375154 1200174 1336144
9742 1336144 1079885 935679 1160230 1429950 1234595 1403681 1430038 1384773 1216783 1336612
9732 1336612 1640452 1846074 1987884 1751485 1430127 1109079 1353611 1592989 1181134 1281013
9722 1281013 1423526 1749376 1801315 1442860 816204 904474 1444862 1732719 1322460 1657242
9712 1657242 1380047 1188048 1023101 1257397 1313992 1095241 1283832 1560655 1732500 1726917
9702 1726917 2027466 1766403 1926160 2059587 2071770 1932358 2003300 2417626 2462030 2628105
9692 2628105 2386520 2118813 2035511 2042860 1719789 1852910 1994896 2052981 1695068 2123737
9682 2123737 2357222 2338595 2493446 2408158 2448774 2481752 2883684 2653970 2578865 2506224 2686622
9671 2686622 3046990 3310751 3065688 2738956 2826485 2582159 2558296 2585928 2318002 2822004
9661 2822004 2675767 2595287 2165052 2966755 3714311 3538039 3376354 2965201 2675171 3202952
9651 3202952 3285173 3089855 3319661 3668231 3457869 3247460 3884722 3762588 3836011 4550385
9641 4550385 5051099 4767403 4904123 5125910 5450747 5756349 5527150 5260523 5264341 5516466
9631 5516466 6033207 6438446 6308019 6349110 6846300 7445320 7428259 6933735 6910780 7245540
9621 7245540 7656261 8153694 8010516 8320090 8755108 9008072 9290815 9684287 10082065 10753007
9611 10753007 11171321 11530649 12097723 13474132 14234427 15048666 16076127 17388086 18355022
9602 18355022 19545015 20633370 21336702 22840761 23749160 24668032 25009505 25507091 26652927
9593 26652927 27866026 28737034 29915148 30836821 32172982 33470044 34316643 35108881 36296394
9584 36296394 37377518 39047451 40420812 42240993 43968237 45737342 48275532 50663552
9576 50663552 53338468 55267618 57368804 60109044 62773536 65795036 70229777 74699451
9568 74699451 79210566 84703774 90350388 97364126 105619755 114491341 124321009 135830678
9560 135830678 150093496 166108046 184283666 205296873 229807190 257583096 285680864
9553 285680864 311158692 331308624 342882289 346856801 345821550 341603464 338593342 336966594
9545 336966594 336119112 334191352 326576700 311360473 289152688 262112004 231526333 201662740
9537 201662740 174708922 151123961 131619050 116431348 103557382 92934779 84288553
9530 84288553 77219515 71722477 66212576 60978464 56797147 53263711 50175353 47285130
9522 47285130 44230866 41266093 39012094 37179975 35397180 33530098 31731111 30294520
9514 30294520 29041853 28087997 27271419 26981219 26381966 26201431 25271403 24727792 24512300
9505 24512300 24859151 24369256 23611450 23728661 23029423 22737862 22703487 23014740 23041399 22424892
9495 22424892 22090089 22384467 22294824 22299238 22801889 23559718 24033256 24324575 25361583 27051600
9485 27051600 28894594 30842925 33327533 35497261 37539976 38394656 38908115 38685837 38438261
9476 38438261 38336630 38033221 38036932 37099000 35688148 33143440 29871740 26628916 23305539
9467 23305539 20912343 19219437 17244528 16023213 15180711 13677855 12778170 12016889 11188289
9458 11188289 10849021 10678725 10234909 9835674 9255922 9430227 9379868 9277851 9424413 9251074
9448 9251074 9001174 9025212 9701852 10021382 10384493 10116460 10102702 10125222 10120759 9918328
9438 9918328 9855410 9742923 9159403 8571103 7760785 7715178 7389881 6584658 6031783 5647221
9428 5647221 5498773 4935413 4716904 4159690 3927886 3833152 3746273 3689520 3537779 3160250
9418 3160250 3558703 3665291 3347031 2938471 2876667 2927336 3336026 2736517 2168453 2233809
9408 2233809 2146342 2719089 3055960 2985386 2470428 2237326 2580567 2564404 2524179 2394269
9398 2394269 2536005 2816658 2855259 2845056 2832972 3079847 2581316 2283801 2308168 2167518
9388 2167518 2291559 2909797 2395608 1829002 2313483 2372781 2035310 2001899 2312609 2438407
9378 2438407 1972421 2709117 2900770 3200883 3064421 2495774 2242265 2815897 2896149 2887426
9368 2887426 3242184 2957965 2701653 2819927 3157127 3150590 2696722 2439950 2742999 2349711
9358 2349711 2201112 2278149 2134927 1965056 1886159 1874737 1754055 1485279 1910501 1531749
9348 1531749 1664828 2475313 2669568 2123206 1754395 2175209 2438730 2051075 2257450 2461595
9338 2461595 2545560 2759144 2491101 2809338 3048622 3073639 2982423 2809454 2626179 2755873
9328 2755873 2616825 2553358 2275762 2315949 2637767 2446222 2398385 2535198 2169547 2097041
9318 2097041 2299261 1980505 1574211 1988160 1400351 1197083 1558384 1412734 2052695 1852784
9308 1852784 1770908 1843952 2120744 2128136 2177763 2024853 1877314 1825401 2451972 2250594 2484324
9297 2484324 3276105 3037317 3391618 3788307 4101568 3784376 3637754 3351703 2691787 2616534
9287 2616534 2818771 2723806 2182573 1895897 1859601 2311296 2320595 2168328 2245980 2254647 2320958
9276 2320958 2063948 1911214 2157929 2687857 2660744 2514140 2291531 2595868 3174459 3403431
9266 3403431 3550969 3738740 3587991 3972097 3916418 4353892 4863757 4828360 5032991 5052277
9256 5052277 4875287 4867657 4480805 4450865 3944081 3931207 3662326 3755913 3150084 3059439 3611804
9245 3611804 3575541 3692262 3395145 3305667 3917168 3933552 3843545 4069266 4232255 4795004
9235 4795004 4595671 4652403 4054824 4363926 4774049 5044538 5539879 6374099 6237439 6035776
9225 6035776 5962315 6857488 7452777 7910734 8182896 9009096 9587237 9501053 9591343 10679524
9215 10679524 10777239 11077636 11890180 12693186 13815448 14818926 15663564 17135012 18992800
9206 18992800 21138171 24117746 27067792 28811477 29297794 28935465 27744409 26867573 26188516
9197 26188516 27396741 27741255 26868586 25176725 22578568 19162903 16486224 14650682
9189 14650682 13072389 11673414 11007468 10004791 9154753 8697051 8364841 7897039 7387535
9180 7387535 7358013 7265876 7136787 7337586 6861076 6949670 7350276 7204637 6661622 6543767
9170 6543767 6914191 6878081 6897263 7161184 6649156 6493870 7001979 6751965 6732495 6955281
9160 6955281 7580396 7670851 7625263 7376854 7104351 7525046 6895027 6294159 6304385 6278617
9150 6278617 6343438 5970005 6210025 5367234 4814924 4701160 4454275 4232209 3963440 3726896
9140 3726896 4016408 4264338 4338618 4321260 4412512 4061201 3972407 4180203 4119514 4198639 3691830
9129 3691830 3735149 3862228 3934429 3709850 3859620 3992096 3659325 3661218 4019582 3986787
9119 3986787 3838546 3653479 3327053 3832872 4043542 3788215 3730854 3835874 4023717 4353245
9109 4353245 4382404 4438772 4435466 4376375 4525628 4096230 4349723 5114882 4902119 4216616
9099 4216616 4837493 4627105 4800297 4724583 4546139 5017092 5053663 5075568 4869355 4441474
9089 4441474 4783340 5123126 5245052 5477690 5012126 5184017 5504691 5434702 5134046 5343754
9079 5343754 5598383 5736909 5737135 5548505 5398805 5611942 5771156 6208527 6879122 6772069
9069 6772069 6738970 6615941 6552078 6610922 6993054 7178557 7549299 7979925 7504625 7564393
9059 7564393 8118886 8051941 8331628 8623878 9156255 9398181 9731146 10098660 10559873 11174506
9049 11174506 11549641 11934531 12265324 12827874 13570710 14294466 14842363 16223267 17090235
9040 17090235 17535583 18383506 19037914 19803539 20362297 21064746 21976900 22503803 23860337
9031 23860337 24998024 26307525 27299155 28475293 29269074 30394753 31646007 33224485
9023 33224485 34985636 37230140 39784888 42650219 45547930 48643358 52089171 56538330
9015 56538330 61297265 66618440 72755590 80133888 88634693 98716419 110786135 125044857
9007 125044857 139369607 148075739 150380746 147975740 143962080 140649888 140193838 142119862
8999 142119862 147370081 151419315 150029098 143875581 134110225 122994338 112680128 104069119
8991 104069119 98502579 93963827 90041412 88027040 87194289 86808855 86887800 87664926 88895278
8982 88895278 91217951 93937914 96829597 100592335 105279304 111543731 118918937 127755852
8974 127755852 137592619 148746254 162756287 181013352 202682907 226838542 251180458
8967 251180458 267214864 271098105 265720357 256071349 247715619 243267606 245268320 252350881
8959 252350881 258498571 255408895 240616669 218850912 193653052 169492026 147679233
8952 147679233 130152928 116946227 105982012 97840252 90403173 83408063 77329674 72401723
8944 72401723 68709893 65892037 63590591 61734829 59779763 58044401 56771478 56065756
8936 56065756 54643364 54048205 53146212 53052286 54308408 55152142 56822219 59330653 62858819
8927 62858819 66530732 70716245 76692293 84994820 93303547 97921190 96670647 91012489
8919 91012489 84024654 78220859 73395651 69363079 65959792 64326411 63314413 62247306
8911 62247306 62296743 62898826 63487024 64297288 66138298 68127941 70229139 72705158 75875111
8902 75875111 79630215 83971618 88922396 94343848 101508335 109269514 118834281 129641644
8894 129641644 142685190 157221804 174798615 195266904 220205821 249921110 284619302
8887 284619302 320269472 348794994 364786690 364785119 346257782 313412442 274757511 235826044
8879 235826044 201588404 172516182 149608945 131514659 117917071 106894091 98315684
8872 98315684 90928999 85226648 80920270 76359588 73814193 71865584 70381241 69162053
8864 69162053 68298909 68618618 68803575 69386151 70522693 72142526 74604640 77564029 81768606
8855 81768606 87199298 93030232 100352455 109684180 121366887 135198601 151955245 169527290
8847 169527290 183399080 191047741 191319107 181499916 164022917 143018507 122350828 103940683
8839 103940683 88396193 76323146 66330930 58501929 52047828 47053496 42976359 39323604
8831 39323604 36823916 34299749 32098667 29951836 27771406 25776577 24921975 24022649
8823 24022649 22552400 21437898 20628932 19780963 19110942 18145879 17003304 15578750 14974277
8814 14974277 14824813 14496219 13768106 12738724 13151902 13027721 12594106 11561323 11153830
8805 11153830 11099582 11334328 10831403 10127879 9646995 9408812 9165513 8421223 8015121 8140139
8795 8140139 7821851 7699645 7564310 7441183 7449955 7170373 6816889 6479940 6034036 6370906
8785 6370906 6735112 5942815 5852905 5737272 5489697 6238739 6655061 6518592 6295321 6407366
8775 6407366 6540137 5952984 5710226 5664285 5482217 5680863 6271056 6656862 7065647 6639723
8765 6639723 6908661 7032429 6683731 6844000 6869229 6644752 6846153 6865695 6719926 7074513
8755 7074513 6803833 5945157 5359033 5382231 4964616 4699806 4635901 3971678 4212440 5044465
8745 5044465 5127933 4550033 4807561 5175898 4834610 5063614 5726165 5975150 6052657 6063947
8735 6063947 6218281 6433534 6691163 6578088 6930194 6345619 6316289 7245750 7486881 7363227
8725 7363227 7043551 6788918 6226534 6020832 5407090 5240041 5121657 4704480 4588633 4408991
8715 4408991 3678634 3107726 2989784 3000759 3461849 3124462 2707154 3035311 3466387 3133139
8705 3133139 3096737 2992464 3468716 3783165 3480035 4175719 3578836 3988297 4123415 3971178
8695 3971178 3508620 3318512 3271586 3408553 3610424 3140894 3077873 2499403 2551955 2559337
8685 2559337 2391068 2319454 1851659 1554204 1454373 2045832 2315635 1694040 1581811 1548661
8675 1548661 1797250 1595914 1249760 1534862 1431505 1637095 1295672 961166 753761 957480
8665 957480 1010124 1053186 1246897 1403188 1395384 1258418 1501051 1120823 507504 673356
8655 673356 1222037 959496 1200031 1081542 863487 916351 829256 936025 1347057 1047107
8645 1047107 776828 849441 825227 521537 658601 1166259 1204234 1558294 1362779 1109397
8635 1109397 1585565 2109646 1391791 943089 1430075 1730633 1874090 1888237 1868340 1908682
8625 1908682 1302315 1741101 1978751 1643296 2044119 1744981 1515458 1702028 1523174 1476973
8615 1476973 1324582 1179469 929286 1432581 1333300 1246275 724181 1287948 1767779 1122475
8605 1122475 833574 1134842 1635304 970130 780916 303863 538509 906647 967316 909022
8595 909022 421561 752550 1563767 1392372 1867041 1587522 1118245 1001685 1469323 1785228
8585 1785228 1229100 1392300 2062714 1772179 1431905 1610969 1730631 1135456 1352912 1443475
8575 1443475 1160677 1276234 1532148 1530000 1133846 770707 804822 547383 679043 920118
8565 920118 766222 659133 641728 382049 278687 442318 330856 494324 541472 765191
8555 765191 514126 301877 473378 503828 353871 -109662 193794 507763 551219 528499
8545 528499 530524 680707 683659 997853 1114700 614892 174424 270301 696746 963811 922936
8534 922936 701012 771715 708403 382580 535245 292364 444491 777944 723877 1317848
8524 1317848 1323628 865153 1206746 1472104 1332780 930368 1348739 1888955 1879259 1745832
8514 1745832 2182665 2066865 1446352 1305707 1071564 917137 1069649 864015 973076 814482
8504 814482 789979 498692 431998 361754 302895 536686 599076 561392 765609 899255 849600
8493 849600 373031 596307 604237 27762 228558 555903 378833 551812 693998 762371
8483 762371 900079 900218 1208756 1380761 1789438 2034356 1946154 1047620 974800 732909 710170
8472 710170 917370 612494 723561 599986 319321 520439 835067 817346 953898 650184
8462 650184 751411 360286 185570 119354 244991 -112546 -296056 -224 628510 853958
8452 853958 689740 314106 278176 599168 69093 -3900 296425 535469 755239 712451
8442 712451 305622 -131445 489076 264873 -140412 170837 190664 420121 -384419 -110714
8432 -110714 150252 -164206 -678971 106686 161331 85119 -11408 -36570 -149905 3660
8422 3660 265204 21694 -374981 -272865 155271 514124 170895 -304135 -245598 -370456
8412 -370456 -139604 -4535 -225068 123372 198451 581117 616675 707588 209344 -537254
8402 -537254 -450836 269641 147141 -880532 -216527 375933 374080 89387 -32319 47801
8392 47801 -289280 -525307 -442251 -82772 356083 600863 -26828 -143784 63926 193768
8382 193768 159814 -352131 -537366 258734 608809 29287 273182 -324701 171297 23839
8372 23839 -95275 -298233 154982 22001 -392404 -281282 -197052 -177231 5405 -118078
8362 -118078 -342181 79882 -194970 -368645 -452195 -80762 759525 417292 61897 -106932
8352 -106932 53096 20219 -143954 268048 394190 215521 -53356 -55506 -104906 -255667
8342 -255667 -150465 -16347 -25893 143199 469691 187840 -20493 189779 217740 36319
8332 36319 -3444 373991 406895 -173408 -86184 -60884 -323608 -396171 71469 674307 468937
8321 468937 258408 -117394 134040 133494 130411 54550 -201129 -602094 184915 441694 -17054
8310 -17054 28154 72537 -76460 -248384 72304 -386813 -293307 -269152 -294042 67912 -20156
8299 -20156 52679 -116311 237819 -384745 -374225 409350 167645 -84191 417329 233100
8289 233100 29964 -232667 41757 180020 216509 385595 -101064 -351192 -135983 67677
8279 67677 529676 427969 539114 424825 17353 -510453 -459392 1766 38435 -263913
8269 -263913 -749377 -448264 -320206 -80035 18027 -246326 -458045 100267 488022 725686
8259 725686 298965 -100155 -588246 -345752 142070 157509 522414 574505 -359058 -342167
8249 -342167 -61441 -274961 -1045 96888 158969 -150016 -231426 -144256 199739 372669
8239 372669 -485527 119134 -33708 168554 -199559 -613745 -245601 91486 76865 -7928
8229 -7928 -86870 -300681 -479583 -60834 -164933 266817 217318 -426344 -105349 723821
8219 723821 835750 119908 133669 -111517 -241390 389543 559725 114143 277408 137635
8209 137635 273784 400500 699890 -150400 -97229 191718 231990 116439 517610 375085
8199 375085 26122 171706 643543 919325 1106849 1314017 2364105 -2399340 -3836126
8190 -3836126 -1450180 -1623216 -1008895 -1072395 -472551 -329837 -654523 -609889 -97168 -626759
8180 -626759 -146275 300992 -437733 -785927 -351501 -289810 -525032 -692992 -356115 -735908
8170 -735908 -1161973 -1184303 -227650 -131184 -385196 -115252 79556 -597384 -352954 -141112
8160 -141112 -349867 -356583 -875352 -699116 -83114 -409668 -533903 -482969 -500543 -248942
8150 -248942 125709 -118268 293976 14712 -162121 -42094 -125830 -134774 450020 674919
8140 674919 68735 390406 173647 -478060 -327501 -215616 -306733 136502 -120859 -88165
8130 -88165 -504161 -354291 15692 22456 -33064 -541976 -338830 -482316 -763424 -527556
8120 -527556 -489113 -311657 -559912 -431175 -456666 -514701 -759141 -1113419 -799409 -276065
8110 -276065 -307201 -52835 -632536 -508887 132587 442157 308542 -89211 -113508 -292971
8100 -292971 372661 448324 -47257 354075 643656 789090 407603 -130415 -637938 -262495
8090 -262495 -269080 -465989 -429515 80966 105021 -110335 -127021 -360299 -630708 -441664 87212
8079 87212 -151224 -562234 -605973 -518933 24658 381956 417816 411284 336387 102402 -452720
8068 -452720 -627606 -153242 -251849 -589483 -300571 -353198 -198812 -165303 -242279 -1031599
8058 -1031599 -545236 34280 -190913 -263637 -281436 -79181 -158879 19966 -132572 168101
8048 168101 -183732 -465874 -274629 -188689 -16791 -124863 -4373 -172808 -164603 -179816
8038 -179816 48813 25631 67928 304677 290945 260527 118300 220189 116757 -353721
8028 -353721 -428535 121165 221617 -92063 231615 347511 743114 202236 -78029 80703
8018 80703 102640 259178 385691 117862 -195014 20098 -98230 357805 459396 -225476
8008 -225476 44172 347481 515839 240917 252022 -139704 -66911 -34498 -342782 -60823
7998 -60823 -108893 -166269 208097 88990 -132783 62263 158526 -94926 -62550 -121499 -135957
7987 -135957 -425282 -125569 -201737 -158613 57615 8736 -189966 -137926 -175458 -192912 -401195
7976 -401195 -1165084 -654736 -460705 -227050 -713496 -491419 -142979 403820 840156 435005
7966 435005 352587 291569 138966 -140582 92205 506258 107490 -34740 578996 267490
7956 267490 -128667 89297 39820 -271505 -982796 -558276 -30706 -158094 -195190 -223743
7946 -223743 161702 438849 363404 344084 -123080 -167695 -297309 -158258 -106011 305051
7936 305051 360503 -137235 -481630 -1025067 -718328 -399621 27159 31017 7884 108013
7926 108013 112854 -357303 -442110 -390635 -50790 416246 -102668 -61177 -227648 74733 301167
7915 301167 -23563 -328778 -478101 -59433 -30502 -543486 -718654 38648 843663 400124
7905 400124 219487 376963 328444 214743 256661 892590 503707 220062 345281 246768
7895 246768 -64098 -376435 -129552 -555891 -504990 -678034 -566066 -106375 -147408 -132779
7885 -132779 353834 63032 27585 178598 329926 120524 -313147 16817 352785 57315
7875 57315 502526 222106 24569 227012 -161193 -55516 -289583 138230 630290 -123032
7865 -123032 -740026 -532829 -360217 -572493 -187578 -36602 -428836 243118 346224 150212
7855 150212 -46907 -174456 -1379 -696425 -332587 68856 -8211 110223 369792 408114
7845 408114 393734 169475 -254161 108629 -92417 114800 -376394 -681382 -566059 -282736
7835 -282736 -281282 -165440 -256161 -610641 -735390 -631405 -1026919 -685478 -627477 -512654
7825 -512654 -298381 205092 -308094 -850399 -284407 27022 300694 62895 -16838 -198791
7815 -198791 -473132 -273895 -621493 -922939 -1058026 -761768 -438010 -374339 -125502 180682
7805 180682 273701 -254067 -400111 -538902 -384677 -245393 -213204 559434 139549 86466
7795 86466 288733 153665 469467 323455 294190 -142314 144059 -13815 -202098 250588
7785 250588 126290 -294784 -178549 -270433 376578 283181 251691 520106 30728 -54037
7775 -54037 67915 -126746 -185231 -169992 33434 436355 304741 -346338 -235949 -120305
7765 -120305 1848 -65153 -58444 63585 -294932 -146691 -273532 -404952 -707647 -182326
7755 -182326 -325138 -401322 -350758 -149946 -21228 329564 -158762 -644989 95778 396542
7745 396542 77586 -334508 -263433 -529944 -506852 -27243 73718 -166293 -403732 -72342
7735 -72342 -412623 -543786 -478646 -259611 -69628 -343862 284324 332744 -367172 -499293
7725 -499293 -25256 50081 -430191 -356783 -260248 -492068 -558366 169013 180710 -88811 -140427
7714 -140427 -330748 -170411 35650 404057 -182797 -533734 -466092 -139191 171798 391162
7704 391162 -125069 -756375 -1060446 -339371 -437044 -94953 -54111 -450855 -160002 -33433
7694 -33433 -5968 168113 167419 -245917 -363769 -337089 -40892 -186946 -417026 -236271 -76981
7683 -76981 242765 88591 -390088 -446353 55486 -96418 -48790 -91152 -451015 14471
7673 14471 102378 193994 -66609 -289798 -496065 -531187 244934 206572 -413483 -396960 205114
7662 205114 460787 297653 85299 162164 412681 73028 -225187 -57196 -297332 -275222
7652 -275222 -698078 -571867 -475226 -327444 -539704 -366739 184530 -209895 2408 -201991
7642 -201991 -779746 -1310458 -791888 -186577 -433140 53595 -59054 95546 162243 70607
7632 70607 -117518 -132730 -652856 -304170 267788 -77793 152912 -211898 -178484 -714564
7622 -714564 -290015 417094 110300 -385698 -844937 -948097 -528226 -24369 503237 613143
7612 613143 38606 -253629 -79026 9611 260772 123498 -18848 -404375 248093 444222
7602 444222 111785 -528401 -488726 -92459 -261423 -335296 -190389 -280152 -225247 -720822
7592 -720822 -159422 32592 -22679 -768112 -818661 -370489 120427 298646 -16319 -250971
7582 -250971 109425 371177 -90397 -43884 -377363 56737 -358139 -40761 -16980 -506271
7572 -506271 -403097 -785788 -568118 -176217 -90079 -347177 -422747 -208657 -266019 389243
7562 389243 138204 36883 -144546 -451649 -500666 -688383 -435443 -30833 243070 38049
7552 38049 -351838 -40517 -288602 -869665 -461992 -299336 -139247 5272 -197290 -407888
7542 -407888 121242 209508 168199 289545 275336 246425 -81662 -273085 39040 -365794
7532 -365794 -411434 194065 359501 698810 -133952 -637421 -186947 -438534 -437594 -460613 -878115
7521 -878115 -683604 -655074 -422131 196312 -9233 -447528 280449 168225 467270 83049
7511 83049 -439587 -948474 -503615 -395884 -317676 -284481 47194 114358 -249991 -451564
7501 -451564 84771 576466 -39133 -253711 -479809 -515410 -757687 -919401 -431830 -485444
7491 -485444 -835221 -78926 31195 -29402 211936 92 -170724 185541 -70068 -145656
7481 -145656 -61504 -249143 -608861 -642732 -913811 -916542 -446720 522468 43937 -58370
7471 -58370 67619 -197546 19105 -7725 437675 254148 25083 74877 102003 559573
7461 559573 255470 -284983 -536362 -422109 -425150 -190374 -173151 -488378 -361251 -717317
7451 -717317 -452009 -142722 28877 -51787 87426 84688 -78004 -397693 39000 47431 -75760
7440 -75760 18555 -398071 75120 276567 155586 106903 -113571 -445109 -556510 -275598
7430 -275598 -92517 -336698 -499110 -423633 -411139 -552586 -390951 41631 -9430 121506
7420 121506 299687 375180 -73958 -210760 -28969 -328397 -236402 217188 162305 -72041
7410 -72041 -162891 -307545 -535991 -399658 257833 537663 368117 282016 282019 147111 -352286
7399 -352286 -428670 -108295 179228 107385 -462033 -392999 -466271 -314257 -188158 -390420
7389 -390420 -337286 -181572 -102122 144789 -204196 -204917 -56286 -306086 -158082 -17373 508662
7378 508662 255786 -376445 -301500 -736070 -546732 -535837 -371298 -406634 -549677 -969601
7368 -969601 -920510 -396029 -296922 -282123 -187045 127945 44736 -274327 -204731 -266221 76160
7357 76160 248398 278434 424480 540015 264189 -235651 321084 413943 111086 293695
7347 293695 802031 -18932 -379506 -461377 -547014 -679752 288576 572536 2914 -340818
7337 -340818 -258716 351528 -64229 -101856 -391927 -288964 -190497 -500545 -103130 438454
7327 438454 220324 -223993 -130454 -429799 -468069 -44289 -49528 -568805 -501119 -378263 124849
7316 124849 170411 -501740 -579271 -521947 -243655 -258221 -296635 -229607 -228019 -246353 -294133
7305 -294133 -829992 -263591 -125404 110810 131586 611880 861745 812873 316546 -316253
7295 -316253 -386148 -178279 -244240 -336925 7265 130931 11155 -68310 -402453 20956
7285 20956 12585 131126 264189 -275737 -541773 -602228 -20118 -553760 -448916 -200893
7275 -200893 -7462 118876 115991 40085 232922 -143132 -179697 -108406 413974 -19449 43658
7264 43658 387093 596373 457473 406716 -157158 -719181 -692220 -422671 -230759 424304
7254 424304 311304 -368649 -188636 -180493 -238770 12394 187129 -273724 408722 432498
7244 432498 144295 122072 192434 112249 -147545 -59515 211853 -243885 -680249 -299029
7234 -299029 -321659 -260277 -82537 -341418 -644889 -94301 416989 609114 311998 76330
7224 76330 11934 -153095 -121565 376142 741651 250718 -558116 -467803 -407623 -311525 363271
7213 363271 41435 -5208 -108418 -265 263294 305001 185583 519881 174492 -431437
7203 -431437 -224999 -398403 -232509 -5420 -236831 -361106 -317852 -8194 -714393 -817642
7193 -817642 -312504 109377 299617 -70556 -279255 -99241 183461 -395417 -730153 -740437
7183 -740437 -541671 -495577 -264512 -374629 -122587 131671 -176794 -461580 -113292 80268
7173 80268 35316 143330 -331689 -204091 -575870 -535707 -306611 -510765 -535544 -159212
7163 -159212 -525968 -592808 -649070 -146578 -162702 -442610 -383486 -404190 -273126 -193336 123602
7152 123602 87121 63450 -38156 -176993 -314989 199855 438824 66924 -200803 127705
7142 127705 106351 -251187 -98405 -178513 -414015 -120250 -40691 -756514 -723088 133072
7132 133072 -72435 -642688 -564938 -387317 25391 302254 217567 216075 -311537 -667830
7122 -667830 -448571 -191977 443417 -6127 210186 -245783 -375023 196950 225860 48635
7112 48635 -503189 -355210 -413633 -435646 -502154 -209097 26340 -126081 -390551 -286571
7102 -286571 76434 155250 100249 -240291 -429373 -64793 97186 -280670 -111294 -228174
7092 -228174 -522808 -279505 107360 294548 3434 -134025 -116453 -71524 -408619 -591598
7082 -591598 -534915 -739674 -765869 -291586 -236921 -56352 7919 -42460 12639 4591 -211497
7071 -211497 247097 -1420 141859 108800 -229095 91332 -74695 213561 -226652 -675342
7061 -675342 -558383 343043 333728 279783 153635 -378796 54137 146283 115466 15724 112911
7050 112911 -173926 -546247 -957867 -575979 42560 61827 -128893 -139227 -7184 -61899
7040 -61899 -320222 -216681 -487588 -332052 -205705 -297613 -83461 -226243 -899782 -1396449
7030 -1396449 -884921 -790762 -705292 -311843 -226169 -109036 -278847 25331 -175608 -430984
7020 -430984 -410922 -271799 -316243 -321264 -39406 -63153 -180424 -453168 4441 -187249 -280412
7009 -280412 -43282 -284237 -483591 -368642 -321588 74949 183246 -427738 63578 13305
6999 13305 146546 -24033 -212893 195108 463486 799515 322796 -467547 43203 110324
6989 110324 -18945 -313044 -303908 -73111 -50428 396142 11028 -35447 -126039 -235013 -211949
6978 -211949 -152217 -244161 112890 435524 259803 -281334 136469 270293 446641 112418
6968 112418 -296611 -155652 -163679 -446752 -269773 -469321 -462292 -32336 -111233 -501073 254516
6957 254516 81995 -374903 -682171 -1054766 -874386 -637947 -469119 -403967 -49308 276320
6947 276320 50278 -201328 -404230 -136251 111402 423978 877416 366523 107331 8441
6937 8441 -40535 -275674 -909333 -608896 -327518 166605 434423 167343 170001 -202456 -259291
6926 -259291 -116469 -194906 -346315 -646360 -452538 -103216 134753 -254578 -571511 141632
6916 141632 2149 66190 -141830 -273682 -800805 -520730 30832 268726 449766 28864
6906 28864 70697 507872 104247 -400039 -255204 -615761 -440937 115972 -48717 51384
6896 51384 -208349 -526705 -264970 -506750 -426050 -644569 -334117 293816 158054 165415
6886 165415 160445 34468 -402162 -683244 -691259 -382607 -562634 -224949 241329 114158
6876 114158 -109095 -24853 -57889 -278741 -436964 -655174 -401846 -365211 -424150 -410318 -535188
6865 -535188 -528975 -425741 326598 273997 -404086 -474964 -336538 11402 130431 -211806
6855 -211806 -231760 -683614 -384387 -378625 280575 218506 108709 18288 285657 33411 -1206
6844 -1206 430217 -382080 -628274 -558331 -409197 -162516 -224153 183692 152834 -272252 -305923
6833 -305923 -453179 -473212 -176171 -424148 -562371 -183816 -344708 4935 198072 -207324
6823 -207324 -401570 233500 356456 113708 319319 201882 22847 352854 -133953 -66545
6813 -66545 -364164 -677217 -260292 96096 -138810 -45192 3874 -469204 -844992 -356894
6803 -356894 -286454 -439431 -603114 -261371 -113592 -105181 -339934 -222036 -214800 -326367 -17470
6792 -17470 176506 -251531 -262133 417275 513945 -41915 -88877 -115883 165425 -315338 -503279
6781 -503279 -334072 -116811 -659141 -828801 -279291 -342419 -551158 -572021 -433278 -85770
6771 -85770 -147517 -535502 -418077 -334337 -344653 -139961 -25080 526562 669198 47390
6761 47390 6790 -387832 -171863 104581 -1441 -560729 -1131387 -624243 -315223 -12113
6751 -12113 136467 -279578 166160 -316205 -49053 158406 151491 217416 -25026 -141338
6741 -141338 -168770 259244 844750 479724 -229558 -407238 -86997 -319069 -622618 -835697
6731 -835697 -763165 -340985 -64090 -526380 -643016 -913897 -427192 -453140 -414114 271317
6721 271317 -106701 -446003 -75298 123914 -344704 -576137 -179361 -96693 272721 69595
6711 69595 38022 179688 143501 -141616 -80648 120361 -83794 331340 -14528 366018
6701 366018 169446 -166142 -915215 -391390 301166 261311 477768 413111 191218 -78238
6691 -78238 231961 37955 24300 -195602 -47520 -354093 -290060 -572592 -389012 171505
6681 171505 225154 75705 -86709 11395 235975 105032 -193194 69710 -739089 -478132
6671 -478132 12651 -123601 -391592 -24475 51842 365214 236133 -93823 -171636 -98183
6661 -98183 274623 195927 520257 88157 -366288 -169587 -51215 -68417 -298113 -1006668
6651 -1006668 -933221 -162555 -42581 209447 122032 176391 174576 215154 239994 140115 -141683
6640 -141683 -331090 -416835 -486856 -395812 -250267 17533 160024 -408282 -828010 -717947
6630 -717947 -150368 68911 -142474 -139143 -75386 98788 315251 522582 695695 672980
6620 672980 591938 682837 449504 56687 -54091 -215931 -496128 -189425 -343548 -354368
6610 -354368 -206857 -371527 -169808 312018 227259 -265283 -110589 348054 375540 122801
6600 122801 240193 531493 584253 526888 -249755 -322988 -590916 -827942 -681012 -124719
6590 -124719 294587 393655 541855 278749 258284 381981 222777 -149976 -8258 200179
6580 200179 651031 140374 -341323 -516066 -625852 -824094 -612242 -118773 327627 -30576
6570 -30576 -792883 -866324 -855230 -970061 -265413 7222 -562202 -373546 380860 554969
6560 554969 340377 -4292 -381410 -35560 89333 219860 -162528 215579 297528 -118378
6550 -118378 -476 -191217 -621462 -174346 -182762 -133640 -301587 -338463 292904 -61259
6540 -61259 533842 259384 362325 106445 -64018 440022 337676 -99777 -391420 -828343
6530 -828343 -847567 -287684 -206086 -392365 -185872 -12125 -257348 -430287 -440432 -248361
6520 -248361 -805600 -866209 -615734 -360571 -311702 -111842 -337728 -502103 -681626 -503730
6510 -503730 -165655 54954 485485 217813 38004 -172155 -436975 -582036 -616617 -275614
6500 -275614 -285460 -101481 7995 548842 508287 61992 -40611 -25387 -316033 -425258
6490 -425258 -560210 -263569 -557578 -269425 -75877 19913 270660 187546 255504 -210102
6480 -210102 254165 222117 -399585 -327457 238348 415021 676468 447529 151676 -95956
6470 -95956 -584643 -602952 -371415 -272430 -540589 -681138 -648448 -481288 93516 -297463
6460 -297463 -396239 -82723 -190623 -392653 -384335 -636817 -867958 -976387 -593217 -59797
6450 -59797 112269 148321 125440 36395 -145512 -802858 -930967 -624610 -114127 -65477 83529
6439 83529 441933 -162881 260973 311334 -59257 -161016 -470449 -379583 -351424 20345
6429 20345 -111479 -449625 -836523 -194655 290563 127530 527985 81808 -55903 -260971
6419 -260971 -954138 -677846 -756490 -823558 -1103804 -883415 -107093 -90624 -141862 -54888 141390
6408 141390 -17817 11797 -362392 -368138 -183720 -151538 -126430 -472077 -590979 -508835 -452596
6397 -452596 21414 -236661 -309622 -140506 -277431 -400504 -677283 -631812 -453550 -472358
6387 -472358 327400 620069 366667 -132708 -142629 63836 -564832 -393630 51655 82755
6377 82755 -36382 34558 -105523 -455358 -400810 -19267 303156 54621 -450582 -569144
6367 -569144 -635462 -150734 172593 -326451 -512800 -547273 -250916 256070 254977 -430539
6357 -430539 -658361 -219936 -385349 -631814 -415425 -64923 -205391 -344353 -90771 2077
6347 2077 -582245 -354922 -148896 -109010 -320282 -316777 -466361 -583573 -504420 -532350 -118012
6336 -118012 67362 -504240 -677700 38517 503213 586740 611995 178417 -120271 393305
6326 393305 169511 -171168 -112795 37353 154524 61027 -161009 -116591 -134793 -187056 13991
6315 13991 -403135 -342404 -127870 186479 516972 478827 510610 770202 350156 536882
6305 536882 404717 -388945 -145127 -94110 18595 330637 220891 -82827 44240 -232168
6295 -232168 -144720 -662764 -410848 -337052 -198546 -261093 -317193 536676 622905 -51804 -388458
6284 -388458 -250440 -196394 -166365 106428 469152 490980 739668 410009 214730 238856
6274 238856 348314 573609 181609 144952 -117177 -340847 -677620 -54193 233619 -159204
6264 -159204 16013 -539373 -680610 -369090 -83164 -259780 95231 846720 479609 -455234
6254 -455234 -765023 -754950 -125931 -87906 -149417 -144138 228968 289874 -252377 229176 92126
6243 92126 -210034 210496 517435 618364 336630 23231 -277730 -187672 -233364 -310533
6233 -310533 19707 -322976 -51813 290343 -268357 -556892 -173658 -68500 36287 -115081
6223 -115081 219829 491762 411803 135910 -80940 45745 133451 -161160 -333211 -235279
6213 -235279 -172255 160338 58252 -371381 -2750 183727 151127 -170961 -503022 -78753
6203 -78753 -193587 -284138 171152 -131562 -185686 -180951 -333971 -454344 -285774 -170707 148551
6192 148551 195161 161564 172324 95445 29425 -213371 -664669 -579741 -266498 -209899 140402
6181 140402 -126987 -159096 -372796 -582658 -146769 227980 203082 88335 -325178 -249224
6171 -249224 -253923 -48808 198220 408511 512027 328095 -431881 -16510 -438602 -14972
6161 -14972 -5745 427600 562786 102791 -55917 -119433 -14779 -159379 274146 -53443
6151 -53443 -138109 69284 -43148 130604 -149386 64295 270160 231205 517946 326625
6141 326625 41488 112565 -134225 659150 929595 737461 416517 338324 660322 -236498
6131 -236498 -231685 109684 -371818 -600547 -484847 -23477 327792 -127677 -204621 -157741
6121 -157741 -272206 -111389 330298 127302 -14103 217053 109009 -421174 -62378 -281679
6111 -281679 -170636 -518496 -418176 -235769 144874 257431 126073 79485 186492 251987
6101 251987 -234329 -602232 -525430 -320530 40344 158483 -271888 -434654 -79934 351437
6091 351437 334745 264331 329657 -202171 -583977 -367218 -385422 -745733 -668548 -323218 291721
6080 291721 485413 338767 -94732 -403091 -344523 -191121 -306121 -132061 149508 -326224
6070 -326224 -1209136 -324424 -379162 -876363 -123916 -10139 235231 13864 -379885 -77411
6060 -77411 -298273 -524317 -375968 -147180 -557979 47398 -46361 -654788 -52589 -459980
6050 -459980 -115990 501456 362438 362458 170330 -62582 91059 -432808 -177708 -58163
6040 -58163 -219965 275384 319824 154518 259315 -177362 -513899 -196150 46861 -10355
6030 -10355 -41452 6399 244498 -324638 -240613 -13456 -22534 -319603 -64850 -89123 -530819
6019 -530819 -425842 -339396 -563410 -444253 -634993 -283142 -199020 -418400 -265558 -261871
6009 -261871 -455607 27795 -182063 -160225 165635 339096 222081 248227 306836 -136843
5999 -136843 -545129 -850784 -875673 -670036 -213434 -239353 127434 229601 16601 249175
5989 249175 177121 38286 -82751 -192602 251753 -130190 -593572 -264558 90002 5516
5979 5516 141050 42584 37713 -352934 -363386 -19174 354201 127268 -235401 106341 562412
5968 562412 384127 30999 -333603 -358848 234123 202936 -253466 -264556 66347 -220293
5958 -220293 -472512 -162201 -389890 -524171 -18963 127162 -16137 -366872 -636543 -510001
5948 -510001 -377838 -559287 -55253 332446 414146 382449 -257348 -77222 -239404 -357161
5938 -357161 -280800 -372233 -82438 156562 446114 374161 -50445 40519 517710 164023
5928 164023 730 -179665 -307642 -251662 -293201 -531191 -388220 -181018 -260423 -313652
5918 -313652 -256445 -432508 -530825 237525 -129183 -377460 213163 365920 25057 -33301
5908 -33301 -159561 199121 -25857 -253093 -46162 -48495 240829 502087 352493 461978
5898 461978 460102 187775 50050 -275797 -576061 103330 243868 -136537 -66357 -103450
5888 -103450 -145851 -392723 -377487 -190641 -250628 -120430 -554478 -355695 -63749 -289170
5878 -289170 119678 177472 -238804 168755 -12256 -465645 184948 140588 -17865 150154
5868 150154 -164981 -609202 -483661 -235399 -262677 -409182 39981 -2937 -176929 -254831
5858 -254831 -424370 -373048 -685989 -1421522 -840212 -550830 -171680 67345 34264 2417
5848 2417 -366034 -279766 -259457 -252735 -361667 -421844 294890 277490 231353 -490678 -502768
5837 -502768 125626 -204943 272534 268711 -76514 666767 643806 442233 836739 536843
5827 536843 743522 434665 -103753 -4670 173123 328677 404600 66009 -72328 39295
5817 39295 124684 -137482 -26254 510917 124287 293006 389431 777795 79892 -593420
5807 -593420 -181727 -93000 184701 95510 -21664 129577 80341 -46741 -138333 -190671 147421
5796 147421 121193 -206110 93859 211333 145190 348864 -217245 -15165 -75469 281168
5786 281168 534623 140121 102149 465721 992585 911518 572576 19230 270314 544215
5776 544215 140143 32124 -438336 -695833 -973771 -452511 -54436 -151052 373927 284344
5766 284344 -198287 -399930 -582243 -363008 -162859 -305529 81314 169835 -1209 289530
5756 289530 238407 68448 -92525 246171 213096 -274409 -270159 -347382 -446171 -334922 214090
5745 214090 -35708 -455603 -131943 51190 913370 1079126 371078 -59065 140300 -248298
5735 -248298 -83433 172284 101639 356664 25620 208161 730820 704504 224007 29984
5725 29984 -91434 -477429 -83301 -40136 -311173 97408 256183 -21597 -110641 -4513
5715 -4513 170317 -17160 163866 65996 31128 -289727 -667586 288769 461279 305689
5705 305689 768572 646969 -191510 -135513 -286373 -105939 215650 265340 423036 323738
5695 323738 603892 471135 -105641 30759 -321288 -142119 190980 273362 144855 110806
5685 110806 -441289 -650314 -866156 -454400 -612870 -141354 1017011 994139 283030 -80344
5675 -80344 38977 150675 85268 -95218 -84557 -126672 -112966 775771 651541 227824 314087
5664 314087 111352 193405 -218895 -542160 -362879 -152511 171647 84272 -285645 -233803
5654 -233803 176014 546661 340141 -108898 56737 -279471 -600810 -111535 -115563 -347944
5644 -347944 -147380 310374 311218 -177504 -432880 99818 154956 35479 -387100 -681831
5634 -681831 -499595 63660 18886 -422822 -186146 276869 271169 287723 120934 -671439
5624 -671439 -548240 -331394 -119876 303111 -44693 371176 329927 504830 109184 -19945
5614 -19945 -55941 97415 32008 353136 -269691 -387115 -125595 50842 127648 126382 130491
5603 130491 146411 481315 660218 75233 -375244 77044 33232 50713 -71957 -65423 -164843
5592 -164843 -104364 272091 -176663 -187382 293829 23692 143790 88928 659218 1001247
5582 1001247 777201 577994 158924 -324850 195016 421600 488118 761251 569405 98356
5572 98356 84819 689220 555945 394949 763664 762913 453844 347118 266691 163417 406244
5561 406244 541282 587371 696894 655339 795619 948664 799077 761336 488334 775734
5551 775734 548956 296458 733829 545707 245145 399795 503681 482857 509671 669460
5541 669460 808856 906862 739967 450508 305644 500000 624955 338435 351635 335667
5531 335667 138882 423402 813414 903643 858872 742498 1039308 870265 633770 460820
5521 460820 491752 491910 699375 1232219 846633 751912 869485 1518415 1282187 820554 843762
5510 843762 1344921 764314 1121712 1704819 1182509 748614 543085 502464 674466 1023682
5500 1023682 897412 707408 767691 1134025 731627 787629 752350 782023 605878 595618
5490 595618 470569 358175 665976 202342 429715 935937 644788 712715 495700 506692
5480 506692 668754 75013 116550 744588 323706 -22864 -100368 106454 180679 231394
5470 231394 580151 660236 382757 479832 875686 741199 911400 551267 349681 511751
5460 511751 476551 575175 19444 330054 381771 905091 837565 481904 783505 590157
5450 590157 261861 352341 699804 520982 386653 -152969 111127 810735 571660 550077
5440 550077 604126 431198 341165 -147943 -40469 60116 125148 82032 -44405 115859
5430 115859 571991 570537 483554 422693 393965 1153615 869816 562592 336675 384515 938317
5419 938317 745039 697519 408902 143215 313361 225031 183867 457116 323844 489344
5409 489344 654223 279130 -74878 68730 172540 311747 -53545 -13372 -54712 -47331
5399 -47331 -5945 -28894 44722 -32111 -161787 328871 635763 773241 681031 517768 269839
5388 269839 115118 533900 443947 706941 693377 421511 203340 443520 456425 450382 282112
5377 282112 175537 162821 435739 388804 458794 715445 823420 597780 812065 508067
5367 508067 631105 727301 359871 174418 354239 529710 571969 767023 541162 580027
5357 580027 737272 561810 367161 312231 389416 364379 300607 361952 359197 542027 565530
5346 565530 247260 282046 354003 143761 -115718 -177223 312089 27186 -57325 184193
5336 184193 248716 35508 212610 43210 50715 -99221 -139070 60206 203607 94611
5326 94611 342784 -155758 -440525 79493 255342 401776 52347 -5294 226110 447842
5316 447842 760300 758220 211204 359418 873709 811830 212506 121691 602171 405540
5306 405540 255270 655595 400489 688968 429690 249897 132792 310006 142089 462937
5296 462937 20601 -76650 628074 589184 125686 426521 939528 993614 787734 327997
5286 327997 409119 297369 145461 61284 787745 673524 1176496 821779 177778 482917
5276 482917 275665 603167 358211 -22622 847187 629752 512593 123060 206050 278288
5266 278288 -22211 -205093 -186558 243181 162721 -103763 -51238 67773 86110 -278579
5256 -278579 -195183 144641 342319 719947 190323 226737 348360 73891 -12979 -113479
5246 -113479 253107 112902 37443 94500 23796 16471 -41819 -169099 -522867 -526990 -417932
5235 -417932 -184406 -40550 454432 352643 281368 -23096 -340847 -154569 256699 177916
5225 177916 53411 267831 -55917 -53321 -43287 -434273 63084 474130 260077 596993
5215 596993 707704 468345 164192 237287 159130 457512 90287 360745 734017 403989
5205 403989 349241 193461 470842 -123226 135740 255934 153117 634097 606243 664184
5195 664184 339674 223984 221657 416074 563390 258624 577870 242451 -133010 -42096
5185 -42096 -29032 -72946 -82797 86311 407242 11129 220562 418879 211241 283769 643636
5174 643636 546910 421565 419418 -247689 -161817 43529 263344 204201 254657 327901 602361
5163 602361 388968 130912 372627 932614 790271 228745 -112313 165306 68849 -133487
5153 -133487 81911 459204 653875 363965 293565 285586 -3642 66945 -42885 -406325
5143 -406325 -59703 -63875 163233 -190268 -171823 60442 434763 871522 551524 231264
5133 231264 64620 673411 1374604 1071779 691033 457045 962515 796261 518404 715520
5123 715520 289790 250138 401316 378588 68371 306473 896687 611865 632868 726940
5113 726940 496967 342892 10642 541141 257595 264035 262995 -72351 418720 456466 439906
5102 439906 684695 1183045 1014125 310873 463711 512363 318274 492969 -230180 -52268
5092 -52268 -25555 253686 342030 539593 801925 784762 711838 133939 -132008 -290142 -205852
5081 -205852 247667 871811 928990 649906 843701 828983 687217 414518 488787 1093975
5071 1093975 1224513 1109172 931818 988997 795513 508337 534673 215262 509690 813422
5061 813422 773952 938771 1036247 924048 558225 364485 101680 339551 864367 1475918
5051 1475918 994791 967898 1459598 858347 535358 1296860 814180 1300217 658445 904257
5041 904257 1246133 879984 1111382 1014393 300878 254502 656779 633821 462097 678353
5031 678353 825741 1019265 1008611 790335 1318347 947817 437091 334489 798014 1144745
5021 1144745 1048315 597639 284971 409325 770489 551779 721758 1341485 1449270 851187
5011 851187 747568 440788 502487 809270 1115201 1171339 1536000 1261118 893485 1050672
5001 1050672 1361200 1140971 1116763 971352 982151 1378203 1523027 1328691 1405767 1394094
4991 1394094 1284917 834315 438944 1237380 1397626 1055078 1575394 1662259 1466698 909743
4981 909743 737010 679696 252785 576405 832494 1206237 1072727 992627 927287 559124
4971 559124 860331 1110222 1063942 1175109 968574 618548 1050479 1198612 1073390 1219920
4961 1219920 1490531 1389509 870353 1177203 736314 354992 504957 519461 435622 534262
4951 534262 1040921 1844549 1418959 1197049 1496416 1679047 1373000 1964073 2058849 2392371
4941 2392371 2443006 1629019 1340172 1215477 1863585 1692624 1929080 2460384 2097602 1995179
4931 1995179 1801492 1748308 1855325 2000852 2059085 2091562 2401544 2302468 2285683 2171660
4921 2171660 2569448 2574447 2441148 2243754 2395108 1833441 1654592 2140005 2093179 2448402
4911 2448402 2587272 2678869 2446797 2662051 2852145 2871613 3030922 3143782 3007905 2551538
4901 2551538 2257570 2592238 2836272 3245269 3171138 3105728 3371655 3120500 3347248 2855816
4891 2855816 3094369 3502284 3549394 3725899 3610970 3519256 3812271 3501405 3550454 3823921
4881 3823921 3962067 3886870 3821992 3479703 3221203 3448510 3674534 3755601 3771440 4125250
4871 4125250 4133898 4173062 4763656 4704564 4498643 4855209 5195664 4741196 4702078 5009929
4861 5009929 5188440 5711284 5519290 5620622 5824516 6318274 6548730 6669082 6328185 6599388
4851 6599388 6871923 7057782 6934305 7429143 7450048 7004192 6826067 7533322 8009674 7921111
4841 7921111 8392587 8665017 8384250 8518065 8874169 9077907 9490993 10136284 10842004 11020015
4831 11020015 11942600 12367214 12134947 12742908 13475712 13673849 14009875 14533737 15061014
4822 15061014 15267936 16210534 17454420 18400808 19133980 20038341 20222630 21757205 22795095
4813 22795095 23446887 24915524 26975028 28892592 30143479 31901563 34545511 37192718
4805 37192718 39134797 41536578 43470877 45648708 47409478 48952083 51512292 53966314
4797 53966314 55805996 57965281 60270968 63055257 66363694 70237065 74844246 79060169
4789 79060169 83991405 89182884 94947907 102012522 110119151 118384657 127714739 137285642
4781 137285642 148401247 161147604 175250145 190878289 208095882 227849396 250280558
4774 250280558 274961174 301390419 329441442 356882652 381998723 401015391 411375456
4767 411375456 410995470 399665482 379321237 353318742 324374133 294902924 266819411
4760 266819411 240528853 216367057 194678767 175787818 158917492 144219412 131540974
4753 131540974 120206854 110730139 102341510 94997569 87865535 81736604 76312903 71168282
4745 71168282 66755169 63032440 59160826 55485049 51997727 49401202 46579070 44351132
4737 44351132 41993893 39343969 37890303 36021655 34317533 32644396 30981513 30187919
4729 30187919 29373409 28379927 27028782 25133914 23770573 23278567 22359229 22387538 21571674
4720 21571674 20293068 19332684 18180197 17405442 17046985 16465542 15876848 15469974 15172948
4711 15172948 14637732 14561508 13857158 13157492 13623886 12895911 12328178 12465235 12142433 11832267
4701 11832267 11672119 10956442 10518433 10213550 10224236 9595353 9041506 8876914 8613866 8298673
4691 8298673 8062198 7966770 7887427 7386097 7880109 7927516 7703169 7871500 7827420 7445529
4681 7445529 6889864 6324391 6466843 6423679 6568352 5911610 5921481 5809119 5545438 4989210
4671 4989210 5176670 5266486 5643228 5349288 4779128 5090348 5160803 5081529 4954187 4171896
4661 4171896 3942492 4299204 4456239 4571250 4233082 4255666 4577538 4336000 3437172 3646913
4651 3646913 3920286 3711736 3364805 3624299 3598580 3861825 3785068 3801388 3728491 3457189
4641 3457189 3525050 3399349 3263404 3446186 3242583 3164838 2875384 2994385 2465618 2123666
4631 2123666 2173949 3017778 3228209 2596418 2480763 2456508 2094218 2270405 2511053 2036170
4621 2036170 2195620 2385352 2458059 2396867 2111484 2428230 2297014 2135681 2184210 2147957
4611 2147957 2002400 2164588 2119204 2309940 2664111 2568862 2532576 2571579 3068038 3100385
4601 3100385 3084568 2838278 3028086 2940333 2976017 2625921 2383238 2736730 3213543 3315424
4591 3315424 3099136 3289725 3744420 3826600 3487685 3084628 2907546 3131651 3346193 3755499
4581 3755499 4007714 4076925 4596588 4492560 4841930 5315555 5570663 5569824 6111803 6104767 6109487
4570 6109487 6777895 7215050 7672902 7537709 8236283 8896778 9793978 10881403 12091740
4561 12091740 12494906 12963093 14110408 14920520 15364837 15950974 16724927 17390185 18336237
4552 18336237 19361141 20268634 20888774 20961349 21195964 21881433 22363061 22651055 23097494
4543 23097494 23736541 23873597 23075399 21897182 20931217 20717973 19808159 19679071 19197613
4534 19197613 18449495 17694670 17010944 16116572 15036747 14294715 13120334 12382373 11842334
4525 11842334 11098348 9951065 9271359 8811480 8026963 7006373 6343204 5824395 5392822
4516 5392822 4995371 4164737 3855811 3921257 3492802 3169183 3491459 3756694 3193818 3185837
4506 3185837 2786416 2227204 1779664 1756392 2557639 2990775 2839938 2498520 2302196 2351750
4496 2351750 2478470 2545205 2310693 2197059 2544558 2241624 2139368 1949970 1555311 1555743
4486 1555743 1394592 1156480 688428 746294 1095844 1079913 1212624 1419797 1340237 974150
4476 974150 1162392 1630986 1353401 1541539 1861894 1700547 1779786 1428034 802130 978585
4466 978585 796687 911073 959347 654176 781138 1118424 1617821 521520 765598 1043291
4456 1043291 1330613 1300786 947460 722792 407855 931215 577074 507137 816247 868218
4446 868218 339085 353581 445381 1298352 1428478 958055 -31709 306870 337853 434779
4436 434779 717833 865197 721018 690240 1194270 1327769 1460603 588330 88746 416962
4426 416962 595981 109357 130035 253072 390329 515815 839470 356647 271241 714135
4416 714135 345077 24667 425310 451051 567241 647295 478590 484218 276273 -104874
4406 -104874 -391831 490842 941457 761588 278726 151756 215141 130472 209858 -22017
4396 -22017 562065 941830 974690 405851 442952 237103 415543 930586 402854 188018
4386 188018 250775 155960 -57377 -62580 42005 231707 1001632 843535 422944 -16622
4376 -16622 -31847 250116 74480 72542 194070 635389 570518 46077 -42219 -133021 -67834
4365 -67834 125649 100407 641987 801471 -32468 283390 606202 493254 698276 308586
4355 308586 22897 -163715 35384 15582 -178921 168995 868220 855318 947709 636109
4345 636109 749176 283698 174943 706240 653107 620112 -84586 -411442 -35129 223436
4335 223436 142782 117020 223981 -251655 -113952 -109921 187847 116230 -196550 180026 592106
4324 592106 1050528 934207 548083 452987 552822 705503 1034805 1170258 1129735 465748
4314 465748 691481 853241 339081 -130838 -183302 -489079 -521970 -430261 -444904 -501432 -518380
4303 -518380 -607481 -411575 -133395 287424 790236 508049 6768 -85263 -30148 -174168
4293 -174168 25572 -102784 382054 394792 -41376 -2786 122241 -54582 259764 10385
4283 10385 -604928 -812872 -447801 -46486 522994 533499 318712 152576 142249 192179
4273 192179 90205 356600 -288175 -309706 -146550 -435433 -827689 -667164 -271185 -14982
4263 -14982 6828 228300 315899 155298 -129826 -87731 256867 -53074 -298662 135384
4253 135384 -63541 525521 380607 211302 249541 333223 68040 152650 479301 710142
4243 710142 -213979 -467935 144909 417136 -110261 270388 418560 82015 210655 458996
4233 458996 229320 -69875 624532 537234 323051 -26853 -309694 72045 154735 91705
4223 91705 300622 -5789 -207783 172750 499230 285785 206770 -173007 -415897 -396843
4213 -396843 64890 -463103 -203329 -229260 -372517 -423778 -315449 -392983 4309 -294540
4203 -294540 -443522 -308921 -212760 -265173 -222643 -350152 -292089 537466 783928 373704
4193 373704 612182 642305 384838 -252528 -29056 318078 110853 -7219 -10040 -32455
4183 -32455 199268 779276 391798 51580 89957 996368 1007740 646431 261401 -148350
4173 -148350 -38254 206392 299206 388974 540672 598801 788777 281251 619889 515281
4163 515281 96020 90843 -156904 207900 -177137 261651 325099 127372 109026 282102
4153 282102 550312 499890 134219 -269102 -30556 -375061 -336839 -427442 5256 -72518
4143 -72518 -109588 -186754 30394 307501 -264629 -285586 -283169 -305430 2128 -561862 -383211
4132 -383211 43462 -22355 -137596 188 251356 298239 -240747 86959 451860 902938
4122 902938 1193912 821114 740779 378099 3526 391377 1282632 651110 681022 193144
4112 193144 -428215 316111 318164 141416 572445 78649 505512 220304 264145 267843 247583
4101 247583 313482 472980 307719 523366 399579 -25079 321454 619042 357595 326806
4091 326806 350124 499897 792213 494553 282323 607179 735480 844210 696732 215316
4081 215316 -295882 133407 470479 768032 741420 504843 131790 377254 -213226 -754780
4071 -754780 -382059 -134587 -420850 -561598 -648768 -577358 -45111 91870 290521 438306
4061 438306 503609 909973 1019120 723628 668455 246325 56266 195038 433488 312735
4051 312735 -97091 63269 411262 490330 1027640 487370 258106 269866 493513 -58526
4041 -58526 -523299 -672890 -923858 -1034914 -967379 -620628 -495069 -39791 237312 -67179
4031 -67179 -103547 -430993 -724178 617 386947 -120047 -21846 -237310 -408599 -277838
4021 -277838 251575 240835 -162274 302407 171221 -89518 -215862 -794818 -333226 -92652
4011 -92652 -82638 -137001 -72635 134222 156569 501771 120113 253796 387228 285117 267683
4000 267683 -125940 -134549 254702 -37768 -162398 174348 -192306 -486240 8611 298950
3990 298950 72742 277763 370082 491101 -898 -301783 -25392 117259 558759 605383
3980 605383 -46674 33629 268024 160552 -816277 -327642 -362379 119607 -152028 -265359
3970 -265359 -413240 -448659 135603 -75494 -206742 -319438 -60740 -174596 -137960 -227573
3960 -227573 -31813 85277 15012 -52051 -83051 -132274 -285891 -16540 369723 -263382
3950 -263382 11694 -108049 126690 477067 172129 58230 -571477 -658310 -248369 -197344
3940 -197344 216149 38712 -141345 128762 90369 32594 -207082 -191775 14417 443571
3930 443571 766098 612805 -85001 -103473 88283 51597 224306 556147 592973 105041
3920 105041 201216 262331 -93041 -371065 108500 442717 472385 224173 388016 383097 329867
3909 329867 310557 61822 45238 -284307 -555220 -330864 -267884 -360548 -142416 -70947 -17342
3898 -17342 522995 181780 -287327 -343260 -255447 24401 60062 -28249 393923 797901 482776
3887 482776 92984 106625 -233196 -796977 -581149 -421189 -180139 145429 625723 472547
3877 472547 -423271 -12849 184189 162702 335652 200173 -574809 -662181 -247658 -582305
3867 -582305 -445995 54669 -155600 208906 -163500 -437928 -325184 -191578 -292307 -618837
3857 -618837 -104803 326427 460753 428669 249873 123914 -202772 -104154 -119090 307447
3847 307447 525997 397026 -473291 -553021 -700781 -176 -43951 -471782 -736997 -177258
3837 -177258 -330491 -92458 178802 -397414 -641209 -661585 32922 -370375 -271475 -207171
3827 -207171 -190123 -561513 -810744 -783753 -675797 -508300 129382 -160045 -288387 -26594
3817 -26594 -165281 -443969 -411753 -118214 -38970 -396141 -456826 -347291 -372582 -266318 304499
3806 304499 -139346 -541279 -325604 -139008 -380358 10478 -54744 212458 338648 630034
3796 630034 313937 72550 -312339 -175601 -421163 58729 223498 -179616 -233430 -279952
3786 -279952 -153135 -251945 -497048 -98504 -412441 -605500 -356900 -264774 -225172 -152222
3776 -152222 -363178 -269197 198196 417594 525191 263873 62901 505702 387967 312864
3766 312864 406575 304229 183326 -34103 124907 168360 -191165 -62508 -634608 -316976
3756 -316976 -342147 128141 -336896 -551902 -775980 -954835 -310968 -600349 -63048 -131513
3746 -131513 -256669 -334056 -46254 -212899 167812 -26169 -370418 -448913 430917 211285
3736 211285 76689 -275520 -50066 96515 150336 -55262 -144105 25107 435030 -142422
3726 -142422 -589150 -59401 68466 94401 528976 715014 759942 952760 629358 -22726
3716 -22726 -17159 25381 245855 140238 211795 320339 326091 -461699 -358857 -2539 243553
3705 243553 690562 324523 -83327 11152 -281252 -716043 -317428 -252511 -502335 -390243
3695 -390243 -151346 36893 -67586 98830 -623387 -455965 -212870 -251940 23666 -164867
3685 -164867 59050 436343 420038 221265 185804 -340195 -601647 -105484 -71594 -117491
3675 -117491 -174655 -32526 -178097 -172607 116305 226099 148891 -155747 152580 197592 380775
3664 380775 770581 670035 569054 714617 431835 49373 -105530 -92521 -444578 -530292
3654 -530292 -476487 55836 123833 -252996 31288 382850 -377757 -203565 176629 447754
3644 447754 280395 59587 -488776 13615 -275012 -295293 29271 209335 186963 164549
3634 164549 209397 -77002 -428875 -251226 -159084 -205365 -583677 -260316 -138362 -468681
3624 -468681 -428486 239548 258077 109689 416774 -107460 -142946 -266759 158490 -38406
3614 -38406 -107269 -26396 -100599 73577 582227 469943 473270 -42519 -413869 292958 345994
3603 345994 30296 772752 571022 459850 253589 -384986 -433363 70568 381848 5516
3593 5516 22338 302229 491812 315365 381417 -104823 -625912 -578784 -333915 -413364 -446624
3582 -446624 -48859 -272232 -344356 -35156 -267403 -602435 -144563 -183287 -295493 -273078
3572 -273078 -453183 -123207 -91932 -397452 -493749 -470751 -272975 -23979 -62834 76725
3562 76725 189197 150745 -92869 -35116 -258730 -666880 -578674 -94031 424622 -130374
3552 -130374 60096 67419 -32762 -136231 -301689 207027 80756 -522379 -13018 -133928
3542 -133928 80500 -408066 -349381 -187977 169311 954203 300912 191905 -368252 -540928
3532 -540928 -736084 -124399 -122712 -301169 -476405 -426943 -239226 -114126 29994 -839583
3522 -839583 -911815 -528913 -406825 -185362 88916 187917 -97796 157605 -11476 470202
3512 470202 676462 743577 505468 -415005 -430841 -246440 -434366 -103288 161494 88755
3502 88755 -328412 -323901 230505 502203 506529 538734 -172951 -17550 593383 229931 164663
3491 164663 17753 46608 185746 -17977 -26221 -61688 17413 -321676 -490923 -202816 94066
3480 94066 341085 386531 329909 -9849 -697054 -711046 -271056 -128092 -540022 -358864
3470 -358864 -1531 -292140 386294 164379 225972 456950 620516 -283708 -85514 358118
3460 358118 285410 74017 18667 101080 544352 324744 -3681 252827 34072 -24903
3450 -24903 -282726 -718292 -353553 320996 424685 609298 221736 154073 202640 -123577
3440 -123577 108998 815202 307884 226720 591935 508200 215679 594313 897032 239962
3430 239962 282820 173258 27455 295661 525694 -87169 -192462 -73721 818973 758916
3420 758916 949290 597039 207849 351742 544310 434460 81763 813516 1136710 490759
3410 490759 208455 261651 -133490 -295672 -660850 84860 431987 137307 -57 520081
3400 520081 948410 1056234 440060 56067 -148779 -357310 -280365 252057 831977 274006
3390 274006 694069 674870 318655 242224 -156195 -180638 -182195 141686 594958 637324 432565
3379 432565 -112267 346642 709416 596673 504984 457214 581593 627296 1018478 256732
3369 256732 258684 349026 574493 909842 667886 430511 1115584 1029834 852294 1383503
3359 1383503 1272151 913052 1088211 1511982 1475427 1249646 1563152 1545217 1635955 1947231
3349 1947231 1856279 1374641 1461720 1163294 1065550 1727260 2122130 2109556 1641107 1250232
3339 1250232 1487264 1918706 2401839 2304011 2557495 2716419 2793013 3262639 3351030 3180814
3329 3180814 2935762 2702362 2305421 2121818 2252360 2183849 1998017 2058319 1702075 1228982
3319 1228982 1669766 1232898 626721 1377043 1681640 1260628 776223 713491 644726 1099886
3309 1099886 837758 1117796 1036943 1127621 969946 433210 945974 1222002 1416085 1537161
3299 1537161 1417154 1491148 1735078 1542382 1426489 1592114 1176430 1161382 1323814 589503
3289 589503 692837 660657 514123 378794 678133 641450 530765 501332 377714 239178
3279 239178 263148 709571 520011 546534 215524 683736 720581 398587 313452 345366 708182
3268 708182 745731 414482 443688 519583 641155 659243 1226835 932238 540275 640585
3258 640585 810943 573229 269952 182818 491279 323697 -127995 -360061 -57636 -220471
3248 -220471 33392 588309 161961 807228 810092 633602 504692 140445 30343 414029
3238 414029 139167 -153568 157009 4327 145507 -162706 83529 -100870 -244705 -172988
3228 -172988 -141022 83524 109451 410360 143528 294067 -36803 -378237 259953 80163
3218 80163 28985 285276 -33744 -333801 -338446 -373363 -468501 -363930 39204 267314 172002
3207 172002 238116 19978 105950 93255 598762 10272 -263094 -543653 -518271 123872
3197 123872 82775 -233356 -79611 -75177 -644237 -612003 -44813 252135 102614 -24499
3187 -24499 -522455 -701005 -581566 -557 129663 276210 71608 -489146 -403322 -102807
3177 -102807 353272 243717 224875 -235052 -265235 -18851 326065 -416141 -372526 140731
3167 140731 -56364 -408195 -261814 -471276 -625799 -111086 -154202 -295289 105247 210588
3157 210588 493615 172158 6252 312571 311124 488140 332619 561577 334165 337867
3147 337867 29894 6500 230993 -101878 -200147 -358293 -119860 249681 325406 58550
3137 58550 -506583 -132732 -677920 -857387 -780586 -130758 -254173 -721688 -500016 -535925
3127 -535925 -728615 -836756 -496081 -503404 -542223 -468094 -162458 -28673 -123236 -395376 -242423
3116 -242423 -67392 -512015 -323552 -304582 -367351 98484 197424 28123 332839 117038
3106 117038 33965 -133626 109167 -89440 -448229 -140324 -215408 -120647 -39949 -71854 -206432
3095 -206432 -743986 -743522 -859346 -776885 -498959 -557562 -625469 -522299 229301 472705 214908
3084 214908 342800 403936 320469 442824 517251 362306 65836 577153 697047 353430
3074 353430 -131936 -580122 -218497 151976 112067 -302651 -556409 38404 180328 -125852
3064 -125852 -152619 179731 -131876 383389 464299 -10415 386749 -81899 145093 35051
3054 35051 -176350 -518430 -944277 -539775 -371649 77403 65771 51565 206350 -63071
3044 -63071 -47410 259573 -209184 -529555 -295992 89566 141416 405576 -153336 24236
3034 24236 73548 2829 -321502 -427900 -118905 -167980 235758 595851 456171 467546 590762
3023 590762 -5395 -302621 -336687 -35132 364806 456939 204434 240369 -110851 175093
3013 175093 78707 -132634 -258417 -101687 177570 -23124 -438382 197682 241632 -72412
3003 -72412 626609 410064 279857 220495 190221 434939 702247 404462 264926 586351
2993 586351 552684 218686 391568 102677 -32841 -33266 -184880 -138479 -145718 -348757 -35655
2982 -35655 447464 417721 -265254 -317798 185259 151992 -12086 88445 304394 202105
2972 202105 361730 303754 -3530 -30098 80075 382451 432639 163447 567382 951858
2962 951858 646927 439422 127713 300936 196603 -14920 384967 -93878 -155507 -642877
2952 -642877 -271231 -22712 216408 161156 317047 -9246 -323450 -286481 356441 528981
2942 528981 302795 244120 260559 -72690 -660835 -762949 -114554 -94911 -93749 586905 489408
2931 489408 324805 89984 -11503 -225365 -149856 -366771 -617566 -686571 -144827 -373525
2921 -373525 -601500 -452094 -183061 231227 83163 -199333 174428 287851 -8333 -199745
2911 -199745 163098 51354 178971 270454 143890 -328723 -167153 1489 -179606 207084
2901 207084 284864 -151105 -566293 -109993 324776 281551 -57824 224351 722675 431683
2891 431683 449032 17023 107303 562856 508645 362021 -395618 -157519 9583 -77440
2881 -77440 -178107 -119051 -502656 -384237 -324054 -628155 117272 126112 29679 -2083 -764021
2870 -764021 -983147 -866070 -303073 306676 228546 -107718 -572354 -480781 -706005 133091
2860 133091 52329 -7817 -70180 -147483 -438330 -674674 -634232 -532214 -135708 -15304 381437
2849 381437 -25714 59018 -139339 -202800 -302594 -71136 -8248 -159678 -82890 103131 -42241
2838 -42241 173491 172574 -447425 -654539 -882362 -422388 -183561 -59201 -121952 122375 -293705
2827 -293705 -718757 -286509 -431689 -709956 -413488 -39718 120052 -172740 -590604 -513462
2817 -513462 -159520 -287124 -477449 6366 -92100 -409357 -443580 -838324 -750068 -332449
2807 -332449 -168302 -381671 -909152 -145209 18775 -115114 -121308 -36695 -333818 -555826
2797 -555826 -295742 114458 432154 222163 118274 -69712 -341639 -145062 66348 -352453
2787 -352453 -258893 -677222 -293205 68514 -658769 -136545 -550350 -700788 -706913 -506118
2777 -506118 -260861 -10482 170918 -26807 86377 -280009 -302169 -255922 -315151 -642954
2767 -642954 -319782 442075 417260 -70634 -156525 245218 245746 -406014 5590 432408 40015
2756 40015 -441272 -582584 94333 -234896 -326251 -66566 112971 -185523 -26737 241347
2746 241347 -24725 -74626 -110090 298757 212583 -229725 -331630 -238056 -603419 -455747
2736 -455747 -459878 -84333 -478358 -510138 138417 -138822 114516 -316269 -47113 357544
2726 357544 118992 54491 199186 265085 -36026 -231429 -401987 -395968 -83568 172052
2716 172052 -202892 103997 -19994 -12278 102873 228187 -72820 122741 293010 190160
2706 190160 17040 -315040 -320437 -329786 -466934 -216047 -362377 -307057 -330206 -526509 -667620
2695 -667620 -688026 -373462 -75126 356966 283352 533208 943782 875999 678215 133700
2685 133700 -642412 -506896 -438879 -478514 -1011180 -539288 -344300 -264730 5491 264993
2675 264993 234619 52874 -123092 -323796 -54121 -122507 -360424 -250640 -340567 -377243
2665 -377243 48055 -131289 10804 257345 4381 -344313 -270674 -167471 -513714 -565969
2655 -565969 -256943 220466 -61030 -353898 -55079 -190223 62294 201118 -143598 -105421
2645 -105421 54728 305011 248970 349204 -27169 -191604 -178951 -821 -78703 -704412
2635 -704412 -607695 -95762 160847 -95359 -93686 178412 -389232 -467865 -558202 -594538 -166304
2624 -166304 -75226 -384017 -210851 -221669 -196351 460818 534866 142302 168602 182031 -164880
2613 -164880 201262 135993 -190834 -267675 -506941 -408192 -378568 -368725 -7855 77641 -555870
2602 -555870 -788466 -710630 -901137 -341626 -312088 -309806 -102846 9465 -453055 -288967
2592 -288967 -32753 -83591 -258603 -327383 -483970 22439 245524 627193 792141 -146885
2582 -146885 -199505 218084 -6870 -394050 -155156 -429312 -59884 -462977 163688 530190
2572 530190 62589 -30314 -40239 -56284 -286246 -110121 -284912 -201698 -78913 20547 -567472
2561 -567472 -359085 -421185 -494015 -298467 -7406 -231325 -193585 37736 -217840 -296855
2551 -296855 -43993 -36356 -337543 -390461 -163831 197055 382717 688982 478173 -67994
2541 -67994 -278762 -280643 -59079 -288558 -22336 -327212 -386084 -273182 -262289 56390 129167
2530 129167 -171469 -553028 -522254 -821675 -134295 21732 118723 -177190 -272765 -257609
2520 -257609 -61135 72916 -220660 -215486 -475737 -593405 -273187 219234 -95288 -247068
2510 -247068 -120914 75457 253398 225166 454427 762145 827701 618323 -133301 -564141
2500 -564141 -131959 -9506 28462 352814 430697 -51913 -221790 22066 345171 -207434
2490 -207434 -420150 -122943 41248 155746 203317 -129992 -452711 -177877 80719 238558
2480 238558 120107 219681 182409 532461 374475 5920 -525373 -279581 -40321 -255684
2470 -255684 50339 39211 -232444 66101 631865 665470 894608 807869 1144244 710475
2460 710475 -64492 104291 527737 -13520 -423457 -490484 -93062 266166 544704 -394811
2450 -394811 -184689 157987 589601 92002 -124564 184524 358811 -2754 30434 129631
2440 129631 408729 909703 739456 822183 466401 573547 108450 256737 245405 -77164
2430 -77164 205591 498374 10580 -562567 -416436 -188322 -72743 97625 203772 273405
2420 273405 -182932 -515521 -251064 -234394 -472739 -698875 -647003 -217656 -141290 467891
2410 467891 128441 28688 256878 157973 -277324 -439876 -155392 141706 -231675 -444811
2400 -444811 -487883 -440614 -105879 242246 -102565 -257818 -365793 -282307 -68430 284592
2390 284592 313460 235772 82496 -13682 -65188 -352272 -97931 -76219 -206900 -171523 -260149
2379 -260149 -589084 -676694 -383001 158676 -17950 27865 106294 293293 232247 130807
2369 130807 471374 183948 347980 -17418 94172 -209509 143404 -59261 -288788 -188634
2359 -188634 -186897 -344506 -375879 -710517 -525207 246712 -355362 -315268 261184 151266
2349 151266 -459356 -232183 188121 310363 806445 482427 184191 127136 511378 345199
2339 345199 -77260 138535 103111 512525 334505 488229 77202 -212598 82233 -7325
2329 -7325 -364500 81770 269620 398693 275509 324648 -625930 -257177 207876 306069
2319 306069 605910 364966 7915 -373603 364000 278036 30873 -129199 48371 368898
2309 368898 515708 616921 417145 781545 857189 306187 -315596 101901 518067 610590
2299 610590 339957 -156678 -201705 -19975 -239114 -431838 -303713 128578 462465 372584
2289 372584 680299 960190 607473 562154 700388 931830 1023374 536622 577157 419754
2279 419754 451351 533741 -73659 -154759 -119118 56053 13247 210426 239470 241449 585065
2268 585065 792912 768753 491257 474209 737635 980034 866896 845360 1226134 1777617
2258 1777617 1951956 1220466 1369199 2027755 1765690 1608835 1638184 1797026 1438394 1492280
2248 1492280 2051768 1995985 2217613 2710248 2513579 2216973 2709816 3160848 3137550 3577153
2238 3577153 3774145 4355501 4375662 4524962 4903038 5607498 6942054 6803269 6880864 7693433
2228 7693433 7657439 7783514 8697435 8891711 9195809 9733185 10496563 11060310 11534467 12440468
2218 12440468 13622074 14610134 15519153 16881328 18052884 19703476 21109426 22702012
2210 22702012 24110212 25932362 28240987 31425563 35313440 39282476 43528048 49241018
2202 49241018 57247535 66433318 77520611 89575410 96572071 94162845 85701590 74369508
2194 74369508 61396325 50301325 41850395 35998262 30982960 26512416 23195348 20278630
2186 20278630 18209427 16568766 15815593 15096287 13949867 12681829 11824681 10836091 9593015
2177 9593015 8340738 7759198 7373618 6508936 5947289 5765920 5559251 5170660 5220766 5367738
2167 5367738 4897171 4382538 4016985 3818969 3578970 3406230 3549568 3459066 3177753 2978277
2157 2978277 3329881 2990127 2693488 2292602 2353321 1769151 1339547 1367693 2143811 2255665
2147 2255665 1575201 1660321 1774083 1720594 1699335 1573463 1264767 905760 512886 836657
2137 836657 786625 692441 1047212 1330843 1586670 1457530 1356170 1462680 1326505 874981
2127 874981 801090 1010329 1230535 1558835 926233 922238 806033 703992 746824 737432 770364
2116 770364 738273 610672 538427 743163 -20960 199511 991419 375830 499688 726507
2106 726507 817262 712489 782643 639369 182000 412655 714667 111368 222944 -443921
2096 -443921 -679826 -192534 89015 -270961 563993 573629 -61645 -150453 272847 816977
2086 816977 404281 52301 -270974 101607 374468 461381 -229051 -560123 -100613 78849
2076 78849 -111864 -402942 -546872 -7002 289039 6485 -75819 182560 -316603 -319410
2066 -319410 179161 456343 -289793 -65812 109286 306676 601913 430378 -54036 -109566
2056 -109566 -449714 -431424 -11360 92572 209242 376885 186469 434232 460884 -105627
2046 -105627 -33582 422813 582516 457059 557861 417554 497056 186841 -156451 -449748
2036 -449748 -627718 -270583 208375 367084 122081 141470 -542942 -720256 -99667 -238572
2026 -238572 -327844 -48157 27991 -61723 -819491 -996974 -154808 -312692 470039 128590
2016 128590 -249311 -294530 -141213 56262 -435234 -429804 -40323 141859 522574 164730
2006 164730 -364479 -130943 295820 312122 302083 173315 -29654 -523817 -119385 100581
1996 100581 53965 38714 132139 505265 -21936 -823736 -327228 60302 -386362 -142027
1986 -142027 -201336 -141621 -128570 177874 -253180 -621757 -425844 218491 617053 337649
1976 337649 -64198 -511145 -646176 -260548 -215033 -458536 -247403 99507 -307021 -315101
1966 -315101 139068 291910 88545 -15290 -1781 123419 74865 -475686 -153531 -96901
1956 -96901 -700909 -1002600 -528108 318099 348099 202602 28867 -64502 -349234 -611851
1946 -611851 -126575 283667 528630 120759 -110441 313985 -117666 -597995 -228885 180633
1936 180633 338162 535014 585876 -12547 401623 596717 375664 890060 444176 459170
1926 459170 -126988 -382959 18807 413198 55554 -317061 110171 76098 -50565 -312960
1916 -312960 -536219 -458450 15867 -20698 163121 398731 -100026 -148921 -121589 213939
1906 213939 398313 -316510 -696998 -385276 -353958 -107203 -310151 -179357 -469627 -345595
1896 -345595 -208708 109988 52893 26075 -253815 -96000 521493 178806 57706 204936
1886 204936 531006 61138 206133 -46644 -142603 -192324 -43117 202505 75499 -110640
1876 -110640 -279422 -703843 6017 178325 -77447 258286 -148185 -266631 -757629 -667883
1866 -667883 -326575 -502847 -198076 -62094 41414 -114887 375160 280251 -393963 -327088
1856 -327088 -415759 -946242 -313639 309224 702431 706675 645759 491735 62259 -233790
1846 -233790 -116881 -267246 462968 585896 51704 -5860 -368508 26658 31840 -315690
1836 -315690 -228274 -458695 -323937 -599870 -705498 -234138 -491257 -460766 -57438 -90531
1826 -90531 -532938 -457702 92628 -84654 -258428 -516672 -379802 -408712 -115469 25425
1816 25425 -132801 -513543 -676004 106590 -203090 -166339 -145595 263744 169628 -105201
1806 -105201 -511505 -219054 -291493 166120 -185998 208309 233427 -163706 -265115 -486721
1796 -486721 -541789 -559062 -679349 -638129 -25438 257759 215461 107073 90683 161475 196043
1785 196043 -190922 -136985 -343778 -687649 -423845 -429412 -239382 196598 -320299 147030
1775 147030 547924 596473 228357 -193374 -76262 302407 40918 42479 43797 13648 -147870
1764 -147870 150920 221015 -526037 -611226 -266153 -46892 -538863 6235 283348 90765
1754 90765 -255797 -778667 -872119 -806103 -233091 -422952 -291510 13929 -535756 -687438
1744 -687438 -288137 -52817 -427685 -605372 -369929 -650700 -652347 -271695 199410 129751
1734 129751 -43778 170759 -88389 -762539 -641698 -225021 41061 -175844 -44296 -84835
1724 -84835 278894 403129 916837 998530 144742 190098 115457 471847 -63513 -11383 341418
1713 341418 264803 280745 403235 15137 -295403 -322064 -399959 -486008 -793027 -416385 -187275
1702 -187275 -204998 84275 -404165 -1111554 -1090358 -458731 -63906 -119953 -184405 131410
1692 131410 536866 138179 95248 -39745 -303089 -590884 -345158 -248711 -128756 134103
1682 134103 392506 -289668 -535026 -195251 -479470 -127869 -467497 -200904 448918 410917
1672 410917 419471 329577 32100 -44271 -162571 -251656 -162666 11326 -418868 -63991 95210
1661 95210 -107470 -77785 234423 -26247 226144 43094 -46666 323223 62128 239373
1651 239373 -21460 -602777 -522335 140885 -254844 -591395 -852590 -717292 -576779 -629674
1641 -629674 -216445 -354572 -304934 -647237 -134778 203096 -15634 -400498 -195035 -319648
1631 -319648 -225894 48068 -164307 -685837 -605754 -203643 -335900 -239023 -564858 -335879
1621 -335879 -75398 234791 179463 204437 88792 -279248 -38266 -160539 -293102 -298614
1611 -298614 -301741 -195752 -287901 -88633 -174185 -139004 -78369 433289 200442 240525 210498
1600 210498 -16463 -144188 -208784 355084 -330619 -151150 -69691 -354727 -205442 -227769
1590 -227769 -150995 -233211 -313822 -314652 97635 54643 -100221 -389705 475353 232224 -3751
1579 -3751 101173 -264406 25653 -2927 -369053 -276428 -625504 -274303 -307031 -588280 -253670
1568 -253670 267593 -10856 -198916 67338 -22497 -229897 -261674 10342 180855 366226
1558 366226 524425 -8022 -693054 -444164 1038 -14463 -54214 435394 269311 -9623
1548 -9623 -612930 114879 593973 -131611 -291638 -101579 321973 65346 106157 172929
1538 172929 -81575 503019 534184 -187658 101085 215234 -182471 103432 -175909 -324531
1528 -324531 114630 -37147 101918 563987 466159 -202583 -244743 -334184 -484227 -534646
1518 -534646 -722760 -633037 -305630 -543358 -477039 -101034 -289250 -288667 -381653 -221559 -43080
1507 -43080 464773 60619 432122 39875 248106 25980 -257790 -468159 -239158 -162491
1497 -162491 -424942 -228643 -531397 -362732 -15900 655658 847255 230301 -386928 -489794
1487 -489794 -362252 291476 390262 159298 -661704 -449217 61354 185161 57765 -57964
1477 -57964 -282405 -409962 -172015 -297150 -227305 -85452 11266 -114861 -95756 35041
1467 35041 356628 -147899 58186 357912 26533 -404983 -476475 -601783 -383390 -366618
1457 -366618 -251265 -424803 -206795 253215 -391167 -684721 -161073 -32946 -359604 -315652
1447 -315652 -12258 251668 -653888 -862581 -660393 -201312 94912 96325 -87884 -114873
1437 -114873 654139 890086 362141 -264297 -657752 -163754 -184182 -121146 -126094 -293907
1427 -293907 -113913 -163117 -65469 -151079 -325649 -204363 -574831 -540784 -171463 537158
1417 537158 276789 -606597 -502454 -751225 -854757 -467422 -703269 -447397 -653554 -223046
1407 -223046 -327391 -353384 523949 658137 332109 110413 -141902 -286813 376973 107454
1397 107454 -2920 167811 361486 414596 332788 -180938 -253846 223117 -341453 -528787
1387 -528787 234943 -98443 -604389 -445458 -233004 -11116 78946 165276 70428 -224629
1377 -224629 -591237 -406937 -166611 -65742 50280 104852 185794 722676 394831 -228192
1367 -228192 -169500 66134 203044 -157400 -276115 65651 303935 238635 -196708 -431583
1357 -431583 -292943 247024 895042 1143107 491445 -231412 378067 175652 120843 -341159
1347 -341159 -554415 -254426 -401485 -350876 334075 -239012 -45253 27930 -476040 -508261
1337 -508261 -780072 -862970 -527025 -623560 -695942 -144766 159220 -124645 -305961 -342380
1327 -342380 -459544 -155953 14664 -346582 -167154 -243092 -183051 -179252 -295284 264666
1317 264666 -421619 -426645 -230243 31124 19437 -238619 -551386 -838754 -438881 -23566
1307 -23566 -30401 541660 -218664 -315280 -313011 -301904 -296927 -461560 140544 421097 242035
1296 242035 -216247 -343880 -69159 69573 78959 405365 428690 56773 -49506 445401
1286 445401 619352 -267188 34565 140439 50580 602360 778736 560309 157642 -217202
1276 -217202 -197588 -336918 -478352 -265179 -210083 -196902 -4999 172828 256023 240910 2675
1265 2675 130741 -27967 -92800 -97844 -227872 -189822 33411 -76617 -555336 -488965 -55488
1254 -55488 -137768 74526 328713 -47030 -322317 -83679 -142357 -94900 -158385 -411052 -2961
1243 -2961 315541 145656 407608 245611 47571 212555 44133 -305530 -230265 47104
1233 47104 -84861 -61698 -31849 88223 544307 325191 90019 176128 148391 -60069 -165238
1222 -165238 -659133 -244324 -407977 63522 180230 -251777 -151091 -299991 -683141 -367413
1212 -367413 18539 -105824 -311634 -132277 7553 -378150 -425486 -62536 -332438 -269393
1202 -269393 128091 -56498 -352615 -603159 -488104 -167756 -262044 -216453 -199200 -4297
1192 -4297 164520 -30599 304122 -146958 -382016 -195870 -108593 19612 139694 39426
1182 39426 695077 114006 -129312 -101908 -531628 -112845 106342 -33709 -356179 -610958
1172 -610958 -323631 -82559 -602468 -223817 282423 -269226 -85058 -28546 388129 483779
1162 483779 995512 960698 664430 116826 -468250 -340794 -60559 133479 262896 -90287
1152 -90287 -263511 -328507 -159547 269219 454626 517627 -32100 281819 320163 379694 -101719
1141 -101719 -398680 -488991 -586749 -562947 5576 475565 119278 272286 653542 -298474
1131 -298474 -545006 -206015 420733 604244 71378 -193954 -492216 83861 -66206 143668
1121 143668 301807 581071 191384 247293 -45343 -232421 -256793 -269530 171898 42960
1111 42960 -237202 -757 -132775 -407240 -98896 -219010 81233 -62342 32779 -76241
1101 -76241 -519568 -688921 -261573 -98977 -245645 -131568 236642 113200 294261 372034
1091 372034 -125258 260662 -39871 -236960 -2584 134050 -62660 193874 119505 -260620
1081 -260620 -205180 -23172 259407 15872 -300956 -297145 24351 -214726 107781 314097
1071 314097 407699 -143661 -141353 -540458 -685949 20359 47324 206161 67241 -117491
1061 -117491 -293147 -166860 -138366 -163622 -101917 -329996 -519455 -271965 60905 -97028
1051 -97028 -61761 -10526 201549 -167304 145788 263720 500678 296170 132104 304421
1041 304421 -236731 -86337 409614 548341 340974 -26441 -81114 -89460 -706054 -421434
1031 -421434 50786 105831 -472250 -138093 -102354 -225902 -301420 -33792 299539 231568
1021 231568 72192 -335545 -196997 246166 402839 451821 313880 308221 430230 140788
1011 140788 75482 171995 214015 -167017 -348796 -95063 -574803 -19103 -230614 98298
1001 98298 122523 -111933 459390 700515 185321 88531 392645 -96660 -158960 -3011
991 -3011 38564 -158634 -191585 -129207 -58680 53737 -262748 -246442 -69282 -134053 -5650
980 -5650 -188072 230026 -118810 122377 114528 667265 249037 4377 434126 650366 864616
969 864616 559044 429791 399360 283802 597703 133838 26154 -105569 179173 701898
959 701898 45507 28672 38007 -31871 -326496 -642049 -482820 -464914 -548838 -356496 -190808
948 -190808 141060 219402 -96575 -30213 374473 -248951 -128074 164171 169516 -13716 -70644
937 -70644 119390 -127620 -13337 -229041 -17597 306921 -195183 -738707 -587894 -231714
927 -231714 259782 393941 683060 275594 160501 252341 -546749 -22842 556117 92563
917 92563 172236 -132331 4756 455768 23577 115403 34040 -23013 265235 449583 300155
906 300155 584574 -20955 -182170 -208757 285471 634460 250644 -21390 -27186 148656
896 148656 32266 -151930 -134247 137982 -306517 -404799 10522 208745 292270 589580
886 589580 563445 292787 225301 -210925 -169558 -108104 206726 240392 492828 36395 -260889
875 -260889 -182607 -165143 -119200 -551085 -572879 244936 -46849 -336336 -161293 144954 509495
864 509495 462058 555475 228022 469917 383572 -491759 -548527 -233174 -420722 161985 476212
853 476212 -143029 -237792 -32338 261568 520445 273475 311715 140240 -275498 -294589
843 -294589 -61059 -78476 -184416 -657630 -660732 -732803 -699332 -642981 -238450 298841 480340
832 480340 49258 32840 227272 60212 -408607 -456709 42920 120013 -129998 102503
822 102503 14784 -314913 -542544 -241310 -262924 -398329 -648524 -122435 490292 -20994
812 -20994 -331141 -126375 40768 -177775 -143251 -355691 -43999 -615192 35208 472102
802 472102 -46456 -320312 -103982 107306 149479 304862 349519 167535 251755 36754
792 36754 -275403 110043 478306 152378 276488 -239502 -356254 763235 169918 -509154
782 -509154 -128421 -219043 -257736 353320 400317 416353 335193 -73933 -251309 98753 752473
771 752473 997777 400343 218232 -119912 -77132 136680 211362 47775 -116104 -225123
761 -225123 47719 272347 220352 430081 288045 -37148 114444 -314392 -155619 -6461
751 -6461 80400 274865 342131 -25901 -163647 -84416 -436747 298789 449231 522512 337326
740 337326 -336159 -179315 -260753 105581 14779 -65991 210192 236930 -33492 27707 564709
729 564709 138333 41290 300833 262647 295395 721818 313969 -96139 -321802 104458
719 104458 110348 151762 399138 481584 879865 282410 -296325 -197757 170329 -33967 51486
708 51486 -42270 -100951 344060 131439 -256929 -149388 -631078 266942 754017 457919
698 457919 208464 -155731 72398 318240 409780 -21858 -233181 135231 358859 30880
688 30880 44808 217664 342657 492222 -99712 16017 453558 -78040 545531 232252
678 232252 210257 809671 474086 -28694 47544 -44458 -127891 -228909 -156151 -407154 -539913
667 -539913 -345802 -155472 -346848 -121506 56368 455365 496110 185629 -210218 -154121
657 -154121 -357079 -263006 100629 -95759 -272201 24686 348503 -273881 -150236 -20921
647 -20921 165670 201508 147266 29367 82188 258901 332363 102034 -327241 81471 555524
636 555524 303356 356847 208731 -197204 -657573 -552757 636560 665378 753979 305817
626 305817 -322972 -522625 231950 383054 410426 1024919 495798 385868 216482 -128554
616 -128554 -222307 -207082 -347349 -127154 -156555 -248702 -572988 -225239 -26152 158368 222563
605 222563 332805 463210 442417 54865 -85934 110571 216870 151704 -194042 32449
595 32449 322369 234076 21853 66202 30234 540423 680672 334566 101267 116960 705692
584 705692 1004454 841369 522950 345276 330202 574281 536566 215786 -379694 -264059
574 -264059 538135 464958 357953 95794 -379495 -278215 -217802 87370 325198 232768
564 232768 -422140 -712042 -363250 -203257 -142486 115570 -63787 -200347 -64271 337694
554 337694 -34307 -55040 324297 8123 -569183 -933084 -1057215 -459894 -289670 -550153
544 -550153 -924941 -375264 316175 287040 175643 -115127 129565 -315631 30205 -127326
534 -127326 -38127 -328745 -356232 -349908 -128832 273019 74979 -114293 39809 521182 -250471
523 -250471 391293 917277 420074 538448 538494 701063 172425 142519 298529 176357 -29153
512 -29153 -65640 179472 151951 131453 -478507 84252 292579 -146039 -97790 -351660 -168990
501 -168990 202714 391069 708906 33056 -412400 -7062 110246 311692 473737 621134
491 621134 560261 -271055 -53540 610352 248538 367057 557211 218940 129786 44996
481 44996 562651 551779 255823 -213744 -212308 174311 412517 367128 -34445 -264872 -65221
470 -65221 8413 988 -78821 -112879 248139 32524 -11154 102336 143089 177282 400047
459 400047 -142744 -71135 -149624 22728 33 70413 5007 447379 636960 417981 -167788
448 -167788 -440348 91819 319383 241850 510246 457088 -127240 181531 591913 71376
438 71376 -210643 55699 -255336 117860 74947 -110946 308079 240363 454878 776790
428 776790 348263 300829 215036 34964 -305326 -186817 208496 383087 615388 734488
418 734488 659114 272238 260745 45190 37415 -214579 228705 129234 -25638 -173774 -414099
407 -414099 -583887 -432218 -47708 270745 878693 1021387 1063594 1118785 912356 329543
397 329543 301031 625567 771317 241864 9560 -405534 17890 10277 157251 28742
387 28742 -365482 20259 40511 4281 -39660 126899 157393 292752 -99935 219650 -29310
376 -29310 -544545 91146 215192 135935 335155 -9078 -189651 -100337 -439523 8010
366 8010 475342 205160 90707 244161 333560 46288 -355609 -131805 358642 62051
356 62051 -61521 50915 116146 -121072 -733354 -550690 -147439 231514 443162 348328
346 348328 -16250 147649 53814 308755 420842 287749 21058 -4956 -94543 64420
336 64420 319917 152709 -14351 276941 238210 507580 428801 111934 461489 750631
326 750631 449475 624459 769049 461145 473707 449228 372695 504739 652086 114984
316 114984 -98989 -184378 -211871 -459421 -164602 348903 221631 371182 763919 777228
306 777228 707328 565014 -148670 -420455 -473261 -165636 97568 122187 321999 -127366
296 -127366 -87142 -115315 47660 452718 131957 160401 -85721 -434484 -118596 514401
286 514401 266941 -187337 227553 289411 303271 107179 257204 291981 457891 106309
276 106309 -98450 -177280 253342 79284 -34292 386946 -194653 -141365 544206 479532
266 479532 303718 506593 261559 190213 91771 -20054 99537 84451 634718 375586
256 375586 672799 712666 304937 -218237 -470694 316101 9735 162041 462027 374620
246 374620 123308 260948 141272 -47033 60119 65702 -229055 281224 380489 406256 329113
235 329113 -72449 -445170 137427 37256 -268747 288922 142292 288148 384 -274514
225 -274514 -21205 -299111 -371749 193488 -193576 42762 98970 285735 130612 220135
215 220135 379219 557435 321483 196294 503839 240897 131623 -174471 -154373 -264294
205 -264294 -196758 -530173 -499181 -159635 9388 210372 306664 294603 428487 380209 126773
194 126773 340459 289310 259408 -68896 -266347 14405 -104303 -204057 349913 811337
184 811337 421626 86109 -307902 -99800 -19738 372951 656531 497234 541296 355984
174 355984 51222 -319249 -46645 -339310 355358 757197 681859 692524 352641 -47377
164 -47377 133023 200254 178938 435525 295474 448179 798885 635443 491024 737298
154 737298 483633 635489 631355 363195 285450 -63096 -125070 134307 20617 -164202 -668029
143 -668029 -554395 -285592 -349054 -336076 -324159 243054 -74296 -146809 64139 112310 -145091
132 -145091 -137909 94236 450217 401136 595349 974419 995410 364833 19115 3413 399576
121 399576 318263 132988 275515 -43573 320301 488613 340820 -137502 384187 381960
111 381960 504972 362692 708230 724096 711895 205074 19238 23691 352967 444532 424530
100 424530 568543 417816 434624 419125 -15521 101646 20520 -157371 116108 89193 284392
89 284392 311240 100833 -404066 -307337 -200246 -293539 -180445 -6652 305399 394846 119154
78 119154 128032 154224 -356008 -90747 388855 65494 642852 591179 500224 242532 490489
67 490489 434005 364489 474083 -55854 -52809 -33322 69127 56411 154333 424387 566228
56 566228 91653 253694 474956 133479 -8244 15148 11261 199662 -74951 164118 270667
45 270667 -165449 -167042 13851 69358 -294533 -122250 -213272 105349 277700 386156 125766
34 125766 237078 608639 818806 431154 -97073 205264 425306 151506 -236353 -15705
24 -15705 351321 472282 353892 305815 212111 145389 -226773 254798 647964 225751 -339904
13 -339904 -330497 148838 327403 343125 86110 564934 567280 223954 286472 482725 348327
2 348327 343240 5284
0 5284
$$ Imaginary data points
##PAGE= N=2
##DATA TABLE= (X++(I..I)), XYDATA
16383 195629 -211681 -471531 -398002 -434881 -37043 132602 72894 -149771 -212833 110036
16373 110036 444133 790979 112832 -229784 86647 222177 87289 -96054 29880 -203473
16363 -203473 115944 120363 206679 134482 265292 78577 181691 182150 300967 391166 23783
16352 23783 206645 590099 733764 798798 966380 667654 694971 752289 513217 520281 528278
16341 528278 722673 519294 677547 911338 1000288 1115210 849829 517769 652933 713795
16331 713795 832673 465028 690244 829713 597992 988326 902579 1029758 711529 783836
16321 783836 778306 947372 977518 1352873 1331881 1367529 1119125 1214927 1178406 1307398 1261177
16310 1261177 1137109 971945 804222 1000372 766154 959462 890625 1056528 1108765 1479220
16300 1479220 1679037 1377592 1188533 1280458 1466859 1403173 1530685 1581503 1881732 1742751
16290 1742751 1986720 1945892 1753973 1992136 1930561 1599463 1621295 1623350 1297312 1205414
16280 1205414 1587194 1345961 1371743 1810385 1499885 1352727 1659696 1850115 1781880 1613491
16270 1613491 1731201 1924611 1897179 1769703 1548325 1819571 1795845 1853797 2164622 2131662
16260 2131662 1981912 2151238 2090516 1868063 1897556 1965624 2149167 2142855 1902107 1669726
16250 1669726 1693381 1954955 2311793 2043170 1884764 2440417 2221217 2329558 2331130 1952764
16240 1952764 2371233 2171855 2068574 2096403 2044095 1613457 1690026 1504051 1458150 1982916
16230 1982916 2158251 2827109 2632500 2151782 2345475 2684747 2515108 2676841 2491299
16221 2491299 2502236 2455009 2538206 2349052 1800233 1440712 1887341 2613458 2396117 2737791
16211 2737791 3095360 2867922 2746423 2910390 3009617 3309851 3340060 3155614 3054046 2712123
16201 2712123 2844676 2856409 2784286 3004496 2758471 2806694 2817202 2877845 3263114 2829557
16191 2829557 2275374 1852349 2251293 2110789 2570943 2619204 2488020 2408890 2399322 2911851
16181 2911851 2995905 3011930 2961933 2864507 2600709 3018536 2875317 2362513 2832485 2861531
16171 2861531 2594285 2412887 2229659 2422234 2400943 2375801 2582066 2024002 2377000 2911549
16161 2911549 2689172 2613450 2662986 2877395 2815963 3385451 3638527 3443657 3053190 3108624
16151 3108624 2971845 3329172 3650918 3679285 3398188 2838982 2734081 2923136 2770465 2845169
16141 2845169 3264492 3096448 2999144 2838566 3011852 2800132 2494440 2882914 2366710 2130863
16131 2130863 2461260 2472533 2738295 2652387 2834533 2956426 3225846 2861121 3303227 3230824
16121 3230824 2851426 3181782 3070960 2899165 3157035 2491490 2348641 2602302 3209550
16112 3209550 3104958 3293447 3349888 2753104 2650991 2517219 2411881 2543743 2766333 2611402
16102 2611402 2747147 2937068 3166950 3211285 3519454 3687729 3777067 3414154 3566248 3261004
16092 3261004 2957928 2918389 3340101 3180640 3038045 3300074 2990269 2816755 2735227 3338561
16082 3338561 3323171 2832849 2984841 2498343 2874039 3076027 3230090 2770039 2945629 3455935
16072 3455935 3417648 3094831 2987900 2571009 2868614 3368289 3077602 3214272 3175362 2971586
16062 2971586 3543106 3020128 3463703 3548370 3387691 3150239 2358861 2304039 2673482 2855807
16052 2855807 3313333 3447702 3302408 2918932 3141199 3365573 3251498 3042503 3185179
16043 3185179 3269171 2925639 2990876 3133089 3478823 3033238 2696328 2665355 3027849 3042220
16033 3042220 3007204 2878104 2479082 3002975 3016148 3088514 3183698 3300499 3399087 3044602
16023 3044602 2998743 2900144 3400905 3028379 2948632 2805837 2905783 2974742 3023261 3356731
16013 3356731 3803072 3262900 3597983 3817213 3760614 3677710 3172858 2919430 3039676 3270217
16003 3270217 3508056 3594506 3937869 3458004 2929776 2753065 2714091 2765882 2489868 2225641
15993 2225641 2633418 2617106 2653042 3106792 3358271 2802617 3125219 3343585 3269585 2880330
15983 2880330 2536221 2272491 2386001 3255622 3640869 3226606 2942824 3120464 3385799
15974 3385799 2745791 2768477 3246104 3504227 3344001 2764237 2947471 2845090 2623561 2586046
15964 2586046 2864017 3011938 3124215 3439447 3301172 3184289 3526497 2957458 2720459
15955 2720459 2954040 2872184 2761812 3507924 2888068 3143291 3255359 2593947 3095580 3227224
15945 3227224 3176065 3394049 3125326 3055900 3018423 3252134 3144975 3259589 2909135 2708306
15935 2708306 2819824 2807485 3034397 2431366 2636068 2950725 2428343 2690572 3264052 2878840
15925 2878840 2979979 2783516 2542108 3407545 3505175 3196365 3240710 3653974 3758211 2875210
15915 2875210 3395619 3823290 3649846 3303612 3376889 3391301 3273652 2782391 3174296 3391506
15905 3391506 3144108 3535980 3955500 3778916 3528227 3442734 3192540 3643898 3379544 3207861
15895 3207861 3854763 4294086 4359160 3917198 3585020 3712118 3355591 3341509 2887003 3260922
15885 3260922 3145301 3229887 3422423 3576996 3168138 3368267 3412391 3629418 3379497 3435761
15875 3435761 3355900 3220818 3398188 3176131 3308346 3437326 3594509 3210151 3310002 3505041
15865 3505041 3594857 3711115 3366336 3136723 3130341 2934269 2818017 2718321 3171316 3400724
15855 3400724 3234980 2976134 2994958 3036905 3102771 2968878 3192027 3377446 3190883 2832636
15845 2832636 2925617 3245598 3329618 2863990 3227692 2902542 2839694 3271727 3174664 3257618
15835 3257618 3302730 3805489 3193439 3483628 3189441 2762174 3018039 2863090 2872832 3199008
15825 3199008 3006513 2450838 2710758 2929443 3008269 2664337 2405491 2283215 2676669 2784149
15815 2784149 2747236 3656939 3510645 2726655 2817056 2854580 3164555 2987444 2962973 3170555
15805 3170555 3031417 3312885 3968273 3384530 2865983 2904958 2859226 3239503 3136187 3148694
15795 3148694 2927789 2822795 3001329 2672403 2735551 2952536 2913801 2986441 2575485 2495152
15785 2495152 2714654 3336658 3033182 3276240 3296424 3352644 3604529 3241217 3233724 3173392
15775 3173392 2974881 2681772 2710280 2972953 2916850 2949608 3042900 3631372 3269276 3019103
$$ [...]
##END NTUPLES=NMR SPECTRUM
##END=
